##TITLE=31Pdec_9P117_D2O
 D2O
  24 sc
 3.11.2023
##JCAMPDX= 6.0         $$ Bruker NMR JCAMP-DX V2.0
##DATA TYPE= NMR SPECTRUM
##DATA CLASS= NTUPLES
##ORIGIN= UXNMR, Bruker Analytische Messtechnik GmbH
##OWNER= root
$$ XWIN-NMR		Version 3.5
$$ Fri Nov  3 14:42:24 2023 Russian Standard Time (UT+4h)  she@DPX200
##.OBSERVE FREQUENCY= 81.013821
##.OBSERVE NUCLEUS= ^31P
##.ACQUISITION MODE= SIMULTANEOUS
##.ACQUISITION SCHEME= undefined
##.AVERAGES= 24
##.DIGITISER RES= 16
##SPECTROMETER/DATA SYSTEM= spect
##.PULSE SEQUENCE= zgpg30
##.SOLVENT NAME= CD2Cl2
##.SHIFT REFERENCE= (INTERNAL, CD2Cl2, 0, 248.564)
##AUDIT TRAIL= $$ (NUMBER, WHEN, WHO, WHERE, WHAT)
$$ ##TITLE= Audit trail, XWIN-NMR		Version 3.5
$$ ##JCAMPDX= 5.01
$$ ##ORIGIN= Bruker BioSpin GmbH
$$ ##OWNER= she
$$ F:/spectra/data/she/nmr/P31/1/pdata/1/auditp.txt
$$ ##AUDIT TRAIL=  $$ (NUMBER, WHEN, WHO, WHERE, WHAT)
(   1,<2023-11-03 14:41:09.53 +0400>,<she>,<DPX200>,
      <created by zg, POWCHK disabled, PULCHK disabled
       configuration hash MD5:
       00 E9 B6 7A A2 85 ED C7 34 08 36 98 17 FE 4E 26
       data hash MD5: 32K
       1C 9B 6F 17 85 3C CB 60 2A 90 40 63 18 4B 7E F7>)
(   2,<2023-11-03 14:41:12.10 +0400>,<she>,<DPX200>,
      <Start of raw data processing
       efp BC_mod = 2 LB = 5 FT_mod = 6 PKNL = 1 PHC0 = -10840.3 PHC1 = 676.2902 SI = 64K 
       data hash MD5: 64K
       E6 4C EC D3 26 49 1F 7D F9 0B 5E 42 26 A9 C0 9A>)
(   3,<2023-11-03 14:41:32.25 +0400>,<she>,<DPX200>,
      <pk PHC0 = 0.9585514 PHC1 = -10.2 
       data hash MD5: 64K
       76 62 42 0C 96 B1 78 A7 D4 B8 83 83 C3 1C 9F 14>)
(   4,<2023-11-03 14:41:35.71 +0400>,<she>,<DPX200>,
      <abs ABSG = 5 
       data hash MD5: 64K
       34 46 1A A8 2E 72 10 03 0E 8B 1C 4C 89 B6 7B 51>)
$$ ##END=
$$ 
$$ hash MD5
$$ BE 6F 3D 1A 87 38 FC C9 C9 24 18 DA 5F B5 76 D6
##$RELAX= 
##$RELAX= 
##$RELAX= 
##$RELAX= 
##$RELAX= 
##$RELAX= 
##$RELAX= 
##$RELAX= 
##$RELAX= 
$$ Bruker specific parameters
$$ --------------------------
##$DU= <F:/spectra>
##$EXPNO= 1
##$NAME= <P31>
##$PROCNO= 1
##$TYPE= <nmr>
##$USER= <she>
##$AMP= (0..31)
100 100 100 100 100 100 100 100 100 100 100 100 100 100 100 100 100 100 
100 100 100 100 100 100 100 100 100 100 100 100 100 100 
##$AQSEQ= 0
##$AQ_mod= 1
##$AUNM= <au_zg>
##$AUTOPOS= <>
##$BF1= 81.014009
##$BF2= 200.13
##$BF3= 200.13
##$BF4= 200.13
##$BF5= 200.13
##$BF6= 200.13
##$BF7= 200.13
##$BF8= 200.13
##$BYTORDA= 1
##$CFDGTYP= 0
##$CFRGTYP= 5
##$CHEMSTR= <none>
##$CNST= (0..31)
1 1 145 1 1 1 1 1 1 1 1 1 1 1 1 1 1 1 1 1 1 1 1 1 1 1 1 1 1 1 1 1 
##$CPDPRG= <waltz16>
##$CPDPRG1= <>
##$CPDPRG2= <waltz16>
##$CPDPRG3= <>
##$CPDPRG4= <mlev>
##$CPDPRG5= <mlev>
##$CPDPRG6= <mlev>
##$CPDPRG7= <mlev>
##$CPDPRG8= <mlev>
##$CPDPRGB= <>
##$CPDPRGT= <>
##$D= (0..31)
0 1 0 0 0 0 0 0 0 0 0 0.03 2e-05 3e-06 0 0 0 0 0 0 0 0 0 0 0 0 0 0 0 0 
0 0 
##$DATE= 1699008068
##$DBL= (0..7)
120 120 120 11 120 120 24 19 
##$DBP= (0..7)
150 150 150 150 150 150 150 150 
##$DBP07= 0
##$DBPNAM0= <>
##$DBPNAM1= <>
$$ [...]
##$SUBNAM3= <"">
##$SUBNAM4= <"">
##$SUBNAM5= <"">
##$SUBNAM6= <"">
##$SUBNAM7= <"">
##$SUBNAM8= <"">
##$SUBNAM9= <"">
##$SW= 501.771253377433
##$SWIBOX= (0..15)
0 1 3 0 0 0 0 0 0 0 0 0 0 0 0 0 
##$SW_h= 40650.406504065
##$TD= 32768
##$TD0= 1
##$TE= 0
##$TE2= 300
##$TE3= 300
##$TEG= 300
##$TL= (0..7)
0 120 53 12 22 120 120 120 
##$TP= (0..7)
150 150 150 150 150 150 150 150 
##$TP07= 0
##$TPNAME0= <>
##$TPNAME1= <>
##$TPNAME2= <>
##$TPNAME3= <>
##$TPNAME4= <>
##$TPNAME5= <>
##$TPNAME6= <>
##$TPNAME7= <>
##$TPOAL= (0..7)
0.5 0.5 0.5 0.5 0.5 0.5 0.5 0.5 
##$TPOFFS= (0..7)
0 0 0 0 0 0 0 0 
##$TUNHIN= 0
##$TUNHOUT= 0
##$TUNXOUT= 0
##$USERA1= <user>
##$USERA2= <user>
##$USERA3= <user>
##$USERA4= <user>
##$USERA5= <user>
##$V9= 5
##$VALIST= <valist>
##$VCLIST= <CCCCCCCCCCCCCCC>
##$VD= 0
##$VDLIST= <DDDDDDDDDDDDDDD>
##$VPLIST= <PPPPPPPPPPPPPPP>
##$VTLIST= <TTTTTTTTTTTTTTT>
##$WBST= 1024
##$WBSW= 4
##$XGAIN= (0..3)
0 0 0 0 
##$XL= 0
##$YL= 0
##$YMAX_a= 186
##$YMIN_a= -200
##$ZGOPTNS= <>
##$ZL1= 120
##$ZL2= 120
##$ZL3= 120
##$ZL4= 120
##$ABSF1= 248.5645
##$ABSF2= -253.2056
##$ABSG= 5
##$ABSL= 3
##$ALPHA= 0
##$AQORDER= 0
##$ASSFAC= 0
##$ASSFACI= 0
##$ASSFACX= 0
##$ASSWID= 0
##$AUNMP= <proc_1d>
##$AZFE= 0.1
##$AZFW= 0.5
##$BCFW= 0
##$BC_mod= 2
##$BYTORDP= 0
##$COROFFS= 0
##$CY= -3
##$DATMOD= 1
##$DC= 0
##$DFILT= <>
##$DTYPP= 0
##$F1P= 0
##$F2P= 0
##$FCOR= 1
##$FTSIZE= 65536
##$FT_mod= 6
##$GAMMA= 0
##$GB= 0
##$INTBC= 1
##$INTSCL= 6.047779e-11
##$ISEN= 30
##$LB= 5
##$LEV0= 0
##$LPBIN= 0
##$MAXI= 10000
##$MC2= 0
##$MEAN= 0
##$ME_mod= 0
##$MI= 50
##$NCOEF= 0
##$NC_proc= -11
##$NLEV= 6
##$NOISF1= 182.463
##$NOISF2= 159.3651
##$NSP= 0
##$NTH_PI= 0
##$NZP= 0
##$OFFSET= 248.5645
##$PC= 4
##$PHC0= -10839.34
##$PHC1= 666.0902
##$PH_mod= 1
##$PKNL= yes
##$PPARMOD= 0
##$PSCAL= 0
##$PSIGN= 0
##$REVERSE= no
##$SF= 81.0140089999694
##$SI= 65536
##$SIGF1= 159.3651
##$SIGF2= -187.1042
##$SINO= 113.3802
##$SIOLD= 16384
##$SREGLST= <1H.CDCl3>
##$SSB= 0
##$STSI= 65536
##$STSR= 0
##$SW_p= 40650.406504065
##$SYMM= 0
##$S_DEV= 0
##$TDeff= 32768
##$TDoff= 0
##$TI= <>
##$TILT= no
##$TM1= 0
##$TM2= 0
##$TOPLEV= 0
##$USERP1= <user>
##$USERP2= <user>
##$USERP3= <user>
##$USERP4= <user>
##$USERP5= <user>
##$WDW= 1
##$XDIM= 65536
##$YMAX_p= 497238162
##$YMIN_p= -35390259
$$ End of Bruker specific parameters
$$ ---------------------------------
##NTUPLES= NMR SPECTRUM
##VAR_NAME=  FREQUENCY,     SPECTRUM/REAL,   SPECTRUM/IMAG
##SYMBOL=    X,             R,               I
##VAR_TYPE=  INDEPENDENT,   DEPENDENT,       DEPENDENT
##VAR_FORM=  AFFN,          ASDF,            ASDF
##VAR_DIM=   65536,         65536,           65536
##UNITS=     HZ,            ARBITRARY UNITS, ARBITRARY UNITS
##FACTOR=    0.620285442955139, 1,           1
##FIRST=     20137.2065510682, 0,            0
##LAST=      -20513.1999529968, 0,           0
##MIN=       -20513.1999529968, -35390259,   0
##MAX=       20137.2065510682, 497238162,    0
$$ Real data points
##PAGE= N=1
##DATA TABLE= (X++(R..R)), XYDATA
$$ [...]
43531 -660581 -893252 -1132456 -1331049 -1453888 -1480776 -1385983 -1164218 -873193 -608746 -427814
43521 -427814 -318708 -246904 -204059 -210471 -294246 -470461 -715172 -954683 -1108656 -1163118 -1190007
43510 -1190007 -1280795 -1461788 -1676168 -1843816 -1936397 -1992223 -2050515 -2075199 -1968892 -1676917
43500 -1676917 -1254893 -809863 -395676 -1686 370307 671294 865038 989799 1133406
43491 1133406 1355663 1646347 1948586 2209231 2404842 2523117 2531493 2388224 2095666 1722480
43481 1722480 1356431 1056399 868642 848257 1003377 1224956 1332640 1211490 874698 398897
43471 398897 -140973 -653325 -1014057 -1135097 -1041388 -849295 -677559 -591304 -597590 -652192
43461 -652192 -679356 -620398 -469679 -255708 -6151 249555 470821 643330 821005 1085373
43451 1085373 1441465 1772516 1917724 1799281 1480990 1115067 828445 643980 503738
43442 503738 368987 290075 367632 645848 1050536 1432471 1674367 1771202 1821042 1936213
43432 1936213 2153149 2418279 2644343 2764655 2747971 2604449 2399190 2236223 2201238 2320825
43422 2320825 2575485 2918854 3260347 3459077 3384743 2999441 2374629 1644340 958263 450316
43412 450316 198778 199340 391676 708768 1082914 1423204 1638709 1705757 1690051 1684475 1730724
43401 1730724 1797507 1812500 1712342 1488415 1200914 936323 738800 584609 415942 181870
43391 181870 -147328 -572446 -1056189 -1540835 -1989202 -2395848 -2752003 -3020133 -3156103 -3138253
43381 -3138253 -2960533 -2619857 -2141428 -1612084 -1156834 -860352 -707644 -601733 -441818
43372 -441818 -196312 83776 312046 425443 409082 290262 126663 -15318 -103377 -166305
43362 -166305 -255675 -374069 -463113 -471536 -414079 -353100 -345108 -418564 -576426 -793265 -1025174
43351 -1025174 -1246968 -1466278 -1679397 -1835925 -1887659 -1863985 -1851132 -1884093 -1896053 -1795462
43341 -1795462 -1564844 -1258578 -926444 -576641 -212288 128368 387603 539415 618085 694535
43331 694535 819706 982807 1121388 1173410 1122960 1004956 880383 811595 845459 995809
43321 995809 1228605 1466034 1616937 1622130 1488237 1280591 1071297 888029 722905 594458
43311 594458 578132 747415 1083681 1464811 1752142 1881216 1871943 1778167 1648654 1523032
43301 1523032 1430358 1371028 1307624 1195119 1036511 906861 901092 1036381 1209199 1272435
43291 1272435 1167565 972989 822759 798017 899569 1083449 1280414 1396387 1346742 1111383
43281 1111383 738010 289293 -186445 -631724 -973195 -1172425 -1264358 -1314209 -1340994 -1302300
43271 -1302300 -1147335 -869502 -518015 -177483 72805 202473 235521 206480 125668 308
43261 308 -136606 -253714 -363786 -496469 -630554 -701465 -694949 -695133 -805664 -1035398 -1281497
43250 -1281497 -1414576 -1368385 -1164464 -872295 -542480 -169916 269015 740836 1141596 1378997
43240 1378997 1452449 1432350 1377701 1301588 1202620 1087613 955271 793697 619422 502896
43230 502896 528347 722480 1029163 1354594 1634968 1864277 2065248 2242193 2366940 2402787
43220 2402787 2322817 2099301 1702730 1146303 529979 4581 -333149 -504669 -602963 -695851
43210 -695851 -786191 -850523 -890308 -940969 -1042190 -1196696 -1342461 -1369831 -1199607 -870807
43200 -870807 -539975 -362913 -365334 -440476 -476600 -470981 -510077 -653763 -857653 -1004158 -994246
43189 -994246 -813074 -528703 -239197 -12695 133500 204622 195388 102440 -34523 -131707
43179 -131707 -122987 -21501 85711 98167 -43232 -337847 -733858 -1154745 -1539348 -1871202
43169 -1871202 -2168996 -2448963 -2699999 -2888444 -2972940 -2917307 -2715488 -2426835 -2179200 -2108156
43159 -2108156 -2272713 -2628953 -3084600 -3564778 -4015273 -4363593 -4520171 -4441839 -4182044 -3859322
43149 -3859322 -3576275 -3370672 -3222000 -3075385 -2862350 -2530883 -2074769 -1527858 -928863
43140 -928863 -305213 311465 881461 1381665 1812892 2164189 2387146 2432537 2310247 2093279
43130 2093279 1859053 1635783 1402430 1126309 797154 433257 61572 -301824 -643232
43121 -643232 -928389 -1112378 -1188622 -1213540 -1260833 -1352540 -1445740 -1480145 -1428492 -1312959 -1189123
43110 -1189123 -1102962 -1045043 -960717 -830627 -725490 -739558 -870152 -1009422 -1073638 -1100591
43100 -1100591 -1186724 -1355308 -1528052 -1618126 -1613616 -1567308 -1539885 -1569623 -1670405 -1824372 -1972074
43089 -1972074 -2032629 -1956712 -1767005 -1539710 -1337514 -1158908 -953891 -683389 -356505 -16079
43079 -16079 297362 565620 790456 977330 1112125 1149607 1036981 760666 369215 -50985
43069 -50985 -418673 -684725 -839965 -906868 -909565 -845068 -705808 -546067 -496535 -666419 -1024792
43058 -1024792 -1410231 -1671896 -1783084 -1813410 -1826921 -1837966 -1843080 -1847904 -1854089 -1852882 -1849281 -1868288
43046 -1868288 -1910640 -1910930 -1765464 -1412142 -886065 -314316 130064 295663 128424 -294181
43036 -294181 -820340 -1328790 -1768857 -2106400 -2278271 -2235537 -2010424 -1703602 -1410289 -1180070
43026 -1180070 -1027856 -941194 -882864 -832810 -833686 -949711 -1164830 -1365277 -1449978 -1423389 -1351848
43015 -1351848 -1268269 -1165697 -1056872 -981035 -955291 -970694 -1043366 -1221096 -1516807 -1867962
43005 -1867962 -2185445 -2420689 -2566186 -2614533 -2547589 -2360251 -2075896 -1742375 -1423227 -1178271
42995 -1178271 -1027457 -930342 -813613 -620774 -331137 54185 514355 985528 1358771 1538055
42985 1538055 1520482 1409587 1322325 1266772 1123449 768893 218601 -365852 -805064 -1014194
42975 -1014194 -999327 -802485 -492871 -177645 49859 191883 338251 556437 815403 1032433
42965 1032433 1160209 1197539 1145225 1002812 804410 608095 432597 236080 -26106 -351253
42955 -351253 -713497 -1100079 -1480684 -1758925 -1812339 -1607003 -1254088 -937703 -793119 -848361
42945 -848361 -1046948 -1295473 -1497164 -1573890 -1486397 -1250715 -937854 -639513 -405689 -206030
42935 -206030 34898 359780 749052 1166540 1601670 2044711 2445167 2733333 2885065 2943616
42925 2943616 2978205 3036195 3120169 3173693 3091117 2794203 2334237 1891413 1630948 1560154
42915 1560154 1549303 1482534 1356292 1235642 1163975 1144218 1175560 1256496 1343058 1339215 1159660
42904 1159660 804830 367032 -35295 -327660 -498874 -574333 -581671 -535641 -442718 -312299
42894 -312299 -162810 -18645 98337 175567 210470 207693 179983 155219 178459 292351 500118
42883 500118 747339 953382 1070004 1107540 1107652 1108352 1144943 1264069 1504304 1854755 2248447
42872 2248447 2605370 2877762 3058096 3160742 3202573 3191915 3134160 3057023 3021903 3082096
42862 3082096 3220388 3350103 3388885 3309393 3109461 2774564 2310559 1788230 1297547 850015
42852 850015 368852 -206288 -832869 -1396410 -1799171 -2002600 -2015342 -1876139 -1639508 -1349123
42842 -1349123 -1024436 -691131 -420494 -313043 -426796 -718365 -1048493 -1243033 -1170579 -798954
42832 -798954 -201304 489882 1141806 1650806 1944578 1990314 1815735 1512889 1202877 977835
42822 977835 856840 784098 674703 481804 236797 31879 -35301 92051 415433 886227
42812 886227 1416870 1900829 2242732 2384928 2316375 2065303 1687288 1256392 856785 565522
42802 565522 423342 411067 461842 514407 564090 656281 821966 1022367 1166386 1184809 1081098
42791 1081098 910667 729145 576256 490675 494584 544313 532111 383239 149344 -31317
42781 -31317 -75317 -26939 17372 17405 -7517 -50853 -138810 -271467 -385288 -401853 -302851 -142523
42769 -142523 4956 98001 137221 144386 140789 135904 119686 59261 -82599 -303473 -534849
42758 -534849 -686633 -738611 -773174 -890491 -1092283 -1270242 -1309863 -1186176 -960225 -716596
42748 -716596 -526009 -445457 -515274 -741296 -1086457 -1482693 -1850091 -2114752 -2225591 -2163631
42738 -2163631 -1938186 -1579044 -1133271 -657434 -198520 217420 569006 814664 900948 809102
42728 809102 590048 338736 122797 -62267 -259341 -472174 -636642 -681645 -607354 -478298
42718 -478298 -336626 -152687 112421 409923 607650 609228 454224 281993 200679 207392
42708 207392 235261 253478 299981 427588 651489 959757 1341761 1768894 2159181 2410633
42698 2410633 2494549 2493100 2520335 2616121 2731851 2800721 2794692 2725555 2628883 2554337 2539285
42687 2539285 2567670 2562047 2427405 2103443 1588077 943452 293228 -214369 -479202 -498828
42677 -498828 -347550 -115628 131315 360317 563910 736269 840263 815160 645690 412481
42667 412481 234278 150947 90269 -45208 -290639 -623504 -1004608 -1374810 -1644278 -1746041
42657 -1746041 -1707986 -1634540 -1604662 -1609106 -1586659 -1486936 -1287789 -991787 -642143 -329749 -153789
42646 -153789 -165134 -340041 -581184 -732770 -637596 -238699 363041 977522 1457876 1753291
42636 1753291 1855493 1757363 1496978 1201961 1027056 1026789 1106820 1114398 977844 764513 615864
42625 615864 628610 786617 991552 1147477 1216290 1211439 1164617 1102665 1034701 946930 822369
42614 822369 678841 575675 565238 642868 759158 876849 1001359 1160411 1370978 1624825
42604 1624825 1888765 2116532 2277033 2379788 2467737 2587743 2776943 3064727 3453706 3883975
42594 3883975 4237595 4402513 4333446 4050046 3596001 3019910 2387799 1790245 1323214 1052745
42584 1052745 978955 1021028 1053747 989867 837530 668789 536324 441045 381640 400851 547256
42573 547256 792833 1017992 1098720 1006388 817382 635713 518559 464574 439605 393354
42563 393354 270682 43129 -258553 -557687 -786703 -923534 -977470 -960694 -884328 -765066
42553 -765066 -618100 -451995 -283885 -147799 -66653 -19985 39662 136229 250988 351726
42543 351726 420724 453490 459476 481436 589045 816186 1100714 1312399 1357886 1252571 1084969
42532 1084969 927417 801482 718836 711171 787122 878577 878284 749176 569265 446829 413638
42521 413638 430097 474680 578773 764184 986403 1166259 1258343 1266335 1207632 1093363 944480
42510 944480 803730 713915 680305 655791 572018 400615 186654 5765 -120550 -251846
42500 -251846 -457738 -732994 -1000595 -1187293 -1269989 -1250709 -1122418 -884943 -579549 -274090
42490 -274090 26 282671 640519 1089964 1577287 2032710 2420651 2726290 2921510 2980000
42480 2980000 2917664 2779943 2585500 2321398 2008501 1733134 1584524 1585312 1707425 1921901
42470 1921901 2188598 2419168 2510902 2430905 2235703 2005077 1787726 1609540 1489732 1428550
42460 1428550 1404289 1392407 1362202 1254303 1008248 638025 247929 -54636 -241407 -345425
42450 -345425 -401390 -435065 -471476 -499827 -450455 -265076 12213 269124 462070 669438
42440 669438 981197 1370066 1707395 1893304 1946147 1972508 2073154 2279641 2563618 2887904
42430 2887904 3230725 3551790 3755029 3725298 3421919 2922391 2362864 1849305 1433208 1142154
42420 1142154 993146 974931 1050210 1193227 1409550 1700835 2018673 2275899 2410387 2425529
42410 2425529 2362400 2248904 2093122 1912085 1732526 1555055 1348029 1099712 857553 688057
42400 688057 605815 565824 517614 437922 312010 115789 -170438 -546379 -990134 -1448677
42390 -1448677 -1830959 -2049236 -2091812 -2039460 -1996639 -2017885 -2094535 -2170252 -2153231 -1961962 -1602821
42379 -1602821 -1173767 -746672 -272689 335430 1036435 1645086 2004706 2127077 2137821 2129766
42369 2129766 2108386 2046598 1936825 1785370 1587704 1321978 962278 507493 9696 -434594
42359 -434594 -734510 -843466 -754724 -496088 -153061 140368 294902 356364 458078 660948
42349 660948 867595 917561 751652 466831 230125 164204 299509 588602 938208 1242104
42339 1242104 1418305 1440799 1343952 1192689 1040179 905256 780440 652437 516081 382883
42329 382883 286471 269062 344337 475237 605599 714784 820409 918878 946247 823274
42319 823274 536906 162674 -191228 -451279 -598983 -647279 -605055 -458007 -189210 162868
42309 162868 468002 561229 373117 6164 -339415 -528527 -581318 -613859 -713762 -879479
42299 -879479 -1050648 -1159914 -1154017 -1001825 -714379 -352901 5825 318361 579280 780333
42289 780333 887901 875036 763652 620235 518053 516179 656744 941207 1294300 1581147
42279 1581147 1694713 1629352 1457569 1244374 1003229 726062 423351 125937 -124456 -269698
42269 -269698 -249123 -55559 230435 500246 722182 961829 1284575 1659448 1978120 2151314
42259 2151314 2160662 2026310 1761993 1381522 932588 496259 138571 -138890 -396531 -699653
42249 -699653 -1060967 -1438362 -1778689 -2046287 -2211744 -2247749 -2164611 -2033842 -1941226 -1914008
42239 -1914008 -1918172 -1925148 -1947448 -1997122 -2038452 -2002832 -1834472 -1509730 -1037337 -466968 113558
42228 113558 612897 965939 1125908 1058739 781276 391472 15015 -294398 -583884 -927000
42218 -927000 -1339424 -1770036 -2151336 -2446555 -2661499 -2822628 -2941666 -3003947 -2997298 -2938733
42208 -2938733 -2849908 -2711931 -2472823 -2104669 -1632388 -1107390 -583785 -127077 189780 324476
42198 324476 286752 117223 -127718 -365400 -512892 -566388 -627780 -803867 -1082733 -1339809
42188 -1339809 -1454395 -1389690 -1182026 -911608 -687372 -596150 -625336 -661299 -594510 -415088
42178 -415088 -196283 -17425 68335 18935 -193056 -554548 -1016427 -1529843 -2057425 -2544457
42168 -2544457 -2906198 -3070725 -3038071 -2888792 -2728072 -2615105 -2538060 -2450346 -2325925 -2175163
42158 -2175163 -2010342 -1812301 -1548573 -1225941 -911566 -689857 -595149 -585906 -579249 -503140
42148 -503140 -316154 4205 460389 1002302 1509662 1842695 1934755 1833854 1647876 1457245
42138 1457245 1285335 1131078 995150 865004 699364 456499 146731 -146865 -304241
42129 -304241 -236223 58606 484097 898092 1196885 1364088 1437165 1431726 1318405 1085778
42119 1085778 808102 618435 601319 724499 889541 1043541 1225410 1497993 1846160 2157332
42109 2157332 2309922 2276821 2133327 1964096 1775334 1505629 1108197 601634 43702 -518343
42099 -518343 -1058488 -1549743 -1950673 -2213516 -2298485 -2184920 -1878605 -1412868 -847374 -270494
42089 -270494 211174 517242 642145 643295 570393 426638 213611 -15389 -183917 -263688
42079 -263688 -282336 -264720 -204914 -101130 23412 158802 342325 626055 1016117 1452881
42069 1452881 1835659 2058693 2052825 1829057 1483354 1139169 878015 721704 654313 629255
42059 629255 562162 362085 6824 -410729 -730370 -838458 -748263 -573707 -423882 -323603
42049 -323603 -234345 -134503 -54237 -32404 -71565 -156973 -299075 -523177 -816202 -1109808 -1327779
42038 -1327779 -1438947 -1460806 -1430858 -1391228 -1390640 -1472633 -1643496 -1860179 -2073428 -2291608 -2578926
42027 -2578926 -2959802 -3328158 -3489535 -3321117 -2884151 -2369758 -1949720 -1689496 -1570227
42018 -1570227 -1539636 -1530881 -1476530 -1349138 -1192761 -1094918 -1113499 -1226529 -1349619 -1399683 -1345210
42007 -1345210 -1207013 -1028904 -857853 -735674 -676631 -644691 -583194 -492390 -459564 -580669
41997 -580669 -855919 -1187525 -1475196 -1684111 -1821379 -1888661 -1882587 -1817010 -1714065 -1577619
41987 -1577619 -1393324 -1152585 -867086 -568175 -305227 -138063 -113577 -243725 -506907 -862617
41977 -862617 -1256603 -1622125 -1898190 -2059081 -2124632 -2135886 -2114230 -2038739 -1865766 -1579751
41967 -1579751 -1226368 -886927 -616695 -415697 -261041 -155073 -132870 -226521 -423252 -652283
41957 -652283 -820493 -884560 -892575 -928545 -1002788 -1024523 -907614 -682324 -471117 -366555 -364094
41946 -364094 -402381 -428584 -425547 -418352 -465056 -601575 -777648 -882392 -858620 -766881 -716874
41935 -716874 -765174 -902890 -1103341 -1334510 -1549274 -1720704 -1882830 -2083247 -2286673 -2370824
41925 -2370824 -2233159 -1867428 -1331628 -698111 -67825 419327 658281 665511 555418 426849
41915 426849 295181 130204 -70947 -258344 -360253 -334214 -197528 -7967 190982 398470
41905 398470 625524 855903 1057423 1218645 1351798 1471121 1593244 1745476 1936350 2116351
41895 2116351 2199729 2134137 1931989 1643861 1336978 1094229 978587 970905 977589 929917 854540
41884 854540 824934 870895 967556 1095262 1273565 1533593 1871311 2223921 2491778 2611518
41874 2611518 2623559 2636950 2701517 2744955 2670789 2485732 2276695 2084144 1872129 1633358
41864 1633358 1452245 1418951 1518129 1646920 1726467 1761722 1803913 1892210 2038418 2241420
41854 2241420 2493990 2772097 3023854 3182136 3204027 3100727 2916596 2674255 2353080 1931316
41844 1931316 1440483 963828 575604 282295 27370 -236570 -475198 -583586 -486178 -224311
41834 -224311 66687 264637 339497 347351 378270 506022 748413 1049567 1307506 1430874
41824 1430874 1375542 1150645 821701 500615 284269 175153 79795 -100934 -396458 -781001
41814 -781001 -1222470 -1690246 -2141846 -2534028 -2833563 -2996822 -2966001 -2726021 -2355751 -1983610
41804 -1983610 -1686258 -1450020 -1221459 -963836 -669967 -362854 -98522 64099 121289 141017
41794 141017 208082 359973 575438 800654 973530 1047771 1024757 961378 927374 949004 998170
41783 998170 1029255 1015284 956195 874427 810105 802488 855034 917572 916951 813853 625784 392204
41771 392204 128058 -175240 -506488 -811307 -1026512 -1138117 -1198422 -1278774 -1400041 -1510833
41761 -1510833 -1543027 -1490067 -1415196 -1373815 -1349055 -1288142 -1186180 -1097673 -1070468 -1110116 -1212528
41750 -1212528 -1379341 -1576034 -1723249 -1775719 -1783142 -1829814 -1935131 -2056187 -2162533 -2246080
41740 -2246080 -2266440 -2160882 -1931573 -1666147 -1438422 -1231779 -997375 -751749 -570323 -502479
41730 -502479 -535165 -631834 -767930 -923948 -1069642 -1159752 -1132184 -923476 -519666 1388
41720 1388 502757 881109 1129756 1321529 1542824 1826933 2113294 2263446 2151474 1770589
41710 1770589 1248850 747221 341998 3832 -328383 -665456 -940799 -1042506 -884038
41701 -884038 -476692 54817 544603 890364 1093948 1214848 1309310 1414412 1549489 1691962
41691 1691962 1759856 1659216 1368810 966509 567340 249787 40241 -66625 -100351 -110506
41681 -110506 -136930 -181224 -225453 -277752 -380005 -565896 -823146 -1097145 -1319413 -1435573
41671 -1435573 -1425772 -1308581 -1122466 -909276 -724859 -648385 -743656 -996768 -1309382 -1565360
41661 -1565360 -1697765 -1699237 -1598654 -1439827 -1257067 -1051782 -808671 -548496 -343468 -258501
41651 -258501 -290617 -383311 -482508 -557489 -590414 -584197 -574485 -597516 -642512 -663601 -638523 -581942
41639 -581942 -494313 -337122 -87374 201442 419896 485105 400363 250618 153031 196047
41629 196047 398589 713772 1066877 1388022 1625772 1764523 1844216 1941654 2109701 2338312
41619 2338312 2578143 2780185 2898265 2883026 2715696 2447535 2174277 1959951 1797642 1642513
41609 1642513 1466036 1282392 1145030 1113940 1192345 1282839 1234550 958590 489899 -68281
41599 -68281 -633433 -1159893 -1600743 -1905792 -2066622 -2134718 -2180232 -2244843 -2337963 -2458115
41589 -2458115 -2600531 -2747839 -2863041 -2895535 -2804343 -2594992 -2340566 -2148338 -2081447 -2103788
41579 -2103788 -2103200 -1970526 -1664190 -1220972 -730884 -307575 -57238 -34154 -199003 -427532
41569 -427532 -589431 -638718 -624870 -612965 -606726 -560040 -447231 -298517 -171923 -114276 -148396
41558 -148396 -267903 -428723 -564177 -628061 -619205 -560365 -470770 -373730 -314812 -344004 -471509
41547 -471509 -649284 -800751 -872551 -869474 -846696 -859862 -914723 -970601 -992965 -985978 -968877
41536 -968877 -946833 -925300 -930245 -982454 -1064571 -1148474 -1247562 -1397300 -1574026 -1675521 -1611244
41525 -1611244 -1389556 -1090330 -769167 -416977 -3552 470395 967437 1435800 1828887
41516 1828887 2117875 2295923 2365543 2320161 2147540 1857360 1499440 1146017 852223 631535
41506 631535 466583 343168 275548 298365 430724 646188 879941 1070440 1198948 1289223
41496 1289223 1366949 1422703 1424094 1366667 1300357 1293095 1373082 1516441 1680581 1825916 1905418
41485 1905418 1865289 1682223 1394017 1077931 800916 595349 464537 385629 310270 191467
41475 191467 23566 -160923 -347812 -577138 -895839 -1276351 -1611204 -1804787 -1853804 -1816872
41465 -1816872 -1718576 -1519794 -1192909 -794360 -429545 -150122 89171 367214 707944 1062884
41455 1062884 1369111 1612713 1838839 2109970 2460236 2888129 3379807 3918009 4460827
41446 4460827 4931575 5253190 5391396 5351621 5143589 4774690 4280486 3736762 3227106 2808166
41436 2808166 2509689 2348430 2323087 2397458 2498603 2540417 2465958 2284836 2064479 1864458
41426 1864458 1678777 1459140 1186425 886704 577835 248834 -79803 -310973 -331622 -116385
41416 -116385 248992 635557 946345 1153311 1304448 1489768 1757816 2051965 2252977 2295021
41406 2295021 2224740 2146580 2134192 2199597 2316724 2447162 2550509 2593398 2561679 2466135 2333019
41395 2333019 2179254 1991545 1740771 1428292 1107800 844769 660585 532738 440704 385993
41385 385993 366693 356558 316146 208609 4523 -303926 -681790 -1059847 -1375335 -1598524
41375 -1598524 -1723784 -1756609 -1715557 -1627488 -1511340 -1380186 -1260534 -1184248 -1148282 -1101700
41365 -1101700 -986507 -776184 -467664 -67298 384829 792016 1037340 1052096 844483 479038
41355 479038 49888 -343988 -643823 -872700 -1114961 -1436515 -1827384 -2222826 -2564965 -2831810
41345 -2831810 -3018606 -3117344 -3127671 -3073835 -2983587 -2839911 -2573248 -2125066 -1514418 -823755
41335 -823755 -131385 506860 1012917 1282251 1267371 1043148 750784 486071 268698 96873
41325 96873 -22142 -99106 -170850 -258655 -348569 -431533 -533466 -678548 -841360 -962664 -1003308
41314 -1003308 -961890 -851441 -687760 -502423 -343478 -248746 -219376 -218165 -192429 -111511 2908
41303 2908 88273 97823 46132 -10448 -31770 -16944 25258 106644 254529 490864 816471
41292 816471 1192414 1528194 1717831 1721157 1607816 1499793 1469019 1504182 1566099 1637402 1700903
41281 1700903 1700158 1563926 1276461 902129 533734 234305 35136 -40345 11241 139295
41271 139295 254580 302146 306497 328182 388671 458409 505115 517457 477250 348724 123711
41260 123711 -145259 -390230 -596414 -794244 -989768 -1144732 -1238116 -1309596 -1410870 -1531940
41250 -1531940 -1605720 -1578987 -1455214 -1275462 -1088374 -942468 -874514 -879583 -900415 -864628 -738422
41239 -738422 -548615 -366556 -276365 -339399 -561470 -885711 -1228614 -1535963 -1809419 -2080837
41229 -2080837 -2358885 -2591958 -2675584 -2503327 -2032939 -1325606 -530152 178613 670002 902505
41219 902505 931429 877914 864739 946421 1082721 1182078 1177506 1064804 879298 655172 412135
41208 412135 160696 -99804 -381075 -685830 -991232 -1266082 -1494298 -1657682 -1705923 -1588279
41198 -1588279 -1333798 -1068995 -928035 -959029 -1129538 -1386024 -1665913 -1876651 -1931574 -1831345
41188 -1831345 -1676035 -1572617 -1548343 -1567855 -1609326 -1694840 -1853327 -2077627 -2322889 -2536626
41178 -2536626 -2687541 -2773121 -2809625 -2822962 -2845651 -2899986 -2964179 -2967918 -2852845 -2641974 -2423748
41167 -2423748 -2258188 -2121802 -1958246 -1761585 -1589727 -1510353 -1553862 -1706443 -1918015 -2106382
41157 -2106382 -2169050 -2015156 -1613290 -1032346 -434410 2945 187287 148044 -9979 -165870
41147 -165870 -205833 -48173 298803 706139 986832 1005761 733703 224487 -422873 -1087094
41137 -1087094 -1658270 -2079938 -2353116 -2495121 -2509553 -2402670 -2210059 -1987522 -1774980 -1574219
41127 -1574219 -1359761 -1111154 -842906 -609915 -482356 -509120 -694549 -994472 -1327972 -1607999
41117 -1607999 -1783203 -1858335 -1872819 -1864332 -1854206 -1848482 -1830396 -1758571 -1601631 -1388076 -1208917
41106 -1208917 -1153929 -1235986 -1370394 -1427383 -1319938 -1057400 -714130 -346476 39317 425593
41096 425593 723995 827494 724978 526655 363311 287179 277624 303233 348489 404012 466256
41085 466256 543168 639783 740819 815206 822936 710029 430480 9757 -428064 -735711
41075 -735711 -847281 -788118 -604508 -337950 -65430 113843 186761 282850 554867 997443
41065 997443 1423901 1630895 1561586 1317091 1059735 921428 949399 1078964 1166466 1102276
41055 1102276 918328 770796 802667 1021668 1301030 1479170 1463064 1269143 991526 728409
41045 728409 523925 368655 239884 125748 19146 -82251 -158068 -165960 -74809 112464
41035 112464 375452 698321 1061460 1424064 1732602 1945642 2047840 2050963 1985413 1876509
41025 1876509 1726686 1540981 1368246 1276256 1266532 1255033 1174563 1065959 1026197 1095588 1250018
41014 1250018 1478746 1792139 2147484 2442898 2617102 2703565 2758413 2789164 2793057 2809451
41004 2809451 2864896 2886800 2738185 2351017 1795575 1221341 759475 474572 365992 393721
40994 393721 514392 697315 901618 1056868 1096916 1014743 866096 721676 627613 591379
40984 591379 569839 480591 275000 16167 -154607 -157851 -61394 -1391 -35138 -99107 -99037 -3666
40972 -3666 156008 342869 537050 715168 844668 919739 988335 1118222 1332108 1590200
40962 1590200 1838631 2058356 2260921 2457023 2646172 2823121 2971526 3053072 3018761 2833418
40952 2833418 2489273 2018333 1516008 1136446 1018149 1190108 1560746 2001523 2421971
40943 2421971 2761293 2946872 2906615 2629608 2193424 1716811 1284693 915463 586416 275371
40933 275371 -24221 -311646 -580051 -806832 -963662 -1050877 -1109711 -1184317 -1282265 -1391739
40923 -1391739 -1524740 -1707362 -1920430 -2082836 -2118987 -2031720 -1892161 -1765689 -1660211 -1536890
40913 -1536890 -1355293 -1113561 -860653 -667698 -571681 -543152 -519094 -471341 -436233 -475847
40903 -475847 -616732 -823524 -1013609 -1085577 -953974 -601401 -127073 269210 395159 196214
40893 196214 -207145 -610178 -858081 -916017 -847682 -747039 -674069 -628397 -578268 -518147 -485790
40882 -485790 -511293 -567193 -593906 -562848 -483365 -358013 -182055 -2628 73403 -20373 -219907
40871 -219907 -388497 -470341 -555032 -779256 -1186322 -1690430 -2152659 -2468936 -2598248 -2541347
40861 -2541347 -2314437 -1941844 -1462365 -932452 -415749 36687 400212 672213 853379
40852 853379 934585 906285 781228 600343 408421 225104 43007 -152336 -370478 -618556
40842 -618556 -899411 -1202937 -1510529 -1811603 -2103663 -2371962 -2586219 -2731284 -2828098 -2903398
40832 -2903398 -2943633 -2905317 -2782105 -2641581 -2569360 -2574211 -2567522 -2450327 -2213840 -1941520 -1717054
40821 -1717054 -1549288 -1391297 -1211219 -1025029 -869160 -761958 -694554 -649218 -625525 -648143
40811 -648143 -730321 -816092 -785425 -559116 -197012 146577 372017 503905 608458 697459
40801 697459 748182 769234 781881 751919 608407 349518 86049 -50388 -28786 57679 65107
40790 65107 -109638 -469289 -906835 -1263146 -1430698 -1422877 -1343673 -1287460 -1260267 -1180157 -941850
40779 -941850 -491711 136148 839175 1496780 2013044 2338583 2481761 2505533 2492635 2493834
40769 2493834 2508843 2519638 2530606 2561622 2601400 2577691 2384614 1954917 1324552 633238
40759 633238 48842 -326296 -486903 -482203 -367823 -204890 -73519 -44566 -126264 -254554
40749 -254554 -346598 -362203 -320401 -274164 -270268 -310401 -335433 -263845 -71869 163176 320000
40738 320000 346248 308946 325853 447517 603417 651745 478895 69072 -498617 -1113226
40728 -1113226 -1700078 -2236120 -2708149 -3073254 -3275655 -3299927 -3195406 -3048107 -2935922 -2898988
40718 -2898988 -2922549 -2935981 -2853047 -2642044 -2355547 -2075406 -1832155 -1596947 -1351314 -1136135
40708 -1136135 -1008120 -955437 -884313 -709033 -452700 -242846 -197991 -323759 -523345 -690514
40698 -690514 -767562 -724010 -529473 -184390 236588 604599 808121 804796 629755 383718
40688 383718 193355 124601 110303 -1048 -287219 -651204 -904442 -950779 -872462 -838440
40678 -838440 -946189 -1151016 -1323262 -1356784 -1233891 -1011533 -761851 -526705 -318286 -145891
40668 -145891 -26189 35777 61977 78336 70119 -23918 -250703 -574060 -886844 -1105917 -1245115
40657 -1245115 -1380742 -1555242 -1735329 -1861417 -1912391 -1909770 -1872219 -1780497 -1586583 -1258118
40647 -1258118 -825741 -391360 -74816 67734 84612 96341 222785 517051 930071 1324393
40637 1324393 1550096 1543099 1358963 1107235 860908 635598 434382 277277 178534 119230
40627 119230 64570 5399 -32813 -26491 15102 74772 183313 421788 836247 1351687 1800546
40616 1800546 2052789 2109088 2069073 2038277 2076661 2194645 2348252 2442728 2384460 2148635
40606 2148635 1785736 1369669 968173 659600 526923 594549 783142 958896 1034808 1016269
40596 1016269 956933 891574 816883 720181 606632 492076 379274 258550 138864 65926
40586 65926 96491 263327 579827 1062732 1710749 2449144 3126358 3591327 3766023 3640221
40576 3640221 3236971 2627922 1966177 1440154 1154143 1060066 1019044 924451 765933 599454
40566 599454 482466 440069 475235 588825 769948 961791 1060057 981400 744476 460888
40556 460888 228123 44830 -149908 -365909 -520371 -517202 -356019 -154868 -68237 -178885
40546 -178885 -453697 -790688 -1104859 -1370495 -1590448 -1745247 -1786858 -1672444 -1387473 -946035
40536 -946035 -398672 156811 608891 907542 1097902 1261340 1432740 1592140 1719105 1817190
40526 1817190 1881382 1878176 1782753 1623129 1470371 1390968 1415376 1536669 1719929 1916379
40516 1916379 2083232 2192965 2224997 2167199 2042332 1918252 1862664 1885368 1945004 2009902
40506 2009902 2080261 2139323 2118589 1948895 1637568 1264429 902003 567064 251953 -34613
40496 -34613 -283104 -513456 -748709 -957981 -1060825 -1005754 -823647 -582375 -302734 51169
40486 51169 495447 966064 1351429 1575278 1635020 1569601 1414157 1192078 929003 648299
40476 648299 350709 18508 -346723 -701854 -997744 -1235631 -1464210 -1707585 -1915304 -2010229
40466 -2010229 -1982727 -1912004 -1885654 -1914328 -1932707 -1865913 -1682424 -1402042 -1079401 -775083
40456 -775083 -515175 -268476 22313 377212 752945 1079524 1304451 1390792 1295307 989485
40446 989485 520164 29274 -322044 -471634 -503863 -577402 -799403 -1152564 -1518947 -1764627
40436 -1764627 -1824804 -1743205 -1638316 -1609058 -1654173 -1686039 -1623964 -1457962 -1216402 -901907
40426 -901907 -495223 -20137 425504 718326 786188 648951 410048 210825 161260 283843
40416 283843 517169 772897 983165 1103109 1103017 985377 799965 616675 476640 378255
40406 378255 308154 267791 255653 226984 91693 -218922 -665766 -1094274 -1343861 -1380682
40396 -1380682 -1315074 -1288728 -1362807 -1513705 -1693230 -1854135 -1938475 -1896855 -1739169 -1539755
40386 -1539755 -1371038 -1239615 -1092667 -871187 -548829 -140077 303604 704368 978354
40377 978354 1052124 866453 390931 -330783 -1141935 -1808098 -2136210 -2090203 -1797958 -1440097
40367 -1440097 -1125894 -868256 -656507 -521605 -515122 -639209 -818498 -940890 -917245 -716154
40357 -716154 -375290 7029 313733 469682 466078 324856 57325 -320456 -738063 -1069275
40347 -1069275 -1207916 -1151637 -1006320 -904651 -915445 -1018571 -1147594 -1242738 -1269492 -1213400
40337 -1213400 -1083969 -928186 -823664 -839616 -992169 -1228655 -1454640 -1592736 -1636794 -1650830
40327 -1650830 -1699061 -1770840 -1784764 -1670223 -1434544 -1150338 -894543 -703836 -567371 -450054
40317 -450054 -341263 -294973 -400873 -692654 -1097995 -1500308 -1837088 -2120512 -2390676 -2690363
40307 -2690363 -3065553 -3527642 -4004071 -4380349 -4617856 -4790824 -4978785 -5157766 -5231555 -5142584
40297 -5142584 -4918087 -4635570 -4386909 -4254980 -4267348 -4362567 -4432019 -4394525 -4208084 -3836331
40287 -3836331 -3267239 -2571235 -1881375 -1288855 -796919 -393353 -111083 25957 69320 90051
40277 90051 69526 -89147 -426509 -847072 -1194556 -1378776 -1410031 -1333815 -1164144 -883657
40267 -883657 -492101 -39651 396179 765370 1064615 1297753 1439104 1460395 1383754 1275973
40257 1275973 1182396 1086579 942454 728784 464021 185047 -74027 -287992 -433794 -478854
40247 -478854 -388445 -166153 115833 356656 508705 595115 630712 554019 270490 -246399
40237 -246399 -922154 -1637088 -2283596 -2777877 -3067430 -3159421 -3124564 -3046693 -2967560 -2883841
40227 -2883841 -2778958 -2639797 -2458287 -2249122 -2071117 -2005364 -2092163 -2291225 -2505756 -2634838
40217 -2634838 -2603403 -2375745 -1982170 -1535729 -1182466 -995196 -910239 -783059 -512613 -110623
40207 -110623 338999 764741 1141433 1457211 1676751 1758171 1708463 1608930 1568797 1645770
40197 1645770 1813216 1999839 2144570 2206277 2142570 1911420 1502096 953840 345746 -218504
40187 -218504 -627209 -804748 -770151 -641733 -559302 -596066 -745097 -966107 -1214496 -1432471
40177 -1432471 -1555402 -1556247 -1473223 -1371994 -1279660 -1167667 -998585 -774454 -529826 -284974
40167 -284974 -21179 290118 638917 968869 1226128 1415813 1602700 1847303 2137326 2384463
40157 2384463 2491941 2424392 2211876 1898028 1503910 1046515 573351 161916 -109107 -181963
40147 -181963 -35629 291849 706935 1123682 1530025 1960621 2397581 2742151 2915283 2952561
40137 2952561 2954684 2961118 2920999 2783796 2565677 2313586 2053169 1802604 1602318 1491597
40127 1491597 1473667 1537197 1694905 1958692 2281577 2570426 2769247 2891184 2942762 2847801
40117 2847801 2493018 1856649 1070482 343782 -173610 -469034 -640665 -807993 -1029666
40108 -1029666 -1279392 -1483587 -1577681 -1531705 -1338454 -997748 -519954 63453 700981 1330487
40098 1330487 1886362 2308393 2558510 2634867 2567536 2398546 2164261 1892282 1609232 1345047
40088 1345047 1120854 928145 730644 504020 273478 94490 -7724 -61999 -110533 -168709
40078 -168709 -234960 -304931 -343066 -268850 -27557 320263 621243 753328 699891 502659
40068 502659 192104 -209507 -652245 -1058237 -1339601 -1408237 -1218257 -842767 -473009 -278275
40058 -278275 -266687 -320058 -347694 -351301 -347741 -303771 -182052 -6539 158075 272580 347629
40047 347629 428370 580995 871371 1320945 1883163 2474400 3014538 3427330 3633085 3586348
40037 3586348 3329686 2991019 2715057 2586655 2597128 2670842 2741255 2817641 2962547 3189051
40027 3189051 3405495 3493799 3427059 3270939 3075028 2810413 2432369 1970050 1522650 1175530
40017 1175530 937550 754620 571000 380291 227605 165616 207085 316598 438540 527721
40007 527721 568578 586565 636211 752864 909548 1037315 1090407 1075424 1023274 968335 964337
39996 964337 1076166 1314197 1590167 1772523 1785923 1642992 1402124 1133533 915325 806259
39986 806259 798019 828100 867165 969525 1205256 1554479 1900252 2125331 2194181 2146468 2046238
39975 2046238 1951805 1903973 1905022 1907051 1848959 1723661 1597891 1541391 1527955 1422125 1084475
39964 1084475 495497 -226955 -921205 -1474693 -1837057 -1992873 -1964346 -1831252 -1707293 -1676187
39954 -1676187 -1755852 -1919738 -2130340 -2346309 -2521566 -2619726 -2625499 -2532089 -2323547 -1979306
39944 -1979306 -1494118 -892100 -231204 402470 922999 1289081 1523810 1686196 1829662
39935 1829662 1994229 2222527 2551779 2969583 3376699 3606802 3511753 3065276 2401268 1733184
39925 1733184 1207539 824996 498707 170225 -142326 -381071 -491962 -435753 -202164 156758
39915 156758 521068 755043 773884 571283 211518 -186055 -477387 -558291 -432687 -215781
39905 -215781 -48787 6875 -4223 -7421 13732 18477 -15588 -56170 -71396 -87280 -149332 -236135
39893 -236135 -254856 -138442 75105 271621 352784 298350 169022 70026 92145 256144
39883 256144 506934 769284 1008875 1238588 1477748 1717360 1922573 2061743 2130252 2140041
39873 2140041 2082299 1921068 1657988 1403531 1336661 1549866 1935008 2244008 2269459 1974087
39863 1974087 1478351 956324 534368 247676 64805 -49349 -94117 -57199 34445 112790
39853 112790 131720 123344 173772 333798 559229 750600 850828 888118 917546 943067 918077
39842 918077 805721 608027 346884 58509 -189422 -320198 -311640 -212842 -85225 41781
39832 41781 144785 184739 149944 87241 44178 1030 -92194 -223725 -315104 -310283 -230153
39821 -230153 -134924 -68003 -42788 -53239 -89683 -167908 -341631 -656827 -1091749 -1566543 -2003014
39810 -2003014 -2339170 -2500812 -2429316 -2166906 -1867681 -1683702 -1655086 -1719471 -1785711 -1772572
39800 -1772572 -1625081 -1352869 -1041510 -780999 -581449 -385307 -154478 82232 257290
39791 257290 305962 187194 -90808 -444997 -741409 -872585 -821955 -661961 -498413 -403475
39781 -403475 -374833 -350959 -278496 -169015 -81040 -49948 -54160 -56247 -61642 -124322 -300436 -604921
39769 -604921 -1008757 -1465728 -1934963 -2383425 -2782999 -3118633 -3394095 -3611910 -3743281 -3734080
39759 -3734080 -3551442 -3214225 -2769295 -2253331 -1696583 -1155334 -713367 -436443 -325891
39750 -325891 -315617 -310695 -236396 -67693 173363 441861 694746 908644 1092233 1278689
39740 1278689 1486559 1685735 1822566 1882396 1899689 1893560 1824938 1646304 1372126 1066886
39730 1066886 780192 533815 363340 319976 412287 579502 745706 883475 1012651 1158906
39720 1158906 1329737 1510617 1662078 1731523 1688830 1548921 1351448 1128548 902871 703233
39710 703233 561733 495728 499975 547557 589855 575032 496713 425894 469362 680373 1012921
39699 1012921 1361255 1630387 1769357 1765693 1639850 1448347 1268384 1153921 1097144 1037421
39689 1037421 917240 737157 561244 471329 512359 670411 890203 1109575 1282640 1375996
39679 1375996 1347886 1142389 718633 89900 -672214 -1470448 -2205624 -2770568 -3055209 -2998801
39669 -2998801 -2648619 -2152565 -1681184 -1348713 -1187200 -1164468 -1216849 -1285598 -1343344 -1386276
39659 -1386276 -1399284 -1343287 -1190682 -966638 -742548 -590756 -550432 -621898 -768660 -921427
39649 -921427 -1001332 -960015 -808434 -618921 -503434 -562808 -812027 -1139480 -1368059 -1388260
39639 -1388260 -1235972 -1038609 -900775 -848636 -852575 -860985 -813479 -664768 -427578 -185098
39629 -185098 -41023 -49271 -189536 -401058 -629570 -842407 -1011290 -1098815 -1074755 -942229
39619 -942229 -732850 -472439 -167242 165413 465774 645905 631086 387993 -55452 -585082
39609 -585082 -1012712 -1167356 -1006553 -637758 -236648 45045 123706 5126 -210892 -389184
39599 -389184 -466882 -499379 -587442 -778005 -1047761 -1346641 -1618806 -1805008 -1878305 -1882695 -1895463
39588 -1895463 -1933692 -1923451 -1782331 -1523579 -1265228 -1133924 -1155283 -1231955 -1232495 -1104677 -890657
39577 -890657 -632570 -304325 123576 575464 890832 973892 885377 763394 683472 622652
39567 622652 532201 399916 239832 54962 -170424 -447641 -758508 -1051279 -1263954 -1358065
39557 -1358065 -1331923 -1205966 -1008450 -780850 -580767 -455416 -401590 -354090 -221531 49168
39547 49168 421009 774876 993182 1060862 1082485 1184838 1400322 1650739 1835019 1913495
39537 1913495 1906802 1837926 1699521 1479395 1202813 935175 738011 624439 559077 497096
39527 497096 420387 344988 307211 339611 440286 556448 614410 583549 505104 443083 410010
39516 410010 357176 239861 76291 -67782 -145274 -168204 -183400 -216794 -247065 -230450 -141755
39505 -141755 12704 210577 426059 631352 806658 954280 1083629 1174372 1181490 1103532
39495 1103532 1029987 1084669 1315129 1653613 1978019 2181506 2189625 1966167 1545213 1043141
39485 1043141 605164 331630 254129 355003 581474 853797 1096733 1277106 1403733 1497035
39475 1497035 1572716 1643688 1711246 1754243 1749190 1700575 1625800 1506295 1281244 903369 384087
39464 384087 -221208 -845793 -1416244 -1854020 -2104349 -2160380 -2049596 -1814331 -1519912 -1253474
39454 -1253474 -1074338 -965307 -859136 -716897 -565566 -463581 -448044 -509771 -596667 -642203
39444 -642203 -613561 -536674 -459450 -394055 -318339 -237049 -218251 -353627 -680652 -1130626 -1539715
39433 -1539715 -1734809 -1655092 -1401463 -1142214 -964775 -840098 -719655 -614545 -560727 -552183
39423 -552183 -547073 -520429 -484255 -472153 -522243 -649767 -810782 -916437 -913930 -835700 -741037
39412 -741037 -633402 -476087 -273411 -86185 37810 111664 182184 286849 443320 650986
39402 650986 892931 1159364 1470930 1845589 2228409 2483741 2485757 2217800 1784425 1342066
39392 1342066 1014327 839670 775286 758311 773363 854961 1026755 1258063 1483912 1646320
39382 1646320 1708818 1656199 1500759 1279643 1037672 825698 715218 775448 998013 1251180
39372 1251180 1340396 1131766 626165 -63864 -791506 -1447919 -1994593 -2440038 -2781109 -2974101
39362 -2974101 -2978893 -2827191 -2622568 -2457652 -2337097 -2190238 -1954477 -1636185 -1290653 -957587
39352 -957587 -633020 -302582 21670 315621 579027 827432 1049345 1205671 1288726 1355364
39342 1355364 1471858 1635537 1778331 1847028 1855795 1852944 1854518 1821718 1693350 1432860 1055522
39331 1055522 623460 208922 -153682 -485002 -821714 -1152985 -1399805 -1465521 -1308630 -966503
39321 -966503 -520356 -54602 354609 646363 801283 853331 848743 790453 644800 408773
39311 408773 147086 -54504 -159737 -189967 -173980 -113753 114 164692 374094 640334
39301 640334 977005 1348682 1651253 1771519 1683591 1482300 1310665 1250014 1276061 1308454
39291 1308454 1293312 1246336 1232300 1307503 1477101 1703025 1942165 2159915 2311163 2346850
39281 2346850 2271164 2177019 2190570 2378064 2721917 3167631 3649933 4071750 4308448 4269411
39271 4269411 3947029 3397232 2692553 1905705 1116064 409479 -128538 -430050 -489058 -397346
39261 -397346 -295901 -256266 -224668 -105781 115020 354772 520747 592210 632867 748270
39251 748270 1011046 1388801 1746963 1950324 1962163 1831744 1614192 1349423 1105139 970151
39241 970151 971106 1028639 1024836 897689 660552 367363 92203 -82954 -107958 1522 189271
39230 189271 411596 643598 846077 969721 1007613 1015584 1058962 1154085 1277474 1410840
39220 1410840 1544453 1640899 1632476 1476626 1205006 908090 680351 586658 662510 915435
39210 915435 1311554 1767925 2172618 2427236 2484747 2354856 2074018 1673424 1180858 643558
39200 643558 125135 -328274 -701681 -985102 -1161664 -1245631 -1311517 -1448636 -1684718 -1972353
39190 -1972353 -2240233 -2432385 -2512596 -2476914 -2370614 -2255985 -2150088 -2026422 -1889492 -1804483
39180 -1804483 -1818876 -1881726 -1881652 -1758620 -1549420 -1327746 -1128811 -940229 -750793 -599040
39170 -599040 -572985 -751390 -1132595 -1623296 -2104393 -2504432 -2806831 -3000205 -3042117 -2883231
39160 -2883231 -2532109 -2090661 -1700108 -1429099 -1229784 -1031764 -860076 -810814 -915848 -1097672
39150 -1097672 -1280230 -1481573 -1751852 -2067580 -2344053 -2521652 -2581159 -2492945 -2213949 -1738823
39140 -1738823 -1113896 -406504 300256 898503 1301444 1506774 1570552 1516866 1324699 1009840
39130 1009840 654143 315993 -46066 -517689 -1116762 -1765342 -2351489 -2788535 -3032395
39121 -3032395 -3084826 -2993071 -2828380 -2648677 -2475624 -2305434 -2146715 -2050630 -2085517 -2257508
39111 -2257508 -2464146 -2557719 -2460187 -2195651 -1817821 -1348774 -804302 -241261 254184 614982
39101 614982 816521 871426 819640 708785 568531 417456 302481 300869 452536 703135
39091 703135 942092 1093684 1153820 1150206 1097430 996872 862093 734457 673402 716027 824436
39080 824436 876996 741525 381222 -105883 -551213 -822274 -889059 -822551 -746453 -771735
39070 -771735 -940766 -1210272 -1487435 -1692812 -1796536 -1802934 -1719820 -1562257 -1379243 -1241859
39060 -1241859 -1179304 -1136075 -1014460 -761792 -408305 -29549 309108 574828 760223 870338
39050 870338 915727 915743 902484 901939 897615 828975 650447 388067 118491 -103374 -277393 -428691
39038 -428691 -574455 -722105 -876398 -1042638 -1236812 -1483829 -1777341 -2043399 -2178777 -2139149
39028 -2139149 -1972512 -1767335 -1594062 -1490432 -1453640 -1424552 -1318207 -1105214 -846986 -629265
39018 -629265 -480213 -375205 -299206 -270265 -306214 -392178 -482351 -523992 -486546 -376299 -215988
39007 -215988 -11105 242628 515516 741434 880437 959070 1025286 1087873 1131390 1173238
38997 1173238 1270802 1476506 1805690 2229208 2664291 2990689 3126295 3094042 2978536 2813217
38987 2813217 2551859 2163758 1710027 1290393 945107 654263 420365 298447 327198 464957
38977 464957 624452 759745 894842 1069164 1275183 1453265 1533522 1481090 1318627 1114102
38967 1114102 934660 803622 709478 652257 653391 709900 771998 795897 799063 831856 909246
38956 909246 1001017 1068857 1067379 922164 572516 59175 -471980 -880681 -1128449 -1264169
38946 -1264169 -1353849 -1436369 -1505909 -1513477 -1415193 -1232952 -1029008 -806307 -488597 -36397
38936 -36397 466003 891539 1203964 1453982 1666855 1798751 1801606 1676243 1456041 1185673
38926 1185673 927417 747602 674033 680335 710153 695978 569461 302157 -48736 -366229
38916 -366229 -563619 -637372 -636179 -610782 -603599 -655349 -794551 -1023360 -1316332 -1621916 -1870364
38905 -1870364 -2008848 -2043871 -2037664 -2055845 -2126667 -2246168 -2398392 -2560553 -2706716 -2824455
38895 -2824455 -2927811 -3048777 -3210066 -3389151 -3495877 -3403986 -3041283 -2461477 -1813429 -1233150
38885 -1233150 -770079 -404501 -105915 135816 318235 449268 560429 688663 832590
38876 832590 935435 933516 823538 667505 535496 462960 457951 517315 622627 741526 850237
38865 850237 946968 1036453 1110787 1149521 1127327 1017407 799246 470535 47618 -442804
38855 -442804 -960437 -1439291 -1791669 -1933000 -1810523 -1430238 -878470 -308295 126551 341361
38845 341361 327831 112680 -261185 -716124 -1142631 -1449877 -1610326 -1647750 -1589753 -1436944
38835 -1436944 -1169347 -777199 -290898 216495 658939 968505 1102076 1041967 812829 488965
38825 488965 160255 -114134 -314265 -440090 -503602 -521850 -486308 -351876 -94307 228685
38815 228685 519274 745648 957785 1183932 1366351 1439384 1433757 1451418 1547695 1679140
38805 1679140 1764023 1756587 1657897 1492615 1300593 1133568 1029086 978423 933735 863605 804435
38794 804435 843208 1035125 1340489 1652862 1885749 2020348 2077981 2076729 2031617 1980283 1979252
38783 1979252 2057341 2167806 2193525 2021878 1637965 1146635 692172 355308 128928 -29344
38773 -29344 -151523 -259126 -370646 -491765 -611913 -714014 -770274 -731919 -560152 -289317
38763 -289317 -37591 74114 16870 -133899 -264953 -296678 -211911 -43353 161585 370713
38753 370713 566467 728607 842474 930931 1051160 1234903 1442128 1597393 1671649 1710662
38743 1710662 1779885 1895316 2015535 2092422 2118128 2121887 2132846 2159541 2202990 2266388 2332490
38732 2332490 2342031 2222682 1952767 1592452 1251809 1028826 959449 1000305 1059322 1067964 1034665
38721 1034665 1016003 1035449 1051874 1014923 927547 834199 758760 673731 529992 305155 20265
38710 20265 -286030 -596158 -923130 -1280661 -1652512 -1999397 -2286208 -2487633 -2578312 -2547197
38700 -2547197 -2426658 -2278459 -2130574 -1943604 -1664491 -1313451 -998913 -833572 -835510 -915793
38690 -915793 -963244 -935266 -862114 -776669 -666065 -495887 -252202 61366 445443 888653
38680 888653 1332137 1678545 1846186 1807933 1589920 1258594 908829 635576 496590 501058
38670 501058 629296 852962 1139139 1446488 1720759 1900764 1953103 1916207 1889471 1952479
38660 1952479 2099711 2265879 2397045 2478695 2517648 2526835 2512829 2450368 2287207 2008892
38650 2008892 1687561 1437802 1342085 1449153 1807739 2429397 3212800 3959591 4485420 4696858
38640 4696858 4583608 4198876 3657685 3102746 2644926 2347263 2240647 2301100 2425086 2499886
38630 2499886 2511697 2525224 2548206 2489551 2281049 1973001 1661942 1372103 1059068 700971
38620 700971 342957 68389 -46611 31532 281414 657633 1126303 1635914 2069816 2305950
38610 2305950 2354860 2379320 2534765 2828367 3160438 3447947 3662935 3802441 3887920 3974591
38600 3974591 4108542 4281044 4455708 4622447 4793976 4971655 5154866 5375749 5688668
38591 5688668 6110831 6570470 6910684 6974106 6739337 6386009 6184974 6304814 6734619 7355306
38581 7355306 8013126 8545974 8860604 9040563 9307112 9823497 10587496 11535703 12667612
38572 12667612 14019836 15599636 17405484 19445375 21682582 24040773 26504085 29069557
38564 29069557 31461162 32992796 32940548 31127195 28078427 24612628 21349037 18556327
38556 18556327 16281396 14499766 13179910 12280711 11715784 11344435 11036662 10753256 10542075
38547 10542075 10460259 10508401 10608455 10619830 10415002 9984375 9450519 8956763 8573375 8327167
38537 8327167 8256872 8385994 8683398 9093535 9559617 9983900 10240640 10298217 10277346 10326518
38527 10326518 10488127 10734808 11062180 11472574 11936454 12453013 13091715 13901461 14847531
38518 14847531 15913712 17182918 18721948 20467347 22330000 24336590 26563530 29016257
38510 29016257 31689043 34655436 37974439 41600522 45526871 49935926 55085437 61159571
38502 61159571 68366947 77029095 87378929 99412527 113139048 128814807 146732780
38495 146732780 167056396 190228710 217348590 249760362 288422907 333725219 384641205
38488 384641205 436223156 477970947 497238162 486964006 450852284 400632570 348302083
38481 348302083 300791549 260194469 226405701 198562637 175304459 155272231 137707489
38474 137707489 122335445 108893823 97106820 86904447 78287981 71038266 64783410
38467 64783410 59260071 54319289 49796477 45585752 41758277 38418130 35500473 32861877
38459 32861877 30491486 28469006 26767553 25251618 23840204 22546152 21382584 20340118
38451 20340118 19427332 18632984 17872872 17060911 16208693 15387573 14635542 13970225 13431666
38442 13431666 13012737 12587246 12014043 11308336 10637144 10156553 9912051 9870788 9973851
38433 9973851 10155508 10358278 10523272 10546703 10299383 9748960 9031363 8347558 7814680 7448338
38423 7448338 7220390 7052906 6802915 6358807 5758594 5154234 4669901 4344523 4173954
38414 4173954 4119003 4079389 3953108 3750874 3597853 3608728 3812344 4204324 4801795 5601263
38404 5601263 6513370 7370367 7986409 8215719 8006318 7440957 6712269 6020940 5474768
38395 5474768 5064105 4704166 4291552 3749624 3061300 2279034 1497699 798759 205083
38386 205083 -309650 -760179 -1105510 -1281665 -1275456 -1143160 -948469 -699017 -355685 102339
38376 102339 624729 1097304 1412504 1551516 1592307 1620880 1646298 1624036 1543294 1453842 1418695
38365 1418695 1481557 1666579 1950344 2227942 2364314 2301559 2082213 1772713 1427040 1133719
38355 1133719 1016003 1134211 1431623 1808864 2199958 2542380 2741892 2737741 2566874 2301426
38345 2301426 1950613 1486982 952145 473452 170983 79837 146725 261371 309621 252935
38335 252935 167023 173749 330602 595368 871986 1061394 1095079 967127 732378 451204
38325 451204 156515 -99623 -207429 -70698 286876 731223 1130581 1423739 1595639 1649749
38315 1649749 1622091 1578577 1568049 1588628 1608764 1614495 1640812 1761431 2022325 2359594 2604019
38304 2604019 2605098 2350954 1952703 1535089 1168665 873370 629153 386685 117667 -135075
38294 -135075 -288587 -305264 -226350 -129976 -83125 -119650 -225217 -346054 -443091 -530541 -635070
38283 -635070 -739158 -805759 -834822 -836662 -761751 -526880 -122661 358069 804157 1142005
38273 1142005 1309145 1260421 1046758 825787 731942 761613 824692 873335 928912 1004958 1060097
38262 1060097 1029470 869177 575238 197736 -154406 -352220 -318504 -76542 258144 535281
38252 535281 650254 603209 488565 421578 471816 649461 915483 1183748 1341696 1311243
38242 1311243 1098058 769401 389220 -11231 -411882 -785699 -1112201 -1386322 -1591319
38233 -1591319 -1669024 -1544987 -1204396 -739301 -302741 -10179 105867 53023 -170438 -556241
38223 -556241 -1039007 -1506393 -1860861 -2057559 -2097364 -2018809 -1897678 -1817565 -1820656 -1898187 -2027268
38212 -2027268 -2191041 -2357000 -2464324 -2451209 -2283769 -1955849 -1484759 -920362 -341291 170952
38202 170952 549095 743866 748902 634831 523622 497101 539745 586858 615116 670410 817708
38191 817708 1071422 1356290 1530309 1481670 1235072 945038 754904 673772 615588 536291
38181 536291 486868 533985 674763 845771 980438 1033255 975920 811037 591355 397108
38171 397108 278844 230096 221242 247047 326696 465538 641874 841596 1087350 1414177
38161 1414177 1824946 2287870 2766406 3218533 3562265 3680671 3497723 3050108 2470631
38152 2470631 1898999 1404131 969671 534028 51688 -464064 -951442 -1353672 -1656366
38143 -1656366 -1870698 -1997510 -2025892 -1959921 -1827852 -1664466 -1498537 -1358643 -1275734 -1270426
38133 -1270426 -1342247 -1474753 -1646169 -1832072 -2004043 -2133137 -2193545 -2156065 -1979302 -1625339
38123 -1625339 -1106054 -513026 25921 440283 756046 1026487 1242115 1340123 1296134 1169174
38113 1169174 1047358 979157 967316 993591 1023035 1010434 940018 855481 827200 887163 1002249
38102 1002249 1100477 1117057 1036993 911790 818666 786613 781095 774863 795910 866358 926601
38091 926601 883900 732660 567135 465035 415010 381072 384124 478289 680228 960531 1276487
38080 1276487 1569961 1753610 1753309 1573796 1296426 1010692 763764 559044 365673 130177
38070 130177 -185155 -561626 -933079 -1225370 -1364881 -1272690 -912421 -360939 214452 679128
38060 679128 1008560 1234791 1363984 1381726 1300181 1148327 936538 685521 482538 448572
38050 448572 629334 954530 1320618 1680940 2036035 2368865 2625075 2748703 2716264 2544963
38040 2544963 2290764 2039055 1877207 1856748 1966950 2135374 2263123 2283978 2201953 2065120
38030 2065120 1902132 1696249 1421088 1083620 724934 390667 101980 -160473 -444089
38021 -444089 -773002 -1103030 -1348672 -1458142 -1433710 -1274611 -948711 -458372 92692 543933
38011 543933 792748 853399 824651 824778 932210 1140293 1362295 1503295 1527020 1443749 1264413
38000 1264413 1008218 737408 530252 414429 365566 367795 425341 508961 550330 517914 453249
37989 453249 399738 335981 220737 73173 -38727 -73148 -35937 56277 180626 273107 245704
37978 245704 75810 -139577 -248405 -166014 68969 345895 573040 725224 828031 915990
37968 915990 1005088 1089111 1152138 1190826 1227669 1282983 1314708 1204889 847452 259227 -422631
37957 -422631 -1060350 -1602721 -2045374 -2353198 -2470263 -2394794 -2204523 -2002593 -1855916 -1775431
37947 -1775431 -1724561 -1645403 -1507364 -1345534 -1238642 -1241734 -1345689 -1493139 -1610250 -1624513
37937 -1624513 -1488667 -1220140 -916472 -713353 -710221 -916819 -1250367 -1580733 -1798836 -1866134
37927 -1866134 -1813046 -1699845 -1581701 -1492027 -1428522 -1348144 -1200109 -983315 -763340 -622800
37917 -622800 -605634 -715945 -941723 -1240881 -1509269 -1609804 -1465640 -1114778 -657292 -162849
37907 -162849 349314 853305 1279321 1553003 1658924 1648850 1587541 1496343 1350480 1130653
37897 1130653 872921 652600 508542 402303 281749 174832 172469 301333 456299 496491
37887 496491 384585 194079 -967 -196317 -423779 -692638 -968668 -1171395 -1189064 -949458
37877 -949458 -507727 -35959 302688 458316 473725 406675 305414 226980 229136 347716
37867 347716 612349 1072488 1762582 2626529 3500215 4186657 4552875 4576270 4336131 3973868
37857 3973868 3634386 3407759 3303036 3266461 3223740 3116185 2911558 2593825 2164041 1675524
37847 1675524 1260919 1075796 1172895 1438416 1681970 1795304 1814089 1838368 1918959 2018073
37837 2018073 2050767 1953350 1731485 1460845 1238800 1122861 1102053 1114053 1089634 1001972
37827 1001972 893149 847664 924473 1112355 1349538 1568234 1710009 1724637 1589942 1334913
37817 1334913 1026335 735237 523654 437577 473382 552606 565006 452843 247424 35927
37807 35927 -85205 -43730 166952 458803 690925 765543 679805 489641 250739 743
37797 743 -230219 -410187 -496121 -437086 -216578 100215 393177 581806 678928 748606 842107
37786 842107 983540 1175212 1386370 1565697 1695358 1805599 1902875 1915316 1764869 1488493
37776 1488493 1239382 1155166 1246720 1408718 1504706 1449335 1260704 1055274 959241 1001616
37766 1001616 1114020 1244366 1432062 1737588 2122300 2443717 2574791 2503066 2311793 2093007
37756 2093007 1893919 1727074 1600637 1523386 1483826 1439451 1346221 1210769 1105900 1114074
37746 1114074 1244613 1414786 1525023 1552734 1564317 1636723 1779660 1936875 2043692 2063865
37736 2063865 1983037 1803449 1561662 1325795 1141717 981813 770465 467551 111058 -229856
37726 -229856 -526125 -795586 -1047102 -1241664 -1320426 -1262920 -1105847 -905337 -691741 -466442
37716 -466442 -231234 -1982 210480 415731 623455 812778 939975 983147 968747 944637
37706 944637 930419 899902 808111 628079 364979 50089 -265935 -517245 -639749 -603793
37696 -603793 -434612 -190067 89482 403113 754152 1103322 1378341 1537492 1609661 1659929
37686 1659929 1725612 1800685 1872636 1945175 2014706 2049927 2021301 1941439 1846041 1730899 1540516
37675 1540516 1245208 914525 680492 618577 680417 750134 752284 696533 634921 600702 591639
37664 591639 593049 598326 606225 613399 627605 691694 874304 1206917 1619879 1961274 2107287
37653 2107287 2061981 1938366 1836439 1747414 1580811 1272234 849047 395626 -19875 -366620
37643 -366620 -615193 -717719 -644450 -428043 -150777 112255 325402 475789 553346 562542
37633 562542 534854 501080 448946 331043 130744 -90192 -232210 -254989 -224451 -253541 -401305
37622 -401305 -636715 -885885 -1086259 -1195568 -1190565 -1092938 -981293 -940382 -994992 -1114226
37612 -1114226 -1269391 -1445606 -1589415 -1592878 -1368954 -931022 -379019 174624 645357 972104
37602 972104 1122289 1114300 1017874 926070 922525 1041506 1222832 1322591 1220683 933673 593391
37591 593391 307329 72201 -167056 -419299 -645806 -833994 -1030183 -1294550 -1642043 -2025892
37581 -2025892 -2364620 -2591198 -2695403 -2721714 -2716926 -2680923 -2574402 -2368339 -2080033 -1773124
37571 -1773124 -1532262 -1417484 -1413553 -1424827 -1343791 -1131964 -824619 -467591 -81485 304929
37561 304929 619378 775613 737905 549466 310400 137997 122760 279523 529101 754263
37551 754263 896630 992378 1105758 1250708 1405071 1583226 1840639 2189053 2553605 2854054
37541 2854054 3094071 3308417 3433656 3313863 2877810 2266088 1733347 1441518 1377115 1434370
37531 1434370 1518597 1576857 1594406 1592958 1606729 1641418 1669355 1664769 1622031 1543288 1439693
37520 1439693 1343835 1280984 1219858 1095667 903155 728720 662603 710041 813750 922595
37510 922595 991545 942849 692179 225532 -377896 -994908 -1501940 -1787892 -1785110 -1518927
37500 -1518927 -1108102 -699261 -401980 -270777 -312467 -496388 -772700 -1086515 -1368808 -1534941
37490 -1534941 -1530971 -1384514 -1180852 -985895 -816347 -673214 -556152 -441565 -305821 -198425
37480 -198425 -240044 -497651 -886967 -1244217 -1482439 -1643187 -1812814 -2031446 -2272698 -2456762
37470 -2456762 -2465569 -2184527 -1567604 -670757 370818 1389901 2236502 2830473 3187331
37461 3187331 3372117 3412176 3269346 2909435 2382773 1816648 1332265 981556 759320 653180
37451 653180 660869 757245 864177 879207 743613 471907 110887 -309127 -763001 -1186956
37441 -1186956 -1483993 -1592873 -1546225 -1453585 -1427039 -1515455 -1693236 -1899127 -2081963 -2212512
37431 -2212512 -2267206 -2224343 -2082349 -1863099 -1588674 -1276488 -968988 -733184 -590476 -461346
37421 -461346 -225214 157290 607295 1006595 1276563 1383160 1323880 1146742 950768 824365
37411 824365 784354 791531 813669 856567 948641 1116122 1361251 1641590 1876144 1990449 1952594
37400 1952594 1757780 1401595 902980 349207 -120710 -403663 -504759 -523461 -573051 -705251
37390 -705251 -896613 -1102775 -1324446 -1605045 -1952604 -2286699 -2499046 -2569666 -2595943 -2697557
37380 -2697557 -2910625 -3177148 -3408215 -3539152 -3545772 -3438162 -3240735 -2967139 -2620918 -2232261
37370 -2232261 -1882016 -1663837 -1615273 -1696228 -1834989 -1980963 -2110394 -2202851 -2237800 -2221989
37360 -2221989 -2213638 -2309471 -2592704 -3071317 -3649620 -4161983 -4455273 -4465521 -4236202 -3873024
37350 -3873024 -3477953 -3110087 -2787286 -2507754 -2263885 -2039899 -1806743 -1530627 -1193829
37341 -1193829 -810353 -424220 -96490 106964 127309 -66602 -450725 -931891 -1370868 -1644606
37331 -1644606 -1714892 -1648334 -1557863 -1507721 -1472279 -1389482 -1242187 -1069953 -908057 -743372
37321 -743372 -540647 -289168 -4702 295977 592000 832561 945846 893565 712249 495665
37311 495665 341133 307711 401127 573885 738175 801406 721361 550224 423836 482245
37301 482245 772339 1216347 1672502 2020535 2195247 2175596 1985481 1708351 1463907 1340637
37291 1340637 1350301 1449027 1587982 1737589 1883088 2017894 2136274 2216097 2209664 2067194
37281 2067194 1779477 1398555 1016648 721735 562498 543076 643265 838470 1099801 1386990
37271 1386990 1658773 1892326 2076845 2178569 2123592 1835000 1300707 612805 -60503 -561917
37261 -561917 -836424 -954040 -1036788 -1153137 -1277122 -1334551 -1271115 -1085564 -832039 -603133
37251 -603133 -478974 -457226 -434844 -282830 46743 481156 883724 1151682 1280349 1347184
37241 1347184 1425133 1503721 1504729 1377246 1155595 914163 692228 484637 281340 83183
37231 83183 -104849 -255975 -299954 -158032 186572 669219 1190698 1657671 1983881 2100564
37221 2100564 1997340 1738724 1424429 1144305 972630 967228 1133223 1390292 1606419 1682402
37211 1682402 1604635 1417990 1156077 808888 369884 -87029 -407754 -474176 -325069 -131546
37201 -131546 -36228 -33041 -12352 104623 297752 486398 596161 592136 482421 304468 94786
37190 94786 -136500 -395768 -671594 -918834 -1076778 -1100598 -989074 -800031 -631076 -555169
37180 -555169 -558167 -546446 -423798 -161564 195374 568715 886006 1099686 1189069 1151819
37170 1151819 1001636 786892 607386 586088 804304 1265738 1916307 2663992 3360027 3804246
37160 3804246 3840234 3467395 2828979 2080241 1304620 567899 -18071 -368672 -554675 -777017
37150 -777017 -1172293 -1675879 -2105183 -2346601 -2427314 -2434102 -2415957 -2363432 -2233962 -1981897
37140 -1981897 -1601495 -1169067 -826133 -694476 -799818 -1066127 -1355339 -1508302 -1395968
37131 -1395968 -990304 -399532 189701 625858 865681 967148 1036781 1164430 1357718 1517446
37121 1517446 1505792 1271572 904242 544961 248724 -45677 -409236 -806520 -1092513 -1113962
37111 -1113962 -817656 -290131 286312 737139 999143 1142181 1281573 1466886 1664543
37102 1664543 1835025 1987551 2143151 2276418 2325760 2245704 2020811 1647207 1148047 610611
37092 610611 160929 -124439 -256439 -266791 -138437 157472 570119 962054 1211989 1309542
37082 1309542 1342149 1402925 1516252 1636207 1699554 1679054 1596676 1501871 1450469 1495910 1664766
37071 1664766 1909761 2096696 2075566 1788938 1311412 784743 323789 -20845 -240485 -342302
37061 -342302 -352836 -330041 -345287 -433813 -563334 -666595 -708662 -706283 -676588 -594208 -421446
37050 -421446 -158519 168910 555380 1002269 1457962 1818389 2004718 2007025 1842330 1523123
37040 1523123 1104299 713319 465393 355120 286377 214483 208761 353268 621515 880337
37030 880337 1005658 977430 871614 777225 723744 684459 640403 616700 639222 679335 681222
37019 681222 639168 605893 618101 656656 696137 747346 814805 844424 758289 530736 200264
37008 200264 -175872 -541803 -833829 -1002470 -1053958 -1037765 -986845 -900346 -789138 -698513
36998 -698513 -662874 -662566 -648932 -596969 -512921 -400326 -238026 9806 369686 835534 1356113
36987 1356113 1848989 2238840 2488577 2598977 2585850 2456998 2205683 1833123 1387448 965189
36977 965189 643000 406084 175803 -79834 -292205 -368710 -301817 -180000 -109706 -153136
36967 -153136 -326431 -616869 -986517 -1374444 -1709185 -1927796 -2002393 -1963436 -1883506 -1815478
36957 -1815478 -1749176 -1641629 -1475313 -1259038 -979330 -590827 -73406 517580 1067238 1453500
36947 1453500 1587899 1448759 1115075 757696 550751 558386 706479 874568 1016743 1187339
36937 1187339 1448057 1761055 1990173 2014563 1831957 1539669 1222170 877997 463247 -12866
36927 -12866 -460997 -785978 -974997 -1097501 -1217480 -1319601 -1333893 -1228116 -1059449 -928844
36917 -928844 -892758 -923219 -942384 -887293 -753014 -592791 -479670 -454730 -500657 -562355 -594157
36906 -594157 -592058 -589927 -629316 -724597 -842971 -911903 -854149 -636660 -307588 14826 220491
36895 220491 302549 363595 499588 685481 810095 819353 775052 755085 744685 664318 470946
36884 470946 186933 -148369 -506255 -857810 -1183185 -1492828 -1798648 -2059683 -2195830 -2170480
36874 -2170480 -2037688 -1906128 -1879884 -2020625 -2313040 -2649462 -2891807 -2980659 -2964658 -2909605
36864 -2909605 -2808223 -2596875 -2227431 -1695170 -1028595 -298218 372127 845813 1047793
36855 1047793 1001518 804107 572671 392774 287684 228056 171848 86671 -61354 -306735
36845 -306735 -649592 -1040513 -1422398 -1769754 -2062067 -2239382 -2227411 -2012087 -1664415 -1289999
36835 -1289999 -973117 -757676 -637773 -551864 -425238 -255708 -145104 -210475 -455172 -744252
36825 -744252 -912324 -881264 -672374 -342177 47971 405284 612723 615878 490083 376252
36815 376252 342015 332666 258479 95229 -107923 -279496 -365476 -356456 -305924 -291964 -324401
36804 -324401 -311326 -156625 122150 406494 586633 610675 441793 46345 -538285 -1173581
36794 -1173581 -1713821 -2122929 -2465298 -2789227 -3058051 -3205649 -3225528 -3171983 -3080912 -2926507
36784 -2926507 -2678001 -2378801 -2130186 -1986123 -1890127 -1735711 -1476874 -1168043 -917480 -824283
36774 -824283 -937725 -1230206 -1597316 -1913288 -2109597 -2198881 -2225255 -2207746 -2137204 -2013031
36764 -2013031 -1866114 -1735421 -1613573 -1423483 -1084492 -628363 -225046 -47012 -105318 -253882
36754 -253882 -356336 -406235 -471880 -575561 -672316 -722099 -729612 -707617 -638742 -494397 -277312
36743 -277312 -30762 187734 329671 355363 230392 -54101 -449376 -851127 -1149501 -1275105
36733 -1275105 -1194022 -887893 -383313 196945 659828 861441 805331 618881 443659 346146
36723 346146 301304 236197 102334 -73398 -215305 -286061 -329877 -412470 -539600 -661719
36713 -661719 -739773 -769117 -750822 -688504 -618470 -590266 -586893 -500665 -233046 187748 615579
36702 615579 905808 1004226 934275 745071 493348 247525 69179 -23385 -68072 -133464
36692 -133464 -279715 -532761 -875577 -1249250 -1566851 -1749286 -1771950 -1681258 -1551673 -1417814
36682 -1417814 -1257521 -1047600 -819850 -642345 -552183 -528363 -529777 -535407 -538792 -523999 -463915
36671 -463915 -335799 -136003 102414 298051 350762 208608 -95607 -477326 -850327 -1139115
36661 -1139115 -1285622 -1290041 -1229079 -1185064 -1154660 -1064646 -875113 -620341 -341885 -37447
36651 -37447 294468 603113 818966 912355 885464 736000 475909 173099 -71671 -193502
36641 -193502 -184280 -58685 159437 417863 647935 816682 947691 1081386 1233047 1394714
36631 1394714 1556273 1712616 1860091 1987358 2059670 2024260 1860643 1624939 1411098 1257605
36621 1257605 1121330 958418 801073 723749 743076 775087 691814 410819 -60269 -643995
36611 -643995 -1246291 -1795934 -2247826 -2571203 -2753718 -2813389 -2788133 -2708154 -2585686 -2424486
36601 -2424486 -2219940 -1952174 -1605429 -1204771 -815130 -491263 -239109 -31656 152241
36592 152241 310795 422137 452945 382016 232652 70797 -48206 -131568 -240419 -431701
36582 -431701 -711093 -1033468 -1338498 -1585466 -1759965 -1859630 -1894745 -1911939 -1990753 -2179624
36572 -2179624 -2435162 -2651974 -2753295 -2727249 -2583847 -2328023 -1994128 -1661747 -1397491 -1199450
36562 -1199450 -1025853 -859552 -718562 -623211 -583263 -602413 -666347 -742642 -828628 -989357
36552 -989357 -1304787 -1767452 -2253755 -2599950 -2693494 -2509589 -2106912 -1604672 -1132534 -771212
36542 -771212 -535300 -406430 -365415 -393812 -470633 -581887 -720424 -866043 -974547 -992979
36532 -992979 -880092 -615921 -212708 270607 736531 1092218 1298470 1385135 1420686 1454900
36522 1454900 1475715 1421749 1245782 964575 641389 329998 48925 -202138 -429039 -652767
36512 -652767 -914775 -1261307 -1719793 -2273398 -2837391 -3272879 -3463611 -3396222 -3149059 -2800249
36502 -2800249 -2374839 -1890968 -1418831 -1053228 -831158 -698302 -555235 -326845 -3404
36493 -3404 357586 668623 872407 973975 1009641 996101 930953 834598 753076 701762 635405
36482 635405 508449 355994 277761 331849 475668 636729 819219 1096271 1489145 1892786
36472 1892786 2153646 2208248 2113983 1945291 1694092 1292422 716695 47334 -572634 -1025263
36462 -1025263 -1269017 -1324369 -1225071 -988408 -634077 -228137 107952 255896 185444 -14972
36452 -14972 -196685 -249441 -157641 23271 233427 447942 655429 814857 863003 788241
36442 788241 690878 737052 1023999 1486349 1939215 2208998 2228190 2041029 1758613 1500824
36432 1500824 1331329 1219875 1084874 887626 667712 480956 341157 249425 240682 345201
36422 345201 514410 635631 623370 457916 144057 -302583 -807227 -1233813 -1479211 -1546050
36412 -1546050 -1495683 -1363799 -1157695 -899503 -614558 -289449 104595 544794 959382 1307412
36402 1307412 1617923 1932451 2235175 2456912 2530678 2433966 2199836 1906674 1643332 1457340
36392 1457340 1326587 1187621 1002307 804226 673972 652161 673840 608946 380625 31790
36382 31790 -326778 -603215 -746364 -729184 -565645 -332188 -125172 3391 36882 -56931
36372 -56931 -302444 -631737 -885666 -938216 -794863 -554686 -317662 -152946 -106332 -177330
36362 -177330 -295875 -361660 -309901 -124749 187676 599354 1038311 1404899 1625141 1678651
36352 1678651 1584384 1388907 1171942 1028221 1009274 1076712 1125100 1066777 908404 748951
36342 748951 695797 777283 937926 1110849 1275923 1443786 1605717 1717871 1728956 1617307
36332 1617307 1413890 1195441 1033402 930228 820912 660671 501931 455999 571295 763916
36322 763916 876644 807620 593049 378726 306809 411350 608023 774042 833265 784257
36312 784257 686905 634728 700331 866832 1024482 1068778 998143 887761 776378 619977
36302 619977 367128 46043 -246644 -431055 -506189 -539169 -602149 -710473 -816385 -868274
36292 -868274 -870839 -872712 -903425 -951494 -1005767 -1079877 -1173213 -1236075 -1207302 -1075796 -878684
36281 -878684 -652489 -423675 -244133 -185366 -265734 -409247 -515694 -567241 -631153 -750704
36271 -750704 -869571 -893785 -813331 -729941 -761510 -937859 -1185224 -1379805 -1407554 -1212417
36261 -1212417 -828773 -361368 94779 513622 899733 1208234 1349720 1286980 1085880 838930
36251 838930 563057 210840 -228662 -685394 -1075349 -1374937 -1599089 -1723665 -1668829 -1373600
36241 -1373600 -875717 -314105 136281 337416 238395 -99145 -517775 -840257 -965468 -905494
36231 -905494 -739384 -545930 -378354 -268220 -217902 -193277 -153936 -100717 -76841 -114162 -191347
36220 -191347 -250855 -242369 -142200 49606 308668 588695 846000 1065931 1252745 1392568
36210 1392568 1444558 1382343 1237530 1088968 1007682 1018638 1113215 1282981 1527703 1831960
36200 1831960 2144421 2385805 2477502 2368268 2046900 1540388 901540 195481 -505535 -1123873
36190 -1123873 -1588953 -1858112 -1924765 -1807188 -1538931 -1172766 -775816 -397330 -36159 350841
36180 350841 804703 1328291 1880135 2383355 2740833 2867514 2734214 2390434 1947633 1538556
36170 1538556 1270505 1176724 1186629 1155995 959208 573978 83531 -397949 -802017 -1127577
36160 -1127577 -1412844 -1695226 -1987059 -2274091 -2526210 -2703813 -2759333 -2653490 -2388537 -2019879
36150 -2019879 -1615059 -1198421 -753982 -288985 125966 399061 492718 446052 336405 240781
36140 240781 224830 329856 549298 835840 1151709 1500538 1889995 2274220 2564723 2706943
36130 2706943 2725588 2682794 2608289 2486929 2301878 2065076 1804514 1544385 1309506 1133286
36120 1133286 1041861 1035028 1101717 1253989 1519028 1876773 2218722 2399271 2340347 2078142
36110 2078142 1709379 1309516 902760 478705 12729 -510634 -1058179 -1531000 -1818000
36101 -1818000 -1883455 -1793482 -1653605 -1530148 -1424735 -1295906 -1094975 -806392 -476323 -192102
36091 -192102 -15816 59966 88481 119629 186428 313893 502946 703328 832612 841104 755763
36080 755763 663972 667654 845249 1219552 1728789 2232670 2575982 2670853 2529410 2229107
36070 2229107 1861903 1516991 1280579 1204085 1251728 1307482 1274433 1170021 1096189 1113640
36060 1113640 1179540 1222135 1238138 1280782 1373444 1476663 1533239 1504094 1355723 1057570 623443
36049 623443 139468 -277273 -556397 -711961 -807343 -875488 -859169 -636548 -131402 594213
36039 594213 1370124 2036449 2510767 2754720 2742284 2505707 2176653 1915976 1786056 1714800
36029 1714800 1586073 1346135 1034640 755330 627166 720265 996570 1315823 1525765 1562357
36019 1562357 1473434 1363171 1318382 1363727 1459475 1541050 1575693 1584350 1604928 1644121 1679042
36008 1679042 1697373 1711710 1729628 1729246 1673411 1530424 1269667 862198 322583 -249231 -704679
35997 -704679 -954649 -1037801 -1069444 -1128910 -1207332 -1248848 -1206552 -1047673 -739033 -269712 309568
35986 309568 898692 1413009 1818052 2088140 2157307 1953318 1492237 918499 435166 196481
35976 196481 258970 596166 1119930 1692228 2164493 2451548 2578738 2642563 2708602 2740115
35966 2740115 2626405 2284120 1734117 1085896 461047 -57077 -412775 -556851 -466182 -181427
35956 -181427 192825 534253 758626 856175 893319 962233 1096188 1233089 1287504 1260849
35946 1260849 1253044 1357401 1571722 1826113 2065169 2268452 2406318 2421504 2274940 1995910
35936 1995910 1668129 1355921 1038642 624297 48176 -630187 -1239920 -1623719 -1750763
35927 -1750763 -1709545 -1612524 -1524068 -1458995 -1408374 -1346867 -1225617 -977472 -551268 33414
35917 33414 657863 1156275 1427195 1496020 1458596 1376645 1248219 1066728 873214 740513
35907 740513 723693 830497 1024958 1258931 1518429 1841885 2272179 2780213 3248719 3542005
35897 3542005 3590407 3416774 3107209 2767570 2487811 2317428 2254116 2244514 2200038 2042371
35887 2042371 1767649 1464761 1240010 1110131 984080 757364 412485 28585 -282348
35878 -282348 -440449 -430893 -306557 -159374 -69836 -69440 -139492 -232553 -294120 -277649 -150629
35867 -150629 104897 477615 897575 1242220 1409196 1385515 1220550 944524 566112 158190
35857 158190 -120371 -141628 74372 392848 689138 905480 1018418 1019216 936296 829749
35847 829749 742106 675974 621888 574284 510155 388815 200447 -2430 -143721 -183835 -127517
35836 -127517 10779 221639 480062 730637 906607 964951 905059 757753 556380 315938
35826 315938 38954 -261672 -552788 -797268 -975846 -1088433 -1139054 -1132986 -1096801 -1089586 -1167476
35815 -1167476 -1321750 -1467121 -1515571 -1459281 -1359231 -1257023 -1134595 -973611 -814139 -713516
35805 -713516 -660076 -564679 -339254 37593 519781 1015831 1404938 1577571 1505183 1275508
35795 1275508 1047908 967783 1105265 1435747 1848897 2183981 2287733 2070140 1537312 799321
35785 799321 43521 -541173 -857100 -929821 -847429 -674746 -428044 -110272 257109 636882
35775 636882 989905 1281435 1490292 1621553 1699830 1738467 1718483 1605645 1386848 1084181
35765 1084181 735485 368864 -2177 -364981 -693965 -949171 -1089598 -1098663 -1008088 -895335
35755 -895335 -843371 -888513 -998432 -1092862 -1083147 -909431 -574401 -162199 191901 387826
35745 387826 440157 469094 600377 867065 1204756 1531214 1814210 2055622 2227783 2260223
35735 2260223 2108678 1822530 1518590 1288123 1147262 1072018 1045481 1053028 1058337 1015019 896887
35724 896887 702038 441389 144301 -138607 -369297 -559593 -755861 -994161 -1293070 -1673362
35714 -1673362 -2135088 -2607158 -2971249 -3173482 -3289655 -3446779 -3688034 -3930303 -4031776
35705 -4031776 -3877794 -3435920 -2790466 -2131482 -1657798 -1453346 -1465642 -1604321 -1822543 -2082078
35695 -2082078 -2284592 -2301650 -2082361 -1699970 -1287174 -952054 -752759 -699009 -738088 -765758
35685 -765758 -701567 -563347 -449016 -449060 -592710 -854468 -1159045 -1373880 -1356525 -1056338 -552985
35674 -552985 30563 629712 1225599 1765466 2158177 2357035 2404206 2376864 2319350 2242354
35664 2242354 2156557 2076570 1999193 1893046 1703847 1367803 843661 154476 -606463 -1322807
35654 -1322807 -1906779 -2309294 -2507886 -2509682 -2358645 -2117113 -1832603 -1525054 -1202224 -885040
35644 -885040 -625558 -496739 -537828 -691440 -813871 -780016 -586049 -343385 -182542 -172373
35634 -172373 -303120 -497484 -630666 -590975 -373727 -119662 -28997 -207377 -578736 -937416
35624 -937416 -1082971 -922432 -480254 148834 838483 1448740 1861654 2041210 2059677 2044410
35614 2044410 2086645 2195873 2323763 2411491 2420506 2347026 2223882 2101527 2018779 1989538 2003042
35603 2003042 2013538 1933828 1680387 1259611 801301 476445 365935 406055 451831 387878
35593 387878 199582 -30010 -186680 -212665 -149357 -95148 -120919 -229460 -384026 -549113
35583 -549113 -697642 -806903 -872209 -915379 -963093 -1026430 -1116041 -1257393 -1455626 -1649948
35573 -1649948 -1747140 -1723329 -1668751 -1708040 -1889225 -2166036 -2464670 -2734136 -2945473 -3092318
35563 -3092318 -3212634 -3379135 -3635738 -3945684 -4215967 -4368031 -4375041 -4241629 -3972167 -3571103
35553 -3571103 -3068417 -2532727 -2046611 -1658034 -1355944 -1104743 -906833 -818208 -890458 -1103449
35543 -1103449 -1365260 -1573657 -1671508 -1658959 -1579765 -1498063 -1460113 -1455853 -1422539 -1298422 -1072773
35532 -1072773 -783964 -483825 -213504 5387 184204 368207 592297 823283 971961
35523 971961 987280 925445 896848 944193 998141 961275 814429 626104 475298 388356 342896
35512 342896 302111 231330 99306 -112024 -393871 -716868 -1058640 -1424204 -1835653 -2297678
35502 -2297678 -2764889 -3134039 -3275113 -3101457 -2645150 -2069292 -1577243 -1279929 -1146077
35493 -1146077 -1081006 -1034342 -1016164 -1034453 -1061438 -1064835 -1033928 -959809 -822549 -621725 -395262
35482 -395262 -182254 11142 179165 273361 241138 108169 -21637 -65745 -35178 6739
35472 6739 31747 74238 192339 422040 752326 1118560 1426999 1613369 1685020 1691758 1652559
35461 1652559 1529677 1290830 988648 753333 688453 777782 909502 992013 1030134 1089074
35451 1089074 1216411 1420593 1694242 2009325 2291232 2444842 2427093 2268121 2007759 1641651
35441 1641651 1152542 569350 -34267 -584180 -1020634 -1286541 -1346969 -1232808 -1036267 -841185
35431 -841185 -665615 -483345 -290153 -126265 -23985 53582 195387 448767 755282 1001671
35421 1001671 1129051 1163749 1141155 1045324 856789 630555 473717 437479 462381 441831
35411 441831 317136 97044 -193859 -554239 -984989 -1443893 -1843026 -2105411 -2221963 -2242247
35401 -2242247 -2213908 -2149852 -2052470 -1935434 -1799905 -1614006 -1348191 -1022218 -693314 -411111
35391 -411111 -212516 -140734 -213123 -358527 -435857 -350862 -136115 104932 311328 501600
35381 501600 725832 1017592 1376054 1747005 2016608 2072728 1907949 1645762 1436352 1329375
35371 1329375 1263554 1164100 1013567 826133 599870 331636 56684 -173673 -356655 -541138
35361 -541138 -753688 -958848 -1118180 -1255220 -1418357 -1592928 -1696106 -1663310 -1503748 -1265772
35351 -1265772 -991104 -726457 -541231 -484680 -527536 -578043 -563741 -484134 -390264 -341552 -387846
35340 -387846 -556806 -820349 -1077899 -1211395 -1185405 -1089687 -1067611 -1197721 -1441663 -1686231
35330 -1686231 -1813325 -1744624 -1470294 -1067007 -667949 -380069 -226763 -180980 -235183 -406824
35320 -406824 -680254 -982149 -1232898 -1406401 -1530314 -1644967 -1773152 -1913738 -2046501 -2146132
35310 -2146132 -2200998 -2218945 -2216002 -2204450 -2185284 -2137617 -2020035 -1806733 -1531920 -1282691 -1136830
35299 -1136830 -1112069 -1168661 -1236220 -1235746 -1112534 -879561 -621196 -435106 -368773 -407277 -496676
35288 -496676 -569507 -580932 -551571 -556670 -639601 -745021 -769538 -675947 -530920 -435979 -454358
35277 -454358 -602541 -866166 -1198690 -1533323 -1829799 -2102186 -2377387 -2626160 -2749263 -2634629
35267 -2634629 -2227823 -1561802 -739404 107424 853836 1399603 1680003 1691431 1519767 1322412
35257 1322412 1241884 1309255 1431217 1484059 1426375 1316176 1219155 1118418 935244 636252
35247 636252 295995 40283 -62088 -47573 -21328 -87736 -287982 -563598 -783111 -843410
35237 -843410 -761225 -645572 -575492 -531748 -455270 -332063 -190107 -45661 94126 179155
35227 179155 119886 -129852 -515652 -927886 -1288090 -1572626 -1770412 -1855322 -1812340 -1671886
35217 -1671886 -1500585 -1358813 -1269690 -1217271 -1158577 -1038781 -815806 -490049 -113104 238553
35207 238553 498646 619374 559709 294434 -147005 -660207 -1109526 -1410792 -1575985 -1673799
35197 -1673799 -1740642 -1725137 -1522322 -1073189 -438429 228044 780631 1152783 1332307 1298359
35187 1298359 1022265 537568 -23309 -496678 -799334 -967560 -1089721 -1207486 -1273372 -1185525
35177 -1185525 -861901 -301226 407757 1131694 1752584 2195971 2427613 2455084 2339490 2176169
35167 2176169 2031997 1900036 1728025 1483016 1168877 791625 348746 -129632 -562031
35158 -562031 -878288 -1099301 -1325239 -1633532 -1999331 -2315101 -2468438 -2397509 -2102620 -1641364
35148 -1641364 -1119493 -665165 -386509 -334820 -493725 -797376 -1166719 -1541874 -1887852 -2173754
35138 -2173754 -2355459 -2389153 -2265448 -2027333 -1749981 -1495672 -1277948 -1064002 -816347 -537831
35128 -537831 -273762 -66481 86833 224204 369377 497950 548943 464878 232557 -93776
35118 -93776 -408442 -620639 -729977 -832854 -1035880 -1357157 -1719358 -2038903 -2308616 -2583010
35108 -2583010 -2888350 -3165344 -3318041 -3322216 -3267568 -3269206 -3334521 -3337373 -3136113 -2706684 -2155158
35097 -2155158 -1626247 -1224618 -998983 -940685 -971700 -970416 -854056 -640442 -415878 -251171
35087 -251171 -163613 -142845 -175643 -237449 -291221 -321228 -360299 -463548 -652146 -892190 -1130613
35076 -1130613 -1344401 -1549596 -1762381 -1951706 -2030747 -1901589 -1522229 -945146 -299467 268326
35066 268326 655635 836102 855507 799335 746683 732010 738329 726198 669026 559435 393427
35055 393427 175256 -48066 -179306 -135047 72248 334427 540420 657943 718229 737456
35045 737456 668687 425479 -52233 -738350 -1507343 -2188214 -2654765 -2877513 -2900476 -2790278
35035 -2790278 -2615384 -2442091 -2307050 -2186719 -2017517 -1759429 -1437546 -1127919 -913617
35026 -913617 -842189 -898748 -1013592 -1109931 -1150866 -1141957 -1107847 -1084697 -1114325 -1207374 -1314655
35015 -1314655 -1369307 -1358667 -1320690 -1269293 -1168259 -992476 -769371 -533865 -283618 -14866
35005 -14866 232469 410960 523112 593811 601972 498652 299689 109292 28110 67044 166952
34994 166952 271273 354088 400877 399840 358125 309980 299634 354510 469214 608282 722511
34983 722511 766475 713895 578247 427482 358859 433647 633206 883372 1107467 1244671
34973 1244671 1248031 1113713 915063 763028 704758 676246 570318 340960 36563 -247067
34963 -247067 -430787 -486485 -430961 -288479 -58741 267247 658049 1028129 1286805 1392006
34953 1392006 1351243 1189703 936750 636517 353386 157582 93009 138038 195468 150397
34943 150397 -35000 -285400 -475479 -517450 -388952 -116993 224735 516032 636659 540826
34933 540826 285257 -14443 -251656 -374557 -399547 -387634 -386060 -377467 -290089 -62219 303123
34922 303123 736353 1139124 1430621 1581470 1617581 1589900 1538137 1479155 1412527 1322044 1183572
34911 1183572 993285 783516 589555 404231 189642 -65764 -327808 -558781 -752637
34902 -752637 -919734 -1064050 -1188721 -1294415 -1348142 -1279767 -1048115 -706787 -376308 -149347
34892 -149347 -40351 -19173 -63499 -173205 -358567 -625154 -952277 -1277097 -1518249 -1628109
34882 -1628109 -1607171 -1453996 -1120428 -547740 247820 1145525 1989908 2686814 3226344 3619568
34872 3619568 3829673 3781283 3446267 2918064 2387023 2022129 1860448 1804731 1726737 1571728
34862 1571728 1365436 1135139 851758 468026 1218 -455690 -821274 -1103994 -1367648
34853 -1367648 -1624652 -1792046 -1764512 -1517923 -1137466 -763520 -518964 -460873 -563294 -738829
34843 -738829 -900394 -1023493 -1151726 -1338031 -1577767 -1793942 -1885588 -1802154 -1589107 -1366064
34833 -1366064 -1247638 -1268904 -1375835 -1478443 -1510224 -1450043 -1311260 -1124574 -927699 -759017
34823 -759017 -647395 -594271 -561123 -488745 -347570 -166841 3128 157307 341232 578346
34813 578346 811145 937180 901151 739756 541713 376836 256905 144265 -6277 -198419
34803 -198419 -376932 -466010 -431453 -300738 -120562 95144 367686 710920 1094087 1442589
34793 1442589 1667997 1705987 1550046 1268229 982492 806066 776612 844048 929484 999232
34783 999232 1081562 1219944 1423092 1658916 1879669 2046240 2144374 2191602 2217390 2219027 2142312
34772 2142312 1925152 1565563 1139667 755227 494065 384543 397433 455193 465862 376308
34762 376308 204180 16449 -129237 -232755 -350291 -540265 -800276 -1059728 -1241824 -1326221
34752 -1326221 -1344018 -1330040 -1303706 -1279167 -1249368 -1155194 -917093 -526482 -81695 289743
34742 289743 524583 625942 610980 497549 321503 121455 -87515 -288083 -421005 -423434
34732 -423434 -312268 -178458 -79715 15404 148143 277040 311532 218283 50463 -119867
34722 -119867 -254882 -333867 -329525 -235757 -110689 -66836 -199073 -505923 -874987 -1160305
34712 -1160305 -1293849 -1318851 -1301069 -1217776 -961789 -460396 231049 962088 1594512 2066850
34702 2066850 2375800 2525047 2497792 2266226 1824228 1222615 581022 55331 -233192 -264637
34692 -264637 -128003 48212 188747 301864 424594 557357 665679 728953 759187 774294
34682 774294 780407 784170 794374 801076 780948 740951 731004 785947 868191 889357 774761 490632
34670 490632 43570 -494402 -972602 -1241775 -1279792 -1206085 -1149160 -1128649 -1087326 -997876 -891151
34659 -891151 -798794 -721617 -659522 -629746 -637679 -658211 -666062 -664784 -664475 -643992 -560549 -398120
34647 -398120 -189343 17735 205659 390004 574636 712397 723178 560341 258329 -90426
34637 -90426 -405426 -665444 -898082 -1134947 -1371296 -1552055 -1596011 -1454324 -1161329 -821473
34627 -821473 -531936 -313001 -112808 127431 418826 725984 1005139 1230585 1386820 1451214
34617 1451214 1406873 1282175 1160030 1119430 1160586 1203785 1169421 1045368 870601 676279
34607 676279 465363 236627 -2562 -252334 -525494 -820923 -1099494 -1297593 -1365072 -1289650
34597 -1289650 -1090209 -791268 -405227 56508 552648 1003874 1334733 1527941 1624450 1664036
34587 1664036 1637342 1503806 1245903 897534 534111 252451 145407 254239 521377 808217
34577 808217 996119 1087094 1196806 1438677 1818304 2243297 2616317 2888680 3023731 2953384
34567 2953384 2618340 2050824 1382230 755128 246795 -120864 -343046 -442026 -487066 -545923
34557 -545923 -606706 -586407 -431710 -181400 83481 315387 502817 635192 711912 772290
34547 772290 869101 1006547 1136300 1217046 1241951 1197556 1034350 708419 238819 -292910
34537 -292910 -785933 -1153118 -1341332 -1355774 -1262114 -1140926 -1036104 -955919 -911039 -925690
34527 -925690 -1009532 -1137566 -1263170 -1338489 -1320048 -1173341 -893440 -530427 -188195 27560
34517 27560 94240 114847 247828 564800 977708 1314143 1451546 1372485 1127351 790638
34507 790638 448626 185651 62655 116320 361489 757494 1179648 1477688 1587332 1558748
34497 1558748 1468467 1344474 1193985 1050625 944166 851821 733328 605962 537076 557975
34487 557975 621937 654529 616372 514072 386306 293705 287808 356895 410150 336806 85385
34476 85385 -311493 -769204 -1193187 -1507394 -1673763 -1697945 -1611422 -1444838 -1221864 -978226
34466 -978226 -778103 -699977 -794096 -1044376 -1371586 -1684445 -1942903 -2183793 -2487717 -2910838
34456 -2910838 -3430758 -3947411 -4341355 -4545272 -4572274 -4485345 -4342922 -4163025 -3922309 -3588369
34446 -3588369 -3169334 -2736664 -2379349 -2121735 -1902951 -1657430 -1403668 -1226575 -1172151 -1184162
34436 -1184162 -1155848 -1032797 -857235 -715927 -644542 -576224 -387359 -6905 514418 1043090
34426 1043090 1458636 1699463 1733898 1533111 1104494 546574 47834 -192985 -75404 342492
34416 342492 882114 1357665 1672482 1825030 1852869 1797183 1705556 1619556 1535912 1407607
34406 1407607 1214853 1025118 951693 1041697 1213585 1309505 1208908 901267 467382 5747
34396 5747 -417180 -755908 -959213 -989027 -867071 -672444 -474871 -282952 -66267 193808
34386 193808 494012 828555 1185560 1527023 1800106 1974162 2047979 2017300 1858320 1558435
34376 1558435 1152494 715375 321913 20019 -163635 -203680 -70516 244206 683627 1111043
34366 1111043 1368603 1383782 1228864 1067333 1033315 1156103 1381966 1640404 1881121 2074744
34356 2074744 2212719 2308500 2373069 2380584 2282679 2076143 1839765 1679546 1643859 1710612 1840788
34345 1840788 2005813 2164289 2261874 2282661 2270515 2266747 2246467 2153070 1985454 1810929 1686728
34334 1686728 1600483 1497244 1336061 1105580 813234 489308 191894 -18508 -113136 -96167
34324 -96167 14239 179212 312603 294927 50295 -377445 -830344 -1127179 -1162713 -940854
34314 -940854 -538274 -53676 412672 761145 916969 877263 727165 585878 523982 535266
34304 535266 581534 637736 675955 628165 409166 -5267 -538428 -1058980 -1449996 -1627756
34294 -1627756 -1534587 -1168355 -627795 -91944 275597 408143 337708 148927 -61602 -220398
34284 -220398 -312861 -380043 -455329 -508443 -475584 -341124 -159810 6944 143154 244359
34274 244359 257549 98418 -259388 -730543 -1164074 -1435283 -1494410 -1354634 -1065296 -696777
34264 -696777 -319763 27441 350284 665808 960708 1188422 1302524 1284535 1149886 948624
34254 948624 759418 654130 646784 682143 682367 599391 426125 187649 -53384 -200743 -175183
34243 -175183 21540 302582 560955 735480 824433 858655 868110 859020 813289 714786 575009
34232 575009 422300 269958 114346 -35040 -149289 -213440 -239106 -223708 -123517 93212
34222 93212 369123 567979 573428 362370 -13545 -479488 -949975 -1323739 -1517127 -1520233
34212 -1520233 -1409618 -1300863 -1289077 -1416490 -1663989 -1960091 -2215450 -2370554 -2414990 -2358924
34202 -2358924 -2193255 -1889176 -1440581 -902338 -378238 38873 320423 492957 575919 544562
34192 544562 372482 102503 -153885 -299854 -322208 -274053 -213543 -174372 -170006 -192016 -209352
34181 -209352 -199909 -189213 -237584 -381350 -597546 -824574 -1001926 -1096672 -1122579 -1143525 -1229422
34170 -1229422 -1384451 -1530928 -1583745 -1533937 -1443241 -1365405 -1297091 -1212124 -1125727 -1103715 -1198888
34159 -1198888 -1382749 -1555728 -1639201 -1654415 -1698124 -1843438 -2080169 -2348235 -2601607 -2829035
34149 -2829035 -3037501 -3236862 -3426132 -3573772 -3621596 -3529963 -3316534 -3036825 -2735456 -2434470
34139 -2434470 -2158018 -1934334 -1760958 -1588724 -1361947 -1076290 -788543 -562187 -400429
34130 -400429 -239134 -17490 246483 468178 585108 606316 560550 430761 182260 -156479
34120 -156479 -488914 -736568 -893759 -978820 -964790 -798174 -483766 -121373 157195 282093
34110 282093 271519 174571 11026 -216091 -464284 -652066 -741711 -798216 -928712 -1167453
34100 -1167453 -1454379 -1728521 -1999329 -2297546 -2581606 -2738273 -2690520 -2486834 -2264181 -2119925
34090 -2119925 -2030999 -1907247 -1712503 -1508666 -1378261 -1333741 -1321040 -1282657 -1181827 -985245
34080 -985245 -677562 -308884 4681 148859 73118 -202663 -604453 -1017527 -1322155 -1449329
34070 -1449329 -1400428 -1213845 -933395 -608013 -286916 -661 226211 338087 268962 27789
34060 27789 -274028 -518279 -678910 -792727 -862327 -839785 -695824 -456210 -168577 126416
34050 126416 388660 584029 706018 759107 714277 522439 197026 -141308 -327940 -255816
34040 -255816 85455 635703 1299114 1971749 2576997 3092252 3530292 3882573 4083807 4049390
34030 4049390 3768842 3366535 3045424 2940072 3018575 3134801 3164848 3078115 2900128 2655435
34020 2655435 2357306 2014410 1622293 1170033 680508 234731 -63060 -149089 -39974 166697
34010 166697 335869 384214 351816 354251 434810 497591 432589 281962 214347 324290 515644
33999 515644 616218 569363 472918 453039 545626 698908 848994 970045 1066041 1135437 1154243
33988 1154243 1102354 1010776 966547 1043480 1221017 1388826 1441751 1359958 1192888 989523
33978 989523 769916 555320 393114 336489 409101 594623 849240 1118468 1355083 1533943
33968 1533943 1647310 1683877 1624637 1468739 1252798 1031846 848136 729153 701407 778474
33958 778474 933666 1109894 1270797 1431357 1631017 1888534 2186950 2480276 2697245 2760935
33948 2760935 2646555 2430874 2255535 2211249 2254187 2245311 2073515 1741732 1349935 1017804
33938 1017804 824978 795734 905556 1092013 1273863 1376307 1347950 1170128 874586 559960
33928 559960 365583 392195 631272 974529 1296105 1531656 1700109 1873954 2124466 2464675
33918 2464675 2827215 3110410 3261843 3313244 3328252 3327487 3273906 3117296 2836793 2452945
33908 2452945 2026026 1643021 1375513 1227056 1127473 993276 797218 579608 400663 287411
33898 287411 217446 141872 27602 -107195 -192729 -153436 29341 293973 542501 714800
33888 714800 822101 910953 1004376 1086336 1132708 1131261 1061887 883573 574227 181502 -197344
33877 -197344 -500568 -748996 -996300 -1255018 -1498272 -1722584 -1971880 -2285378 -2638676 -2946830
33867 -2946830 -3114793 -3083542 -2854173 -2493657 -2108550 -1781021 -1513039 -1242802 -933411 -650334
33857 -650334 -539158 -704082 -1091428 -1497015 -1707232 -1646445 -1394299 -1081304 -795382 -579386
33847 -579386 -462322 -451520 -517475 -629804 -801333 -1056783 -1358021 -1603885 -1720408 -1719127
33837 -1719127 -1648749 -1521348 -1313615 -1015635 -641415 -200250 307130 857546 1392114 1843976
33827 1843976 2173265 2375924 2465218 2442219 2281740 1957396 1486730 941236 411247 -15741
33817 -15741 -239562 -162608 226693 800367 1371460 1834826 2199382 2494553 2701604 2791276
33807 2791276 2778446 2709387 2629210 2587096 2631585 2752907 2850771 2808416 2597616 2278086 1903761
33796 1903761 1477540 1007652 561498 225806 25254 -93097 -194008 -287130 -329318 -286372
33786 -286372 -184714 -96306 -73954 -113911 -191179 -319175 -551372 -917447 -1369850 -1802759
33776 -1802759 -2124613 -2318109 -2440844 -2568720 -2728407 -2878672 -2959816 -2961277 -2937024 -2954674
33766 -2954674 -3029577 -3101194 -3070914 -2879837 -2571772 -2278339 -2119783 -2106855 -2143209 -2124241
33756 -2124241 -2028257 -1919425 -1881336 -1948374 -2077076 -2167181 -2121487 -1905001 -1556224 -1152526
33746 -1152526 -780061 -529890 -482077 -655817 -976118 -1311229 -1550853 -1648896 -1611259 -1473228
33736 -1473228 -1292420 -1135483 -1046415 -1025415 -1042278 -1065320 -1074253 -1055140 -996851 -896631 -764439
33725 -764439 -615521 -453831 -262867 -22529 250459 472854 514460 267570 -278269 -1010365
33715 -1010365 -1741254 -2309530 -2667360 -2884292 -3060903 -3233527 -3360662 -3388573 -3310305 -3160435
33705 -3160435 -2973853 -2761119 -2509570 -2195381 -1806373 -1368404 -941367 -573935 -267285
33696 -267285 5970 261103 500695 741424 1005448 1280706 1522410 1706717 1853220 1975882
33686 1975882 2043171 2021106 1937389 1862206 1826568 1791245 1695656 1502774 1192262 756027 234631
33675 234631 -265434 -632683 -837422 -945201 -1047343 -1191543 -1374806 -1581045 -1810674 -2073018
33665 -2073018 -2352079 -2585793 -2695487 -2650289 -2499316 -2329430 -2190797 -2067392 -1911811 -1696988
33655 -1696988 -1438385 -1179125 -953347 -754161 -540261 -286384 -24971 178522 294906
33646 294906 360642 430758 513790 560456 504169 300739 -60516 -558673 -1137125 -1699395
33636 -1699395 -2127313 -2334779 -2334414 -2257685 -2285347 -2526425 -2947094 -3408019 -3761295 -3915534
33626 -3915534 -3840817 -3556102 -3131695 -2686405 -2350169 -2206116 -2255336 -2427045 -2618937 -2741100
33616 -2741100 -2749921 -2664951 -2554330 -2482153 -2447974 -2373961 -2160165 -1759400 -1204876 -580596
33606 -580596 20748 521492 875212 1084332 1198019 1277044 1352983 1417811 1444281 1412711
33596 1412711 1329069 1229559 1165600 1175377 1267100 1425719 1622248 1810707 1935133 1963545 1912465
33585 1912465 1819159 1690632 1500907 1242638 958044 702731 490772 289603 60682 -207199
33575 -207199 -494374 -758745 -946171 -1009489 -928651 -712455 -384040 26742 476698 905177
33565 905177 1243917 1434719 1450343 1318240 1130070 1009429 1042903 1226585 1476399 1691190
33555 1691190 1811434 1833654 1791816 1737352 1722753 1769086 1823193 1757810 1455771 927483 343208
33544 343208 -72424 -190838 -34772 288299 676399 1064253 1412511 1700810 1919861 2048237
33534 2048237 2049418 1917716 1715355 1523566 1346900 1099544 707604 201244 -319310 -789603
33524 -789603 -1219439 -1633688 -2012099 -2298361 -2444830 -2437262 -2295530 -2063053 -1780098 -1458030
33514 -1458030 -1100481 -762310 -553552 -541041 -655202 -744882 -744280 -751403 -911381 -1239913 -1590228
33503 -1590228 -1782379 -1735194 -1483466 -1120708 -756933 -500884 -424291 -512957 -659822 -724060
33493 -724060 -614465 -338504 7920 299202 453964 475456 423922 345599 233574 64650
33483 64650 -134820 -280254 -295523 -182153 -16272 119577 200033 262477 358332 493203
33473 493203 604379 599626 431935 143819 -166625 -430823 -666021 -951171 -1346418 -1826056
33463 -1826056 -2280060 -2585869 -2694753 -2659113 -2579464 -2529730 -2529310 -2555428 -2546797 -2408745 -2076124
33452 -2076124 -1604613 -1160370 -866988 -675209 -434565 -93560 226028 371442 320762 161856
$$ [...]
##END NTUPLES=NMR SPECTRUM
##END=
