##TITLE=31Pdec_93SR1910
 D2O, 24 sc
 19.10.2021
##JCAMPDX= 6.0         $$ Bruker NMR JCAMP-DX V2.0
##DATA TYPE= NMR SPECTRUM
##DATA CLASS= NTUPLES
##ORIGIN= UXNMR, Bruker Analytische Messtechnik GmbH
##OWNER= root
$$ XWIN-NMR		Version 3.5
$$ Tue Oct 19 15:37:53 2021 Russian Standard Time (UT+4h)  she@DPX200
##.OBSERVE FREQUENCY= 81.013821
##.OBSERVE NUCLEUS= ^31P
##.ACQUISITION MODE= SIMULTANEOUS
##.ACQUISITION SCHEME= undefined
##.AVERAGES= 24
##.DIGITISER RES= 16
##SPECTROMETER/DATA SYSTEM= spect
##.PULSE SEQUENCE= zgpg30
##.SOLVENT NAME= DMSO
##.SHIFT REFERENCE= (INTERNAL, DMSO, 0, 248.564)
##AUDIT TRAIL= $$ (NUMBER, WHEN, WHO, WHERE, WHAT)
$$ ##TITLE= Audit trail, XWIN-NMR		Version 3.5
$$ ##JCAMPDX= 5.01
$$ ##ORIGIN= Bruker BioSpin GmbH
$$ ##OWNER= she
$$ F:/spectra/data/she/nmr/P31/1/pdata/1/auditp.txt
$$ ##AUDIT TRAIL=  $$ (NUMBER, WHEN, WHO, WHERE, WHAT)
(   1,<2021-10-19 15:35:37.20 +0400>,<she>,<DPX200>,
      <created by zg, POWCHK disabled, PULCHK disabled
       configuration hash MD5:
       00 E9 B6 7A A2 85 ED C7 34 08 36 98 17 FE 4E 26
       data hash MD5: 32K
       B1 81 39 09 EC 75 43 EF 3D A4 45 9E 62 72 8D 43>)
(   2,<2021-10-19 15:36:15.89 +0400>,<she>,<DPX200>,
      <Start of raw data processing
       efp BC_mod = 2 LB = 1 FT_mod = 6 PKNL = 1 PHC0 = -8992.118 PHC1 = 417.069 SI = 64K 
       data hash MD5: 64K
       9F A8 49 8F AF 38 42 E1 43 B7 65 66 2D 01 83 51>)
(   3,<2021-10-19 15:37:20.46 +0400>,<she>,<DPX200>,
      <pk PHC0 = 151.1847 PHC1 = -326.4001 
       data hash MD5: 64K
       6D 1C 63 E0 D6 58 ED 45 00 AE F5 83 FC 2E 03 68>)
$$ ##END=
$$ 
$$ hash MD5
$$ 08 28 3D 3C 2A 49 56 B5 EA 73 BB E3 B8 6C FB AA
##$RELAX= 
##$RELAX= 
##$RELAX= 
##$RELAX= 
##$RELAX= 
##$RELAX= 
##$RELAX= 
##$RELAX= 
$$ Bruker specific parameters
$$ --------------------------
##$DU= <F:/spectra>
##$EXPNO= 1
##$NAME= <P31>
##$PROCNO= 1
##$TYPE= <nmr>
##$USER= <she>
##$AMP= (0..31)
100 100 100 100 100 100 100 100 100 100 100 100 100 100 100 100 100 100 
100 100 100 100 100 100 100 100 100 100 100 100 100 100 
##$AQSEQ= 0
##$AQ_mod= 1
##$AUNM= <au_zg>
##$AUTOPOS= <>
##$BF1= 81.014009
##$BF2= 200.13
##$BF3= 200.13
##$BF4= 200.13
##$BF5= 200.13
##$BF6= 200.13
##$BF7= 200.13
##$BF8= 200.13
##$BYTORDA= 1
##$CFDGTYP= 0
##$CFRGTYP= 5
##$CHEMSTR= <none>
##$CNST= (0..31)
1 1 145 1 1 1 1 1 1 1 1 1 1 1 1 1 1 1 1 1 1 1 1 1 1 1 1 1 1 1 1 1 
##$CPDPRG= <waltz16>
##$CPDPRG1= <>
##$CPDPRG2= <waltz16>
##$CPDPRG3= <>
##$CPDPRG4= <mlev>
##$CPDPRG5= <mlev>
##$CPDPRG6= <mlev>
##$CPDPRG7= <mlev>
##$CPDPRG8= <mlev>
##$CPDPRGB= <>
##$CPDPRGT= <>
##$D= (0..31)
0 1 0 0 0 0 0 0 0 0 0 0.03 2e-05 3e-06 0 0 0 0 0 0 0 0 0 0 0 0 0 0 0 0 
0 0 
##$DATE= 1634643336
##$DBL= (0..7)
120 120 120 11 120 120 24 19 
##$DBP= (0..7)
150 150 150 150 150 150 150 150 
##$DBP07= 0
##$DBPNAM0= <>
##$DBPNAM1= <>
##$DBPNAM2= <>
##$DBPNAM3= <>
##$DBPNAM4= <>
##$DBPNAM5= <>
##$DBPNAM6= <>
##$DBPNAM7= <>
##$DBPOAL= (0..7)
0.5 0.5 0.5 0.5 0.5 0.5 0.5 0.5 
##$DBPOFFS= (0..7)
$$ [...]
##$SUBNAM2= <"">
##$SUBNAM3= <"">
##$SUBNAM4= <"">
##$SUBNAM5= <"">
##$SUBNAM6= <"">
##$SUBNAM7= <"">
##$SUBNAM8= <"">
##$SUBNAM9= <"">
##$SW= 501.771253377433
##$SWIBOX= (0..15)
0 1 3 0 0 0 0 0 0 0 0 0 0 0 0 0 
##$SW_h= 40650.406504065
##$TD= 32768
##$TD0= 1
##$TE= 0
##$TE2= 300
##$TE3= 300
##$TEG= 300
##$TL= (0..7)
0 120 53 12 22 120 120 120 
##$TP= (0..7)
150 150 150 150 150 150 150 150 
##$TP07= 0
##$TPNAME0= <>
##$TPNAME1= <>
##$TPNAME2= <>
##$TPNAME3= <>
##$TPNAME4= <>
##$TPNAME5= <>
##$TPNAME6= <>
##$TPNAME7= <>
##$TPOAL= (0..7)
0.5 0.5 0.5 0.5 0.5 0.5 0.5 0.5 
##$TPOFFS= (0..7)
0 0 0 0 0 0 0 0 
##$TUNHIN= 0
##$TUNHOUT= 0
##$TUNXOUT= 0
##$USERA1= <user>
##$USERA2= <user>
##$USERA3= <user>
##$USERA4= <user>
##$USERA5= <user>
##$V9= 5
##$VALIST= <valist>
##$VCLIST= <CCCCCCCCCCCCCCC>
##$VD= 0
##$VDLIST= <DDDDDDDDDDDDDDD>
##$VPLIST= <PPPPPPPPPPPPPPP>
##$VTLIST= <TTTTTTTTTTTTTTT>
##$WBST= 1024
##$WBSW= 4
##$XGAIN= (0..3)
0 0 0 0 
##$XL= 0
##$YL= 0
##$YMAX_a= 3287
##$YMIN_a= -3588
##$ZGOPTNS= <>
##$ZL1= 120
##$ZL2= 120
##$ZL3= 120
##$ZL4= 120
##$ABSF1= 0
##$ABSF2= 0
##$ABSG= 0
##$ABSL= 0
##$ALPHA= 0
##$AQORDER= 0
##$ASSFAC= 0
##$ASSFACI= 0
##$ASSFACX= 0
##$ASSWID= 0
##$AUNMP= <proc_1d>
##$AZFE= 0.1
##$AZFW= 0.5
##$BCFW= 0
##$BC_mod= 2
##$BYTORDP= 0
##$COROFFS= 0
##$CY= -3
##$DATMOD= 1
##$DC= 0
##$DFILT= <>
##$DTYPP= 0
##$F1P= 0
##$F2P= 0
##$FCOR= 1
##$FTSIZE= 65536
##$FT_mod= 6
##$GAMMA= 0
##$GB= 0
##$INTBC= 1
##$INTSCL= 5.30512e-09
##$ISEN= 30
##$LB= 1
##$LEV0= 0
##$LPBIN= 0
##$MAXI= 10000
##$MC2= 0
##$MEAN= 0
##$ME_mod= 0
##$MI= 50
##$NCOEF= 0
##$NC_proc= -7
##$NLEV= 6
##$NOISF1= 182.463
##$NOISF2= 159.3651
##$NSP= 0
##$NTH_PI= 0
##$NZP= 0
##$OFFSET= 248.5645
##$PC= 4
##$PHC0= -8840.934
##$PHC1= 90.66891
##$PH_mod= 1
##$PKNL= yes
##$PPARMOD= 0
##$PSCAL= 0
##$PSIGN= 0
##$REVERSE= no
##$SF= 81.014009
##$SI= 65536
##$SIGF1= 159.3651
##$SIGF2= -187.1042
##$SINO= 113.3802
##$SIOLD= 16384
##$SREGLST= <1H.CDCl3>
##$SSB= 0
##$STSI= 65536
##$STSR= 0
##$SW_p= 40650.406504065
##$SYMM= 0
##$S_DEV= 0
##$TDeff= 32768
##$TDoff= 0
##$TI= <>
##$TILT= no
##$TM1= 0
##$TM2= 0
##$TOPLEV= 0
##$USERP1= <user>
##$USERP2= <user>
##$USERP3= <user>
##$USERP4= <user>
##$USERP5= <user>
##$WDW= 1
##$XDIM= 65536
##$YMAX_p= 319208464
##$YMIN_p= -42401980
$$ End of Bruker specific parameters
$$ ---------------------------------
##NTUPLES= NMR SPECTRUM
##VAR_NAME=  FREQUENCY,     SPECTRUM/REAL,   SPECTRUM/IMAG
##SYMBOL=    X,             R,               I
##VAR_TYPE=  INDEPENDENT,   DEPENDENT,       DEPENDENT
##VAR_FORM=  AFFN,          ASDF,            ASDF
##VAR_DIM=   65536,         65536,           65536
##UNITS=     HZ,            ARBITRARY UNITS, ARBITRARY UNITS
##FACTOR=    0.620285442955139, 1,           1
##FIRST=     20137.2065510759, 0,            0
##LAST=      -20513.1999529892, 0,           0
##MIN=       -20513.1999529892, -42401980,   0
##MAX=       20137.2065510759, 319208464,    0
$$ Real data points
##PAGE= N=1
##DATA TABLE= (X++(R..R)), XYDATA
$$ [...]
13151g94064k039286k030110k99902J546372J693342K87204q86881o43749N14666
13142b652408J551639K122935K172222J245139p44387k499776k359241n07658
13134a671535R13212M56382p47194o35489Q59678J775306R49916m54408q39790
13125F06078m08456l74416p49615n28859J60533K714r78034q40503J125477K549512
13115E64431J252084j112479j331346L55310P78750p10434j063511J098097K685273
13106B516175J069141j412615j217733N81154L69755j557181j349974J632141
13098F30863L167101P09532k511704k439621j15446N31684j137025k017618l98450
13089c580684J665058J716880K76041m55116J03442M80405k86713j139004p12149
$$ y = [-794064, -2833350, -4863460, -5163362, -3616990, -1923648, -1636444, -2523325, -3167074, -2652408, -1100769, 1022166, 3194388, 4439527, 3695140, 1195364, -1163877, -1671535, -758323, -301941, -1049135, -1684624, -824946, 950360, 1900276, 1445868, 606078, 197622, -176794, -926409, -1455268, -1294735, -1292021, -2270055, -3110558, -1985081, 564431, 1816515, 704036, -627310, -272000, 506750, -203684, -1267195, -169098, 2516175, 3585316, 2172701, 954968, 1536122, 1905877, 348696, -1001278, 630863, 3797964, 4507496, 1995792, -443829, -559275, -27591, -1164616, -3182234, -3580684, -1915626, -198746, 77295, -377821, -274379, 206026, -80687, -1219691, -1931840]
13080a931840L88981L93179p81807j211080n4985R05120J99270o19624N94403
13071b118383K697960K603347L379k168160k092386j031036m43412M7621Q47681
13062a653389J100351M50702m4287J06765o965n91688m53360N54882Q35756Q754
13052C07521r3784J086105J202974j065250l197583k468078l063J472397J669107
13043a089654J667194J089743m26316j046792L86285J251167j032518l789206
13035b990097k445703J875940L356135J71183l006527k316693K97907J373422
13027c684433J006879J033413J404536J209819R08204R79738L41287j557535k916122
13018a274214k211267r06898r82061j288554N79264L615839L960912M81182l094546
$$ y = [-1931840, -1542859, -1149680, -1931487, -3142567, -3197552, -2292432, -2093162, -2712786, -2118383, 579577, 3182924, 3186303, 1018143, -1074243, -2105279, -2548691, -2501070, -1653389, -553038, -102336, -146623, -39858, -46823, -638511, -1091871, -536989, 298767, 307521, 213737, 1299842, 2502816, 1437566, -1760017, -4228095, -4231158, -2758761, -1089654, 577540, 1667283, 1240967, 194175, 580460, 1831627, 799109, -2990097, -5435800, -3559860, -203725, -32542, -3039069, -5355762, -5057855, -3684433, -2677554, -1644141, -239605, 970214, 1878418, 2858156, 3199443, 1641908, -1274214, -3485481, -4392379, -5374440, -6662994, -6083730, -2467891, 1493021, 1974203, -1120343]
13009a120343k893767K66833K455866J797395O5718n66859k77661l15389o40900
13000a229107m48409j09148o10848j359778p19770J034653J613449K58920r71771
12991b541809n50892M02595Q12078J611371K840704J838501k337134n373861k970642
12982f269089K183771L659173N63394j813359o42493Q99709P3044j019442j83952
12973b549244M80942j327940l260835j753950J998205L613662J777649p18579
12965a740090j502211r18174j2488Q85050J274458N05794p90227j037112L2607
12956c302393Q75472L77253o41391q40912l32048k31129o40978l05114J254723
12947c786517K354617J293157o77534o69573J297057J762107q14196l014776j374022
$$ y = [-1120343, -4014110, -3747277, -1291411, 505984, 571702, 4843, -272818, -588207, -1229107, -1677516, -1786664, -2397512, -3757290, -4477060, -3442407, -1828958, -1570038, -2541809, -3092701, -2690106, -1878028, -266657, 2574047, 4412548, 2075414, -3298447, -6269089, -4085318, -426145, 137249, -1676110, -2318603, -1418894, -1345850, -2365292, -2549244, -2068302, -3396242, -6657077, -8411027, -6412822, -2799160, -1021511, -1740090, -3242301, -4160475, -4172963, -3287913, -2013455, -1507661, -2297888, -3335000, -3302393, -2426921, -2049668, -2691059, -3531971, -3864019, -4095148, -4736126, -5041240, -3786517, -1431900, -138743, -816277, -1485850, -188793, 1573314, 759118, -2255658, -3629680]
12938c629680K138287L083876J210820m1451L87282K62976j000834j290837k75089
12929H45350k90454j666976j718749J24854P85283q67457j455805J200346M042801
12920I99193L566072R17237r98231j946189k544777j565820J166589K440058K37586
12911B271718k338483j821942K0370j08011q41208R02297L300184K119812j606639
12902A898098k683537n2142K054404J396792K84942J26890q04190k684054k612791
12893c075588R1400J842197N07881j051903P3652K110402J891830j13263j210337
12884A066271p05758Q6335L66406P2521q68222j647835o82137J644623K360789
12875A692993N5847k400577j732117R25525J898167M17460q47211j96658J080274
$$ y = [-3629680, -1491393, 1592483, 2803303, 2761852, 3149134, 3412110, 2411276, 1120439, 845350, 554896, -1112080, -2830829, -2705975, -1920692, -2788149, -4243954, -3043608, 999193, 4565265, 5482502, 4484271, 2538082, -6695, -1572515, -405926, 2034132, 2271718, -66765, -1888707, -1868337, -1976348, -2817556, -1915259, 1384925, 3504737, 1898098, -785439, -837581, 1216823, 2613615, 2898557, 3025447, 2221257, -462797, -3075588, -2984188, -1141991, -634110, -1686013, -1612361, 498041, 2389871, 2276608, 1066271, 360513, 446848, 813254, 885775, 17553, -1630282, -2312419, -667796, 1692993, 1748840, -651737, -2383854, -1458329, 439838, 857298, 10087, -186571, 893703]
12866H93703J333325P28596O0929p03483j631461j865385p17697Q61037J089508
12857D9072l12757j501158p36998J309460K354474J434758n2097m77239P4623
12848B142138O15606P49804L88471p83740k284357k484825q34732P37713M45092
12839a308830n63876k37072P57138K76164j225223j179495O77448J784997J045162
12830B6413K31882L07231j96292j719554j982978J93666K315136J890796J99506
12821A265806k63531J06203n17954j552626r79821P71774J221976j15511j079739
12812a143423n12594J25665m61143j214401m60329J594389L173229K915382R02731
12803D919506j614285l062415k690515j209074O1426O10498P68640O03842j94711
$$ y = [893703, 2227028, 2955624, 3016553, 2313070, 681609, -1183776, -1901473, -1040436, 49072, -263685, -1764843, -2501841, -1192381, 1162093, 2596851, 2544754, 2067515, 2142138, 2757744, 3507548, 3896019, 3112279, 827922, -1656903, -2491635, -1753922, -1308830, -1872706, -2109778, -1352640, -1076476, -2301699, -3481194, -2803746, -1018749, 26413, 258295, 565526, 369234, -1350320, -3333298, -3139632, -824496, 1066300, 1265806, 1002275, 1108478, 590524, -962102, -1941923, -1170149, 51827, -63684, -1143423, -1656017, -1530352, -1991495, -3205896, -3666225, -2071836, 1101393, 4016775, 4919506, 3305221, 242806, -2447709, -3656783, -3595357, -2984859, -2216219, -1612377, -1807088]
12794a807088j230400j289409Q1875J596989J607795K07726p70991j7338J522971
12785i7870J712630l1269j744182j233688J008044K203496P82422j533312j892378
12776h26107Q8617J976768J672166j72644j295925n94058R65180J753119J002511
12767D569627q65403k537543k475845l96292J671699J138628j642184l120233
12759c657546j087005K041673K515454N51298m80666N00896J128100J17046p34342
12750H94908k72773j39252j259610j532334M08184K143218J256827n10528l60109
12741F28531P40672K76618q68757j75999J351095O93479j425493j463486N29285
12732B85945Q31453j145397j545043J030442K738692R96150j168651l95137J592190
$$ y = [-1807088, -3037488, -4326897, -4245022, -2648033, -1040238, -832512, -1603503, -1620841, -97870, 1614760, 1583491, -160691, -1394379, -386335, 1817161, 2599583, 1066271, -826107, -737490, 1239278, 2911444, 2738800, 1442875, 848817, 1813997, 3567116, 4569627, 3704224, 1166681, -1309164, -1705456, -33757, 1104871, -537313, -3657546, -4744551, -2702878, -187424, 363874, -116792, 384104, 1512204, 1629250, 894908, 622135, 482883, -776727, -2309061, -1900877, 242341, 1499168, 988640, 628531, 1369203, 1645821, 777064, 601065, 1952160, 2645639, 1220146, -243340, 285945, 1117398, -27999, -1573042, -542600, 2196092, 3192242, 2023591, 1628454, 3220644]
12723C220644J478889j33376n81080O9389j11138j075400j295478p99536p57937
12714A4977j143534j251478j284118j245425R3529K781321M071465J942225j407927
12705B571035k447202j187762j86487j31489J97864O34430j02624j315393r76321
12696b943949O16998J096245P2091k46485J045365K024576J155661n72341j674707
12687E73454k051400j891422q46150O19312R84654k1383n94688L65549J221477
12678a640597q052k294312k560004J96685L372610L898961J875998N7912M5577
12669B944778L69972r36245l065662l387891j207997J394609K585548K571237
12661A268349J958613O44488p25933n84727Q65890J109598q30161k410290j577822
$$ y = [3220644, 4699533, 4566157, 3985077, 4054466, 3943328, 2867928, 1572450, 772914, 14977, -1128557, -2380035, -3664153, -4909578, -4816049, -2034728, 2036737, 3978962, 2571035, 123833, -1063929, -1250416, -1381905, -1184041, -549611, -652235, -1967628, -2943949, -2326951, -1230706, -1158615, -1405100, -359735, 1664841, 2820502, 2248161, 573454, -1477946, -3369368, -4215518, -3596206, -2611552, -2632935, -3227623, -2862074, -1640597, -1648649, -3942961, -6502965, -6306280, -2933670, 965291, 2841289, 2899201, 2944778, 3314750, 2378505, -687157, -4075048, -5283045, -3888436, -1302888, 1268349, 3226962, 3871450, 3145517, 2560790, 3426680, 4536278, 3706117, 1295827, -281995]
12652b81995k23037p91352j843612o55664J583549J447674q34718j651507j0379
12643c261041J190218M55881q0071R44505J497031M8j499219n39613J766836K456155
12633B930730P96738j447453k586840k127183m35114J265476J543917M89842k97781
12624A32332j91000m14873j509902j861536l28024J414280J186246k99938n88815
12615b461230P06530J496537N07732j025239j385694n66786K91470O35261P35651
12606a065768O46309l8211j108161j277772K32859K045765K010966L86462k39628
12597A592821R93735J503752n87686k867303k164115R5485K9835k066650j919378
12588e389504J503332L849474K194862n44100q06459j3692j214933l158224k255205
$$ y = [-281995, -505032, -1296384, -3139996, -3795660, -2212111, -764437, -1599155, -3250662, -3261041, -2070823, -1614942, -1695013, -750508, 746523, 746571, -752648, -1292261, 474575, 2930730, 3727468, 2280015, -306825, -2434008, -2869122, -1603646, -59729, 430113, 132332, -58668, -473541, -1983443, -3844979, -4173003, -2758723, -1572477, -1872415, -2461230, -1754700, -258163, 249569, -775670, -2161364, -2728150, -2436680, -1801419, -1065768, -419459, -457670, -1565831, -2843603, -2610744, -564979, 1445987, 1832449, 1592821, 2586556, 4090308, 3502622, 635319, -1528796, -1433311, -1403476, -3470126, -5389504, -3886172, -36698, 2158164, 1614064, 807605, 793913, -421020, -3579244, -5834449]
12579e834449J156157K993373J466111q96741j438589l58389R74658J901847J941284
12570A905262O63048j070522j504266l11389Q92432P58311l66864j410709j676943
12561b121640r05076M57271J071910J62838r96982n76961J030234J722348R21725
12552G65667K12927M52011M62737n52971j360340p49588L66429M24465l59168
12543c37831n62808J37036O55659K10667p61991j350169j101511k56127N19442
12534b847633P19739N07179M12317N55192O37012O21997O96342N57467l21335
12525A538277j544512j916019j053932P7474O33322Q48643J035838P67252j42919
12516B43424q56525p02580l51401p65139j610085j740493p71996P29231K071932
$$ y = [-5834449, -4678292, -1684919, -218808, -1115549, -2554138, -2912527, -1937869, -36022, 1905262, 2568310, 1497788, -6478, -317867, 574565, 1332876, 966012, -444697, -2121640, -3026716, -2569445, -1497535, -1334697, -2331679, -2908640, -1878406, -156058, 765667, 978594, 1430605, 1893342, 1340371, -19969, -769557, -403128, 21337, -337831, -900639, -763603, -107944, 102723, -659268, -2009437, -3110948, -3367075, -2847633, -2127894, -1620715, -1208398, -653206, -16194, 605803, 1302145, 1859612, 1538277, -6235, -1922254, -2976186, -2898712, -2265390, -1416747, -380909, 386343, 243424, -613101, -1315681, -1667082, -2432221, -4042306, -5782799, -6554795, -5825564, -3753632]
12507c753632K578630J673765K341l58544J560754L438205K100177j841193m105748
12498A294755k319431O99932Q92378j423652k272383J69497L045842K860030J26776
12489C073744j604034n14085J486252J721963K43224o98399J4025R45059K92161
12480D959910j621915k903868k553515j333344l56460R0117J29832k05847n22890
12471d317980m4004J174020J782541Q72859n00621p47485j63760l26530j222147
12462c493107r56106J075973K671473J842107j34340n38292Q10899J502244K28293
12453C009144j536362j920977r73351R2094N45605K64572n99982j277942p58936
12444c156135P09124J531806R18907m0025k83318l57526q87383r65632J70581
$$ y = [-3753632, -1175002, 498763, 501104, 142560, 1703314, 5141519, 7241696, 5400503, 1294755, -1024676, -324744, 567634, -856018, -3128401, -2958904, 86938, 2946968, 3073744, 1469710, 955625, 2441877, 4163840, 4407064, 3708665, 3722690, 4667749, 4959910, 3337995, 434127, -2119388, -3452732, -3809192, -3719075, -3589243, -3795090, -4317980, -4361984, -3187964, -1405423, -532564, -1033185, -1780670, -1944430, -2270960, -3493107, -4449213, -3373240, -701767, 1140340, 1006000, 467708, 1278607, 2780851, 3009144, 1472782, -448195, -1421546, -1329452, -783847, -519275, -1119257, -2397199, -3156135, -2447011, -915205, 3702, -36323, -319641, -677167, -1564550, -2530182, -2359601]
12435b359601J140549L09250j246391j187488K25617N75130m93627o81931O88529
12426c029963J135521o77299k137592o11900K207477K822275J167758J36220P08955
12417A721452Q30296p89908k608593k711686j266999K61112Q60718M27523l17901
12408c593986j86372J095793K114622J698499R51058J426025K008339L65244k721156
12399C158066l737498j659350N88033R40288R16562J804367J808994k58196j791688
12390A769578m64018J286064M6636k458301j940534J065168J808873p76875k324461
12381a987870l31524J995787J421029l90170n99626M1266l14880n92010P55652
12372b346J817648J22079k329870j586417J626182K605761J1222k248050j408216
$$ y = [-2359601, -1219052, -909802, -2156193, -3343681, -3118064, -2542934, -3036561, -3718492, -3029963, -1894442, -2571741, -4709333, -5321233, -3113756, -291481, 876277, 1012497, 1721452, 2551748, 1761840, -846753, -3558439, -4825438, -4564326, -3703608, -3276085, -3593986, -3780358, -2684565, -569943, 1128556, 2079614, 3505639, 5513978, 5879222, 3158066, -579432, -2238782, -1650749, -710461, 206101, 2010468, 3819462, 3561266, 1769578, 1305560, 2591624, 2638260, 179959, -1760575, -695407, 1113466, 336591, -1987870, -2319394, -323607, 1097422, 707252, 107626, 148892, -165988, -757998, -2346, 1815302, 1937381, -392489, -1978906, -352724, 2253037, 2264259, 16209, -1392007]
12363a392007L29310K14823p75421o78837k79194r59905j371751K40965K202222
12354b469795J685406k49073M3496K635600L375937L65462k814071k419513P9085
12345B32534Q24171m64495p95700Q25026J901542M84737k034758l027940j646893
12336c701776R79745L020351K869530L99120k114721j939061N58708K064440Q76995
12327C013331p85477n00145N47021j05874j715430j382847J036666K424413J177013
12318C708671n74995o35652L9322m69267j691745j744073m01671Q80026J317611
12309D28227J300376R61524O4006p68070m05266R33920J632163R09143j83061
12300D872962n86882p90360j555750k127483j206823O48894J243513k59846j978164
$$ y = [-1392007, -1062697, -847874, -1623295, -2302132, -2581326, -3541231, -4912982, -4672017, -2469795, -784389, -1033462, -989966, 1645634, 5021571, 5387033, 2572962, 153449, 232534, 1056705, 592210, -203490, 621536, 2523078, 3007815, 973057, -2054883, -3701776, -2722031, 298320, 3167850, 3566970, 1452249, -486812, 71896, 2136336, 3013331, 2227854, 1727709, 2274730, 2168856, 453426, -929421, 107245, 2531658, 3708671, 3133676, 2498024, 2537346, 2068079, 376334, -1367739, -1769410, -889384, 428227, 1728603, 2690127, 2754133, 1986063, 1580797, 2514717, 4146880, 5056023, 4872962, 4286080, 3495720, 1939970, -187513, -1394336, -745442, 498071, 238225, -1739939]
12291a739939j878541n77844j08450n87748j53423J649196K666617J452956j77046
12282E45778J41672J460200R31913j494424k696096j103084R34112P64047q16586
12273a332468j243859j1512J248478J532722J250967P32211q9154n96835P3505
12264A564055J315139J433094K10732m71406N83279J816853R02750j923396l882724
12255A548376k940399o0024K058637J828124L1411j368087j283371l92820j09028
12246f87181q00490j362602p44403N80540J328833J263870J230345J266412K00119
12237B275443k013071l082654j280147J489050J907396J54329l15802J612950
12229G47494K633095L64429k253596j131622K369693L032538n18670l779558k906373
$$ y = [-1739939, -3618480, -4196324, -4304774, -4892522, -5045945, -3396749, -730132, 722824, 545778, 687450, 2147650, 3079563, 1585139, -1110957, -2214041, -1279929, -515882, -1332468, -2576327, -2587839, -1339361, 193361, 1444328, 2176539, 2087385, 1490550, 1564055, 2879194, 4312288, 4523020, 4051614, 4634893, 6451746, 7354496, 5431100, 1548376, -1392023, -1452047, 606590, 2434714, 2466125, 1098038, -185333, -578153, -687181, -1487671, -2850273, -3594676, -3014136, -1685303, -421433, 808912, 2075324, 2275443, 262372, -2820282, -4100429, -2611379, -703983, -549654, -865456, 747494, 3380589, 3745018, 1491422, 359800, 2729493, 5762031, 5243361, 1463803, -1442570]
12220a442570K26984J419527l3663j461599j275013n75833n44453n01292O34999
12211c552913K245107K540096R54436r75024j559110j057614q54790j021565l52180
12202c633557J061594J416241K59049k90390R71836J878570L62692j659572j115650
12193g49187J040714J311190n51644j457787n23263k16886j326788j298164Q99224
12184b872591K429131J237456o30103p52125o5587k88942o28910J34261Q89388
12175e48022L36679m19655p2377L67767j54441l29640Q90420J664431K72452j517693
12165D89921j256533J55939M58792r4912j68597l82125j313343q32548K407318
12156e36088M991739K934612j838623m020719k512275n06263O26597J973438K543873
$$ y = [-1442570, -1215586, 203941, 170278, -1291321, -2566334, -3142167, -3686620, -4187912, -3552913, -1307806, 1232290, 2186726, 1211702, -347408, -1405022, -2259812, -3281377, -3633557, -2571963, -1155722, -896673, -1187063, -215227, 1663343, 2026035, 366463, -749187, 291527, 1602717, 1051073, -406714, -929977, -1146863, -2473651, -3771815, -2872591, -443460, 793996, 163893, -588232, -653819, -942761, -1571671, -1437410, -548022, -211343, -630998, -703375, -335608, -490049, -819689, 70731, 1735162, 2007614, 489921, -766612, -610673, -151881, -246793, -415390, -797515, -2110858, -2943406, -536088, 4455651, 7390263, 5551640, 1530921, -981354, -1487617, -861020, 1112418, 3656291]
12147C656291J89830l082556k882714R2734O69521j864174k229910J502657L979351
12138C1030J293263k641975k778057n60223Q9052k22958J036890K308913N40159
12129i03906k468163k190857J255641L234048J746340l19425l77604O17140R20091
12120A513305N79140K26973j86024n99124o26376m85441n66827k75157R31375
12111E11844J775823N72802j804861k591090q63364J379850K021192Q51349j252664
12102F00881l182702l425851j143010J966458K796248P33798j222652l75511K047984
12093a204357K682473N94247j651591j504805M43899J601375P99289n92344r01618
12084B66568k59871J61937J9295j89191k82657k77580L50854J706431K166303
$$ y = [3656291, 3846121, 763565, -2119149, -2026415, -1356894, -3221068, -5450978, -3948321, 31030, 1324293, -1317682, -4095739, -4655962, -4566910, -4789868, -3752978, -1444065, -903906, -3372069, -5562926, -4307285, -1073237, 673103, 353678, -23926, 593214, 1513305, 2092445, 2319418, 2133394, 1534270, 907894, 422453, -144374, -419531, 511844, 2287667, 2860469, 1055608, -1535482, -2398846, -1018996, 1002196, 1853545, 600881, -2581821, -6007672, -7150682, -5184224, -2387976, -1654178, -2876830, -3252341, -1204357, 1478116, 2072363, 420772, -1084033, -640134, 961241, 1760530, 1168186, 266568, 6697, 168634, 187929, -1262, -283919, -561499, -210645, 1495786, 3662089]
12075C662089O4862l223421m107813j383619K032087K976603J714702L81880m27414
12066A689956j555787k831470k769851o65685K183178L449643J757789j767772
12058e09999l940502k583167P81926K688225K120437J191141J269417J083288
12050B100766l37599j520546j046320Q7854M70104N48840R46022O20776r89223
12041H80674j967304o46235J350130J471470J32281n04288j77794m9148P0293
12032E60079Q78492J189430k94475j914148j315289K63360m3400j364525m17465
12023b457941K091608J811872j655777l167860k25421K656695J212242j757999
12015a492581j470651P96971N00543j712562q32274L581183N638001J925456l207081
$$ y = [3662089, 3726951, 503530, -3604283, -4987902, -2955815, 20788, 1735490, 2117370, 1689956, 134169, -2697301, -5467152, -6132837, -3949659, -500016, 1257773, -509999, -4450501, -7033668, -6251742, -3563517, -1443080, -251939, 1017478, 2100766, 1763167, 242621, -803699, -715845, -245741, 303099, 1249121, 1869897, 880674, -1086630, -1732865, -382735, 1088735, 1221016, 716728, 538934, 489786, 560079, 1438571, 2628001, 2333526, 419378, -895911, -632551, -675951, -2040476, -2457941, -366333, 1445539, -210238, -3378098, -3603519, -946824, 265418, -1492581, -2963232, -2166261, -1665718, -3378280, -4210554, -629371, 5008630, 6934086, 3727005]
12006C727005m067033j287471N70021J82998p9425O14980M75364p12763n95286
11997a171610J248776J626044j075110l242300j125076K680940K380599k118880
11989g96617m480216j188262L231055L029628n19439j777462O51621K661848J447089
11980B259245q65654j271332m6795P91235O60865J92179m33773j104963q91321
11971g10314P34423K406783K120362j50345k199031k116665m03836P37056O989
11962D25422j422313j326362O02196K062327J097584j115892j766578k56718J136970
11953e63364O11367q57358j293290m02173O50362J197611J513085J696459J326736
11944C879435L39618n56603o57590q0175M13225K18708n99152j436629j621356
$$ y = [3727005, -340028, -1627499, -1057478, -874480, -953905, -338925, 136439, -576324, -1171610, 77166, 1703210, 628100, -2614200, -3739276, -1058336, 1322263, -796617, -5276833, -6465095, -3234040, -204412, -723851, -2501313, -1849692, 812156, 2259245, 1393591, 122259, 75464, 866699, 1527564, 1719743, 1285970, 181007, -710314, 24109, 2430892, 4551254, 4400909, 2201878, 85213, -318623, 418433, 425422, -996891, -2323253, -1721057, 341270, 1438854, 322962, -1443616, -1700334, -563364, 48003, -809355, -2102645, -2504818, -1854456, -656845, 856240, 2552699, 3879435, 4219053, 3662450, 3004860, 2924685, 3337910, 3556618, 2957466, 1520837, -100519]
11935a00519q72750L86023J124541N70388o99851j047500K22211J657652J449889
11926B690084l3014r33924q68004j195740k030036j383568J422510L703510K802038
11917D173856q2637j771648j596331j412231j864428j495825L38984K175658K590768
11908A056166J754670M42517q24773j429288j101128q03520j487764k128063j052037
11899e573220R62668J504478N50445O28194K271779K674318M21796j713231j120543
11890F06684L69229k99990k101828j571067J389979L182108J917625k26343o98834
11881B567563J29220L81465o04293j941915k238583n50494K393433L953589K272739
11872F362724q66297j972448o59670R9366j013841j586997J06283J766775P23606
$$ y = [-100519, -973269, -587246, 537295, 1107683, 407832, -639668, -417457, 1240195, 2690084, 2657070, 1723146, 855142, -340598, -2370634, -3754202, -2331692, 1371818, 4173856, 4091219, 2319571, 723240, -688991, -2553419, -4049244, -3710260, -1534602, 1056166, 2810836, 3253353, 2428580, 999292, -101836, -905356, -2393120, -4521183, -5573220, -4610552, -3106074, -2555629, -1927435, 344344, 3018662, 3440458, 1727227, 606684, 975913, 675923, -1425905, -2996972, -1606993, 1575115, 3492740, 3266397, 2567563, 2696783, 3078248, 2473955, 532040, -1706543, -2257037, 136396, 4089985, 6362724, 5496427, 3523979, 2864309, 2963675, 1949834, 362837, 469120, 2235895, 2959501]
11863B959501j561842j868396l68091J76851o16663m45334J114404J586041l3682
11854I42789j326336l31280J508774J981134J192165K21397r88647k370533k493878
11845a664415q54755M76058j48284j129055l78447R64874O79469l32191L18185
11836b068561J804601J197303j154840j750630K27008J602843P16917j38192N46679
11827I83128O22963j340331k700596j026756J454528J376444l41451n28522P27283
11818g73310Q48937j70249R2294J612924J534398p53607k115169o53870J157424
11809G79772L98572j768393k008340K00887K046854J488109k72865r39678k51284
11800c26366J99418l48922q29884m21453j48079j041605j731918n7214L120110
$$ y = [2959501, 1397659, -470737, -838828, -661977, -1278640, -1723974, -609570, 976471, 942789, -383547, -714827, 793947, 2775081, 3967246, 4188643, 3199996, 829463, -1664415, -2519170, -2043112, -2191396, -3320451, -3698898, -2734024, -2054555, -2386746, -2068561, -263960, 933343, -221497, -1972127, -1745119, -142276, 574641, 436449, 983128, 1606091, 265760, -2434836, -3461592, -2007064, -630620, -972071, -1500593, -773310, 75627, -94622, -2328, 1610596, 3144994, 2391387, 276218, -377652, 779772, 1178344, -590049, -2598389, -2397502, -350648, 1137461, 864596, -75082, -326366, -126948, -475870, -1305754, -1727207, -1875286, -2916891, -4648809, -4706023, -1585913]
11791a585913M215405J712964j672945k790424j849145r04408n68364k23354O5900
11782c600284n649K38724J282796K001848J211988l36160j173916j240448j164059
11773b785160o88285M07702J122360Q08851N64170J195872J446270L23480o68510
11764A726750q7616O34546j93864j134207k22520J005943O8500j612854r58409
11755g73731R83799N93109j666080j630261J367164L201369J732360m26146j172597
11746B208986j667649k187413p03060K100235J946065j755202l248659P56115
11738b550582M763037K445467l214022m267942K24903L490985J624282j676161
11730H39967j932162P0128J191718P82271K0442q15969j853896k052993m03184
$$ y = [-1585913, 2629492, 4342456, 2669511, -120913, -1970058, -2874466, -3442830, -3666184, -3600284, -3605933, -3367209, -2084413, -82565, 1129423, 793263, -380653, -1621101, -2785160, -3473445, -3065743, -1943383, -1134532, -570362, 625510, 2071780, 2395260, 1726750, 1639134, 2273680, 2079816, 945609, 723089, 1729032, 1797532, 184678, -773731, 210068, 803177, -862903, -2493164, -1126000, 2075369, 3807729, 3381583, 2208986, 541337, -1646076, -2349136, -248901, 1697164, -58038, -3306697, -2550582, 2212455, 4657922, 1443900, -2824042, -2599139, 891846, 2516128, 839967, -1092195, -1022067, 169651, 951922, 972364, 156395, -1697501, -3750494, -4153678]
11721d153678K024678K935394J604732k53323n91767N81591J356967M02447j316180
11712B590861j867111r16186R5337J22588m29669q28620p77581K0924J497594
11703d91863K318484J202799o84948q54773O42026J092577l69367j169273K71153
11694A956815J572199K59886j997792j950550L04411J943351J651741M22270q48900
11685C313431j876195j901524n99235O23414M71454K0117Q29612J882283J108008
11676C871365q84729j578374o18539j28419r72654j543084o25263R61871J996210
11667D78384K048034Q95114j182712k499874j551173M52079R03190l12241p67864
11658a537063M29823J279570L49793j015679j139277m30621l7590O0159K96036
$$ y = [-4153678, -2129000, 806394, 2411126, 2157803, 1566036, 2147627, 3504594, 3907041, 2590861, 723750, -192436, -97099, 25489, -404180, -1232800, -2010381, -1989457, -491863, 1826621, 3029420, 2344472, 1489699, 2131725, 3224302, 2854935, 1685662, 1956815, 3529014, 3788900, 1791108, -159442, 144969, 2088320, 3740061, 4162331, 3313431, 1437236, -464288, -1063523, -440109, 31345, 51462, 881074, 2763357, 3871365, 2986636, 1408262, 789723, 661304, -311350, -1854434, -2479697, -1517826, 478384, 2526418, 3421532, 2238820, -261054, -1812227, -1360148, -456958, -769199, -1537063, -1107240, 172330, 522123, -493556, -1632833, -2063454, -2101044, -2040885, -1744849]
11649a744849M32734M08439Q03727J407519Q29330j293898l108341k799263q52382
11640e916984J031360K057026K244158J479442M1010q84456n34261L07634N89980
11631D14909N23038O96848O31751l61848j573925j662985o56232K01616L47800
11622a439028L28653M68234M16608P5182k03071m38987r18086j137829j61509
11613c009833J558036K039155L40646j774792j944256l18569Q00718K10577p79660
11604b877978n07106P70220J539106J089200J3402p48197m97569J023119K978183
11595B782380L429760J301208j727373k657791p97930J305169J091415r72511
11587C754327k362861j655825K13046J405917J116960J37398j96937L05542L31095
$$ y = [-1744849, -1312115, -903676, -99949, 1307570, 2136900, 843002, -2265339, -5064602, -5916984, -4885624, -2828598, -584440, 895002, 936012, 51556, -482705, -175071, 414909, 937947, 1634795, 2266546, 1904698, 330773, -1332212, -1988444, -1786828, -1439028, -1110375, -642141, -225533, -150351, -353422, -792409, -1710495, -2848324, -3009833, -1451797, 587358, 928004, -846788, -2791044, -3109613, -2308895, -2098318, -2877978, -3385084, -2614864, -1075758, 13442, 26844, -721353, -1218922, -195803, 2782380, 6212140, 7513348, 5785975, 3128184, 2330254, 3635423, 4726838, 3754327, 1391466, -264359, -51313, 1354604, 2471564, 2608962, 2412025, 2717567, 3048662]
11578C048662j009724k382900j736284N13868J674168O63818l41210N99866J957718
11569B987982R92171j986830l907809l025894o70384J020466J306772O26784k48776
11560b905518m49935M20826J603187J917495J239534M19891m8838k68094j42377
11551A786171L84784N38580l67852j303985n08425J657857K638159J116554j147978
11542D793865j904362j295575q26499p49116k85994K40314m60480k248197l027941
11533e763985j385596J388817K851091K299500J138190O79566O71100K11726p37181
11524A353228j344588j010173M1001J065259J361628P94312P1083J00173O77253
11515C109176M32978j185140k568303j821487M03679J520697N27760p53349m92535
$$ y = [3048662, 2038938, -343962, -2080246, -1566378, 107790, 771608, 430398, 1030264, 2987982, 3980153, 1993323, -1914486, -4940380, -5610764, -4590298, -3283526, -2656742, -2905518, -3355453, -2934627, -1331440, 586055, 1825589, 2245480, 2196642, 1928548, 1786171, 2170955, 2709535, 2341683, 1037698, 529273, 2187130, 4825289, 5941843, 4793865, 2889503, 1593928, 767429, 18313, -267681, -27367, -487847, -2736044, -5763985, -7149581, -5760764, -2909673, -610173, 528017, 1207583, 1878683, 2090409, 1353228, 8640, -1001533, -960532, 104727, 1466355, 2260667, 2331750, 2431923, 3109176, 3542154, 2357014, -211289, -2032776, -1629097, -108400, 419360, -333989, -826524]
11506h26524P07848J181175O57781M1039l23457p15003r28670m91044K35543L82530
11496g8782j6406r460P29299J232551M99363j098823k111211j614097k26830P38923
11486a955473J030317J606183K618867K352129l92721l572865l734957o78063
11478b726583J992384J690378l2137m60446L59556O16889n264l74355k34661k84979
11468E40782m87602k56507P1728k48884p48421l61784O18894Q90681K15674m24579
11458a90018n14844l62123j10503J41401j98914j044008p72853J369759K962490
11449A280387J321140j826283k064399J051777K898632O68408k371623j939499
11441i81460J012663K338024Q71428r79825j617715j643187j285977O9436J490062
$$ y = [-826524, -118676, 1062499, 1720280, 1761319, 1437862, 722859, -205811, -696855, -461312, -78782, -95188, -104648, 624651, 1857202, 2356565, 1257742, -853469, -2467566, -2694396, -1955473, -925156, 681027, 3299894, 5652023, 5259302, 1686437, -2048520, -2726583, -734199, 956179, 924042, 463596, 823152, 1440041, 1434777, 1060422, 825761, 540782, 53180, -203327, -131599, -380483, -1128904, -1490688, -871794, 18887, 234561, -190018, -704862, -1066985, -1177488, -1036087, -1235001, -2279009, -3051862, -1682103, 1280387, 2601527, 775244, -1289155, -237378, 2661254, 3329662, 958039, -981460, 31203, 2369227, 3240655, 2260830, 643115, -1000072, -2286049, -2216613, -726551]
11432g26551Q59814j483374k393356n00805J557391J277730J14405O49662K018279
11423A373195J456850p09974j324938L92405J523915K74903j190664m67521J320607
11414B648778J739511Q46598K39528J2184o60029j240211q81878n77580j357401
11405G69500j573712N15836K475287M20807m081949m856033r8664M391965L469397
11396A432434l20347j516052J25691Q31990k65138m66464J045838J787927M52598
11387C108477r66624n83717O83666J003686J06097j192428k285981k640199j641187
11378d408210M84999K357025K652946J278765p15563j948547j653400l36924P44198
11369a544711J033167J010587R35515L86286n17255q34897m21181k75300n21655
$$ y = [-726551, 133263, -1350111, -3743467, -4244272, -2686881, -1409151, -1294746, -645084, 1373195, 2830045, 2120071, 795133, 1187538, 2711453, 2986356, 1795692, 1328171, 2648778, 4388289, 5234887, 5474415, 5486599, 4826570, 3586359, 2704481, 2126901, 769500, -804212, -288376, 2186911, 2607718, -1474231, -6330264, -6428928, -2036963, 1432434, 1112087, -403965, -278274, 553716, 288578, -177886, 867952, 2655879, 3108477, 2141853, 1558136, 2241802, 3245488, 3351585, 2159157, -126824, -2767023, -4408210, -3923211, -1566186, 1086760, 2365525, 1649962, -298585, -1951985, -2288909, -1544711, -511544, 499043, 1434558, 1820844, 1303589, 468692, 47511, -227789, -749444]
11360g49444N2465J390712J369457p78744k581119j975190n20857m02390n91209
11351d786319P33393K059245Q49674j480584j303026J215229K328572Q66654l09905
11342A72933M54123J276702P85801M32767J107330J065395p56652k430763k119672
11333a2036q59373l02963q0178O58249J245785R35970L71294l4360j115786k714398
11323a907796k674335q0867K576036K683743J125369L35889M41853r1482j217536
11314A190874j388016k96345O85320N57756l93641j286842j070782Q11370L011313
11305A821007K880877j8205k549093k007150J32798P99835K8769M6591Q74842
11296B010271N36440p09589l08538J797450K176588p37466l715597l414020j094914
$$ y = [-749444, -696979, 693733, 2063190, 1284446, -1296673, -3271863, -3792720, -4195110, -4786319, -4052926, -1993681, -1144007, -2624591, -3927617, -2712388, -383816, 482838, 172933, 627056, 1903758, 2689559, 3122326, 4229656, 5295051, 4538399, 2107636, -12036, -871409, -1174372, -1254550, -596301, 649484, 1585454, 1956748, 1922388, 806602, -1907796, -4582131, -4662998, -2086962, 596781, 1722150, 2058039, 2499892, 2408410, 1190874, -197142, -493487, 191833, 749589, 355948, -930894, -2001676, -1190306, 1821007, 4701884, 4683679, 2134586, 127436, 260234, 1060069, 1088838, 1135429, 2010271, 2546711, 1837122, 1528584, 3326034, 5502622, 4765156, 1049559, -2364461, -3459375]
11287c459375J25827K94058J321481K332820O34507k876635l653535j19047L380983
11278b018916K507635j071584k483418m26932K057713K443346J114756o12531
11270A510069j835453j536081L92281J614946r0925k708500k021458J712387L394254
11261D31520Q96352j364864M59845L337228K437268r43317j879472m4447M26306
11252C756419j507324k286945l70901J107607q3001j728559j417174l53592l47346
11243c230816l72549R21280J957010O90153j526058j693284K49489J444407L48925
11234a211443j412423j598271r2973J323961J124253l14302j074908L5917J837605
11225a382584K234140J042675j8638q6736j01243o69010r23668l11536K42582
$$ y = [-3459375, -3333548, -3039490, -1718009, 614811, 1249318, -1627317, -5280852, -5399899, -2018916, 488719, -582865, -3066283, -3493215, -1435502, 1007844, 2122600, 1510069, -325384, -1861465, -1469184, 145762, 54837, -2653663, -4675121, -2962734, 431520, 1327872, -36992, 422853, 3760081, 6197349, 5254032, 3374560, 3330113, 3756419, 2249095, -37850, -408751, 698856, 615855, -1112704, -2529878, -2883470, -3230816, -3603365, -2682085, -725075, -34922, -1560980, -3254264, -3004775, -1560368, -1211443, -2623866, -4222137, -4315110, -2991149, -1866896, -2181198, -3256106, -3220189, -1382584, 851556, 1894231, 1875593, 1788857, 1687614, 1018604, 94936, -216600, 25982]
11216B5982k9537m58102l09566k6278o9595J12109R00498J548700J386017P49798
11206C830026q0393j350523k350265j392531J284916K546564L84995k649072k617240
11197b393523K14422J882252N82204j085172n41100R11349N78017j158653j483973
11188b494177L35348J768001R47167n30883k87136J067836J119131l05899r88060
11179F31328j63421L23541n52469j172286k40345R56035J011724P06295P67683
11170B268085j38029k501380l538760j125218J931913J626350q44233j059599
11162c380871J225555J920569j52932j390090j700Q60486j040007k746158r88846
11153e693994K325740L205717J498044L1701k93596q89452j916073j693633L46434
$$ y = [25982, -3555, -461657, -771223, -797501, -867096, -754987, 145511, 1694211, 3080228, 3830026, 3749633, 2399110, 48845, -1343686, -58770, 2487794, 2872789, 223717, -2393523, -2179101, -296849, 285355, -799817, -1340917, -429568, 148449, -1010204, -2494177, -2158829, -390828, 556339, 25456, -261680, 806156, 1925287, 1619388, 631328, 467907, 791448, 238979, -933307, -1173652, -217617, 794107, 1500402, 2268085, 2130056, -371324, -3910084, -5035302, -3103389, -1477039, -2321272, -3380871, -2155316, -234747, -387679, -1777769, -1779469, -918983, -1958990, -4705148, -5693994, -3368254, -162537, 1335507, 1367208, 1073612, 184160, -1731913, -3425546, -3079112]
11144c079112K544265L122157J921616K3999j302316j439139r23097q04065j186989
11135a122681j132983k46713O63382Q52837N38171K55475L20188R30753J680205
11126B738634J285635o81430k273507j375086R69678J826399O96020k22926p2198
11117B891219l98925j643734j928911n31220N39621l9790o99572J12606J309115
11108c89591J244387K84086l87422o56521p43015l42825L15058L01020k76469
11099f51292k54885L55227M16957K65900J369914K875266J918052j549855l783756
11090I61528k598267k39559Q00339J260475K240150K330067L30521j997960k535993
11081E51301j761509r37547J03251J324731J380420K18674k6715J220339J411755
$$ y = [-3079112, -534847, 2587310, 4508926, 4532925, 3230609, 1791470, 868373, 64308, -1122681, -2255664, -2502377, -1838995, -986158, -447987, -192512, 127676, 1058429, 2738634, 4024269, 3342839, 1069332, -305754, 663924, 2490323, 3186343, 2963417, 2891219, 2492294, 848560, -1080351, -1611571, -1071950, -1111740, -1811312, -1698706, -389591, 854796, 1138882, 751460, 94939, -648076, -990901, -675843, -374823, -651292, -906177, -550950, -133993, 131907, 1501821, 4377087, 6295139, 4745284, 961528, -1636739, -1876298, -1075959, 184516, 2424666, 4754733, 5085254, 3087294, 551301, -1210208, -2147755, -2044504, -719773, 660647, 879321, 852606, 2072945, 3484700]
11072C484700p85735k849512k498095j098575m31451M37163K172435K628970N73157
11063A633057j406113j087357l76407j370068k151881m70764J723568J707433
11055a798532Q38212J506300K205605M58752j957217j710883L18464Q36674k52982
11046D44393p22690n49119r20097p45134J130470K392654Q47593q26741O82749
11037A734078K752584O99526l666556m195459j55699K990500K341557M39754q36769
11028B103516k634295m414424l173940R44623L656243K823200R95915M12929K13833
11019I27600j37272N80195J932760J486545p52388j831774r23619n00337j355478
11010e73768j115241Q64892J761116J99391j396370j155119l93864k79673R2302
$$ y = [3484700, 2698965, -150547, -2648642, -3747217, -4178668, -3741505, -1569070, 1059900, 1633057, 226944, -860413, -1236820, -2606888, -4758769, -5229533, -3505965, -1798532, -960320, 545980, 2751585, 3210337, 1253120, -457763, -139299, 697375, 444393, -278297, -827416, -1747513, -2492647, -1362177, 1030477, 1878070, 1051329, 1734078, 4486662, 5186188, 1519632, -2675827, -2831526, 158974, 2500531, 2940285, 2103516, -530779, -4945203, -8119143, -7174520, -3518277, -695077, 300838, 713767, 927600, 790328, 1370523, 3303283, 4789828, 4037440, 2205666, 1282047, 781710, -573768, -1689009, -824117, 936999, 1136390, -259980, -1415099, -1808963, -2088636, -1996334]
11001a996334P71006K65113p59805M38092L278228L372738l91831l228121j783830
10992c4744O13868l32828l050508l158590l12100K186463K527231J506633N7577
10983C002j256695j499236n36868J92127j57587m18287L54558J089653O93994
10974a535339o6855j85568k3665K1493M81997J257276J153585R763r02308j306365
10964a095986k102662k539006n99709K717285L347592K07376k455884j144096
10956c665090J935417K747672J090805o69654j722616k386823j860002K99139
10948d231152K149547J765370J92262m63155k35051k00569l3240P40902P87893
10939D72807r48597k636574j791966R36457K672549K083675J75404j606270k146748
$$ y = [-1996334, -1225328, -960215, -1720020, -1281928, 1996300, 5369038, 4977207, 1749086, -34744, 579124, 246296, -2804212, -5962802, -6274902, -4088439, -1561208, -54575, 3002, -1253693, -2752929, -3289797, -3097670, -3255257, -3673544, -3318986, -2229333, -1535339, -1602194, -1787762, -1811427, -1789934, -1307937, -50661, 1102924, 1112687, 210379, -1095986, -3198648, -5737654, -6337363, -3620078, -272486, -65110, -2520994, -3665090, -1729673, 1017999, 2108804, 1439150, -283466, -2670289, -4530291, -4231152, -2081605, -316235, -123973, -587128, -822179, -1022748, -1055988, -315086, 472807, -475790, -3112364, -4904330, -3967873, -1295324, 788351, 963755, -642515, -2789263]
10930b789263p70797J532743K295723P50724p16753j07082J088157N52149r91992
10921H43609j308623m84587k61843o54889k62830P18897P24440k36597n42748
10912a465171J71722N63236J50352R2535R72789J705257J279664J49085p46280
10903B873189j242975j601741j622871q32360N64576J433852R09015k26578k96583
10894d2476O82969O12358j234428k160305J5732K528267J053784l037909l638636
10885e220644R34085M737962K741294j885266k872914J20613K277443J425189
10877B257762J16238L34561O18021o23990k217279k113186k28929J760578K335020
10868B238796J211005o32007j669208j172988P0385P12144K42427p64560j242199
$$ y = [-2789263, -3560060, -2027317, 268406, 1019130, 302377, 195295, 1283452, 1835601, 843609, -465014, -949601, -1211444, -1866333, -2129163, -1410266, -685826, -922423, -1465171, -1293449, -730213, -579861, -487326, 485463, 2190720, 3470384, 3619469, 2873189, 1630214, 28473, -1594398, -2426758, -1862182, -428330, 480685, 254107, -42476, 640493, 1252851, 18423, -2141882, -2126150, 402117, 1455901, -1582008, -5220644, -4286559, 451403, 3192697, 1307431, -1565483, -1444870, 832573, 2257762, 2374000, 2708561, 3326582, 2702592, 485313, -1627873, -1856802, -96224, 2238796, 3449801, 2817794, 1148586, -24402, 45983, 758127, 1000554, 235994, -1006205]
10859a006205l89264J255076J568348p97247l704546l350292M64329L349701K147014
10850d63086o83128q74589J396943K269730L04564j610778r11638R92327J206368
10841A626713l37040j078704J37361J200578j56650k542673k217658J485531M311745
10832B429203K466324j838978l122740k36238K260885Q91824k075890k617756
10824a843366p76458K97454m92135j057504J02463J597505J416334n8937n75532
10815a390176Q50093K482929K153557K59512q63818m33301j20889q22075r19229
10806A196603N28333J277479o27422k839747j785051J493460K663861P78148p62723
10797A922941j69031L47798o94878j280871Q8380J318669K43486j680839j837722
$$ y = [-1006205, -1395469, -140393, 1427955, 630708, -3073838, -6424130, -5959801, -2610100, -463086, -1146214, -2020803, -623860, 1645870, 1950434, 339656, -571982, 420345, 1626713, 1289673, 210969, 348330, 1548908, 1392258, -1150415, -3368073, -1882542, 2429203, 4895527, 3056549, -66191, -302429, 1958456, 2850280, 774390, -1843366, -2619824, -2322370, -2814505, -3872009, -3769546, -2172041, -755707, -814644, -1390176, -540083, 1942846, 4096403, 4355915, 3492097, 3058796, 2937907, 2115832, 1196603, 1724936, 3002415, 2374993, -464754, -2249805, -756345, 1907516, 2685664, 1922941, 1753910, 2101708, 1406830, 125959, 214339, 1533008, 1776494, 95655, -1742067]
10788a742067l38269J016891J721979K094855J443757p97514l093814l202550
10780b896732j162726P08121O68542o04206j043582K92430J868879J441837o06873
10771a334310j274049O24277K161282P05920j597932j170058J040951J317011
10763D73092k71319j81585J927303K281509l72014k447682j497544K72384N18848
10754G02992L51206J007656J039700m55106j370011j77369J109601K95746j360343
10745A144072j441707l7902J087216J034705j11657j713311k144242k85026J992550
10736d75302J719438m50646r38548R56141K098014J065558P4166K39714k40205
10727D048330j665333j584155J76689L19533j922555k772216l85115J888633J491281
$$ y = [-1742067, -2080336, -1063445, 658534, 2753389, 4197146, 3399632, 305818, -2896732, -4059458, -3351337, -2682795, -3287001, -4330583, -4038153, -2169274, -727437, -1334310, -2608359, -1984082, 177200, 883120, -714812, -1884870, -843919, 473092, 201773, 20188, 1947491, 4229000, 3856986, 1409304, -88240, 184144, 702992, 1054198, 2061854, 3101554, 2646448, 1276437, 1099068, 2208669, 2504415, 1144072, -297635, -335537, 751679, 1786384, 1674727, -38584, -2182826, -2467852, -475302, 1244136, 793490, -145058, 811083, 2909097, 3974655, 4048821, 4288535, 4048330, 2382997, 798842, 975531, 1295064, -627491, -3399707, -3784822, -1896189, -404908]
10718d04908N99222J018553O09882j617850k276434M22488K564741Q00226k068201
10709c52281k198752p62233m01242k86100P13729O29569j127937q18561L045208
10700a558600N305314K022759k361310k058826P47224O17362j571960j426957
10692b84994L14841p3060j460978j85055K160137J278902j397797r46591J847388
10683A252793J783603j123163j696700P86171J374491j306823k550205m5545K369450
10674H44072J736596L16232L01797n0290k071443l333601j724083R33445K013681
10665a033594J742337J494641J139403J00061r77396j206859p56764l73681n76006
10656d47858j200959r53070J394234M252067L873961l27417l766233k699700M77702
$$ y = [-404908, 194314, 1212867, 1822749, 204899, -2071535, -1649047, 915694, 1715920, -352281, -2551033, -3313266, -3714508, -4000608, -3286879, -2657310, -3785247, -4603808, -1558600, 3746714, 5769473, 3408163, 1349337, 2096561, 2713923, 1141963, -284994, 29847, -43213, -1504191, -1689246, 470891, 1749793, 351996, -594595, 1252793, 3036396, 1913233, 216533, 1002704, 2377195, 1070372, -1479833, -1525378, 844072, 2580668, 2896900, 3198697, 3148407, 1076964, -2256637, -3980720, -3047275, -1033594, 708743, 2203384, 3342787, 3442848, 2465452, 1258593, 501829, 128148, -447858, -1648817, -2601887, -1207653, 3044414, 6918375, 6590958, 2824725, 125025, 602727]
10647F02727J287510k49648j085858o83689n62141l56533R79916J741179l9842
10638A633621k172863j194978J629964K120595k1796j195772p8458J001301O55208
10629B376822k4878m78192j274446j812502r71385K62317P5689q98565p15263
10620c460403M00494P98940N39410P61299J153548Q74012N26229O65153K70213
10611B528895q82483q98804O68812J101241q66547k357931j342136j29874m46522
10602b625349K00169L061752M188184R63486k430019j669092N66936J17533j123559
10593A250041J03537J290257p81437k574132M39369M687458L747477q06616k475585
10584D880369p72238l86210j878626j780404r1248K67406l46269J49980K88418
$$ y = [602727, 1890237, 1640589, 554731, -128958, -691099, -1047632, -67716, 1673463, 1633621, -539242, -1734220, -104256, 2016339, 1994543, 798771, 720313, 1721614, 2376822, 2351944, 1873752, 599306, -1213196, -2184581, -1922264, -1846575, -2745140, -3460403, -3059909, -2260969, -1721559, -960260, 193288, 1067300, 1593529, 2258682, 2528895, 1646412, 747608, 1416420, 2517661, 1651114, -706817, -2048953, -2178827, -2625349, -2425180, 636572, 4824756, 5788242, 3358223, 1689131, 2256067, 2373600, 1250041, 1353578, 2643835, 1862398, -711734, -272365, 4415093, 8162570, 7355954, 4880369, 4108131, 3721921, 1843295, 62891, -28357, 239049, -107220, 42760, 331178]
10575C31178j665283k433263R54369M381862K922907l97014l45955Q40911j362216
10566C227496l997187k121943Q69807o79853l154569J6542N078066L745785j632224
10557A351920k141947J652846J629889k331265k849890M84187J125278j073236
10549b152218k59401K719592J711146j803754j007689K380277Q47259l741918
10541a306706k729114K794015L615831l53876o04270K847175J604675l892459
10533A975271m384244N61207K010078q37488o4666L792825K181384l483334l116011
10524a364978K306817J929706l699892l326096K483382J691541n137196m552949
10516i669665L953095O172011q5602j670015L467963K915191l756896l002472
$$ y = [331178, -1334105, -3767368, -2812999, 1568863, 4491770, 4094756, 3748801, 4589712, 3227496, -769691, -2891634, -2021827, -2701680, -5856249, -5839707, -761641, 2984144, 1351920, -790027, 862819, 2492708, 161443, -2688447, -2204260, -1078982, -2152218, -2411619, 307973, 2019119, 215365, -792324, 1587953, 2435212, -1306706, -4035820, -1241805, 2374026, 2020150, 1415880, 4263055, 5867730, 1975271, -2408973, -1847766, 162312, -675176, -739842, 3052983, 5234367, 1751033, -1364978, 941839, 2871545, -828347, -4154443, -1671061, 20480, -5116716, -9669665, -5716570, 455441, 369839, -1300176, 2167787, 5082978, 1326082, -1676390]
10508a676390M568334L559843m965591l490096O791862N901266n310472m580915
10500G97841P121142M599986j0300100p112326J2341367J0015984j4119541j2038633
10492h694280K0712556K2842547j7042120j1051116Q3919517J54306382P4214978
10485C19208464r1525416j58531402p7173390J7451279J8722010k1197500j6823575
10478i869530J3737738J0974844j3779494j2487025Q454117R201905p164616p715461
10470h647522N740155N513436o446513n645000N684595M791379o205530n249490
10462a0464490O830067Q837074q52789l929532K188365K568927m015807l829592
10454b667777L395991L975908k702272l630709K126623K531918l253818l817367
$$ y = [-1676390, 2891944, 6451787, 1486196, -2003900, 4787962, 10689228, 5378756, 797841, 7918983, 12518969, 2218869, -4893457, 7447910, 17463894, 3344353, -8694280, 12018276, 34860823, 17818703, 6767587, 90687104, 244993486, 319208464, 227683048, 69151646, -8021744, 9429535, 28151545, 6954045, -9869530, 3868208, 14843052, 1063558, -11423467, -2969350, 6232555, -932061, -8647522, -2907367, 2606069, -3840444, -9485444, -3800849, 990530, -5215000, -10464490, -3634423, 5202651, 4349862, 420330, 2608695, 5177622, 1161815, -2667777, 728214, 4704122, 2001850, -1628859, 497764, 3029682, -224136, -4041503]
10446d041503J744169K754337j626132j621273K845560K105132l227886k785558
10438c853154K966230K962488l161565m071023J751491L245971k207729m132257
10430f499548J261848M616691J094655k000406m4995J495123o73081j664753O92523
10421a721943J402289j161402j794424J021691K140849Q7589l80028J663430J390892
10412B648943j643809k159888L18404L99907k133126j393925K737766L298743
10404B073015r14444k696467N10759K295620m93606k276264L09084K443229Q27760
10395B078686l55338J767331K890869k77991l811748l617156j736025j049353
10387d110725k21802J828428K511746N60700j092396o80400m17416j294913p79501
$$ y = [-4041503, -2297334, 457003, -1169129, -2790402, 55158, 2160290, -1067596, -3853154, -886924, 2075564, -1086001, -5157024, -3405533, -159562, -2367291, -6499548, -5237700, -621009, 473646, -1526760, -1571755, -76632, -749713, -2414466, -1721943, -319654, -1481056, -3275480, -2253789, -112940, -25351, -405379, 1258051, 2648943, 1005134, -1154754, -836350, -436443, -2569569, -3963494, -1225728, 2073015, 1158571, -1537896, -1027137, 1268483, 774877, -1501387, -1192303, 1250926, 2078686, 1723348, 3490679, 6381548, 6103557, 2291809, -1325347, -3061372, -4110725, -4332527, -2504099, 7647, 568347, -524049, -1204449, -1621865, -2916778, -3696279]
10378c696279J674136K543951L72330j423119l75036J449550J739016R28306n18231
10369B694624k765992l723399j040780K525736J947355j550297j870868J446755
10361b336866K177269j544686l678772p44562K389509J266456j018176j97311
10353c687139K051884K370826J656243J848295J455688j059302l396149l102908
10345a862562j649617j226584q93451P39598K181015J504453n60307k253431k823538
10336f844424j599832J624978M287578L144530l55467j315930J036201K265343
10328B242977N08537o21412Q97577J696804m89696k301657o86569J700372J283236
10319D230169o33934j108601p05723j195512j546928k88355J104891Q26760o8865
$$ y = [-3696279, -2022143, 521808, 894138, -528981, -904017, 545533, 2284549, 3212855, 2694624, -71368, -3794767, -4835547, -2309811, -362456, -1912753, -3783621, -2336866, -159597, -1704283, -5383055, -6127617, -3738108, -2471652, -3489828, -3687139, -1635255, 735571, 2391814, 4240109, 5695797, 4636495, 1240346, -1862562, -3512179, -4738763, -5632214, -4892616, -2711601, -1207148, -1767455, -4020886, -6844424, -8444256, -6819278, -2531700, 612830, 257363, -1058567, -22366, 2242977, 2751514, 2130102, 3027679, 4724483, 4234787, 1933130, 1246561, 2946933, 4230169, 3596235, 2487634, 1781911, 586399, -960529, -1248884, -143993, 682767, 613902]
10310F13902k08640m90452j198180k24081K509296K906805r13890m040113j585771
10301b631124L195204L370067j265826m297317k412705P81654J277641N1557J32605
10292a798244J694390K356622Q25301j465912k086145m22480J422129R95533j365336
10283A55858k858482j791905N58374J938487J452634l50843k054998j836431P46024
10274d041282L258355K843662K93859q78197L19965J090771l96790k146662j692450
10265a348769L67375J803728J573316n4266k132455k910142j278941J029212J187383
10256a763559m22399p48160O92279J012998n81113r65757J237366K552929K54207
10247A268791k748236k340165M85899J753370P12039j28931K48574M60176p8098
$$ y = [613902, 405262, -85190, -1283370, -1507451, 1001845, 3908650, 2994760, -1045353, -2631124, 564080, 3934147, 2668321, -1628996, -4041701, -3260047, -1982406, -1930849, -1798244, -103854, 2252768, 3078069, 1612157, -473988, -896468, 525661, 1521194, 155858, -2702624, -4494529, -3936155, -1997668, -545034, -895877, -2950875, -4787306, -4041282, -782927, 2060735, 2354594, 1476397, 1796362, 2887133, 2490343, 343681, -1348769, -981394, 822334, 2395650, 2341384, 208929, -2701213, -3980154, -2950942, -1763559, -2185958, -2934118, -2241839, -1228841, -1809954, -2775711, -1538345, 1014584, 1268791, -1479445, -3819610, -3333711, -1580341, -868302, -997233, -748659, -288483, -366581]
10238c66581l51678k0023Q2320l15893o00831n01662k01698K95611P54595M74376
10228g51464m73921q52680j35352N25496K85416M3444O26625J108914M13647p92039
10218a914j222533p28036K31790J398353J935603O68001j605027k053063K38483
10209a138343K242586J003179k023198l030859j062258J320478J925273J203612
10201D40470O39986N80327J37529j345125k910449k447780N76789L388601K787639
10192A847987l45840j882393k00203J709434J000177j055638j729486r74071n18409
10183b148442o86773o10117l77015o88568j127841o38417P57285J986407K122862
10174a410619Q94007r98722j715635p9698K064115J526599j478115k968606q44261
$$ y = [-366581, -718259, -738282, -655962, -971855, -1572686, -2074348, -2276046, -1980435, -1225840, -751464, -1225385, -2078065, -2213417, -1687921, -1402505, -1359061, -732436, 376478, 790125, -1914, -1224447, -1952483, -1720693, -322340, 1613263, 2281264, 676237, -1376826, -1138343, 1104243, 2107422, 84224, -2946635, -4008893, -2688415, -763142, 440470, 1080456, 1660783, 1798312, 453187, -2457262, -4905042, -4328253, -939652, 1847987, 1502147, -380246, -580449, 1128985, 2129162, 1073524, -655962, -1630033, -2148442, -2835215, -3445332, -3822347, -4510915, -5638756, -6277173, -5519888, -3533481, -1410619, -516612, -1515334, -3230969, -3310667, -1246552, 280047, -1198068, -4166674, -5010935]
10165e010935K031226K310601Q16025J03418J2081j014675k060779r24715J662826
10156b074927K475142M45234j875663j867749J92444K105928K265142R04307l86619
10147B183239m58382n5840o14196j664411j285985M75339J095273m82803j993118
10138b800884j471977r4392N03448R69317J935873J798963k30909j500850J39394
10129g52017K106686Q23527k217038k591177J32504K273280K135338J444207Q56815
10120D212125r91701l314248k922336L43458K311766O60327j494443p09882J459094
10111d45840J340858j084812k566487j418455P99765J858077J110402m45685j076242
10102a928419J55539J958504J942520j07297j595410p71321P57740P32560k45691
$$ y = [-5010935, -2979709, -669108, 146917, 250335, 262416, -752259, -2813038, -3737753, -2074927, 400215, 845449, -1030214, -2897963, -2705519, -599591, 1665551, 2569858, 2183239, 1724857, 1669017, 1054821, -609590, -1895575, -1420236, -324963, -807766, -2800884, -4272861, -4367253, -3863805, -2894488, -958615, 840348, 609439, -891411, -752017, 1354669, 2178196, -38842, -2630019, -2497515, -224235, 1911103, 3355310, 4212125, 3220424, -93824, -3016160, -2672702, -360936, 299391, -1195052, -1904934, -445840, 895018, -189794, -2756281, -4174736, -3374971, -1516894, -406492, -852177, -1928419, -1772880, 185624, 2128144, 2020847, 425437, -345884, 411856, 1144416, 898725]
10093H98725r7272J033785J053338m51635j364514k87034J366802J501598K28749
10084C882542n97441j31382M04790l49236j714669j664067K43587J729698O23258
10075B427080j909746k657934q01453R87695N57148p18086m32195J125605J860468
10066D38582J257566M41080l87355j831969k860642j505141J474668K639335P88307
10057D54431j039742k74694J290217R29102k15376O01836K352477J542479j557921
10048D082809k684197m20030J285291m90519k820533j712473J480466K455065
10040A175879P06817n01537L8076J94587p86830o22407J595731K975873J023414
10031E799603k382816l651790k253805l89404P19042J537607J934288R74856p39940
$$ y = [898725, 801453, 1835238, 2888576, 2436941, 1072427, 785393, 2152195, 3653793, 3882542, 3285101, 3153719, 3558509, 3209273, 1494604, -169463, 74124, 1803822, 2427080, 517334, -2140600, -2942053, -1954358, -1397210, -2115296, -2547491, -1421886, 438582, 1696148, 2137228, 1749873, -82096, -2942738, -4447879, -2973211, -333876, 454431, -585311, -860005, 430212, 1359314, 1143938, 1745774, 4098251, 5640730, 4082809, 1398612, 978582, 2263873, 1773354, -1047179, -2759652, -1279186, 1175879, 1882696, 1381159, 1419235, 1613822, 826992, 204585, 1800316, 4776189, 5799603, 3416787, -235003, -2488808, -2878212, -2159170, -621563, 1312725, 2287581, 1547641]
10022A547641r28146J184683L226612K563006k25565k202568j901474p25466m07139
10013B131584o31648j38461Q59414Q65170m72722j549257q98474Q75221J937613
10004B978440J412188Q6034p56055o85459l84331p29234j601005j885137j002019
9995b566578P4107J17848n06734m59728M61352J213972J294423J037982L22531
9986I89175j095759j996412p92396J470038J826084j85331j628928p94010L64307
9977a843232O0813k84965P14012J245213l91277j912525l36942K732599L194577
9968C178273O79279j347459j159471n51261j000090j522116q56906Q43767K736208
9959A000224L633708K191340j042502k874726j451357M38567o52929l128657k831938
$$ y = [1547641, 619495, 1804178, 5030790, 7593796, 7368231, 5165663, 3264189, 2538723, 2131584, 1499936, 1361475, 2220889, 3086059, 2613337, 1064080, 165606, 1040827, 2978440, 4390628, 4476662, 3720607, 3035148, 2650817, 1921583, 320578, -1564559, -2566578, -2492471, -2374623, -2881357, -3341085, -2879733, -1665761, -371338, 666644, 989175, -106584, -2102996, -2895392, -1425354, 400730, 215399, -1413529, -2207539, -1843232, -1782419, -2067384, -1353372, -108159, -499436, -2411961, -2748903, -16304, 3178273, 3857552, 2510093, 1350622, 799361, -200729, -1722845, -2579751, -1735984, 1000224, 4633932, 6825272, 5782770, 2908044, 1456687, 1895254, 1242325, -1886332, -4718270]
9950d718270k967J262388O0021k57387J466045K184718M82389q31494k2485N25597
9940A48555q54330j716772n3382J697808P34880j207282p52053J687276K919316
9931B604016J789694q5176j218896j403486r31437m97004p99135j070465L28889
9922a283000K833580L489040J195793j368748j695194p08108k45813j4331O94730
9913B897949Q72837o6307m31746P74109J383729m62631k580657j871771N91946
9904A107458J299310q8133p15250L33074P20426p91510k006055p28216J734825
9895H65929K331098M42002j432145j143868L58894P54619j9490J73239J793082
9886D123360K375336N42480j402795j209732k69442l57207J84034K755783M258904
$$ y = [-4718270, -4721237, -3458849, -3398828, -3656215, -2190170, -5452, 476937, -354557, -377042, 148555, -705775, -2422547, -2475929, -778121, -43241, -1250523, -2002576, -315300, 2604016, 4393710, 4308534, 3089638, 1686152, 754715, 257711, -541424, -1611889, -1283000, 1550580, 5039620, 6235413, 4866665, 3171471, 2463363, 2217550, 2203219, 2897949, 3770786, 3704479, 3272733, 4046842, 5430571, 4967940, 2387283, 515512, 1107458, 2406768, 2318635, 1603385, 1936459, 2656885, 1865375, -140680, -868896, 865929, 3197027, 3639029, 2206884, 1063016, 1421910, 2176529, 2157039, 2330278, 4123360, 6498696, 7041176, 5638381, 4428649, 4159207, 3802000, 3986034, 6741817, 11000721]
9877A1000721K238149Q22369L608752L696034p854330k3879301k5134541o899833
9869d2401980J1547838J2194871J523074k507410K910004O019925K071312j307173
9861i949539M84433K335929O09108n64706J898120M137756K609472j15549q45994
9852E99030p93216j404018r00915J340714K134359j43889k175322j226187L31480
9843b237964l27197j420906j97069J822035J524989l31957m93314J460660K706147
9834B505424J385626j382695l262515k829372n76212J271326R18906o43731r89335
9825c602578J4016J75377j033036j401790J81952J766752J596208O79851N46147
9816a077101Q15686O09237K51428J09212l11914r22938p16604J67048K77260m17461
$$ y = [11000721, 13238870, 14061239, 17669991, 21366025, 13511695, -10367606, -35502147, -42401980, -30854142, -18659271, -17136197, -19643607, -16733603, -10713678, -8642366, -9949539, -9465106, -7129177, -6520069, -7084775, -5186655, -1048899, 1560573, 1445024, 599030, -194186, -1598204, -2499119, -1158405, 975954, 832065, -1343257, -2569444, -2237964, -2565161, -3986067, -4183136, -2361101, -836112, -1168069, -1661383, -200723, 2505424, 3891050, 2508355, -754160, -3583532, -4159744, -2888418, -1969512, -2613243, -3602578, -3588562, -3413185, -4446221, -5848011, -5666059, -3899307, -2303099, -1623248, -1077101, -261415, 347822, 599250, 708462, 396548, -526390, -1242994, -1075946, -798686, -1216147]
9806a216147k54642P37608K49686k093389l143042r16782K055467K507567R91736
9797a081938M3961O6328j40850n53039m37575l03118p77668q14348N30800J763893
9787a703554R53429r17177j184942N10676J897356J427780j45848j424127j773999
9778b360406j138324M7768P57938L58571m45128n45628O5032N56039M92895L5981
9768b175262m85063n57310J54693R10096M87989p29183p62610R94711K529063
9759C67124K189738J118533R72644R96927k89301j882846j627274l3757K69463
9750B081251j101434j531673K07941J684329N96920j362186q66100J958552L455461
9741E123061J503586j662764k648506j191017K61718K03218n72939r19512p12678
$$ y = [-1216147, -1470789, -733181, -483495, -2576884, -5719926, -6636708, -4581241, -2073674, -1081938, -1037977, -971649, -1112499, -1665538, -2103113, -2406231, -3183899, -3998247, -3467447, -1703554, -750125, -1667302, -2852244, -2341568, -444212, 983568, 837720, -586407, -2360406, -3498730, -3450962, -2693024, -2334453, -2779581, -3325209, -3260177, -2704138, -2211243, -2175262, -2660325, -3217635, -3062942, -2152846, -1664857, -2394040, -3156650, -2161939, 367124, 2556862, 3675395, 4648039, 5644966, 5355665, 3472819, 1845545, 1811788, 2081251, 979817, -551856, -343915, 1340414, 1937334, 575148, -290952, 1667600, 5123061, 6626647, 4963883, 2315377, 1124360, 1386078, 1589296, 1016357, 96845, -615833]
9732f15833m7154J136149K034442J346163n10662j335039l94133K44285q09661
9723A048557j632598k12672J660862R84852j277951j447711P96403J634210q74723
9714F79229l690249l291029l39410K027460K323538J271694l6481q17078o57502
9705b529828j41732l02536p90881j61742J439795J968677P89542l6105P95380
9696A030570J454987J20187j584574r49489J382527K228099N58462j355830j600721
9687A284218r71147r37886j216360o53865N83825J156083N76144j47370j64646
9678d91004m0852n72619j156586o96725K57789J35176p62533k73466J847214K713291
9668I59685O60967j616879r47247J302261J382435r93934k580460j703299J28928
$$ y = [-615833, -662987, 473162, 2507604, 3853767, 3343105, 2008066, 1613933, 1858218, 1048557, -584041, -796713, 864149, 1849001, 571050, -876661, -80258, 1553952, 679229, -3011020, -6302049, -6641459, -4613999, -2290461, -1018767, -1055248, -1872326, -2529828, -2671560, -2974096, -3764977, -3926719, -2486924, -518247, 271295, 235190, 1030570, 2485557, 2605744, 1021170, 71681, 1454208, 3682307, 4240769, 2884939, 1284218, 313071, -624815, -1841175, -2495040, -1911215, -755132, -178988, -326358, -491004, -531856, -1104475, -2261061, -2957786, -2699997, -2564821, -3327354, -3600820, -1753606, 959685, 1620652, 3773, -943474, 358787, 1741222, 747288, -1833172, -3536471, -3407543]
9659c407543J450934K197018J891328m1598k002709j640376K70826P42324o28387
9650a168183j463722j171665j434940j883710j22096L021223L384537K23847k031661
9641b646370q86718N53992k51850p56489J373608L315648J861737j017376j960070
9632d13888j791226k534934k461715N42054L694702L070698K63406l54062R93186
9623A008221P05101j152706j164099Q67293J655883N26801L5575M33348p22405
9614B193012k897030k340226J181217K897747K73748l101815l189945q59428R20270
9605d922450J583106K000425J922966R28042j57811o05256p65446p41316j95100
9596i52840M6407j109363k190050n98374K545580K974100j30110k373076r16564
$$ y = [-3407543, -1956609, 240409, 2131737, 2090139, 87430, -1552946, -1282120, -539796, -1168183, -2631905, -3803570, -5238510, -7122220, -7244316, -4223093, -838556, -614709, -2646370, -3533088, -2979096, -3230946, -3987435, -2613827, 701821, 2563558, 1546182, -413888, -2205114, -4740048, -7201763, -6659709, -2965007, 105691, 369097, 15035, 1008221, 1713322, 560616, -603483, 263810, 1919693, 2446494, 2482069, 2915417, 2193012, -704018, -3044244, -1863027, 1034720, 1308468, -1793347, -4983292, -5842720, -4922450, -3339344, -1338919, 584047, 1512089, 1354278, 749022, -16424, -757740, -952840, -906433, -2015796, -4205846, -4804220, -2258640, 715460, 585350, -1787726, -2704290]
9587b704290J294043Q06711q90721p65271L53467q3140j341430q80199Q88880
9578c321950J500988R32807J135152J800928O95180j843217k648830o62117J277227
9569a133832P47818r13831j089574L68052J472406R36024o42529j736349j271482
9560c263297M15583J697747J352246J17490l23898K21298L17972o73065j496911
9551a634835r34929M24675J216731J109593N85515k77068j537500k328708j483856
9542d860382O09010K016170J667967P34234P38517J180418M30568j347260j917400
9533g48158j63308J926969J671489p62067k590180j894387L61526J851156J419156
9524A072196j96697j496608j665829j083327n40926j34989O21283J646660K126617
$$ y = [-2704290, -1410247, -603536, -1494257, -2259528, -1906061, -1989201, -3330631, -4210830, -3321950, -1820962, -888155, 246997, 2047925, 2743105, 899888, -1748942, -2411059, -1133832, -386014, -1299845, -2389419, -2021367, -548961, 387063, -255466, -1991815, -3263297, -2847714, -1149967, 202279, 319769, -4129, 217169, 535141, -137924, -1634835, -2569764, -2145089, -928358, 181235, 766750, 489682, -1047818, -3376526, -4860382, -4251372, -2235202, -567235, 166999, 905516, 2085934, 2516502, 1169242, -748158, -911466, 1015503, 2686992, 1924925, -665255, -2559642, -2198116, -346960, 1072196, 875499, -621109, -2286938, -3370265, -3911191, -4046180, -3424897, -1778237, 348380]
9515C48380J747396J056520J87479j391064l061757k708948K41883K941530K449369
9506A810788j00769j148795J31235J123562J88265j098876q57603L76172R68259
9497A392238M67467l93490o68041K40955J592025J050023k435195n630609l926941
9488h311568K079899O178896M229762p86640l409413k448123m53686R16437J627069
9479c77367J164239p23119k133496j069032J275047K172957J537499J335374J566298
9470D748400L93258j881351k678281j431814n04055j040763j360707n39231p4543
9461d369087m74248K29949K431960K958613P5329k670931j356508K026373K516322
9452A367772j75472j734232l92318R43071L59241j6523J493277K643114J082507
$$ y = [348380, 2095776, 3152296, 3339775, 1948711, -1113046, -3821994, -3580111, -638581, 1810788, 1710019, 561224, 692459, 1816021, 2004286, 905410, 47807, 423979, 1392238, 1859705, 1466215, 798174, 1039129, 2631154, 3681177, 1245982, -4384627, -8311568, -6231669, -52773, 4176989, 3390349, -19064, -2467187, -2920873, -2004436, -377367, 786872, 63753, -2069743, -3138775, -1863728, 309229, 1846728, 3182102, 4748400, 5141658, 3260307, 582026, -849788, -1353843, -2394606, -3755313, -4294544, -4369087, -4843335, -4613386, -2181426, 777187, 852516, -1818415, -3174923, -1148550, 1367772, 1192300, -541932, -934250, 8821, 368062, 351539, 1844816, 4487930, 5570437]
9443E570437j380715j555417J46597Q19055j05295n17484K53782K34311j691054
9434A774217l633812l241979p34894J737355K673049K155698R65200k48822j096260
9425C49752j377610j072693m26388k486k38548p40663o21005J07684L72429n5302
9415c704830K89016K151313L460598J812740j480101k436963J44874K831070K237138
9406E304855n92803k139576j149552N14627Q77734j47406j476048k083074j456116
9397b347359J84116J940293K928961K810181J618970k17329j576517j489982p00670
9388C150664j017907k438241k551315o4748K709387K776760O40028p04813k06144
9379B293671L09186m84493j573310j665143j015225l72413K28069P29963N39006
$$ y = [5570437, 4189722, 2634305, 2780902, 3599957, 3494662, 2977178, 3230960, 3465271, 1774217, -1859595, -5101574, -5836468, -4099113, -1426064, 729634, 1694834, 1446012, 349752, -1027858, -2100551, -2526939, -2529425, -2767973, -3508636, -4129641, -4021957, -3649528, -3704830, -3415814, -1264501, 2196097, 4008837, 2528736, 91773, 236647, 3067717, 5304855, 4712052, 2572476, 1422924, 1937551, 2815285, 2667879, 1191831, -891243, -2347359, -2163243, -222950, 2706011, 5516192, 7135162, 6917833, 5341316, 3851334, 3150664, 2132757, -305484, -2856799, -2921547, -212160, 2564600, 3204628, 2499815, 2293671, 2602857, 2118364, 545054, -1120089, -2135314, -2507727, -2279658, -1549695, -1010689]
9370a010689k95757n79078L24637J228167O28459j132100k133046j002402J717335
9361b254474L930647L530820L81809k934388l392225j094349O20841m73989k390608
9352d075916j779692J106807K644695J027775j221702j038410Q49735J351434
9344a135274k37088j318118k3709J990159J991971O5442j146862k08735J234891
9335A212677Q38175j241222k478019j167225J299982J950722l4685j985905j038578
9326b644078J803465K663879J88578k198591j000534K185854K831972j8631k525645
9317A286269j696855O96585J246634l16605j471447p32515Q48283J577538J064676
9308B502563K57231K42310R72306J147546q4523j566871j471709r0548M06714
$$ y = [-1010689, -1306446, -1885524, -1560887, -332720, 295739, -836361, -2969407, -3971809, -2254474, 1676173, 5206993, 5588802, 2654414, -737811, -1832160, -1211319, -1685308, -4075916, -5855608, -4748801, -2104106, -1076331, -2298033, -3336443, -2486708, -1135274, -1372362, -2690480, -2714189, -724030, 1267941, 1333383, 186521, -22214, 1212677, 2050852, 809630, -1668389, -2835614, -1535632, 415090, 380405, -1605500, -2644078, -840613, 1823266, 2011844, -186747, -1187281, 998573, 3830545, 3811914, 1286269, -410586, 285999, 1532633, 1216028, -255419, -987934, -139651, 1437887, 2502563, 2759794, 3002104, 3974410, 5121956, 5037433, 3470562, 1998853, 1908305, 2315019]
9299B315019p43659j788772j276057q45P91006J173258J387728R26975P1528K71650
9289C127831J499517J432884r12842l051626k710098j269062q88392o50174J036005
9280b385957K368999P20886k126871j930018J301485L095013J277209j380841
9272I39905k039675j238945l00461R10503K082844J716585l2606p95568J82814
9263A425396P20887k33722n48876J042467K158914O80529j495913j618607m79871
9254A651204m11998j026833m77972O31037K66805j086883j054774N20001J397805
9245D08392P70067K10784O16061R60016N08079j28766n37665r46731r22508J55759
9235A093488J168524K68403j793343j989453N16561K813603K384440L86962p92295
$$ y = [2315019, 1571360, -217412, -1493469, -1494314, -703308, 469950, 1857678, 2784653, 2856181, 3127831, 4627348, 6060232, 5147390, 2095764, -614334, -1883396, -2771788, -3421962, -2385957, -16958, 703928, -1422943, -3352961, -2051476, 1043537, 2320746, 939905, -1099770, -2338715, -2639176, -1728673, 354171, 2070756, 2038150, 1242582, 1425396, 2146283, 1912561, 1363685, 2406152, 4565066, 5245595, 3749682, 2131075, 1651204, 1239206, 212373, -265599, 365438, 632243, -454640, -1509414, -989413, 408392, 1178459, 1389243, 2005304, 2965320, 3473399, 3344633, 2806968, 1860237, 937729, 1093488, 2262012, 2530415, 737072, -1252381, -735820, 2077783, 4462223, 4849185, 4056890]
9226D056890j023824j422251j679163q37997M27481O92183K18103K98422P39995
9217A469839L00616p11358p43099R4320K4647j059228j013914P41653J575573
9208F79049l25585k611401j980733R04103K535583J606261N5511m64459l06598
9199I1731k4749M10863L19933j128201k652456j890423O78236J747444J43125
9190b304497j245369j3637K221199K833020K007712J210538L52562q86122j207140
9181B968266N452O92676o08850j740396n15345R69310k99587k553803j720829
9172b803106J642044L034138J141239r22760j536500k340715l371669j938185
9164g095514J951011M103611K365348j36932l33813M98046L49908J19843O33679
$$ y = [4056890, 3033066, 1610815, -68348, -906345, -478864, 213319, 431422, 729844, 1469839, 1770455, 1059097, 315998, 410318, 434965, -624263, -1638177, -896524, 679049, 353464, -2257937, -4238670, -3334567, -798984, 807277, 862788, 398329, 91731, 66982, 477845, 797778, -330423, -2982879, -4873302, -4195066, -2447622, -2304497, -3549866, -3563503, -1342304, 1490716, 3498428, 4708966, 5061528, 4175406, 2968266, 2973718, 3666394, 3057544, 1317148, 801803, 1771113, 1471526, -1082277, -2803106, -1161062, 1873076, 3014315, 2091555, 555055, -1785660, -5157329, -7095514, -5144503, -1040892, 1324456, 1187524, 853711, 1351757, 1701665, 1821508, 2455187]
9155B455187R0170k097243k721839R4388K688571J099747k456030l055254o36989
9146d539292Q73594L49703K27797J231103J272906j89398r73267l5729R11776
9137h70807M05212q63854j629458j322604K37011K314080K868817R72574j088355
9128A022616o56414J213590J442401j39694r61752l24507r7779p57834n60911
9119A79716O85634P08246j189375k433878j066769J367636K347597J553520K02353
9110B354680p85836q22080K88813J408356R75231n58360j161708m26633M7872
9101A320335j91383J94068J144606O36638j414831k046814N7374J987202J139389
9092B826584p16881q81144l85546j464521k619417p81803K647079K772665j386705
$$ y = [2455187, 2545357, 448114, -2273725, -2179337, 509234, 1608981, -847049, -3902303, -4539292, -3665698, -3315995, -3088198, -1857095, -584189, -773587, -1746854, -1782583, -870807, -465595, -1329449, -2958907, -4281511, -4044500, -1730420, 1138397, 2110971, 1022616, 366202, 1579792, 3022193, 2882499, 1920747, 1596240, 1498461, 740627, 179716, 865350, 1573596, 384221, -2049657, -3116426, -1748790, 598807, 2152327, 2354680, 1568844, 746764, 1035577, 2443933, 3419164, 2860804, 1699096, 1272463, 1320335, 1128952, 1323020, 2467626, 3104264, 1689433, -357381, -300007, 1687195, 2826584, 2109703, 1228559, 843013, -621508, -3240925, -4022728, -1375649, 1397016, 10311]
9083A0311m851190l524148M79179K508849J648054N96085R64650J607377J208836
9074F48003J04679q11977j254248j070209J3662J440067J719417K82503j286670
9065b14773r97488R14452K232503J588636m1322q82826m23616M79502P74003L5802
9055C464873j296224k164348j829967o59192M88890J304745J624851P19810j386850
9046B66588k557236r45032J498196J083405j710263k274047Q43189L048336Q36220
9037H9356k441486k021728P11897J283544q7694K00209J803855J073342j518825
9028i07530j465766J599205K607353l80578k876650j787986j93217q65133j133546
9019e403848J268299K792228R0326l174468j866912J807751J890630j305296k013998
$$ y = [10311, -4840879, -8365027, -7885848, -5376999, -3728945, -3132860, -2168210, -560833, 648003, 752682, -59295, -1313543, -2383752, -2370090, -930023, 789394, 1071897, -214773, -1212261, -297809, 1934694, 3523330, 3482008, 2599182, 2175566, 2655068, 3429071, 3464873, 2168649, 4301, -1825666, -2484858, -1995968, -691223, 933628, 1653438, 266588, -2290648, -3235680, -1737484, -654079, -2364342, -4638389, -3795200, -746864, 89356, -2352130, -4373858, -3661961, -2378417, -2466111, -2265902, -462047, 611295, -907530, -2373296, -774091, 1833262, 1452684, -1423966, -3211952, -3405169, -4270302, -5403848, -4135549, -1343321, -1252995, -4427463, -6294375, -4486624, -2595994, -3901290, -5915288]
9010e915288J063284K858552N81326k211617j940280J3596R43219J004244J242701
9001b360263J031943K1204k57963Q89941J499662J42542j279653m02337J683502
8992I68578J970530k4319j769845j385094J26517N97224n14159j620347j069825
8983b720740O44081J308868r7492j836027j694110L7025J297674J252673P92601
8974a015447N49564L75852N05123J162509J215347n14476k632825k397449J35582
8965b616220J811235Q80825p94253j010243j34361N56530J047108J474885R67054
8956B182560o20207j568396o47818R56770J635658J596829J489372O25025j382350
8947D267443k815673j984144Q4963J283366J533585J902684J773051k56203l171998
$$ y = [-5915288, -4852004, -1993452, -1412126, -3623743, -5564023, -5550427, -4607208, -3602964, -2360263, -1328320, -1307116, -1565079, -675138, 824524, 967066, -312587, -714924, 968578, 2939108, 2914789, 1144944, -240150, -113633, 483591, -30568, -1650915, -2720740, -2076659, -767791, -865283, -2701310, -4395420, -4358395, -3060721, -1808048, -1015447, -465883, -90031, 415092, 1577601, 2792948, 2278472, -354353, -2751802, -2616220, -804985, 75840, -718413, -1728656, -1863017, -1306487, -259379, 1215506, 2182560, 1562353, -6043, -653861, 302909, 1938567, 3535396, 5024768, 5649793, 4267443, 1451770, -532374, -447411, 835955, 2369540, 4272224, 6045275, 5789072, 2617074]
8938B617074m112997k271167J50271J154191J002769O95161M05335R8698J16624
8929a44041M25331L58932m67732j752291k894968k979430j042704K274549M148466
8920b073888K600970m27466j325907J72595R38024m56450j725806r97001J56197
8911c138732k14871q94998K46859K168629J903418p27328k591262j736244O3800
8902d920729K51795q47816q85818Q18434K175696J270140q09614j274629N35843
8893c686698K149785J421540m62563r30578J20476O42410J62881M56707K000714
8884A874674K554826P28297j405692j311391J80873L94220j070255k174566j726913
8875a955927n24550M42381Q70879M95315n08681q07645L87876J353294J4630k186423
$$ y = [2617074, -1495923, -3767090, -3616819, -2462628, -1459859, -764698, -359363, -260665, -144041, 281290, 640222, 172490, -1579801, -4474769, -7454199, -8496903, -6222354, -2073888, 527082, 99616, -1226291, -1053696, -115672, -572122, -2297928, -3294929, -3138732, -3353603, -4248601, -4001742, -1833113, 70305, -657023, -3248285, -4984529, -4920729, -4668934, -5516750, -6402568, -5584134, -3408438, -2138298, -2947912, -4222541, -3686698, -1536913, -115373, -577936, -1508514, -1388038, -745628, -582747, -126040, 1874674, 4429500, 5157797, 3752105, 2440714, 2621587, 3015807, 1945552, -229014, -1955927, -2480477, -2038096, -1167217, -671902, -1180583, -1988228, -1600352, -247058, -232428, -2418851]
8865b418851j613545J897038L922235J510641k464069l296828p37095J428623
8857a771851R13493p25858j069749J79257J630557K024329J055684n96229j626808
8848A2825j156494L11348J386037J269264M34268l7441M26992J192329Q30624
8839D669752j155612l087858k718136l01570J420884R22801j87452r8265L03178
8830b32278n52500j665741r62252R43473J524665N41422K77045J340137J544882
8821B758853o2842j292236n83667K55532o06159j512082j18678K174390K045494
8812C058605m52698j934108q99964M35359J44680o52670l32565M45749K45389
8803E7777o81730j261923j555484j967476j574463O25337L262259L574464J091152
$$ y = [-2418851, -4032396, -2135358, 1786877, 3297518, 833449, -2463379, -3200474, -1771851, -858358, -1584216, -2653965, -2474708, -844151, 1180178, 2235862, 1639633, 12825, -1143669, -832321, 553716, 1822980, 2257248, 2219807, 2646799, 3839128, 4669752, 3514140, 426282, -2291854, -2593424, -1172540, -249739, -437191, -535456, -232278, -784778, -2450519, -3412771, -2469298, -944633, -403211, -126166, 1213971, 2758853, 2696011, 1403775, 820108, 1075640, 469481, -1042601, -1161279, 1013111, 3058605, 2605907, 671799, -228165, 207194, 351874, -300796, -633361, -187612, 57777, -623953, -1885876, -3441360, -5408836, -6983299, -6357962, -3095703, 478761, 1569913]
8794A569913j469177j632618l2308J101436J073561Q91731R34251K61894j374212
8785A324471k364491j245953R11692J532198j70159k206858k379475o66721J389697
8776c875599K488257K043347J10973k007053k180709O872J985691J235205j107424
8767a300440j849268n24731J81965q71956j244454R71839L637095L496766Q53258
8758C350074j224611j278135n55488l18546m41405n93533p77778n95951L51019
8749b084354J359184J434068R31446P67808N08522p19972j888588j163080P89076
8740f5890J405403L59917k3024Q80317P65664j021159j398616J342314L633361
8731E878287J482314l079406m535865j606090J728248K427191J494944N78624
$$ y = [1569913, 100736, -1531882, -1564190, -462754, 610807, 1502538, 2436789, 2698683, 1324471, -1040020, -2285973, -1374281, 157917, -12242, -2219100, -4598575, -5265296, -3875599, -1387342, 656005, 766978, -1240075, -3420784, -3413912, -1428221, -193016, -1300440, -3149708, -3674439, -3492474, -4364430, -5608884, -4637045, -999950, 2496816, 3350074, 2125463, 847328, 291840, -26706, -468111, -1061644, -1839422, -2435373, -2084354, -725170, 708898, 1640344, 2408152, 2916674, 2196702, 308114, -854966, -65890, 1339513, 1699430, 1676406, 2556723, 3322387, 2301228, 902612, 2244926, 5878287, 7360601, 4281195, -254670, -1860760, -132512, 2294679, 3789623, 4368247]
8723D368247n53593j930322k124989p92841J35296n02264j104239j34605J081553
8714a557757M86968j266116j697825k8170K026571K578612J340814n32504j390962
8705d0369m46666J022560P17502j577673l137042j779328J027650K247172J451267
8696e14927Q11551J411458J868045Q76030q48811j856308j754147j023487j86877
8687a217473K02440k66761j078247j056172j5876P30714K25634o26529l55593
8678c457863Q84095J568744J014983J58667k8828J92385J86268J53617N70935
8669A243003R92103O01449k25105l17718R1511p46095l025112l900727j094571
8660f381262L048238L807311L92125k784380k028377J045544K529775J592211
$$ y = [4368247, 3814654, 1884332, -240657, -1033498, -898202, -1400466, -2504705, -2639310, -1557757, -1070789, -2336905, -4034730, -4062900, -2036329, 542283, 1883097, 1350593, -40369, -487035, 535525, 1253027, -324646, -3461688, -5241016, -4213366, -1966194, -514927, 296624, 1708082, 3576127, 4452157, 3603346, 1747038, -7109, -1030596, -1217473, -1015033, -1281794, -2360041, -3416213, -3432089, -2701375, -2475741, -3102270, -3457863, -2573768, -1005024, 9959, 168626, 139798, 332183, 518451, 672068, 1243003, 2235106, 2836555, 2611450, 2293732, 2385243, 1639148, -1385964, -5286691, -6381262, -3333024, 474287, 866412, -1917968, -3946345, -2900801, -371026, 1221185]
8652A221185L77493K1008l31000r76571r03740P1186O59095K68897J1967P39812
8642A159332J576174J281369q2173j581191k454162k144837n04471J314873J431087
8633c999l12998j601678n54352J581155K061249L01249j659854k066054j276333
8624c531615n71838m57949n64537l01672P41397K311335L228781K456512O24405
8615C934819m93021l53895l49597j445528k344648j320424R01091J770884L13260
8606F12941j699198k281690j482960m18933N96865J780568K590911K107843N06329
8597B312676q97391j105956l07942N51255N20535o40848j861313j477640N46022
8588b360602J879727O81589j477417j476695P94116K098978O08912j410014j029756
$$ y = [1221185, 1598678, 1619686, 1288686, 312115, -591625, -520439, 138656, 407553, 419520, 1159332, 2735506, 4016875, 3934702, 2353511, -100651, -2245488, -2749959, -1435086, -3999, -316997, -1918675, -2473027, -891872, 1169377, 1470626, -189228, -2255282, -3531615, -4103453, -4561402, -5125939, -5427611, -4686214, -2374879, 853902, 3310414, 3934819, 3441798, 3087903, 2738306, 1292778, -1051870, -2372294, -1471203, 299681, 612941, -1086257, -3367947, -4850907, -5269840, -4672975, -2892407, -301496, 1806347, 2312676, 1415285, 309329, 1387, 552642, 1073177, 432329, -1428984, -2906624, -2360602, -480875, 200714, -1276703, -2753398, -1959282, 139696, 748608, -661406, -1691162]
8579a691162J177784K334973J354629k11474q12428n19293j40418j73641o78058
8570F40912j195991r75932p0610L15740m58944j122218j59046J733851K391243
8561A099005J095103p36030j633574j432848o21310K51926M88702j41012p21298
8552b351336l58484K40134j33110q06385Q2468K394288L581075K116615m54694
8543D310571j710703j113654J26479N85800n06352k518309l229860j143423J780294
8534c419157K001984m69148j728586N2590J662381K08083j790439l50579L209237
8525f23634L937118P45003k250963k012925n5741J166785J503864J317806q8776
8516C638537k298851k919023j053720Q13765N89882j98251N27330J432740J28586
$$ y = [-1691162, -513378, 1821595, 3176224, 2964750, 2152322, 1633029, 1492611, 1318970, 640912, -555079, -1531011, -1601621, -1285881, -1744825, -2867043, -3026089, -1292238, 1099005, 2194108, 1458078, -175496, -1608344, -2229654, -1977728, -1489026, -1630038, -2351336, -2709820, -2469686, -2602796, -3409181, -3326713, -932425, 2648650, 4765265, 4310571, 2599868, 1486214, 1612693, 2198493, 1692141, -826168, -4056028, -5199451, -3419157, -1417173, -1886321, -3614907, -3562317, -1899936, -1691853, -3482292, -3832871, -623634, 3313484, 4058487, 1807524, -205401, -261142, 905643, 2409507, 3727313, 3638537, 1339686, -1579337, -2633057, -1819292, -1229410, -1427661, -900331, 532409, 660995]
8507F60995k240816k498436o39806L27760l77982j85110J938387L226431J558950
8498A770373q87277q91977J020914J710089R6992j808514k065102q81164L97615
8489a538051Q21980L14990l42949j72399O58911Q17372p6228m65120O69725J622841
8479B311072K76286k304347l050037j310953N04372Q12480O50202R30251O35419
8470e45255q49672j885409r10042R79684J603490O70108m73468j024695j034234
8461c469493m16561P22335J414994R55285J48482J82841Q71602J173818P21228
8452B304531k52319j488155k075283p01257J889043K422218n81241l647832k642099
8443d772394R85554K123927k36860j662952M39753K756936J621617j173934j541902
$$ y = [660995, -1579821, -4078257, -4718063, -4390303, -4768285, -4953395, -3015008, 211423, 1770373, 883096, -8881, 1012033, 2722122, 2819114, 1010600, -1054502, -1935666, -1538051, -716071, -401081, -744030, -916429, -257518, 559854, 483626, 18506, 688231, 2311072, 2587358, 283011, -2767026, -4077979, -3573607, -2761127, -2110925, -1180674, -545255, -1394927, -3280336, -4190378, -3210694, -1607204, -937096, -1410564, -2435259, -3469493, -3886054, -3163719, -1748725, -793440, -644958, -462117, 409485, 1583303, 2304531, 2052212, 564057, -1511226, -2212483, -323440, 2098778, 1517537, -2130295, -4772394, -3786840, -1662913, -1899773, -3562725, -3122972, -366036, 1255581, 81647, -1460255]
8434a460255M95597J392946j96202j884299j476676N01017K342480K874940J512216
8425D101764j211787k966977j686073J246527K033200n09600l067597k294709
8417d355252O58894K019411O64462p91583j04309J552344J583281l35751k013812
8408a122315j822878o08304n4868j85509L61223J850471K652041J531498l30711
8399B270648q04640K26119Q30892j1968j040587r73826n76746j008908j315141
8390b404157J96219K437610K118897j316194l858881j965151K416762M372329
8382A997434K449183l29091j402083j360667j270405o46089M74479L72326j361473
8373a076386k154431k64186J895494J243676q85914p47916J711049K727483P05627
$$ y = [-1460255, -964658, 428288, 232086, -1652213, -3128889, -2627872, -285392, 2589548, 4101764, 2889977, -77000, -1763073, -516546, 1516654, 1007054, -2060543, -4355252, -3696358, -1676947, -1012485, -1804068, -1908377, -356033, 1227248, 891497, -1122315, -2945193, -3553497, -3608365, -3793874, -3432651, -1582180, 1069861, 2601359, 2270648, 1466008, 1692127, 2523019, 2511051, 1470464, 496638, -80108, -1089016, -2404157, -2207938, 229672, 2348569, 1032375, -2826506, -4791657, -2374895, 1997434, 4446617, 4117526, 2715443, 1354776, 84371, -561718, -87239, 285087, -1076386, -3230817, -3495003, -1599509, -355833, -1241747, -1989663, -278614, 2448869, 3154496]
8364C154496j606207j832454j236939j581603j836602m17172J538769J759996
8356b057716L58574o37370m29394K7173J46748L63694P61682P44072K39736q3686
8346e66487m4555k71238r34023j068997J70621J987949K395277M82718k088432
8337F2833k545531k11579K443287K611250M03897j624440j686848l00562J035211
8328A87518J309785K58390j445174k213076j085623P60914J388575P79896N07964
8319D49169R55824R41397J70198k58947j62703o31200j455144q56393J153140
8310C05341J864057j03893k367001k259180n07389O05055O47988M27646n8355
8301a445731o93274j18851J959645L091493J349727j394293k279763j815626k174074
$$ y = [3154496, 1548289, -284165, -1521104, -3102707, -4939309, -5356481, -3817712, -2057716, -1699142, -2336512, -2765906, -2738733, -2591985, -2228291, -1466609, -722537, -482801, -566487, -611042, -882280, -1816303, -2885300, -2714679, -726730, 1668547, 2151265, 62833, -2482698, -2694277, -250990, 2360260, 2764157, 1139717, -547131, -847693, 187518, 1497303, 1755693, 310519, -1902557, -2988180, -2227266, -838691, -58795, 449169, 1404993, 2346390, 2516588, 2257641, 2094938, 1463738, 8594, -847799, 305341, 2169398, 2065505, -301496, -2560676, -3068065, -2463010, -1815022, -1387376, -1445731, -2139005, -2257856, -298211, 2793282, 4143009, 2748716, 468953, -1346673, -3520747]
8292c520747k708354j087667J962382L167610J837280N99200P33431N78085o86681
8283H74539j334578m27553L79949j04581n46459L02020J336799J101764L5624
8274A617524p49055j127462j163060m26498P76230J245894Q43871O86065P24920
8265B428429l97692k186195j956566P52971K487615Q65203j591556j467286K55478
8256h09599L87690r90275j209882M2391O05188K24552R22275K677325K718557
8247D568222K01290j952475j482242j5945L4928q40767r11522l74970m06655o80785
8237a860921l29953q3589r14687j628641n48291J171699R61627p55212r28604
8228d916572J002991J929889K23075j443875n87656R43185L79893j000878k02201
$$ y = [-3520747, -6229101, -7316768, -5354386, -2186776, -349496, 249704, 983135, 1561220, 874539, -460039, -887592, -507643, -612224, -1158683, -856663, 480136, 1581900, 1617524, 868469, -258993, -1422053, -1848551, -1072321, 173573, 1017444, 1703509, 2428429, 2030737, -155458, -2112024, -1359053, 1128562, 1993765, 402209, -1065077, -809599, -421909, -1412184, -2622066, -2579675, -1974487, -1749935, -827660, 1849665, 4568222, 4769512, 2817037, 1334795, 1318850, 1353778, 513011, -398511, -773481, -1180136, -1860921, -2190874, -2274463, -3189150, -4817791, -5366082, -4194383, -3232756, -3987968, -4916572, -3913581, -1983692, -1760617, -3204492, -3792148, -2848963, -2469070, -3469948, -3672149]
8219c672149J903266J756365p20805j762614l280J448896N29087n19568L73833
8210f66969J317987J93150j201189m04126J027177K62992j405205n31911K253151
8201H45057K789077K5693k460113k198625q35685k78663J80128J174853J254018
8192D95740k46588j237364j20343J416322J184397l3681k16154M73855M96755
8183B212939j76523m10732j90728l71782q52911q90520n83819m13386r0342N57566
8173a210238N37470o84927j499044j80915K084157K447839L93772j630702j617867
8164a360455j49665J078800J231323M46991o78287j301051r62915k38911o6805
8155b000975n31248r66542r03142k31840R40264J814501J223109n17898j260944
$$ y = [-3672149, -1768883, -12518, -733323, -2495937, -2499217, -1050321, -521234, -1040802, -666969, 651018, 844168, -357021, -761147, 266030, 529022, -876183, -1408094, 845057, 3634134, 3659827, 1199714, -998911, -1834596, -2113259, -1933131, -758278, 495740, 249152, -988212, -1108555, 307767, 1492164, 1458483, 1242329, 1716184, 2212939, 2036416, 1625684, 1434956, 1063174, 210263, -680257, -1264076, -1677462, -1767804, -1210238, -672768, -1357695, -2856739, -3037654, -953497, 1494342, 1888114, 257412, -1360455, -1510120, -431320, 800003, 1246994, 568707, -732344, -1695259, -1934170, -2000975, -2532223, -3498765, -4401907, -4633747, -3693483, -1878982, -655873, -1173771, -2434715]
8146b434715J291J167585J37022j387574j69742L066626L919122O14993l289394
8137A625214l886001j723314K47319J052562J535604J592638M62244r80065q81104
8128i54903O89395J684371J111730J48493j94241n92513j674812k389718j523772
8119c695970J59740Q74246M43501L87346J328984J871606P08571j328522k290906
8110a541404j449345K73987J566950J554629J52982j307653p66164J690098K684619
8101B858699k89980m290274l885003J026360M304645K080848j791836j785201
8093a771742J258235K379104M29478j258979j068512p87048j040468n5738J995127
8084G9457K059656o82432k908099k336020q93825m82902L25452K404917K899049
$$ y = [-2434715, -2433424, -1265839, -1128817, -2516391, -2686133, 380493, 4299615, 4914608, 1625214, -2260787, -3984101, -3736782, -2684220, -1148616, 444022, 906266, -73799, -954903, -265508, 1418863, 2530593, 2679086, 2484845, 1892332, 217520, -2172198, -3695970, -3536230, -2661984, -2218483, -1831137, -502153, 1369453, 2078024, 749502, -1541404, -2990749, -2716762, -1149812, 404817, 557799, -749854, -1516018, 174080, 2858699, 2568719, -1721555, -5606558, -4580198, -275553, 1805295, 13459, -1771742, -513507, 1865597, 2295075, 1036096, -32416, -819464, -1859932, -1915670, 79457, 2139113, 1456681, -1451418, -3787438, -4681263, -5164165, -4838713, -2433796, 465253]
8075D65253j06434l067600j749564J988445L082669J100429n7047P90377Q79110
8066C325638p27410j575142q73805j058361k808455l192969q29390J373240J089858
8057e276796L09750J344849K625013J767802j21773p49977p51148j789986k582786
8048e225052q09673K316873L334067J693020N4178j20243J67714L00829P32760
8039B444473Q60094m12646j828440r49016J416283J591881j200030l123943j456462
8030b657806J335929J591029k51537j173905m27471J53927l66505r75309p99069
8021c570717j21642N91127J083658Q95868p3404p94171j65454J288066J904698
8012A038029J005606m21460j117681q37182k21748K8726j87751l23347O4494N46560
$$ y = [465253, 358819, -2708781, -4458345, -2469900, 612769, 1713198, 1656151, 2446528, 3325638, 2598228, 1023086, 149281, -909080, -3717535, -6910504, -7739894, -6366654, -5276796, -4967046, -3622197, -997184, 770618, 648845, -101132, -852280, -2642266, -5225052, -6034725, -3717852, -383785, 1309235, 1363413, 1243170, 1410884, 1711713, 2444473, 3304567, 2891921, 1063481, 114465, 1530748, 3122629, 1922599, -1201344, -2657806, -1321877, 269152, 17615, -1156290, -1583761, -1429834, -1796339, -2771648, -3570717, -3692359, -3101232, -2017574, -1121706, -1195110, -1989281, -2154735, -866669, 1038029, 2043635, 1622175, 504494, -332688, -554436, -525710, -713461, -1036808, -972314, -425754]
8002d25754L36845m69318r72468q17504m90725k00855L46114Q85434O89404K7005
7992a091822r540M69379J18507j007089r19865R99635K314654R40961j559049
7983B55771k226666q64022L24843K45979k02176j43349M02382J185675J574248
7974E52685M61772j934643l151566j418241J397779K112989O87717k51267K73909
7965a268866P37841M24060M47458J017738O78259p99157j447003k37766J166132
7956G18696J138436M53681M41581O45619Q279j043051j371907r93262p22380p24398
7946a448706n88658k13495K92303R60424J527266J362528M08802n60195j037945
7937G02324j259686j279882p03203K70333P61418O33666O94110R99263N09121
$$ y = [-425754, -88909, -558227, -1530695, -2348199, -2838924, -3039779, -2693665, -1808231, -1118827, -1091822, -1101362, -631983, -513476, -1520565, -2440430, -1440795, 873859, 1814820, 255771, -1970895, -2834917, -2510074, -2264095, -2466271, -2609620, -2207238, -1021563, 552685, 1014457, -920186, -4071752, -5489993, -4092214, -1979225, -1291508, -1542775, -1268866, -531025, -106965, 340493, 1358231, 2036490, 1237333, -209670, -447436, 718696, 1857132, 2310813, 2752394, 3398013, 3406292, 2363241, 991334, -1928, -724308, -1448706, -2037364, -2250859, -1958556, -998132, 529134, 1891662, 2300464, 1740269, 702324, -557362, -1837244, -2540447, -2270114, -1508696, -875030, -180920, 818343, 1327464]
7928A327464q17275j226605L27281K234212K184445J54737j817068k126698q33633
7919e93140Q82284J552418M55782j293830j524779K32453J736166R20987j167339
7910A201002j853654o43327K83413m84354j382072j75033K418288L003793r6770
7901B271286l902477l803232N58171M357133L500235l21265k294874q03249J412523
7892I74251J707719L90758r45335j443337q90627L08281P60501l84651j633557
7883a155997j131284k3475p80901k420417j388227K222782L852305J506880r14513
7874b32847O5451K169438J846342K14308K12363R97555R0052j283365k99381J564315
7864E344231L32422l313471m266789r10195K350622J826817o66108j641666p74641
$$ y = [1327464, 510189, -716416, -389135, 1845077, 4029522, 4184259, 2367191, 240493, -593140, 289144, 1841562, 2297344, 1003514, -521265, -288812, 1447354, 2368341, 1201002, -652652, -1295979, -1012566, -1496920, -2878992, -3054025, -635737, 2368056, 2271286, -1631191, -5434423, -4876252, -519119, 2981116, 2659851, 364977, -438272, 974251, 2681970, 3072728, 2127393, 684056, -206571, 101710, 862211, 477560, -1155997, -2287281, -2310756, -3091657, -5512074, -6900301, -4677519, -825214, 681666, -232847, -167396, 2002042, 3848384, 4062692, 4275055, 5272610, 5362662, 4079297, 3779916, 5344231, 5676653, 2363182, -1903607, -2813802, -463180, 1363637, 697529, -944137, -1718778]
7855a718778K95316R54312J183740N08344o57446o21209R37075J849163O12575
7846C343092j197221j356314j34085P62759Q89290Q21519M02718p93755j931071
7837H06932j639629n7491J229512J225955M87841N1273J81703L51703P7960m35035
7827B280724n98918l64042l25791o05714m10608N80377J291469Q25871M6231Q9983
7817B809582K22973q32448k133179j582584M23200J155393k28949j348341m32049
7808a946402J034840R50282k31138o97424q5131O14979Q29280O26784Q8014m15305
7798G68779k50248K81995j8380j116460j134708Q67103K956772K746600N60590
$$ y = [-1718778, -1423462, -469150, 714590, 1222934, 565488, -55721, 881354, 2730517, 3343092, 2145871, 789557, 655472, 1418231, 2307521, 3129040, 3531758, 2738003, 806932, -832697, -890188, 339324, 1565279, 2053120, 2104393, 2286096, 2637799, 2715759, 2280724, 1681806, 1317764, 991973, 386259, -24349, 556028, 1847497, 2673368, 2719599, 2809582, 3032555, 2200107, 66928, -1515656, -1092456, 62937, -166012, -1514353, -1946402, -911562, 38720, -192418, -889842, -974973, -359994, 469286, 1096070, 1184084, 768779, 518531, 800526, 782146, -334314, -1469022, -601919, 2354853, 5101453, 5662043]
$$ [...]
##END NTUPLES=NMR SPECTRUM
##END=
