##TITLE=31Pdec_92SR1910
 , 124 sc
 19.10.2021
##JCAMPDX= 6.0         $$ Bruker NMR JCAMP-DX V2.0
##DATA TYPE= NMR SPECTRUM
##DATA CLASS= NTUPLES
##ORIGIN= UXNMR, Bruker Analytische Messtechnik GmbH
##OWNER= root
$$ XWIN-NMR		Version 3.5
$$ Tue Oct 19 15:49:28 2021 Russian Standard Time (UT+4h)  she@DPX200
##.OBSERVE FREQUENCY= 81.013821
##.OBSERVE NUCLEUS= ^31P
##.ACQUISITION MODE= SIMULTANEOUS
##.ACQUISITION SCHEME= undefined
##.AVERAGES= 124
##.DIGITISER RES= 16
##SPECTROMETER/DATA SYSTEM= spect
##.PULSE SEQUENCE= zgpg30
##.SOLVENT NAME= DMSO
##.SHIFT REFERENCE= (INTERNAL, DMSO, 0, 248.564)
##AUDIT TRAIL= $$ (NUMBER, WHEN, WHO, WHERE, WHAT)
$$ ##TITLE= Audit trail, XWIN-NMR		Version 3.5
$$ ##JCAMPDX= 5.01
$$ ##ORIGIN= Bruker BioSpin GmbH
$$ ##OWNER= she
$$ F:/spectra/data/she/nmr/P31/1/pdata/1/auditp.txt
$$ ##AUDIT TRAIL=  $$ (NUMBER, WHEN, WHO, WHERE, WHAT)
(   1,<2021-10-19 15:47:43.96 +0400>,<she>,<DPX200>,
      <continue with go, POWCHK disabled, PULCHK disabled
       configuration hash MD5:
       00 E9 B6 7A A2 85 ED C7 34 08 36 98 17 FE 4E 26
       data hash MD5: 32K
       BB 44 B0 20 2D 55 6D B7 A2 83 D5 09 D8 4E 82 9C>)
(   2,<2021-10-19 15:48:27.10 +0400>,<she>,<DPX200>,
      <Start of raw data processing
       efp BC_mod = 2 LB = 1 FT_mod = 6 PKNL = 1 PHC0 = -8840.531 PHC1 = 90.66895 SI = 64K 
       data hash MD5: 64K
       93 A8 22 B8 25 D7 E3 26 EA BD 1F 9B 21 EB EC 6F>)
(   3,<2021-10-19 15:48:53.73 +0400>,<she>,<DPX200>,
      <pk PHC0 = 74.39045 PHC1 = -182.6 
       data hash MD5: 64K
       6F 94 88 90 FE 2B A4 51 E9 8A 36 68 20 B7 D9 AC>)
(   4,<2021-10-19 15:48:57.21 +0400>,<she>,<DPX200>,
      <abs ABSG = 5 
       data hash MD5: 64K
       48 88 EE 53 8F B8 A3 9E 75 3A 42 87 D2 4A A5 DE>)
$$ ##END=
$$ 
$$ hash MD5
$$ 8F 75 74 C0 5A A1 BD 3A 93 EF 2A 54 0A 6F B0 AA
##$RELAX= 
##$RELAX= 
##$RELAX= 
##$RELAX= 
##$RELAX= 
##$RELAX= 
##$RELAX= 
##$RELAX= 
$$ Bruker specific parameters
$$ --------------------------
##$DU= <F:/spectra>
##$EXPNO= 1
##$NAME= <P31>
##$PROCNO= 1
##$TYPE= <nmr>
##$USER= <she>
##$AMP= (0..31)
100 100 100 100 100 100 100 100 100 100 100 100 100 100 100 100 100 100 
100 100 100 100 100 100 100 100 100 100 100 100 100 100 
##$AQSEQ= 0
##$AQ_mod= 1
##$AUNM= <au_zg>
##$AUTOPOS= <>
##$BF1= 81.014009
##$BF2= 200.13
##$BF3= 200.13
##$BF4= 200.13
##$BF5= 200.13
##$BF6= 200.13
##$BF7= 200.13
##$BF8= 200.13
##$BYTORDA= 1
##$CFDGTYP= 0
##$CFRGTYP= 5
##$CHEMSTR= <none>
##$CNST= (0..31)
1 1 145 1 1 1 1 1 1 1 1 1 1 1 1 1 1 1 1 1 1 1 1 1 1 1 1 1 1 1 1 1 
##$CPDPRG= <waltz16>
##$CPDPRG1= <>
##$CPDPRG2= <waltz16>
##$CPDPRG3= <>
##$CPDPRG4= <mlev>
##$CPDPRG5= <mlev>
##$CPDPRG6= <mlev>
##$CPDPRG7= <mlev>
##$CPDPRG8= <mlev>
##$CPDPRGB= <>
##$CPDPRGT= <>
##$D= (0..31)
0 1 0 0 0 0 0 0 0 0 0 0.03 2e-05 3e-06 0 0 0 0 0 0 0 0 0 0 0 0 0 0 0 0 
0 0 
##$DATE= 1634643881
##$DBL= (0..7)
120 120 120 11 120 120 24 19 
##$DBP= (0..7)
150 150 150 150 150 150 150 150 
##$DBP07= 0
##$DBPNAM0= <>
##$DBPNAM1= <>
##$DBPNAM2= <>
$$ [...]
##$SUBNAM3= <"">
##$SUBNAM4= <"">
##$SUBNAM5= <"">
##$SUBNAM6= <"">
##$SUBNAM7= <"">
##$SUBNAM8= <"">
##$SUBNAM9= <"">
##$SW= 501.771253377433
##$SWIBOX= (0..15)
0 1 3 0 0 0 0 0 0 0 0 0 0 0 0 0 
##$SW_h= 40650.406504065
##$TD= 32768
##$TD0= 1
##$TE= 0
##$TE2= 300
##$TE3= 300
##$TEG= 300
##$TL= (0..7)
0 120 53 12 22 120 120 120 
##$TP= (0..7)
150 150 150 150 150 150 150 150 
##$TP07= 0
##$TPNAME0= <>
##$TPNAME1= <>
##$TPNAME2= <>
##$TPNAME3= <>
##$TPNAME4= <>
##$TPNAME5= <>
##$TPNAME6= <>
##$TPNAME7= <>
##$TPOAL= (0..7)
0.5 0.5 0.5 0.5 0.5 0.5 0.5 0.5 
##$TPOFFS= (0..7)
0 0 0 0 0 0 0 0 
##$TUNHIN= 0
##$TUNHOUT= 0
##$TUNXOUT= 0
##$USERA1= <user>
##$USERA2= <user>
##$USERA3= <user>
##$USERA4= <user>
##$USERA5= <user>
##$V9= 5
##$VALIST= <valist>
##$VCLIST= <CCCCCCCCCCCCCCC>
##$VD= 0
##$VDLIST= <DDDDDDDDDDDDDDD>
##$VPLIST= <PPPPPPPPPPPPPPP>
##$VTLIST= <TTTTTTTTTTTTTTT>
##$WBST= 1024
##$WBSW= 4
##$XGAIN= (0..3)
0 0 0 0 
##$XL= 0
##$YL= 0
##$YMAX_a= 32623
##$YMIN_a= -50258
##$ZGOPTNS= <>
##$ZL1= 120
##$ZL2= 120
##$ZL3= 120
##$ZL4= 120
##$ABSF1= 248.5645
##$ABSF2= -253.2056
##$ABSG= 5
##$ABSL= 3
##$ALPHA= 0
##$AQORDER= 0
##$ASSFAC= 0
##$ASSFACI= 0
##$ASSFACX= 0
##$ASSWID= 0
##$AUNMP= <proc_1d>
##$AZFE= 0.1
##$AZFW= 0.5
##$BCFW= 0
##$BC_mod= 2
##$BYTORDP= 0
##$COROFFS= 0
##$CY= -3
##$DATMOD= 1
##$DC= 0
##$DFILT= <>
##$DTYPP= 0
##$F1P= 0
##$F2P= 0
##$FCOR= 1
##$FTSIZE= 65536
##$FT_mod= 6
##$GAMMA= 0
##$GB= 0
##$INTBC= 1
##$INTSCL= 5.30512e-09
##$ISEN= 30
##$LB= 1
##$LEV0= 0
##$LPBIN= 0
##$MAXI= 10000
##$MC2= 0
##$MEAN= 0
##$ME_mod= 0
##$MI= 50
##$NCOEF= 0
##$NC_proc= -8
##$NLEV= 6
##$NOISF1= 182.463
##$NOISF2= 159.3651
##$NSP= 0
##$NTH_PI= 0
##$NZP= 0
##$OFFSET= 248.5645
##$PC= 4
##$PHC0= -8766.141
##$PHC1= -91.93105
##$PH_mod= 1
##$PKNL= yes
##$PPARMOD= 0
##$PSCAL= 0
##$PSIGN= 0
##$REVERSE= no
##$SF= 81.014009
##$SI= 65536
##$SIGF1= 159.3651
##$SIGF2= -187.1042
##$SINO= 113.3802
##$SIOLD= 16384
##$SREGLST= <1H.CDCl3>
##$SSB= 0
##$STSI= 65536
##$STSR= 0
##$SW_p= 40650.406504065
##$SYMM= 0
##$S_DEV= 0
##$TDeff= 32768
##$TDoff= 0
##$TI= <>
##$TILT= no
##$TM1= 0
##$TM2= 0
##$TOPLEV= 0
##$USERP1= <user>
##$USERP2= <user>
##$USERP3= <user>
##$USERP4= <user>
##$USERP5= <user>
##$WDW= 1
##$XDIM= 65536
##$YMAX_p= 513227365
##$YMIN_p= -166479642
$$ End of Bruker specific parameters
$$ ---------------------------------
##NTUPLES= NMR SPECTRUM
##VAR_NAME=  FREQUENCY,     SPECTRUM/REAL,   SPECTRUM/IMAG
##SYMBOL=    X,             R,               I
##VAR_TYPE=  INDEPENDENT,   DEPENDENT,       DEPENDENT
##VAR_FORM=  AFFN,          ASDF,            ASDF
##VAR_DIM=   65536,         65536,           65536
##UNITS=     HZ,            ARBITRARY UNITS, ARBITRARY UNITS
##FACTOR=    0.620285442955139, 1,           1
##FIRST=     20137.2065510759, 0,            0
##LAST=      -20513.1999529892, 0,           0
##MIN=       -20513.1999529892, -166479642,  0
##MAX=       20137.2065510759, 513227365,    0
$$ Real data points
##PAGE= N=1
##DATA TABLE= (X++(R..R)), XYDATA
$$ [...]
42970a0611384J1058589J0420134m785263j0571800J446237J0931718K503419
42963A0391650j0838012j0826318j141252M008405L425799M544082O623417M355077
42955A0542848K72083o76479j905416p266689r605150j582333Q210952N598828
42947C588644o427513j1166265l292634M983990M432475R34059K308923N068087
42939D29766J976578m734893o040408N95327O984249M449157m605513q579023
42931i524760j401270Q001110O353129n327820j1937362m798565O933750R846503
42923a855285L099921m451491p017907m813600K56448N184046O349013M298599
42915A049744L454544M237790K516577q50354p6608K862658j028862r103690n743827
$$ plain form
42970 -10611384 447205 10867339 6082076 -4489724 -3043487 7888231 10391650
42963 10391650 -446362 -11272680 -12413932 -8405527 -4979728 -435646 6187771 10542848
42955 10542848 10814931 10138452 8233036 966347 -8638803 -10221136 -2010184 3588644
42947 3588644 -2838869 -14005134 -17297768 -12313778 -7881303 -6947244 -4638321 429766
42939 429766 2406344 -2328549 -8368957 -7773630 -789381 3659776 -945737 -9524760
42931 -9524760 -10926030 -2924920 3428209 -1899611 -13836973 -18635538 -11701788 -1855285
42923 -1855285 1244636 -3206855 -10224762 -15038362 -14781914 -9597868 -3248855 1049744
42915 1049744 4504288 8742078 11258655 10408301 10331693 13194351 12165489 3061799 -2682028
42906b682028J0888834J9137911N643489j1141253r065066K494125O05411j0967618
42898D913805r413518O032266J2449306K477190n504105j094252K865910k944880
42890I781722q282055m736675j19271r2128L065177J1350914J1611619j194668
42882B1384635j0928980n415230L555908J442298m869598j912500O091507O583616
42874A5931656M42174l506310n324575q350843p041136K396104R119081L084978
42866F751129o119912m317817K638804m11603j0338475j0944787r24754N809439
42858a7857976N318827O740717J0324693M969807q859706j4620476m362840R448558
42850h898396J3086627P335442j078740q588150r953402M8016J3463614J2968804
$$ plain form
42906 -2682028 8206806 27344717 32988206 21846953 12781887 15276012 15881423 4913805
42898 4913805 -4499713 1532553 13981859 16459049 10954944 9860692 12726602 9781722
42890 9781722 1499667 -3237008 -3356279 -3448407 -383230 10967684 22579303 21384635
42882 21384635 10455655 5040425 8596333 10038631 5169033 3256533 9348040 15931656
42874 15931656 16373830 12867520 7542945 -807898 -7849034 -5452930 3666151 6751129
42866 6751129 631217 -3686600 -1047796 -1459399 -11797874 -22742661 -23667415 -17857976
42858 -17857976 -12539149 -5798432 4526261 9496068 636362 -13984114 -18346954 -8898396
42850 -8898396 4188231 11523673 10444933 1856783 -8096619 -8048603 5415011 18383815
42842A8383815l294693j5485073r773694K437438M426233p21747J81505O411935
42834B565719O423036q22638m680100j507800O93569k194900l472846J714125
42826a281835P266849N530812j378573n752992n272401l933045m204494l645469
42818a2671148K67064N421986O987682L119421k514970m381102r74157L800183
42810i45041N540904M353400L235504K397348j288552p720231j0191938l119851
42802g738457Q400363J2722411O398040j247323j294292L146949L768134j30905
42794B4024920l408954n466603r076090j0835288m079631P518139J0459552k59305
42786H876740j2609584j2799178j808218Q697070J0724366N053340k601648n791386
$$ plain form
42842 18383815 15089122 -395951 -10169645 -7732207 -3305974 -4027721 -3846216 2565719
42834 2565719 8988755 8166117 3486017 1978217 2671786 476886 -2995960 -1281835
42826 -1281835 5985014 11515826 10137253 4384261 -888140 -4821185 -9025679 -12671148
42818 -12671148 -12404084 -6982098 5584 3125005 610035 -3771067 -4745224 -945041
42810 -945041 4595863 8949263 12184767 14582115 13293563 5573332 -4618606 -7738457
42802 -7738457 661906 13384317 19782357 18535034 17240742 20387691 24155825 24024920
42794 24024920 20615966 15149363 6073273 -4762015 -8841646 -1323507 9136045 8876740
42786 8876740 -3732844 -16532022 -18340240 -9643170 1081196 6134536 3532888 -2258498
42778b258498k216876K476398R44567m190840k544881P676564J4711208R097016
42770B3694658m170228j4086719j5558909q537742M539774J5034082J2792936
42763A3707852R41399n346452j092417J233519n419301r189493r79630P304621
42755A160098K930176m664248j137401O034661J354262r032272p246245M172279
42747f428690P136507O96411P40182Q353729P586674k944875n735008K387471
42739A1792401K227256j2222342j8606055j981555J8962227K0013454N642109
42732B5827495m258709n183223n684953p275158o049398m935040p363550p030790
42724b1953326J017623P905115M480792j581270J810635R623135P700163l360615
$$ plain form
42778 -2258498 -4475374 -1998976 -1054409 -5245249 -7790130 -113566 14597642 23694658
42770 23694658 19524430 5437711 -10121198 -18658940 -14119166 914916 13707852
42763 13707852 14649251 9302799 8210382 9443901 4024600 -5164893 -6144523 1160098
42755 1160098 4090274 -573974 -1711375 4323286 5677548 -3354724 -10600969 -6428690
42747 -6428690 707817 1404228 2144410 10498139 18084813 15139938 9404930 11792401
42739 11792401 14019657 1797315 -16808740 -18790295 171932 20185386 25827495
42732 25827495 21568786 16385563 10700610 3425452 -2623946 -7558986 -14922536 -21953326
42724 -21953326 -20935703 -13030588 -8549796 -10131066 -8320431 1302704 9002867 5642252
42716E642252r647813o290735k075017k386987k298401J712573N144436L563261
42708f636431q43605l068575p45018M311745P083061M187438n42932m43034K926802
42699F229451J782817k908753r69959P659341Q355827m171167j3199642n281545
42691b503630O569190L355397q193815o556114Q948287J7075609P945792m615276
42683B2025440p036869l403763l293463p202558j0358452j0044338m668499N329465
42675a8653037J3311648J2014511M183747j170776k300304m228513o175296j960888
42667d978908O675011R803508M169100l083369o869533q808098q379070k072549
42659a3543908O453408P939627K144450j327818M91831o7366n101122n394691
$$ plain form
42716 5642252 -4005561 -10296296 -12371313 -14758300 -17056701 -15344128 -10199692 -6636431
42708 -6636431 -7480036 -10548611 -11293629 -6981884 101177 4288615 3745683 3302649 6229451
42699 6229451 8012268 5103515 4133556 11792897 20148724 15977557 2777915 -2503630
42691 -2503630 4065560 7420957 -772858 -7328972 1619315 18694924 26640716 22025440
42683 22025440 14988571 11584808 8291345 1088787 -9269665 -19314003 -23982502 -18653037
42675 -18653037 -5341389 6673122 10856869 9686093 7385789 3157276 -3018020 -4978908
42667 -4978908 1696103 11499611 15668711 12585342 5715809 -3092289 -11471359 -13543908
42659 -13543908 -7090500 849127 2993577 1665759 2157590 2090224 -3010898 -8405589
42651h405589K543666P404850K49845j0327375j0415917j5814R472146J0865704
42643A371516O120246O09693p50537L936567R737439Q369558n97932p702128o188504
42634A4905918n0849L920240M554116K839738j832039p277044q295269n345782
42626C419029m891531o779405j995944J0533603J6694832O705431q343921j1573439
42618C768655l724544J901341J500395K629287P090274P497114J953102j431583
42610B1184041J690481M624862J096589m609934m887361k98889K224750m78796
42602B0545743m832885o807890o791230o731657n242264M59123P407848P101997
42594E108785k610211j0618381n892209N018242N452332n875495j0978867L48036
$$ plain form
42651 -8405589 -5861923 1542927 1792772 -8534603 -18950520 -18966334 -9494188 1371516
42643 1371516 7491762 8101455 7350918 11287485 21024924 29394482 28796550 21094422 14905918
42634 14905918 14855069 18775309 23329425 26169163 24337124 17060080 8764811 3419029
42626 3419029 -1472502 -8251907 -10247851 285752 16980584 23686015 15342094 3768655
42618 3768655 44111 1945452 3445847 6075134 13165408 20662522 22615624 21184041
42610 21184041 22874522 27499384 28595973 23986039 19098678 18799789 21024539 20545743
42602 20545743 15712858 8904968 2113738 -4617919 -9860183 -9401060 -1993212 5108785
42594 5108785 2498574 -8119807 -14012016 -8993774 -3541442 -9416937 -20395804 -20047768
42586b0047768J3924986J2362887Q12575l221042K423464M331208k392179p432854
42578G61277m183993L89019k92944j520853K655018Q093608O968852o06087p714055
42569D549842r259674n101716J468760N088131K388851k507959j338422O564428
42561A852241J1334363N544197m942880q652954l494482K185525K078992o92894
42553E212108K19871N201171Q533804N974520k23403m624260n199159m283023
42545A0811629l575551j919513O91215J065120k107566m749521l059774N03963
42537b339998J556619Q69153J593704K671067J688488J143482L696993M101592
42529A4981100l705811j2934432j0039027M007888J2071492N200761m792762m977846
$$ plain form
42586 -20047768 -6122782 6240105 7052680 3831638 6255102 10586310 8194131 761277
42578 761277 -3422716 -3033697 -3326641 -4847494 -2192476 5901132 12869984 12263897 4549842
42569 4549842 -4709832 -9811548 -8342788 -3254657 -865806 -3373765 -4712187 1852241
42561 1852241 13186604 18730801 13787921 5134967 1640485 3826010 5905002 5212108
42553 5212108 5431979 10633150 19166954 25141474 24918071 20293811 15094652 10811629
42545 10811629 7236078 5316565 6007780 7072900 4965334 215813 -2843961 -2339998
42537 -2339998 -783379 85774 1679478 4350545 6039033 7182515 10879508 14981100
42529 14981100 11275289 -1659143 -11698170 -7690282 4381210 9581971 4789209 -188637
42521a88637o86929l382561r426322o370265M926493J0630300N732382O30147
42513A864608L034788O334869K067802o035902q619018n094147k876023m757726
42505a4080749n003422R12582Q491358R762659L931630k146145m013929m612901
42497f758917o202605l357019Q172098J9362602J6155911K28029j0891251q007359
42489H701489j390305j366488k485089J784872L100442o250931j3751372l844682
42481a5502064J3018594J2921752l158148j0264939o01705M837987n675192j3313790
42473a7737505j571615J4237535J2093688j264114m579702K220235K795430m067070
42465B126882m374982L487036O481120J859025O19731M259340J268527q802632
$$ plain form
42521 -188637 -875566 -4258127 -13684449 -20054714 -15128221 -4497921 1234461 1864608
42513 1864608 4899396 11234265 13302067 7266165 -1352853 -6447000 -9323023 -14080749
42505 -14080749 -19084171 -18171589 -9680231 82428 4014058 1867913 -2146016 -6758917
42497 -6758917 -12961522 -16318541 -8146443 11216159 27372070 27600099 16708848 8701489
42489 8701489 7311184 5944696 3459607 5244479 8344921 2093990 -11657382 -15502064
42481 -15502064 -2483470 10438282 7280134 -2984805 -3586510 1251477 -4423715 -17737505
42473 -17737505 -19309120 -5071585 7022103 5757989 1178287 3398522 6193952 2126882
42465 2126882 -2248100 1238936 7720056 9579081 10198812 14458152 15726679 6924047
42457F924047j0530519N10393P437925m63688r113310k572641J1005645J2690904
42449A5888756J089806r077490r873299o275843l007749Q56951M381492K942911
42441c074465l937246r765340q218944m9320P535457P542385Q28969l654646k4831
42432a2817981N285383K678337m247801k835948P464584J1994585L661740n466289
42424E716610l846470J515470j385782q767105q066523J284684Q372298Q109824
42416B933006N128324K768052q0061k283439p96759K793485M042584K483666k0755
42407A6968103m231530r520857r769919k095519N337580M170111o49958M17387
42399F25398M520370K037077m438019k843469O869982J0464731J856326p317001
$$ plain form
42457 6924047 -3606472 -3096079 4341846 3878158 -5235152 -7807793 3197852 15888756
42449 15888756 16978562 7901072 -1972227 -8248070 -11255819 -10398868 -6017376 -3074465
42441 -3074465 -7011711 -16777051 -24995995 -25045315 -17509858 -9967473 -9138504 -12793150 -12817981
42432 -12817981 -7532598 -4854261 -9102062 -11938010 -4473426 7521159 11182899 5716610
42424 5716610 1870140 3385610 1999828 -6767277 -14833800 -13549116 -5176818 2933006
42416 2933006 8061330 10829382 10749321 8465882 7669123 10462608 14505192 16988858 16968103
42407 16968103 12736573 3215716 -6554203 -8649722 -3312142 857969 208011 625398
42399 625398 5145768 7182845 2744826 -98643 6771339 17236070 19092396 11775395
42391A1775395o428612j007436j213149n600367n692948j04971M636009M069969
42383D33890J10379l129690l714628k661140j985275j668941L62711L955994N455103
42374b841597L416755J346986R91007j091682m653320j419154J1033046J8953624
42366B5735665R228752r289097j6821335j1214791p550837j0346848o726083Q238527
42358a8746047J9235883J3424959l45696o324217l386340j77399R96982L083065
42350G761190M186411K36507o145874q343563m640366J280409N159154L837048
42342C330916k452772o565830o62807J0780010J3313021K372584r224314r401859
42334A488949j743493M818337R470116J2703550P506998q927549k2953600j9089134
$$ plain form
42391 11775395 5346783 4339347 3126198 -2474169 -8167117 -8272088 -3636079 433890
42383 433890 544269 -2585421 -6300049 -8961189 -10946464 -12615405 -12252694 -8296700 -2841597
42374 -2841597 575158 1922144 2913151 1821469 -2831851 -4251005 6782041 25735665
42366 25735665 34964417 25675320 8853985 -2360806 -9911643 -20258491 -26984574 -18746047
42358 -18746047 489836 13914795 13569099 7244882 3858542 3681143 4678125 7761190
42350 7761190 11947601 12184108 6038234 -2305329 -6945695 -5665286 -506132 3330916
42342 3330916 878144 -5687686 -6350493 4429517 17742538 20115122 10890808 1488949
42334 1488949 -254544 4563793 14033909 26737459 34244457 25316908 2363308 -16725826
42326a6725826k304587Q570984O802204K833219M375084O102609K205348l195376
42318H663659l957548j693303j399726k677758j196484L568376O875289N034672
42310A3217177L29394k006453r66227j280916o119332j0999566q865151K95024
42302a6396050R287251J2000323P633078q82228p214270m177395O188733R530107
42294A5969549k768955j6712730j2120736O157529J2730054j95916j0738859j910418
42286i590482J2762916J2623105J356597l323070R61187J991424l903545p764922
42278E113210m487373R05022K358096j515646p973775r754862o90668J2253646
42270c792350J2997466o8198q238654p16849P574422J449678q255824m354471
$$ plain form
42326 -16725826 -19030413 -10459429 -3657225 -824006 3551078 9653687 11859035 8663659
42318 8663659 4706111 3012808 1613082 -1064676 -2261160 1307216 8182505 13217177
42310 13217177 13546571 11540118 10573891 9292975 3173643 -7825923 -16691074 -16396050
42302 -16396050 -7108799 4891524 12524602 11642374 4428104 250709 6439442 15969549
42294 15969549 13200594 -3512136 -15632872 -9475343 3254711 3058795 -7680064 -9590482
42286 -9590482 3172434 15795539 17152136 13829066 14790253 16781677 12878132 5113210
42278 5113210 625837 1530859 3888955 2373309 -5600466 -15355328 -16045996 -3792350
42270 -3792350 9205116 9136918 898264 181415 7755837 9205515 949691 -3404780
42262c404780N811037M045950n689561n429644L604513M889136j203799O24373
42254C247225Q146588K936811j3314790j6167866M35620J1602531J875078j0761489
42246a2000292o649253N739047R758101P663341Q101719O073796l818773j0253079
42238D614607k244165R763096R814259J878865k58162K138076j356280q003766
42230A6346530o704897J86821J74134p094588r686168m347564j14149p74970k8281
42221a2043132M113839M754847q36938n687240m134102J028192M823411N640327
42213b340796L503864L778l34955M317548P706143L545690l427313l671716K013885
42204A1316128M107071J63425k425081m58904l13006n869745j0841269q245066
$$ plain form
42262 -3404780 2406257 6452207 762646 -4666998 -1062485 3826651 2622852 3247225
42254 3247225 11393813 14330624 1015834 -15152032 -14716412 -3113881 -1238803 -12000292
42246 -12000292 -18649545 -12910498 -3152397 4510944 12612663 18686459 14867686 4614607
42238 4614607 2370442 12133538 21947797 23826662 23568500 25706576 24350296 16346530
42230 16346530 9641633 9828454 10002588 2908000 -6778168 -11125732 -11239881 -12014851 -12043132
42221 -12043132 -7929293 -3174446 -4011384 -9698624 -13832726 -12804534 -7981123 -2340796
42213 -2340796 1163068 1166846 831891 5149439 12855582 16401272 12973959 9302243 11316128
42204 11316128 15423199 15586624 13161543 12702639 12389633 6519888 -4321381 -12566447
42196a2566447o04672M252809L119054l61113m06206N277994J1845741J0315812
42188B0872972j429682j2654364j1311665k42110O298814K389034k666683N2667
42180A308983N795810M616953l153204p553596k831470N656782Q685794L464327
42172A5990379m413916p602825m503366l7285P60760j472514k308891O0890K682976
42163h43792K179398o47100j609058J458240M620896J386353p613647j1501510
42155a2570220j702430J3408985J5308966k39082j4872521j0779443N607316J3274145
42147G435716N153966n155133m419990M367521J0146118Q234727J664923n175404
42139B2252444q859789p101193j135715M453133O732573O646125N228059J789394
$$ plain form
42196 -12566447 -13171119 -8918310 -5799256 -6160369 -6566575 -1288581 10557160 20872972
42188 20872972 19443290 6788926 -4522739 -4764849 1533965 3922999 1256316 1308983
42180 1308983 7104793 11721746 8568542 1014946 -1816524 3840258 12526052 15990379
42172 15990379 11576463 3973638 -529728 -567013 193747 -1278767 -3587658 -3526768 -843792
42163 -843792 1335606 688506 -920552 537688 5158584 6544937 -1068710 -12570220
42155 -12570220 -14272650 -863665 14445301 14206219 -666302 -11445745 -5838429 7435716
42147 7435716 12589682 7434549 3014559 7382080 17528198 25762925 27427848 22252444
42139 22252444 13392655 6291462 5155747 9608880 16341453 22987578 28215637 30005031
42131C0005031k538299m315188l245342l101330m435701k457750L376248M546698
42123A7834367m049102j2524764p905781N118718Q671252j559610q431225R23231
42115a922914J4807695J4667225L166434j810833L741636N638605k787399r514126
42107B5986323m981321K204332J245480k931401p68031L981056K239836k787533
42099B4188741j930008J950825j025107q382138q277524p33398J589237m720034
42091B660594p994906j226830P734060J0486952Q669773N495921K35699m089559
42083B1971704j240844N016787K554496q762731j3727978n507950L651148L874673
42075G829305K468405O175581O386926l099932r827535k047085R348782P817639
$$ plain form
42131 30005031 27466732 23151544 19906202 16804872 12369171 9911421 13287669 17834367
42123 17834367 13785265 1260501 -6645280 -1526562 7144690 5585080 -2846145 -1922914
42115 -1922914 12884781 27552006 30718440 28907607 32649243 38287848 35500449 25986323
42107 25986323 21005002 23209334 24454814 21523413 20755382 24736438 26976274 24188741
42099 24188741 22258733 24209558 23184451 14802313 6524789 5791391 7380628 2660594
42091 2660594 -5334312 -6561142 1172918 11659870 20329643 25825564 26061263 21971704
42083 21971704 20730860 25747647 28302143 19539412 5811434 303484 3954632 7829305
42075 7829305 10297710 16473291 22860217 19760285 9932750 7885665 17234447 25052086
42067B5052086j276991j206271O685855O508497l967541j0416339n960636J244627
42059A6663287M355013M605031J988382m680472r008419m053098L187073N43547
42051A3600344p885441o997267L604182Q726886L392493q90974J069574j22328
42043A4497469p670376r475129R10934J1482815J0412508K934322m61874M04469
42035B3035138J289894K668895L610192j706449j2109664j5544429o343682M739171
42027c60934O820503L676680K805488K024704j758918k277788M481592Q745409
42019B4156736J251674r478925q910179J215590P089149M139685m53092k723930
42011A6286708m902511n622215j183161L946103J059351p456667q824533J677769
$$ plain form
42067 25052086 23775095 22568824 29254679 35763176 31795635 21379296 15418660 16663287
42059 16663287 21018300 25623331 27611713 22931241 13922822 9869724 13056797 13600344
42051 13600344 5714903 -1282364 2321818 11048704 14441197 13550223 14619797 14497469
42043 14497469 6827093 -2648036 -1737102 9745713 20158221 23092543 22630669 23035138
42035 23035138 24325032 26993927 30604119 28897670 16788006 1243577 -5100105 -360934
42027 -360934 6459569 10136249 12941737 14966441 13207523 10929735 15411327 24156736
42019 24156736 25408410 15929485 7019306 8234896 15324045 19463730 19010638 16286708
42011 16286708 11384197 5761982 4578821 8524924 9584275 2127608 -6696925 -5019156
42003e019156J3356086J4656010O869312m91973j914924L80100J491134l15840
41995B9010749k387519k264902k228221n324496p757193l017472N225770N133673
41987A6390389m027390p361931K373816J0491067K969207r061670o378522N716425
41979A1111391N393680q093325j0983801N899233J9750125J0062315j0013001
41972B3126617j4190758r70334Q734184M323400l907260n434311l093585k568351
41964F019602k056105J410257M723572M235130K235612K245764K685426O51414
41956B2150672j887481j345208P59006J11941l031749m607892l892076l594339
41948D662874k910959K214655J0104663J2315291N739144j245171o30317L324907
$$ plain form
42003 -5019156 8336930 22992940 29862252 29370279 27455355 27835455 29326589 29010749
41995 29010749 26623230 24358328 22130107 16805611 9048418 6030946 11256716 16390389
41987 16390389 12362999 5001068 7374884 17865951 20835158 11773488 5394966 11111391
41979 11111391 16505071 8411746 -2572055 3327178 23077303 33139618 23126617
41972 23126617 8935859 7965525 16699709 21023109 17115849 11681538 8587953 6019602
41964 6019602 3963497 5373754 10097326 14332456 16568068 18813832 21499258 22150672
41956 22150672 20263191 18917983 19676989 19788930 16757181 12149289 8257213 4662874
41948 4662874 1751915 3966570 14071233 26386524 32125668 30880497 30250180 33575087
41940C3575087J553021n386759r144648o610511k017191J642927L976734K191679
41932A9780339m717584q462732m13511J2180718J2688906l54359r935621n875684
41924A4890472K030979L011380J706115N250904Q266139L747882k778922l550651
41916C2574298k474123m922818m524263M068645J0007764K673196o317189J71331
41908C1256841J3118536Q537201j1806777j9405607l393410J2006093N593499
41901C5906376j0031668j2011591j307648O228104P702281J0809486J3248364
41894E0543704N900562p425997j2351892n512836J925578K875691K167643L817228
41886D1939681L654532r70516m570601j958078M101991Q156037Q935347P145331
$$ plain form
41940 33575087 35128108 29741349 20596701 13986190 11968999 13611926 17588660 19780339
41932 19780339 15062755 6600023 6186512 18367230 31056136 30701777 20766156 14890472
41924 14890472 16921451 19932831 21638946 26889850 35155989 38903871 36124949 32574298
41916 32574298 30100175 25177357 20653094 24721739 34729503 37402699 31085510 31256841
41908 31256841 44375377 52912578 41105801 21700194 18306784 30312877 35906376
41901 35906376 25874708 13863117 12555469 18783573 26485854 37295340 50543704
41894 50543704 56444266 49018269 36666377 31153541 33079119 35954810 38122453 41939681
41886 41939681 45594213 44623697 40053096 38095018 42197009 50353046 59288393 66433724
41878F6433724K110332m872665q255155m223261L501246P857023O767247L734499
41870G3052990J417751j189332m589258n708923k053050K882270K605884l234559
41862F3183773o941387k886583M076372N253241R22289q7074O156040J2408208
41854H2084879J0068081P9360r256948j1411010n632964M256080J1705617J1359711
41846I3252806M542004j662208l033345k494834l600652m590545k746952K3793
41838G9690067J037636K225310N809522Q016794M005435l055902n194411j253350
41830I1281101J874108P9622k876506k772818r28736N4111R87628K772332K766860
41821I3237702j140544n735270o096696k455030L33065o01307l257349m334164
$$ plain form
41878 66433724 68544056 63671391 55416236 51192975 54694221 62551244 69318491 73052990
41870 73052990 74470741 73281409 68692151 62983228 60930178 63812448 66418332 63183773
41862 63183773 56242386 53355803 57432175 62685416 63607705 63520631 69676671 82084879
41854 82084879 92152960 92232320 82975372 71564362 65931398 70187478 81893095 93252806
41846 93252806 97794810 96132602 93099257 90604423 87003771 82413226 79666274 79690067
41838 79690067 80727703 82953013 88762535 96779329 100784764 97728862 92534451 91281101
41830 91281101 93155209 93234831 90358325 87585507 86656771 86710882 87698510 90470842 93237702
41821 93237702 92097158 86361888 80265192 77810162 78143227 77541920 74284571 69950407
41813F9950407l051726r86530K65593Q06232K267989N271042O835379K711624
41805H4070010n819328j0234356m128724O867621J0135275K168383o302556m972345
41797G1783980J772974K072394n204863q794002k386214N896187O325982K063552
41789G3529990K578520P289743O253825k866761q701966j571848J2053883J7297328
41781A05862714R790529k11601k527035O98908O67895m628449q553255o633392
41773I4466314k746062j733996j526836J628056M268318N01901n972065m884545
41765H4001085M167401R329760M747062m50799J143014J720275o306897j2227853
41757H6123048k062356J4602698J4007257n333457j7188418n135920J4028570
$$ plain form
41813 69950407 66898681 65912151 66177744 66983976 69251965 74523007 81358386 84070010
41805 84070010 78250682 68016326 63887602 70755223 80890498 83058881 76756325 71783980
41797 71783980 73556954 75629348 70424485 61630483 59244269 65140456 71466438 73529990
41789 73529990 76108510 83398253 89652078 86785317 78083351 76511503 88565386 105862714
41781 105862714 115653243 115441642 112914607 113613515 114281410 109652961 101099706 94466314
41773 94466314 91720252 89986256 88459420 90087476 94355794 94857695 88885630 84001085
41765 84001085 88168486 97498246 102245308 101794509 102937523 104657798 98350901 86123048
41757 86123048 84060692 98663390 112670647 107337190 90148772 85012852 99041422
41750I9041422J6060245K569102o803901m560108m14838j327005k983286j501557
41742A00080074o94321m409027r751431j0940582n527118L839602J0731428R618860
41734I2947485K464431k264614n25282J886612p71128m775545m025948q33765
41726H4102246j088084l169910j321949L055930L487293j61688k194133j609860
41718H1099845k261359l730378k427734p14309l417621n902714P65814J1442339
41710G4853883R325004p881958j9751349j0726915P392449J3324961O171865J955785
41702G4663725O686616R894893M231723l920773o716047n471318m036574j323097
41694G4009148L433591N496770J481860l957606m798197k679759k436265k269328
$$ plain form
41750 99041422 115101667 117670769 110866868 106306760 105891922 104564917 101581631 100080074
41742 100080074 99385753 94976726 85225295 74284713 68757595 72597197 83328625 92947485
41734 92947485 95411916 93147302 92622020 94508632 93737504 88961959 84936011 84102246
41726 84102246 83014162 79844252 78522303 81578233 85065526 84903838 82709705 81099845
41718 81099845 78838486 75108108 72680374 71966065 68548444 62645730 63411544 74853883
41710 74853883 84178887 76296929 56545580 45818665 53211114 66536075 72707940 74663725
41702 74663725 81350341 91245234 95476957 91556184 84840137 79368819 75332245 74009148
41694 74009148 77442739 82939509 84421369 80463763 75665566 72985807 70549542 68280214
41686F8280214L065789J0566369J0124375k38762q883209n585598M530314R085904
41678I0945396N659840K303604L352695M428034K098650o59346j163998j116159
41670A05848716j042620J214033L196319j316290r086937o488019R133621J8667882
41662A20126705O095381j4544488j5588428M461372J8236104Q948007p877189
41655A19857464j0467213q74314M341119P64287k264137K26418M023684O368797
41647A21976105Q818022J0016332O103037j024575m402288j909633J535778K246751
41639A43359529J670963J483178J159715J425173M124949P293671N966002k27657
41631A66255523n291294m820694j210908J407403K971077M901818N407901J861498
$$ plain form
41686 68280214 71346003 81912372 92036747 91797985 82914776 77329178 81859492 90945396
41678 90945396 96605236 98908840 102261535 106689569 108788219 108128873 106964875 105848716
41670 105848716 104806096 106020129 109216448 107900158 98813221 92325202 101458823 120126705
41662 120126705 126222086 111677598 96089170 100550542 118786646 127734653 119857464
41655 119857464 109390251 108515937 112857056 113621343 111357206 111583624 115607308 121976105
41647 121976105 130794127 140810459 146913496 145888921 141486633 139577000 141112778 143359529
41639 143359529 145030492 146513670 147673385 149098558 153223507 160517178 166483180 166255523
41631 166255523 160964229 156143535 154932627 156340030 159311107 164212925 169620826 171482324
41623A71482324l877134p047439o943566q150514j2942699j5735301r348734L816992
41615A11253929J1914723P460978k956473p162780k809650J639196J81462l616552
41607A15904833m133528j599152N66335Q04904j460472o415350r969757n229929
41599H8467884O960111J4530372Q222154m898053r820483l251102L275333j93980
41591A03292236r962471j4854209r138514K811886J1381639J0006669J019801
41584I4557037o608752p050864l391467j199036K5579L505617O101682Q55413
41576H6795209j0452202j5251128n302592J0784597J5854074M160577j1352618
41569G5235917j3509141n16820J2348248J1474647R23910n117356k509998p26989
$$ plain form
41623 171482324 167605190 160557751 153614185 145463671 132520972 116785671 107436937 111253929
41615 111253929 123168652 130629630 127673157 120510377 117700727 119339923 119521385 115904833
41607 115904833 111771305 110172153 110738488 111543392 110082920 103667570 93697813 88467884
41599 88467884 95427995 109958367 118180521 113282468 103461985 100210883 103486216 103292236
41591 103292236 93329765 78475556 69337042 72148928 83530567 93537236 94557037
41584 94557037 87948285 80897421 77505954 76306918 76332497 79838114 85939796 86795209
41576 86795209 76343007 61091879 55789287 66573884 82427958 86588535 75235917
41569 75235917 61726776 61209956 73558204 85032851 85956761 80839405 78329407 77602418
41561G7602418n714907j0174798o518529K31373J455863o49961J461055O141028
41553F3833542N649027Q74944J43141L744637K459898o280013j2391070p608142
41545E0425964L209919R776023Q211300J793784l505280j920382O676045J2686109
41537H7353482O331454p086464j1319826j593615Q087351N461327l199822n184970
41529G8848917p64570M88130l151638l798054K302698Q725122P510569j746154
41521H8415020j1922153j4396606o325643N620694J0913281O491101l68640j636670
41513G6790384L106036Q853500J0516208N136220n036609j0961066n867989L624782
41505H6161466N124991l57302j12966O925494N785985p915384j5616638m215798
$$ plain form
41561 77602418 71887511 61712713 55194184 55425557 56881420 56231459 57692514 63833542
41553 63833542 69482569 70357513 70500654 74245291 76705189 70425176 58034106 50425964
41545 50425964 53635883 63411906 71623206 73416990 69911710 67991328 74667373 87353482
41537 87353482 93684936 86598472 75278646 73685031 81772382 87233709 84033887 78848917
41529 78848917 78084347 78572477 75420839 71622785 73925483 82650605 90161174 88415020
41521 88415020 76492867 62096261 55770618 61391312 72304593 78795694 78427054 76790384
41513 76790384 79896420 88749920 99266128 104402348 99365739 88404673 82536684 86161466
41505 86161466 91286457 90929155 90816189 97741683 103527668 95612284 79995646 75779848
41497G5779848J0006491N439123r907483j1055207M138633J3430692O485755k655703
41489I1662149k651962p06498l707576m386219K678310Q181954L679903l307621
41481I1442440k325029K757620K257440k104790j543748L832710N808292K224274
41473A02349209j99932K953705P525834O915835M70189n126716k527891O620354
41465A18980587J0710080K144589j0001876j0242426J142955P840624J297893
41458A21872426q265508r329200m048727J562451Q740162J6715719J5115962m47753
41450A41915532j5149036j2848310P3512M922428r78458m006233O31516K877237
41442A17438188j393609k315846N076526J0089025L963094m443009k153202P363940
$$ plain form
41497 75779848 85786339 91225462 81317979 70262772 74401405 87832097 94317852 91662149
41489 91662149 89010187 88303689 84596113 80209894 82888204 91070158 94750061 91442440
41481 91442440 89117411 91875031 94132471 92027681 90483933 94316643 100124935 102349209
41473 102349209 102149277 105102982 112628816 119544651 120014840 114888124 112360233 118980587
41465 118980587 129690667 131835256 121833380 111590954 112733909 120574533 121872426
41458 121872426 113606918 104277718 100228991 101791442 110531604 127247323 142363285 141915532
41450 141915532 126766496 113918186 113991698 118914126 117935668 113929435 114560951 117438188
41442 117438188 116044579 113728733 118805259 128894284 132857378 128414369 126261167 133625107
41434A33625107R615931Q31010p703582p055327k248652k593579p240054p168048
41426A10062806K69193O149179K539561n327532o419793n95210J824944k204028
41418A06299120k787119N637431J2895679Q552482p56872k124253K579855J420516
41410A31716839n966667q103292k614273m60532n867678q021838M51345J0423110
41402A11557014J0535818L627430p17099j386823l422858o545238n734738q2251
41394A07831255O292480R928979R881093O896806L932875L436358K556045k464676
41386A48291215o273566O66168J3810123J4587310l208973k0251657j7133098
41379A30487522j685934M623713j028797k680983O225707J3847736J0778231L369008
$$ plain form
41434 133625107 143241038 144072048 136368466 129313139 127064487 124470908 117230854 110062806
41426 110062806 110331999 116481178 119020739 113693207 107273414 106678204 108503148 106299120
41418 106299120 103512001 109149432 122045111 130597593 129840721 127716468 130296323 131716839
41410 131716839 125750172 117646880 115032607 114572075 108704397 100682559 101133904 111557014
41402 111557014 122092832 125720262 125003163 123616340 120193482 113648244 107913506 107831255
41394 107831255 114123735 124052714 133933807 140830613 144763488 148199846 150755891 148291215
41386 148291215 142017649 142683817 156493940 171081250 167872277 147620620 130487522
41379 130487522 128801588 133425301 132396504 129715521 135941228 149788964 160567195 163936203
41371A63936203J423404M869019P464582M706493m478106j5518035j7573298n258897
41363A39571365R550642R972890j703666o616426J976448R200020L308650o837658
41355A58422265q514423m585470m325283o932213o974873o331281q041349p178891
41347A05538482m13369M176471L8622m299652M64143N890254k99992r760310m927429
41338I6407220R225778R488500p999432j9259689q825938Q080568J1355708M336723
41330A02809438J197718J981728j708979o832317l686460M605891M765932n290369
41322I7842582j2108161n789284O999520J2401777N611659m792405o579768J778973
41314I5364893P101833k853553j9894792k1924088k886915J6187009J4739973
$$ plain form
41371 163936203 165359607 170228626 177693208 182399701 177921595 162403560 144830262 139571365
41363 139571365 149122007 159094897 157391231 150774805 152751253 161951273 165259923 158422265
41355 158422265 149907842 145322372 140997089 134064876 127090003 120758722 112717373 105538482
41347 105538482 105125113 109301584 109340206 105040554 105504697 111394951 111094959 101334649 96407220
41338 96407220 105632998 115121498 107122066 87862377 79036439 87117007 98472715 102809438
41330 102809438 104007156 105988884 104279905 97447588 93761128 98367019 103132951 97842582
41322 97842582 85734421 79945137 86944657 99346434 104958093 100165688 93585920 95364893
41314 95364893 102466726 99613173 79718381 57794293 54907378 71094387 85834360
41307H5834360m87293q511914l788961K740635M969335O337593O673245J794800
41299I5561800m292045k918272L109357K410131n273652q469624m471198k835461
41291G2821036n115069k48188J2865319J7240176L413557j3282102j4480987m115127
41283F9098615K349776K030300K143971K885098m42593m385422k215726K636752
41275G4100771K647933J311021O864414J4253042J0041450m947640j4052306q382055
41267H1836630K003146M356980j288239p194975q311890l600086M351834Q192769
41259H0346169K663151n798016n710086J914965M062582l512338q860561l118401
41251F1987465N132242L984873l173553m375271J967820O305638L279751k265000
$$ plain form
41307 85834360 85347067 76835153 73046192 75786827 80756162 87093755 93767000 95561800
41299 95561800 91269755 88351483 91460840 93870971 88597319 80127695 75656497 72821036
41291 72821036 67705967 67457779 80323098 97563274 100976831 87694729 73213742 69098615
41283 69098615 71448391 73478691 75622662 78507760 78065167 73679745 71464019 74100771
41275 74100771 76748704 78059725 84924139 99177181 109218631 104270991 90218685 81836630
41267 81836630 83839776 88196756 86908517 79713542 71401652 67801566 72153400 80346169
41259 80346169 83009320 77211304 71501218 73416183 77478765 73966427 65105866 61987465
41251 61987465 67119707 71104580 67931027 63555756 65523576 71829214 75108965 72843965
41243G2843965m189422k204433N57544J607156M0703k917507m356612l272386
41235E8109008k677795n574574j0158911j1594172p496647J70034P251088J0021886
41227C8049917P487361K488588r82906j943668j834418n69396K830822N878771
41219E1405071M151826j684619n525462m127793p81089Q75898J269022J351158
41211D6934012O20308P84317M716877R000895N228710o782726j4907350j0271418
41203C5323625l1071L204399r61546k824250J161264M130158O69522n255830o530386
41194B8885885k300350J427989m78483m929817l222699O245666J1891467L837775
41186D1357433p930063m096801J3757690K0878969N132551j3138979j1493482
$$ plain form
41243 72843965 68654543 66450110 67007654 68614810 68655513 65738006 61381394 58109008
41235 58109008 55431213 49856639 39697728 28103556 20606909 20776943 28028031 38049917
41227 38049917 45537278 48025866 47042960 45099292 43264874 42695478 45526300 51405071
41219 51405071 55556897 53872278 48346816 44219023 43437934 44313832 45582854 46934012
41211 46934012 47554320 48338637 53055514 62056409 67285119 60502393 45595043 35323625
41203 35323625 35292554 38496953 37535407 34711157 35872421 40002579 40672101 35416271 28885885
41194 28885885 26585535 28013524 27535041 22605224 19382525 25628191 37519658 41357433
41186 41357433 33427370 29330569 43088259 63967228 69099779 55960800 44467318
41179D4467318J091047J894604p315231o353735N339423O504537p998184j6089724
41171B1540055m714703Q643521N622045l353494J493749J5513152J6947330L10716
41163F2002371j7028518j9290357q441950L363531O496419r0173p589092m746560
41155A4675671P501859J4646138Q314700j499645l041696r46732m421033p624111
41147B7605151j60138R895295N168137j0907939j5858548k759473R183673N643945
41139B7810103k412203q08984M152660N5040p807732n536539M848399Q269317
41131B8570061M29885p303880o281715k55091M257373N876021M845177R63748
41123C1101579l111094l877437k776036k933398j386553O328932J4582037J1988586
$$ plain form
41179 44467318 45558365 47452969 40137738 33784003 39123426 45627963 37629779 21540055
41171 21540055 16825352 25468873 31090918 27737424 29231173 44744325 61691655 62002371
41163 62002371 44973853 25683496 17241546 20605077 27101496 27011323 19422231 14675671
41155 14675671 22177530 36823668 45138368 43638723 40597027 39650295 35229262 27605151
41147 27605151 27445013 37340308 42508445 31600506 15741958 12982485 22166158 27810103
41139 27810103 25397900 24588916 28741576 28796616 20988884 15452345 20300744 28570061
41131 28570061 28999946 21696066 15414351 15159260 19416633 25292654 30137831 31101579
41123 31101579 27990485 24113048 21337012 18403614 17017061 23345993 37928030 49916616
41115D9916616o48041q438510l377609L649699m24466j1107811j3734970n333740
41107A0501168K208041j2997o574203o616326K284556J2461673J5215799R112145
41099C8579856M51304l495067j706468R61019J003719j25762o88050k219852n041673
41090B7719026m906012L46146M599250J135582o003890o888768j032597K031606
41082A7000343j090302j884284M756223R956311M352898n817485p220563Q51739
41074B0904880P248082P042418N904802N888495M61991j1637688j9553852j4771310
41066A487818l191608N067590R236285J2115430R615352j115326r464886k943817
41058B0806838J1247720J2907965j135772j0559088j376405J3345047J3326148
$$ plain form
41115 49916616 49268575 40830065 37452456 41102155 40677689 29569878 15834908 10501168
41107 10501168 12709209 12696212 6122009 -494317 1790239 14251912 29467711 38579856
41099 38579856 39031160 35536093 33829625 34790644 35794363 35668601 34980551 32760699 27719026
41090 27719026 22813014 23159160 27758410 28893992 22890102 16001334 14968737 17000343
41082 17000343 15910041 14025757 18781980 28738291 33091189 27273704 20053141 20904880
41074 20904880 28152962 35195380 41100182 46988677 47450668 35812980 16259128 1487818
41066 1487818 -1703790 3363800 12600085 24715515 34330867 33215541 23750655 20806838
41058 20806838 32054558 44962523 43826751 33267663 31891258 45236305 58562453
41051E8562453o13267j1537214j1470455o999381m076750j363027J886601L136969
41043B7525929K658821K991899K421136j981301n785954k081375N518178O445883
41035C7713216N26778j249888M052636N613600j793333p085263j120378O928868
41027D3586236M087333n265922p203789p13609K825407o41116l542731j766284
41019C1365525l77682k379184l521552j384293K33540p55353p68136K605167O996807
41010C2014839J0151131J1263812P284144l175699j2016144q694798L178697Q326448
41002D8332430K115054k904274J662254O564541K259339l818710q37513N292707
40994E8665828J564326r150112j1856911l097844N657580P620301P505865P219770
$$ plain form
41051 58562453 57949186 46411972 34941517 27942136 23865386 22502359 24388960 27525929
41043 27525929 30184750 33176649 35597785 33616484 27830530 25749155 31267333 37713216
41035 37713216 38239994 36990106 41042742 46656342 44863009 37777746 36657368 43586236
41027 43586236 47673569 42407647 35203858 34490249 37315656 36674540 33131809 31365525
41019 31365525 30987843 28608659 25087107 23702814 23936354 23181001 22412865 25018032 32014839
41010 32014839 42165970 53429782 60713926 57538227 45522083 36827285 40005982 48332430
41002 48332430 50447484 47543210 49205464 55770005 58029344 54210634 53373121 58665828
40994 58665828 60230154 51080042 39223131 36125287 41782867 49403168 56909033 64128803
40986F4128803J117564r351750j1336214M10302J1842625P309932q712692j7431446
40978C7977124q714657R499900K1191429J5792269l841557k1273274j9289136
40971C1342098P32997J7132116J2494388n317404j4776797q050280L807477R327621
40963D6692216P641758J645584o601509j1032851m551471Q323881J3231428O494449
40955F1843485K001510Q704507J3553490J244151j8063776j9770396r73198J4357131
40947F2896904R787134k891146o034030k175258l462772p733988l454751P651200
40939E4583293J1871069O639159M357888R528729R083833n749363k1506385j9009106
40931D9799117j6743J5381369J4515646L785383m604739o702097m862040k29303
$$ plain form
40986 64128803 65246367 55894617 44558403 44968705 56811330 64121262 55408570 37977124
40978 37977124 29262467 38762367 59953796 75746065 71904508 50631234 31342098
40971 31342098 32075095 49207211 61701599 56384195 41607398 33557118 37364595 46692216
40963 46692216 54333974 55979558 49378049 38345198 33793727 42117608 55349036 61843485
40955 61843485 63844995 72549502 86102992 87347143 69283367 49512971 48539773 62896904
40947 62896904 72684038 69792892 63758862 61583604 58120832 50386844 46932093 54583293
40939 54583293 66454362 73093521 77451409 86980138 96063971 90314608 68808223 49799117
40931 49799117 49782374 65163743 79679389 83464772 78860033 72157936 67295896 67066593
40923F7066593O900555J2680180J1353048K308989p107881q555566k718052P49369
40915H2677235m179188j0873154r123150m33464M471959K797330K861308P149590
40907G5348466N435430o782870j5172108n422775J3013316J8114721O352049m081630
40899H6804599r45943P521196R151093M023438j994736p298346j0689190p827084
40891G8745027P14933O337191M210712p82j198394k808649o417101m685089M872439
40882G9770287R844902O57684j0446985n236826J1167871J6146987L814721o940743
40874I8777898k985641M121513j34425q887547o393966N415246R879526J491824
40866A01284428o724424l241027O845978J1205514O209220k152001p836888r298868
$$ plain form
40923 67066593 73967148 86647328 98000376 100309365 93201484 84645918 81927866 82677235
40915 82677235 78498047 67624893 58501743 58068279 62540238 65337568 68198876 75348466
40907 75348466 80783896 74001026 58828918 53406143 66419459 84534180 90886229 86804599
40899 86804599 85858656 93379852 102530945 106554383 104559647 97261301 86572111 78745027
40891 78745027 79459960 85797151 90007863 90007081 88808687 86000038 79582937 74897848 79770287
40882 79770287 89615189 90272873 79825888 74589062 85756933 101903920 105718641 98777898
40874 98777898 95792257 99913770 99779345 90891798 84497832 89913078 99792604 101284428
40866 101284428 94560004 91318977 98164955 109370469 115579689 113427688 105590800 96291932
40858I6291932p087461k447376J609289J716786j818748m326553j764263M285042
40850H6458648Q003175N690944l39827m428730l271352J176101L743252J330476
40842I8362687k752061r94143Q861823J7661325J3557030j830413j2411517p024582
40834A13430149N994658J0185939K311279o147329o143342P659O484917J0704627
40826A36828557J0373604L396688n656428p487356p55644N041603L694004O46528
40818A46081556J702433K786506q44803l868420O4313N470409L247874l384585
40810A51255283m287063k90277j233104p171585o985860K020925Q219392M665831
40802A46193542L71400M767300J2334002J2110149L919203m096778p317792n728437
$$ plain form
40858 96291932 89204471 86757095 88366384 90083170 88264422 83937869 82173606 86458648
40850 86458648 94461823 100152767 99812940 95384210 92112858 93288959 97032211 98362687
40842 98362687 95610626 94616483 103478306 121139631 134696661 132866248 120454731 113430149
40834 113430149 119424807 129610746 131922025 125774696 119631354 119639013 126123930 136828557
40826 136828557 147202161 150598849 144942421 137455065 136699421 141741024 145435028 146081556
40818 146081556 147783989 150570495 149725692 145857272 145921585 151391994 154639868 151255283
40810 151255283 146968220 146677943 145444839 138273254 131287394 133308319 141527711 146193542
40802 146193542 146564942 151332242 163666244 175776393 179695596 175598818 168281026 162552589
40794A62552589K99059P119643P141189n72020n538143n40934O140804L760702
40786A80362889l037614k864245J910107j73354p109430l980081J1666483K2630669
40778A99405424J6711713L519906j996836j00420J1924l188690m799806m347105
40770B05216110m430118l325763J392191N989708O246448N710455Q975659J0970110
40762B36744800L904677p562732r987284l21103R497995R362493K734572j893211
40754B42480207k726323k878304l219918k438896m87523J895269M204824M646892
40746B41476228J557406j791412R20788R114442J2780821N210790o008839p568120
40738B55692104J941572J0130864P012508l329822r695095p215242O9775O487821
$$ plain form
40794 162552589 162851648 169971291 177112480 176540460 171002317 170461383 176602187 180362889
40786 180362889 177325275 174461030 176371137 176197783 169088353 165108272 176774755 199405424
40778 199405424 216117137 219637043 217640207 217539787 217551711 214363021 209563215 205216110
40770 205216110 200785992 197460229 198852420 204842128 211088576 216799031 225774690 236744800
40762 236744800 240649477 233086745 223099461 222778358 232276353 241638846 244373418 242480207
40754 242480207 239753884 236875580 233655662 231216766 230729243 232624512 236829336 241476228
40746 241476228 243033634 241242222 242163010 251277452 264058273 269269063 263260224 255692104
40738 255692104 257633676 267764540 274777048 271447226 261752131 254536889 254606664 261094485
40730B61094485R456232Q314071L746493q73623j866948l56858r96486l989345
40722B74528021l389424L369645R652175Q794526M183277K731716K695916j870296
40714C00695556p262323l621686P103013J0688069K208958n789996l470942J850289
40706C02400938J209668K44131O243166J0896206L293789q489594q225213J389969
40698C08963060L152967n327957q476403m14571O141001L977172L309755J0798767
40690C22123791J5857691R361446o97930m594793o423621j1100711j1153946j854405
40682C11517522M889739o67972o821917M0625R116168K483084j1072302q004863
40674C01480084Q814166J2422600k530912r281857N575933J7796308N576405j3129702
$$ plain form
40730 261094485 270550717 278864788 282611281 281737658 279870710 279513852 278517366 274528021
40722 274528021 271138597 274508242 284160417 292954943 297138220 299869936 302565852 300695556
40714 300695556 293433233 289811547 296914560 307602629 309811587 304021591 300550649 302400938
40706 302400938 303610606 303854737 310097903 320994109 324287898 315798304 307573091 308963060
40698 308963060 312116027 306788070 298311667 297897096 304038097 308015269 311325024 322123791
40690 322123791 337981482 347342928 346644998 342050205 335626584 324525873 313371927 311517522
40682 311517522 316407261 315739289 308917372 308957997 318074165 320557249 309484947 301480084
40674 301480084 310294250 322716850 320185938 310904081 316480014 334276322 339852727 326723025
40666C26723025r534270R556638J4871655K572741l806155L896408O872115l983489
40658C47168668j0680684j064655P318095l242273j7471190r163281J6030395
40651C28895075K7899152J7019033M408798L847250L039276p627137j3690231
40644C63791216j837534J3702828J2280052J63916j708930O053089M396955q194402
40636C88647190j1156089K842332J4522410R460404k88493P21811O601545M744701
40628D16095811j026677j6035M784605L835733l56678P40820M453498K794522
40620D31305599n93682L304354J0457187R079969K74626l544503J037155N743133
40612D57063838O473501O085953L450190l731432p438575J213891J2799980R993209
$$ plain form
40666 326723025 317188755 326745393 341617048 344189789 340383634 344280042 351152157 347168668
40658 347168668 336487984 335423329 342741424 339499151 322027961 312864680 328895075
40651 328895075 356794227 373813260 378222058 382069308 385108584 377481447 363791216
40644 363791216 361953682 375656510 387936562 388100478 386391548 392444637 396841592 388647190
40636 388647190 377491101 380333433 394855843 404316247 404027754 404749565 411351110 416095811
40628 416095811 415069134 415053099 419837704 423673437 423316759 424057579 428511077 431305599
40620 431305599 430711917 434016271 444473458 453553427 453828053 450283550 451320705 457063838
40612 457063838 463537339 469623292 473073482 469342050 461903475 463117366 475917346 485910555
40604D85910555l342494o010681N606302J1415869K517601l850672M229059J1991891
40596E08467430M759935n945879l608415M113315P22082q323276n327498P463056
40588E02320750J0517450j098948j1237815q797504r17312K491985J052876k405527
40580D91925955o780981q485379l984245J819123O28062n474061o647783j536549
40572D61464142J440975p75305k728935l456957q271378j4673587j1631573J136811
40564D22504193P371514l349383j9044293k1560275j0634610q45919o25551n263064
40556C68552612p720743o530399l377569l24562j22670m219872r900556j2691886
40548C23664355j1270874p450411k747342J829111L918965J767908j977195k317313
$$ plain form
40604 485910555 482568061 476557380 482163682 493579551 496097152 492246480 496475539 508467430
40596 508467430 513227365 507281486 503673071 507786386 508508468 500185192 494857694 502320750
40588 502320750 512838200 511739252 500501437 491703933 490786621 493278606 494331482 491925955
40580 491925955 485144974 476659595 472675350 474494473 475122535 469648474 463000691 461464142
40572 461464142 462905117 462129812 459400877 455943920 447672542 432998955 421367382 422504193
40564 422504193 429875707 426526324 407482031 385921756 375287146 374441227 373815676 368552612
40556 368552612 360831869 354301470 350923901 350599339 350476669 346256797 336356241 323664355
40548 323664355 312393481 304943070 302195728 304024839 307943804 309711712 307734517 305417204
40540C05417204Q69012J040308o339239j5377077j5237108m903076L617532J059782
40532B70147338o090919o265901j571709l471299j1155972j0274916K318279R340940
40524B42975841r68230j4586421j2539917k48227K594444o198792j0358172l044213
40516A97626313M971795N911293M417595L226681k172289r538237q141368K290530
40508A98592313P536652J514680l595807Q03554M525545k366624j0735367p938116
40500A88336830L44664P77685m762026m681089P05257R44417m819277o856642
40492A69989819k366419J292173P47399O454n50646m870154r825395o737151L187715
40483A50873795P955768L063626j818349M29422L042806j753698q871628q919674
$$ plain form
40540 305417204 306286216 307326524 300987285 285610208 270373100 265470024 269087556 270147338
40532 270147338 264056419 257790518 256218809 252747510 241591538 231316622 233634901 242975841
40524 242975841 242007611 227421190 214881273 214633046 217227490 211028698 200670526 197626313
40516 197626313 202598108 208509401 212926996 216153677 213981388 204443151 196301783 198592313
40508 198592313 206128965 207643645 204047838 204851392 209376937 207010313 196274946 188336830
40500 188336830 188681494 189459179 184697153 180016064 180721321 181665738 176846461 169989819
40492 169989819 167623400 168915573 169662972 169669426 169118780 164248626 154423231 147686080 150873795
40483 150873795 158829563 161893189 160074840 160504262 163547068 161793370 152921742 144002068
40475A44002068l319348n80890j818355l04288N739248R416671O165061J144730
40467A60444897J432680N293450M623629l078922j0247148q322060J979012J1702761
40459A63828299J2559116K868095j1700349j9918704j2444493N888194J5644294
40452A56724452M529774j3414026j3639355M163931J4120178K078482j3223673
40445A41339763r366538N867282Q706050l474149j1424970n979797J456078J230084
40437A28353803j973000l033928m869776p072267k677066O368166O469688n503550
40429A16062070j2640899k745293J0886437Q703877n493358j1723375m361068
40422I8688391K984357J600195j174355K002972O549371O165365K928800J04095
$$ plain form
40475 144002068 140682720 140101830 138283475 137979187 143718435 153135106 159300167 160444897
40467 160444897 161877577 167171027 171794656 168715734 158468586 150146526 152125538 163828299
40459 163828299 176387415 179255510 167555161 147636457 135191964 141080158 156724452
40452 156724452 161254226 147840200 134200845 138364776 152484954 154563436 141339763
40445 141339763 131973225 137840507 146546557 143072408 131647438 125667641 127123719 128353803
40437 128353803 126380803 123346875 118477099 111404832 108727766 115095932 121565620 116062070
40429 116062070 103421171 100675878 111562315 120266192 114772834 103049459 98688391
40422 98688391 101672748 103272943 102098588 104101560 110650931 116816296 119745096 119849191
40414A19849191m848854j1712455j1162396J839556J4669590J0670250n882521
40407A13422361j2993131j726355J0740715O691305o408535r198198o74883K687144
40399A02540423m293133p200099K542277J1776834O229384o419922q411789J631847
40391I8395822R156337O242410l97310k551932N82784O335986J0855955Q054591
40383A36674643l597142j4060600j1894748n68620O134118L771131N4277j181387
40375A15331672m292878q399046n004121N988697J1949623N966237k751233m023868
40367A14765083n00603J344384K361077L973520J286147o872356j0806764l803425
40359A01747063N496741N927560J136408J896270P855878J0201726P647802O111442
$$ plain form
40414 119849191 115000337 103287882 92125486 93965042 108634632 119304882 113422361
40407 113422361 100429230 98702875 109443590 116134895 109726360 100528162 99853279 102540423
40399 102540423 98247290 91047191 93589468 105366302 111595686 105175764 96763975 98395822
40391 98395822 107552159 113794569 113397259 110845327 111428111 117764097 128620052 136674643
40383 136674643 133077501 119016901 107122153 106553533 112687651 116458782 116513059 115331672
40375 115331672 111038794 102639748 97635627 103624324 115573947 121540184 118788951 114765083
40367 114765083 114264480 115608864 117969941 121943461 123229608 116357252 105550488 101747063
40359 101747063 107243804 113171364 114307772 116204042 124059920 134261646 141909448 148020890
40351A48020890N276445p87305r866869j1305055j968857P613256O939704j498579
40343A42423630o513895j454785R147281J4446066Q716776j726097n653014r18887
40335A58467075M203455M389165L518198M560089L271014k066893m605563n25355
40327A71211185L013648O68334n14796N303981Q865855K79113j0927703p611009
40319A70288608P869336J6186310R139241j719618n057800k527264O33622L502477
40311A98314912M662364J458093l101300k953356M82128P40649j208892J209235
40303A99603833O450137O205513P11500j218100J665838J476305k556199j626024
40295B10712803N673236R156309M224221j186392j306095O3521J017366N304110
$$ plain form
40351 148020890 153297335 152510030 142643161 131338106 129369249 136982505 143922209 142423630
40343 142423630 135909735 134454950 143602231 158048297 166765073 165038976 159385962 158467075
40335 158467075 162670530 167059695 170577893 175137982 178408996 176342103 171736540 171211185
40327 171211185 174224833 174893167 174378371 179682352 188548207 188827320 177899617 170288608
40319 170288608 178157944 194344254 203483495 201763877 196706077 194178813 194812435 198314912
40311 198314912 202977276 204435369 201334069 198380713 198862841 199603490 198394598 199603833
40303 199603833 206053970 212259483 212970983 211752883 213418721 214895026 212338827 210712803
40295 210712803 216386039 225542348 229766569 228580177 227274082 227337603 228354969 233659079
40287B33659079J0013825N624451n933302r833372j512749N910758M413402K275018
40279B44617110L823720o77668j2288440j2842777N024183J8246306O617192j1944680
40271B40574946o731302J7436729K7142503J0288191j0155519j3130164l965422
40264B61459962L338616O004851O321255K656699m273955p748706m384093J191705
40256B64566334M215506M508798K554678q26489j353650L714715R219531R292983
40248B95892406P226059Q482320R372333M683563L13723L771731Q499082M789382
40240C43030599p2303O682291J6831125J1169430n578693p988926Q254972J7098065
40232C89426560M036085j1198159q422931K828996N804852N770146J3929517K1266066
$$ plain form
40287 233659079 243672904 249297355 243364053 233530681 232017932 237928690 242342092 244617110
40279 244617110 248440830 247763162 235474722 222631945 227656128 245902434 252519626 240574946
40271 240574946 233843644 251280373 278422876 288711067 278555548 265425384 261459962
40264 261459962 264798578 270803429 277124684 279781383 275507428 267758722 263374629 264566334
40256 264566334 268781840 273290638 275845316 275018827 273665177 277379892 286599423 295892406
40248 295892406 303118465 311600785 320973118 325656681 325970404 329742135 338241217 343030599
40240 343030599 342958296 349640587 366471712 377641142 372062449 364073523 372328495 389426560
40232 389426560 393462645 382264486 373841555 376670551 382475403 388245549 402175066 423441132
40224D23441132J3821915N7710k477550K919970Q74084o004026k716716P425116
40216D37341635N693424q351452j3051108N96217J4795982J3847190N646723L321967
40208D59840578L797019j585724q743039p629853J108115Q310815R250795N125671
40200D69474377k582111j0710402j2728418o676777m05506j490691o155493n536408
40192D23188571Q70165N631274M564391L78938l148765m513706l524006k282343
40184D21164519n022989j1719977j4825672r001196j239429k555184j0678145
40177C66121927j1587635p95844P578413p683j6256038k2125559j2501298j498553
40169C08927730j415137p352352q064744l245101p91487j791725L35005N735023
$$ plain form
40224 423441132 437263047 437320757 434843207 437763177 438637261 432633235 429916519 437341635
40216 437341635 443035059 434683607 421632499 422228716 437024698 450871888 456518611 459840578
40208 459840578 463637597 462051873 453308834 445678981 446787096 455097911 464348706 469474377
40200 469474377 466892266 456181864 443453446 436776669 436371163 434880472 428724979 423188571
40192 423188571 424058736 429690010 434254401 434633339 431484574 426970868 423446862 421164519
40184 421164519 416141530 404421553 389595881 380594685 379355256 376800072 366121927
40177 366121927 354534292 353738448 361316861 361309178 345053140 322927581 310426283 308927730
40169 308927730 307512593 300160241 292095497 288850396 288058909 286267184 286602189 292337212
40161B92337212M578262p583019j9932137j9705770r487318k004097j196229N62235
40153B37569139O222637O872702l571808j5305257j3586902P09979J0767502N007570
40145B34685562q473599j2546756k505622Q145991M192480j1989519k1515737
40138A89992800j0979913R875050J7990856M751023j3030621j4342659j45752
40131A84110784J0144149N428725m886225p443832k705422N01696k76594j460883
40123A83412398l246054p983394j0922174m319485Q111859J2134865K247531r769500
40115A69666046j0962258l259740L022299L823434J585689k469060p276074q074374
40107A46055962k653403K467224O85029m091380m579272k882020m998745p169717
$$ plain form
40161 292337212 296915474 289332455 269400318 249694548 240207230 238203133 237006904 237569139
40153 237569139 243791776 250664478 247092670 231787413 218200511 218910490 229677992 234685562
40145 234685562 226211963 213665207 211159585 219305576 223498056 211508537 189992800
40138 189992800 179012887 188887937 206878793 211629816 198599195 184256536 184110784
40131 184110784 194254933 199683658 194797433 187353601 184648179 185149875 184873281 183412398
40123 183412398 180166344 172182950 161260776 156941291 165053150 177188015 179435546 169666046
40115 169666046 158703788 155444048 158466347 162289781 163875470 161406410 154130336 146055962
40107 146055962 143402559 145869783 146554812 142463432 137884160 135002140 130003395 122833678
40099A22833678j370074Q123993Q731342k26952o816648o866479q226809j1991531
40091A04190520q237495L189670O860183l152180j0758986l737010N299086N90893
40083I4244681r633526p873708L129387P621319M179807K657817J150310q728640
40075H6747447j8121812j0115580P690534Q797775r525652j8714556l980891J2106172
40067E4883437P449484m515250l74958J3310413J2872942k416594j1053191m549069
40059F5607214L573468L406870O45614K41832k255404p742557q125050k93586
40051E5058401P191313P249174L181410o71907o315042j3857374j5660230o749917
40043B9425828N561089J0069516N527423K2031l04241L351009O327504N496694
$$ plain form
40099 122833678 121463604 129587597 138318939 138091987 131275339 124408860 116182051 104190520
40091 104190520 95953025 99142695 106002878 102850698 92091712 88354702 93653788 94244681
40083 94244681 84611155 76737447 79866834 87488153 91667960 94325777 95476087 86747447
40075 86747447 68625635 58510055 66200589 74998364 65472712 46758156 42777265 54883437
40067 54883437 62332921 57817671 57442713 70753126 83626068 81209474 70156283 65607214
40059 65607214 69180682 72587552 73233166 73474998 71219594 63477037 55351987 55058401
40051 55058401 62249714 69498888 72680298 72008391 65693349 51835975 36175745 29425828
40043 29425828 34986917 45056433 50583856 50605887 50301646 53652655 59980159 65476853
40035F5476853J028360m399525q061204q731545n318585L157891J2963240J4629172
40027G0744657L146967j2356711j6749619p112082M338031O464588Q22300m852931
40019D4445200o854418n423980j235606L242509L881651O65658r66671J884368
40011C9638711M833356L220756p63713k354541j625551j983303m195093o009636
40003C0760986n462620j703480M663607R820081R079098L430797n27428K80663
39995E0341704J394492j119610m480777n059402m269887l797865j506177K144273
39987C3646751R37517o202898q844533Q1101R951237O398929n143206o059765
39979B4765133O171014J3135118M244590o793992l984023O303539O429989n155149
$$ plain form
40035 65476853 66505213 62105688 54044484 45312939 39994354 43152245 56115485 70744657
40027 70744657 73891624 61534913 44785294 37673212 42011243 48475831 49298131 44445200
40019 44445200 37590782 32166802 30931196 34173705 38055356 38721014 37754343 39638711
40011 39638711 44472067 47692823 46929110 44574569 42949018 40965715 36770622 30760986
40003 30760986 25298366 23594886 28258493 38078574 47157672 50588469 50061041 50341704
39995 50341704 51736196 50616586 46135809 41076407 36806520 33008655 31502478 33646751
39987 33646751 34584268 28381370 19536837 19617938 29569175 35968104 30824898 24765133
39979 24765133 30936147 44071265 48315855 41521863 37537840 43841379 50271368 45116219
39971D5116219j2731911p005783L307489N542515q89320o548772m488709L106256
39963B5407984Q495447O496302l56962m772762l128814Q34037J676980j167978
39955C3484234m334608m936439j707432M657207R221699N205425o503084j4200877
39947B0886125q366126M750381J0165263L817721l328064k143815K578367J792341
39939C0152193k884710j789209P425273J4579467R376039n074229j4899990j1191581
39931B5693253M5297N733916J645674l859573k581374K615640L770971J90259
39923C3254063k034918r26209j089271m409392n810152j508671M464493O257265
39915B8197208M313891L005884L363421K830000N57356j095250m2400K732238
$$ plain form
39971 45116219 32384308 25378525 28686014 34228529 33339209 26790437 22301728 25407984
39963 25407984 33903431 40399733 40042771 35270009 32141195 32975232 34652212 33484234
39955 33484234 29149626 24213187 22505755 27162962 36384661 41590086 35087002 20886125
39947 20886125 12519999 17270380 27435643 31253364 27925300 25781485 28359852 30152193
39939 30152193 27267483 25478274 32903547 47483014 56859053 51784824 36884834 25693253
39931 25693253 25738550 31472466 33118140 29258567 26677193 29292833 33063804 33254063
39923 33254063 31219145 30292936 29203665 24794273 18984121 17475450 21939943 28197208
39915 28197208 32511099 35516983 38880404 41710404 42267760 41172510 41130110 43862348
39907D3862348L633442l16130o851978q288812o00002Q043140N287432p314801
39899C7454639j3603791n126551N751673M040225n281921o026856L045987O814210
39891B7067615j296344q848730m175841O371643R306482K883793m072003o143580
39883B1093035n218882l726073j508758J763679N778836R673244J0498682N315548
39875D3669311k688672n519014j186540L147359L018077L548668P854848P725038
39867E9569075l141995j3899158r109775O658700J2491034L95707j3951367j3955499
39859B5056722k356416P665385J0052178O283569k162591j1918707j5037453q055433
39851I527254P52215K064564o03722K825399J1765435J4626064N852019o237077
$$ plain form
39907 43862348 47495790 47179660 40327682 32038870 31438868 39482008 44769440 37454639
39899 37454639 23850848 18724297 24475970 28516195 23234274 17207418 20253405 27067615
39891 27067615 25771271 16922541 12746700 19118343 28424825 31308618 27236615 21093035
39883 21093035 15874153 12148080 10639322 12403001 18181837 27855081 38353763 43669311
39875 43669311 40980639 35461625 34275085 37422444 40440521 43989189 51844037 59569075
39867 59569075 56427080 42527922 33418147 40076847 52567881 52963588 39012221 25056722
39859 25056722 22700306 30365691 40417869 46701438 44538847 32620140 17582687 9527254
39851 9527254 10279469 12344033 11740311 14565710 26331145 40957209 46809228 40572151
39843D0572151j1010686p448699j445182K626249L751092K174684l00179n30504
39835B8388926J905875K658026j998375q548872q528722J436021J3883200J6941307
39827D6137386O635543q485261j5642721r920039K350135J0640885R237363Q80488
39819D1833779o134511n443551O47026L405814j050845n867316l273107L302601
39811B7419890M392435n02157k917591m71230m08875n140545o447295m55167L376461
39802A8845926k330859q894594n053162M088717N805956J238633K042491Q708211
39794B4451319R453590J366362m221283j349000J278165k800157n704436O71598
39786B3146158R698338R927370K094628m309323n990581p328431j0006272j0004923
$$ plain form
39843 40572151 29561465 22112766 20667584 23293833 27044925 29219609 28919430 28388926
39835 28388926 30294801 32952827 30954452 22405580 13876858 15312879 29196079 46137386
39827 46137386 52772929 44287668 28644947 18724908 21075043 31715928 40953291 41833779
39819 41833779 35699268 30255717 30902743 34308557 33257712 27390396 24117289 27419890
39811 27419890 31812325 31310168 28392577 27921347 27512472 22371927 15924632 15469465 18845926
39802 18845926 16515067 7620473 2567311 6656028 12461984 13700617 15743108 24451319
39794 24451319 33904909 35271271 31049988 29700988 30979153 28178996 22474560 23146158
39786 23146158 32844496 42771866 44866494 40557171 34566590 27238159 17231887 7226964
39778G226964m272858N175923J2919662J3060659L857924p776906j1203564m789563
39770A4198241J862628J956567N09783L902469Q275444O541292P25170k087435
39762C5884159j645712k834594n390763m906657j921170p56123q22892J932519
39754A9538767O145876O609437L804586K693863K727543j057973o965458p337933
39746B6158708j738934J432429p80245j135589L762999N830113q13391q016105
39738B4699985m914635N457654J0745610O546958j81361k986981k640307k133921
39730C4593002j979700j572843o16309J190442K604554L56401n804633r729714
39722A9041200o102561M66833N66900n632814p036640K310000J3051282J2387975
$$ plain form
39778 7226964 2954106 8130029 21049691 34110350 37968274 30191368 18987804 14198241
39770 14198241 16060869 18017436 18527219 22429688 30705132 37246424 37971594 35884159
39762 35884159 34238447 31403853 26013090 21106433 19185263 18429140 17606248 19538767
39754 19538767 25684643 32294080 36098666 38792529 41520072 40462099 33496641 26158708
39746 26158708 24419774 25852203 25071958 23936369 27699368 33529481 32716090 24699985
39738 24699985 19785350 25243004 35988614 42535572 42354211 39367230 36726923 34593002
39730 34593002 32613302 31040459 30424150 31614592 34219146 34575547 28770914 19041200
39722 19041200 12938639 13405472 13972372 8339558 1302918 3612918 16664200 29052175
39714B9052175J275022p908907q810603p279466q363107o350901M895489J7385647
39706A3895349J5968021L57413j0855576m018141J0527076J2853079J366701o497001
39698C3596921q58255P316687M777171m185998o474021r23628J941608k175644
39690C3014841n855320l327430J082480J359982j344655k615882j435201J216259
39682B2095074N043918P617718M340525l791587p712242j842303O463869O484283
39674C8699255o29911n111255m530662n513602r189252p098966L678821J1985469
39666B2289897P149849n395808j1905371q351474j419280M410387J0002999J3087903
39658B9869102P874203m224225j2267368q567778J961704Q892857Q039325K855699
$$ plain form
39714 29052175 30327197 22418290 13607687 6328221 -2034886 -8385787 -3490298 13895349
39706 13895349 29863370 30220783 19365207 15347066 25874142 38727221 40093922 33596921
39698 33596921 32738666 40055353 44832524 40646526 34172505 33248877 35190485 33014841
39690 33014841 27159521 23832091 24914571 26274553 24929898 22314016 20878815 22095074
39682 22095074 27138992 34756710 39097235 35305648 27593406 25751103 32214972 38699255
39674 38699255 38069344 32958089 28427427 22913825 13724573 6625607 10304428 22289897
39666 22289897 29439746 24043938 12138567 3787093 2367813 6778200 16781199 29869102
39658 29869102 37743305 33519080 21251712 12683934 14645638 23538495 31577820 34433519
39650C4433519j722558l141375j584890N78991J116077P09073J523814L173781
39642C5086432L185342J176726j131985l506874o317380o883424k388418L952996
39634B3173415O100550M370934L958323M394021j5972p813403r520258l044353
39626B1603257J505860j429397k971246M343028J1798844P723627l170934p607725
39618C1795314m750919m252034o877559l378767O968569J2150540N615791l875031
39610C3395904n749356r98636K999298K631218j662834p745847j0153226l455964
39602I260557Q250378J2504618M507784m764139l104532N798840P988283o66839
39594C9774950q647086m646233O961668J1300691K013169j0216619j1256796k025444
$$ plain form
39650 34433519 32710961 29569586 27984696 28563687 29679764 30388837 31912651 35086432
39642 35086432 38271774 39448500 38316515 34809641 28492261 21608837 19220419 23173415
39634 23173415 29273965 33644899 37603222 41997243 41981271 34167868 24647610 21603257
39626 21603257 23109117 21679720 18708474 23051502 34850346 42573973 39403039 31795314
39618 31795314 27044395 22792361 15914802 12536035 19504604 31655144 37270935 33395904
39610 33395904 27646548 26647912 29647210 32278428 30615594 22869747 12716521 9260557
39602 9260557 17510935 30015553 34523337 29759198 26654666 32453506 40441789 39774950
39594 39774950 31127864 26481631 33443299 44743990 46757159 36540540 25283744 23258300
39586B3258300L613920p43738n299848m04775P896404Q057141J508092j462675
39578C6422821O1095k098963p700268o258478M138396J0640848M683079n027064
39570C4861466o765704k621144j139371j390082L727690J2438635J4100643M455405
39562E7667538p885986j2279980p653108r98209J745915K85518k802516n750230
39554B2328942o915535l299094N227272J0648713L483282j1802257j6736966k100749
39546H33608J6303510J6547140k8744j2158162q769770k8779K734228J933862
39538A7366893L421177N359154M840267M542079N552201L057660m294529r653768
39530C0191134q399233m497885j585328K381744O788103O052276J241229J443761
$$ plain form
39586 23258300 26872220 26128482 20828634 20423859 28320263 36377404 37885496 36422821
39578 36422821 36483916 34384953 26684685 20426207 24564603 35205451 39888530 34861466
39570 34861466 28095762 25474618 24335247 22945165 26672855 39111490 53212133 57667538
39562 57667538 49781552 37501572 29848464 28850255 30596170 30881688 28079172 22328942
39554 22328942 15413407 12114313 17341585 27990298 31473580 19671323 2934357 833608
39546 833608 17137118 33684258 33655514 21497352 12727582 12698803 15433031 17366893
39538 17366893 20788070 26147224 30987491 35529570 41081771 44139431 39844902 30191134
39530 30191134 21791901 17294016 15708688 18090432 24878535 30930811 32172040 33615801
39522C3615801O895201M899263q366716j7038629q945708M434710O493693R90942
39514B2978557J387983N896627L570923k738186j490627M040548q5357j1888739
39506B1671729j3460064j91676J1053695Q641894J834764J785824M131387R74479
39498C6442032l974548l914078j648751k296238k135618L796434R920165P575122
39490D3764520m34036m062257k017923k358723p492487r361681k510955O585744
39482B2112202Q394309K978773j996623k610455j692321j688830j309846m08541
39474B3778668j493878l396358m12820P014231Q197071k565080j3266060r118423
39466H737351L994144O495062n034291j2421016m177507Q356159J1096928P097461
$$ plain form
39522 33615801 40511002 45410265 37043549 20004920 11059212 15493922 21987615 22978557
39514 22978557 24366540 30263167 33834090 31095904 29605277 33645825 33560468 21671729
39506 21671729 8211665 8019989 19073684 27715578 29550342 31336166 35467553 36442032
39498 36442032 32467484 28553406 26904655 24608417 22472799 26269233 36189398 43764520
39490 43764520 43330484 39268227 37250304 34891581 27399094 18037413 15526458 22112202
39482 22112202 30506511 33485284 31488661 28878206 27185885 25497055 24187209 23778668
39474 23778668 22284790 18888432 18475612 25489843 33686914 31121834 17855774 8737351
39466 8737351 12731495 19226557 14192266 1771250 -2406257 5949902 17046830 24144291
39458B4144291N262384L811568j385350m189582J154765O647321K812527m430879
39450C3827045m368311l69299j622168l848606L058390J3532858J2040733k062719
39442E0187923j3746036j5225195j2132779p666796J157396J0393399J0066585
39435B3034497J210401l494098J095708O836456P256877M131487j385327r102773
39427B9583228j1325907q87977J1780295Q079684j0066084k0059701j0823603
39420c720065M254557J1222263J2006529J0331643K253911r480329j1307205p08815
39412A4852489N640910k357668j1553986p637274K730376O265329M321485M699260
39404A6960921N936757M694644N700886R776617N881810r227974j8157147p939024
$$ plain form
39458 24144291 29406675 33218243 31832893 27643311 28798076 35445397 38257924 33827045
39450 33827045 29458734 29089435 27467267 23618661 26677051 40209909 52250642 50187923
39442 50187923 36441887 21216692 9083913 1417117 2574513 12967912 23034497
39435 23034497 24244898 20750800 21846508 28682964 35939841 40071328 38686001 29583228
39427 29583228 18257321 17369344 29149639 37229323 27163239 7103538 -3720065
39420 -3720065 534492 11756755 23763284 34094927 36348838 26868509 15561304 14852489
39412 14852489 20493399 18135731 6581745 -1055529 1674847 7940176 12261661 16960921
39404 16960921 22897678 27592322 33293208 43069825 48951635 39723661 21566514 13627490
39396A3627490O330773M191810o604704l997906J0169831J3573598J604307n900945
39388C2994254R70893O694569k386962j5739333j5350840j100951J1691523J1970157
39380B9743310K119086p589246r015702l609652k79890k836501l849693K644908
39372G326620Q897642M939688l230632j565945Q642845J1730152K701188n405330
39364C4036228l190805J941991J187052j412223L48527J721335l735361j0115516
39356B0781228p018719K900357O302201j642723j0776897j0736756m006296K45278
39348c952327j69609M22186M333043N876819J250375k856261K069907J1574937
39340A8549070J1870891M5655r408407m168152Q270399J1329671J860876q427625
$$ plain form
39396 13627490 19958263 24150073 17545369 13547463 23717294 37290892 38895199 32994254
39388 32994254 33965147 40659716 38272754 22533421 7182581 6081630 17773153 29743310
39380 29743310 31862396 24273150 15257448 11647796 11367906 8531405 4681712 7326620
39372 7326620 16224262 21163950 17933318 16367373 25010218 36740370 39441558 34036228
39364 34036228 30845423 32787414 33974466 32562243 32910770 34632105 30896744 20781228
39356 20781228 13762509 16662866 22965067 21322344 10545447 -191309 -4197605 -3952327
39348 -3952327 -4121936 -3699750 633293 6510112 7760487 4904226 6974133 18549070
39340 18549070 30419961 30465616 21057209 16889057 25159456 36489127 38350003 29922378
39332B9922378j0859586q051188m542070m2334M850375N011008j651044q416338
39324F221201p278567L47176N394243K924029k197492k734341J167977L319773
39316G163999J277481o08097N28704Q55521k621359n257887k576599N75036j791284
39307b454485m272371J802193J0955539R582739j185021n808883K59074M193491
39299A3072276N1180p71037P219154J0319890k51826r772909l558549P259200
39291B3567379M525134n917936n698229L504999M349066m719403q123204j959845
39283I527961M44250o041785r843818m179697K644419L828116L534155M622299
39275D535900L182493J32884K496045Q401820O630387l797914r446524l672493
$$ plain form
39332 29922378 19062792 11011604 6469534 6427200 11277575 16288583 14637539 6221201
39324 6221201 -1057366 -710190 4684053 7608082 5410590 2676249 3844226 7163999
39316 7163999 8441480 7833383 8362087 9217608 6596249 1338362 -1238237 -663201 -2454485
39307 -2454485 -6726856 -4924663 6030876 15613615 14428594 8619711 8878785 13072276
39299 13072276 13123456 12352419 19571573 29891463 29639637 19866728 16308179 23567379
39291 23567379 28092513 22174577 16476348 19981347 24330413 19611010 11487806 9527961
39283 9527961 9972211 3930426 -5913392 -10093089 -7448670 -3620554 -86399 4535900
39275 4535900 7718393 7851277 10347322 18749142 25379529 21581615 12135091 8462598
39267H462598L631570L943383K134685L084248J638871m950426q486012l450228
39259F008689L054469L919929K555539K414300q98122p509440o924442M434743
39251G055665J1992768L009709j2827518j7205081q674730L80146M592025P655258
39243d021758Q899328L936615l542518m978137q76939J236469J282026N372450
39235G307536J0444416N285074r586992j7213211o768282R971659J4200006M854295
39227A8494501k870870l78178M342276J281405o649875r340468m337096J992345
39219B534040N626681Q271201R387278M793942l429210n770559j24198K499039
39211B3788214l872878p121307M078081J7536112J2524576p233658j6963376p485031
$$ plain form
39267 8462598 12094168 16037551 18172236 21256484 22895355 17944929 9458917 6008689
39259 6008689 9063158 12983087 15538626 17952926 17054804 9545364 2620922 7055665
39251 7055665 19048433 22058142 9230624 -7974457 -16649187 -16269041 -11677016 -4021758
39243 -4021758 4877570 8814185 5271667 293530 -583409 653060 1935086 7307536
39235 7307536 17751952 23037026 13450034 -3763177 -10531459 -559800 13640206 18494501
39227 18494501 15623631 15245453 19587729 20869134 14219259 4878791 541695 2534040
39219 2534040 8160721 16431922 25819200 30613142 27183932 21413373 21289175 23788214
39211 23788214 19915336 12794029 16872110 34408222 46932798 39699140 22735764 15250733
39203A5250733L751201K974417j152593J103549J975734n699967r877135J725592
39195A0051531J6912240J4469734l291209j4253006r031430K09940L107510L883831
39187B2059141O862730O145520k301059j0266425q068884J410185P073095L855307
39179B6769610l066900n902635k168431L707172M753201j323869q764856r467349
39171D535943k292057N389729N861536o58507o161768k966635P463503J4260234
39163B5431978Q498051m999796j1483820l741670Q768376J1662450K765187p046425
39155B9854331q039860j933809K294633k3791l902215j845823M653661N507095
39147B6564222l129444j0475610n402667N546023O163056m743256j0744313k787646
$$ plain form
39203 15250733 19001934 21976351 20823758 21927307 23903041 18203074 8325939 10051531
39195 10051531 26963771 41433505 38142296 23889290 14857860 15067800 18175310 22059141
39187 22059141 28921871 35067391 32766332 22499907 14431023 15841208 22914303 26769610
39179 26769610 23702710 17800075 15631644 19338816 24092017 22768148 14003292 4535943
39171 4535943 2243886 7633615 13495151 12836644 6674876 3708241 11171744 25431978
39163 25431978 33930029 28930233 17446413 13704743 22473119 34135569 36900756 29854331
39155 29854331 21814471 19880662 22175295 22151504 18249289 16403466 21057127 26564222
39147 26564222 23434778 12959168 7556501 13102524 19265580 14522324 3778011 990365
39139I90365P565641P061344J57466r76606L839281N319928J002910k789355k393626
39130A9777348l71105R26088J690562J754850R72192N21752j53156l732472q462461
39121A2923598p168667J880306R583565P892017P36263l623246m136417l243820
39113A4843599N83931P058171Q236096l14277q856069o227630K180684K554955
39105B0059460n377202q900796k685962N763999J0380917J2104508R795368M0015
39097D1180307j1593137j2826661k279405P079287O055643m16219m688386o234906
39089A6276523n423375K10160P042868M736651p166765j3267083l388308J0126189
39081I146860R041613l905161r551694p62657Q944889P150346p36354k811756
$$ plain form
39139 990365 8556006 15617350 15774816 14798210 18637491 23957419 24960329 22170974 19777348
39130 19777348 19406243 20332331 22022893 23777743 24749935 25271687 25118531 21386059 12923598
39121 12923598 5754931 7635237 17218802 25110819 25847082 22223836 18087419 14843599
39113 14843599 15427530 22485701 30721797 30407520 21551451 15323821 17504505 20059460
39105 20059460 14682258 5781462 3095500 8859499 19240416 31344924 41140292 41180307
39097 41180307 29587170 16760509 14481104 21560391 27616034 27199815 22511429 16276523
39089 16276523 10853148 11063308 18106176 22842827 15676062 2408979 -979329 9146860
39081 9146860 18188473 14283312 4731618 3968961 12913850 20064196 19327842 16516086
39073A6516086J345962L266789O32009n67631J892245J933745l790935p991396
39065A3236874k799673O693413P924674q59375p366248l165580M146784K957696
39057B0768565n128724q672369l108398N075326R585894J0970355J1086781Q647035
39049D9224465L152184k085097l917634l061857j970294j795785k519376l332559
39041C3694047k282221J517193M832270K779763m527906j0670512r807891k924488
39033A2610255M114571P126295O553907M500428J020923m649087r642260q099456
39025A3535576P91848Q588233O700137j992231o944304m436183n36891O04544
39017A6310729K055052N161359N091630J89053l115354p44749J906311j61536
$$ plain form
39073 16516086 17862048 21128837 21760846 21193215 23085460 25019205 21228270 13236874
39065 13236874 10437201 17130614 25055288 24195913 16829665 13664085 17810869 20768565
39057 20768565 15639841 6967472 3859074 8934400 18520294 29490649 40577430 49224465
39049 49224465 52376649 50291552 46373918 43312061 41341767 39545982 37026606 33694047
39041 33694047 31411826 32929019 37761289 40541052 36013146 25342634 15534743 12610255
39033 12610255 16724826 23851121 30405028 34905456 35926379 31277292 21635032 13535576
39025 13535576 14327424 22915657 29615794 27623563 20679259 16243076 15706185 16310729
39017 16310729 18365781 23527140 28618770 28807823 25692469 24947720 26854031 26692495
39009B6692495k824508j457745o0863l044802n666532k446188K014760J227662
39001A4434279q43793K780103Q221765O770935M709l781819m004228n523452n952266
38992A2106233L47462Q212707O771570k198404n722397K82126O538602O763201
38984C3101100M469648K290460j492592m214564o50301M806483K284658n540103
38976C5054789n340670M221967Q775200J783790n663666n191070l577678o158112
38968B3904550n421185K421086O137961j384692p718533m65678J0875927J0369441
38960C8718877K052803J200869O974959N084776n584701j0178759k916081M251133
38952C9603876K584840o13064K451630N570732k48422j0407738j2517319m015264
$$ plain form
39009 26692495 23867987 22410242 22349379 19304577 13638045 11191857 13206617 14434279
39001 14434279 13590486 16370589 24592354 31363289 31367998 27586179 23581951 18058499 12106233
38992 12106233 12453695 20666402 27437972 25239568 19517171 19799297 26337899 33101100
38984 33101100 37570748 39861208 38368616 34154052 33503751 38310234 40594892 35054789
38976 35054789 29714119 33936086 42711286 44495076 38831410 33640340 30062662 23904550
38968 23904550 18483365 20904451 27042412 25657720 17939187 17473509 28349436 38718877
38960 38718877 40771680 41972549 48947508 54032284 48447583 38268824 35352743 39603876
38952 39603876 42188716 41575652 44027282 49598014 49349592 38941854 26424535 22409271
38944B2409271N479121P903923M974754J983175M6674k036137k548423J020838
38936C9233196N763506N286911o73613m552963k193086O87583j038113j959536
38928D0553885M037545J0007982N116444n626319o506505L488858P441329k616969
38920E5896250j2453401q081163L576114Q170622N420656L522674K333285k823655
38912E5561382p833885n414436R11922K891224L253797R877114J6974634R662112
38904H5883864j0693542k2372464j1469260Q459078J4179154K037608j0595246
38897E5429192r450519P97938O362917L052865r97228Q9389O16769n947800j2838584
38888C7114939p462386P921611J5740232P234670n116110o496490O1911K455406
$$ plain form
38944 22409271 27888392 35792315 40767069 42750244 42796918 40760781 38212358 39233196
38936 39233196 44996702 50283613 49610000 45057037 42863951 43551534 42513421 40553885
38928 40553885 44591430 54599412 59715856 54089537 47583032 51071890 58513219 55896250
38920 55896250 43442849 35361686 38937800 47108422 52529078 56051752 58385037 55561382
38912 55561382 47727497 42313061 43224983 46116207 49370004 59247118 76221752 85883864
38904 85883864 75190322 52817858 41348598 49807676 63986830 66024438 55429192
38897 55429192 45978673 46776611 53139528 56192393 55195165 55284554 55901323 49953523 37114939
38888 37114939 29652553 37574164 53314396 60549066 55432956 48936466 48998377 51453783
38880E1453783q06228k002914Q35750K740378J875133o2084m037763j0013915
38872C9982140j1125278k620839P150579O738350m76498j323648O080905J0227232
38864E4632943N347398j203194k973868k946324m147729l205342J472776M255508
38856E1232168N06598o321587r773552p402887r76245M876644M052264m418732
38848C1774671j1533726p734046L124247P658525J081246p238316p209926J092040
38840A1014715J0669229J4199311P739447m549034j0988072n857865J169277r59954
38832B2437054o554809k941163O733717Q551615K932133L433161R977836P019760
38824E1589304o747868j1699392J27818R905027L012514p689153o438631q77073
$$ plain form
38880 51453783 50647555 48644641 49480391 52220769 54095902 54033818 49996055 39982140
38872 39982140 28856862 26236023 33386602 40124952 39648454 38324806 44405711 54632943
38864 54632943 59980341 58777147 55803279 52856955 48709226 45503884 46976660 51232168
38856 51232168 51738766 45417179 35643627 28240740 27264495 32141139 36193403 31774671
38848 31774671 20240945 12506899 15631146 23289671 24370917 17132601 9922675 11014715
38840 11014715 21683944 35883255 43622702 39073668 28085596 22227731 23397008 22437054
38832 22437054 15882245 12941082 19674799 28226414 31158547 34591708 44569544 51589304
38824 51589304 44841436 33142044 33269862 43174889 46187403 38498250 32059619 31182546
38816C1182546l450222o266535J418324P560774l210975j7379610j0117641J2510331
38808A2246992K0201289N035804r138523o270710K141902L322336K182674L858297
38800C3580061J047146q652206j2810432m662154L860814K416640q10748L866091
38792A7835212R067386M295469m494572n542252r58462M73204J004490P250847
38784B8931322J2833720O002809q656503j3621575l619527P752094Q393969J522466
38776C9538775l947053n506340n054769l253935n81694J234422J723790J880467
38768B6033663J272111r03005k207685P06367O113565Q046398L449475m587270
38760C7923619j0000221q019802Q49706Q500582N746540m578974p322869N207524
$$ plain form
38816 31182546 27732324 21465789 22884113 30444887 27233912 9854302 -263339 12246992
38808 12246992 32448281 37484085 28345562 22074852 24216754 27539090 29721764 33580061
38800 33580061 34627207 25975001 13164569 8502415 12363229 14779869 13969121 17835212
38792 17835212 26902598 31198067 26703495 21161243 20202781 20675985 21680475 28931322
38784 28931322 41765042 47767851 39111348 25489773 21870246 29622340 38016309 39538775
38776 39538775 35591722 30085382 25030613 21776678 21194984 22429406 24153196 26033663
38768 26033663 27305774 26402769 24195084 24901451 31015016 39061414 42510889 37923619
38760 37923619 27923398 19903596 20753302 29253884 35000424 30421450 23098581 28306105
38752B8306105J9388919J6307552k423372j6655285j4351035m278580l33880m010100
38744B1950324o963593l481551M412723J0184480Q728421K000152j740672K058615
38736C7148899P502645O797655J747026r31127j725528n401992q804197m145160
38728C2188221N897139R388804K978147m054559n709874o112342p410999m906055
38720B2258482R22167J811244k590598j250554P961873J0326690j795609j2359504
38712B5284191m678117J1356812J3607567P13731q851887o123737m61099J13537
38704C0960998q62947k8981n44577l009860k997187r76782k836930p660027p084438
38695D959269k23254L328118J63459R129Q775071J6361777J1374552q71599o457453
$$ plain form
38752 28306105 47695024 64002576 61579204 44923919 30572884 26294304 25960424 21950324
38744 21950324 14986731 11505180 15917903 26102383 34830804 36830956 35090284 37148899
38736 37148899 44651544 51449199 53196225 52265098 50539570 45137578 36333381 32188221
38728 32188221 38085360 47474164 50452311 46397752 40687878 34575536 27164537 22258482
38720 22258482 23180649 24991893 22401295 21150741 29112614 39439304 37643695 25284191
38712 25284191 20606074 31962886 45570453 46284184 37432297 31308560 30847461 30960998
38704 30960998 30098051 30069070 29524493 26514633 23517446 22540664 19703734 12043707 4959269
38695 4959269 4736015 8064133 8227592 8236721 17011792 33373569 44748121 43876522 37419069
38686C7419069l294890j592620o125848r550634n227873K345812M547574O42181
38678A9162771k615105j066482K445148L994135M106466M749393M369829L87638
38670C5533793n149765p404901n557551k752122j02517L063446L854896j011887
38662B0473392o575595m400918K491356K028138n694145m800813J0215481K0749428
38654C4486324J0760834o760163q938650J812534M240444n914756j1324103m454594
38646A3907870J180767k788159m521061N921835J7400502J4539952J221862o811285
38638D0052283m859694j912755m516977q674732p345410K78362P706332P907598
38630B8635007J859833j650190K078907O349792L897027o55667R64453N427034
$$ plain form
38686 37419069 34124179 32531559 26405711 16855077 11627204 13973016 18520590 19162771
38678 19162771 16547666 15481184 17926332 21920467 26026933 30776326 35146155 35533793
38670 35533793 30384028 22979127 17421576 14669454 14566937 17630383 21485279 20473392
38662 20473392 13897797 9496879 11988235 14016373 8322228 3521415 13736896 34486324
38654 34486324 45247158 38486995 29548345 31360879 35601323 29686567 18362464 13907870
38646 13907870 15088637 12300478 7779417 13701252 31101754 45641706 46863568 40052283
38638 40052283 35192589 33279834 28762857 20088125 12742715 13021077 20727409 28635007
38630 28635007 30494840 28844650 30923557 37273349 41170376 40514709 41479162 46906196
38622D6906196L738750j901781k379544N00876k244277p475968m183559L622907
38614C6583600Q36337r967571q806882O783514J3817342J536974r633230k339421
38606B8810663R587998P005761k870113l420532J713196K72608l275056J002465
38598C8826990N764569K78097n754257J189143J0009081K335169j1709840p424445
38590C3514507J0942501J5177904O35823o621627M879585J3897905M448691q999501
38582F7875788r447643m109984n567126p982414j255322P918980P852264K056901
38574E7341444P51678K470492k44855m993058l844964K116093M612220M94943
38566E8703993o384705j1175149r945494j796228O331186N111741k765127m114737
$$ plain form
38622 46906196 50644946 48743165 46363621 46864497 44620220 37144252 32960693 36583600
38614 36583600 37419937 27452366 18645484 25428998 39246340 40783314 31150084 28810663
38606 28810663 38398661 45404422 42534309 39113777 40826973 41099581 37824525 38826990
38598 38826990 44591559 44869656 39115399 40304542 50313623 52648792 40938952 33514507
38590 33514507 44457008 59634912 60270735 53649108 58528693 72426598 76875289 67875788
38582 67875788 58428145 54318161 48751035 40768621 39513299 47432279 55284543 57341444
38574 57341444 58093122 60563614 60318759 55325701 51480737 53596830 58209050 58703993
38566 58703993 52319288 41144139 31198645 29402417 35733603 40845344 38080217 33965480
38558C3965480M106158Q674911J801318n299348j233770O655128N990906N80137
38550E5240920J833651P318400N223532m200522q294035j888991O723096R713848
38542G1669899P039342l34830j2011232k1035403j6856329P3663J5016475J5040791
38534E8602376L098915p294990p368070l49261M170346J480508k570213R34867
38526E0704478J0444174J3579385M154248p054866o310790L277729O549405q73585
38518G4470178o570620q87629Q378287P833364k173259r127726o511294j200878
38510F4210423j205629l879230j967502L277786L420104k893001n909200P01608
38502E5755359Q831025P068501k247687o792728k657017J845220J287639R84697
$$ plain form
38558 33965480 38071638 46746549 48547867 43248519 42014749 48669877 54660783 55240920
38550 55240920 57074571 64392971 69616503 65415981 57121946 55232955 61956051 71669899
38542 71669899 78709241 78374411 66363179 45327776 28471447 28545110 43561585 58602376
38534 58602376 61701291 54406301 47038231 46688970 50859316 52339824 49769611 50704478
38526 50704478 61148652 74728037 78882285 71827419 65516629 68794358 75343763 74470178
38518 74470178 67899558 67011929 75390216 83223580 81050321 71922595 65411301 64210423
38510 64210423 63004794 59125564 57158062 60435848 63855952 60962951 55053751 55755359
38502 55755359 64586384 71654885 69407198 62614470 59957453 61802673 63090312 64075009
38494F4075009N881075J0952565Q728145J11836p791840j0111303o546356M7078
38486F5346209M161067J699136l754414m328717L79207K386755q66056j039841
38478F3983346P052522J4926824J2243888K046189n009268o126349o386287p313192
38470G5417673n588441j546506J12621j863618l634420k432852Q10859M060053
38462F5335369N012678J513491m518324o717977k561592J901972Q93618k348782
38454E8510453k195713o66533k441868m702693k217458R13772l629216j2718605
38446C0852139j3463472k164341R465570J0428226L542065j636425j249363J897294
38438C7671693L850814K288818j661511k669127K503578P562709L104977q084857
$$ plain form
38494 64075009 69956084 80908649 89636794 89748630 81956790 71845487 65299131 65346209
38486 65346209 69507276 71206412 67451998 63123281 63502488 65889243 65023187 63983346
38478 63983346 71035868 85962692 98206580 100252769 95243501 89117152 82730865 75417673
38470 75417673 69829232 68282726 68395347 66531729 62897309 60464457 61275316 65335369
38462 65335369 70348047 71861538 67343214 60625237 58063645 59965617 60859235 58510453
38454 58510453 56314740 55648207 53206339 48503646 46286188 47199960 43570744 30852139
38446 30852139 17388667 15224326 24689896 35118122 38660187 37023762 35774399 37671693
38438 37671693 41522507 43811325 42149814 39480687 41984265 49546974 52651951 44567094
38430D4567094j1498518j017428J0453211P827699n367352j2174033m870567O723448
38422C4643554R756102L538744k812834l403444j590188l127012o805382n612476
38414B4587064K588364J0096833Q768149J006253m092728l240776o52664J380886
38406D0441381M652572O887251J773610q533522j0975867N80232J3159204J0494996
38398E8479857m398238j4037870j1041765n009367m036962k734227N285216J3544197
38390C6050841J1149601k99722q177911n810875L77982J544820k688867o683899
38382B5461970p010117m348419k497N296296R402955Q720171J913846o800073
38374C2634132r797211l411684O772638J0661423N245899j561210j776576J525772
$$ plain form
38430 44567094 33068576 32051148 42504359 50332058 44964706 32790673 27920106 34643554
38422 34643554 44399656 47938400 45125566 41722122 40131934 37004922 30199540 24587064
38414 24587064 27175428 37272261 46040410 47046663 42953935 39713159 39060495 40441381
38406 40441381 45093953 51981204 53754814 45221292 34245425 34825657 47984861 58479857
38398 58479857 54081619 40043749 29001984 23992617 19955655 17221428 22506644 36050841
38390 36050841 47200442 46900720 38722809 32911934 33289916 34834736 32145869 25461970
38382 25461970 18451853 14103434 14100937 19397233 28800188 37520359 39434205 32634132
38374 32634132 22836921 19425237 26197875 36859298 42105197 40543987 38767411 40293183
38366D0293183J8087n212060m083693N569645J1478282L866006q743149j0186230
38358C3000071R22798R864665O319008l573876p901611l794221K436679M603847
38350D1877360J874088k464394m593004l794529k895040l557090l074967O50339
38342B4022763L852120K501803M97412M127441R975452Q447947m47970o274377
38334D6702591n147039m798552q197554o355377L820343Q504378k571802j5744786
38326A6212202j0836686P720982J6197602N998845o422060o553665l87547R31708
38318B2861381q81383P59037L167122O17184k948060J75796P177205Q062915J636147
38309D0627344k615828M80788M181592O31072p228010r310184j193827J0307342
$$ plain form
38366 40293183 40311270 35099210 31015517 36585162 48063444 51929450 43186301 33000071
38358 33000071 33922869 43787534 50106542 46532666 38631055 34836834 37273513 41877360
38350 41877360 43751448 41287054 36694050 32899521 30004481 26447391 23372424 24022763
38342 24022763 27874883 30376686 30874098 35001539 44976991 53424938 52976968 46702591
38334 46702591 41555552 36757000 28559446 22204069 26024412 34528790 31956988 16212202
38326 16212202 5375516 13096498 29294100 35292945 28870885 22317220 21929673 22861381
38318 22861381 21979998 22739035 25906157 26523341 23575281 23751077 30928282 38991197 40627344
38309 40627344 38011516 38492304 42673896 43304968 36076958 26766774 25572947 35880289
38301C5880289J4016569N649547p634163j4158297r582786o41017L513241J035948
38293B8079331l482366o213285o105124k148498N172984R934669N170696o345758
38285B4062649j1921729m230787P773667R400806p68963r342641n651463N708301
38277A5029840J2254742Q558665J02624m890768l710784j48670L72661l147948
38269B4420362n704780k283857M699072P330914K552225l591718m471194j404514
38261B1546510K30001k53539O76803L558201M773399K302824j803825m758486
38253B6271888n344303l273074M72346L212696L445387L017766L557994K908773
38245C4269473r63507m815810l882842P46094L507383J892707k043502n948246
$$ plain form
38301 35880289 49896858 55546405 47912242 33753945 24171159 23530142 27043383 28079331
38293 28079331 24596965 18383680 12278556 10130058 15303042 25237711 30408407 24062649
38285 24062649 12140920 7910133 15683800 25084606 24315643 14973002 9321539 15029840
38277 15029840 27284582 35843247 35945871 31055103 27344319 27195649 27568310 24420362
38269 24420362 18715582 16431725 21130797 28461711 31013936 27422218 22951024 21546510
38261 21546510 21776511 21522972 22199775 25757976 30531375 32834199 31030374 26271888
38253 26271888 20927585 17654511 18126857 21339553 24784940 27802706 31360700 34269473
38245 34269473 33305966 28490156 24607314 25353408 28860791 30753498 28709996 22761750
38237B2761750q090269o375608j792494K48210j818496m15604R694607J8996085
38229C3208181J3858091k610778j3299135j0710978m507657l735190n316957m181353
38221B704224j739243R45206O206174J0737380O228261m971858q430696M92573
$$ plain form
38237 22761750 14671481 8295873 6503379 6751589 4933093 4517489 14212096 33208181
38229 33208181 47066272 44455494 31156359 20445381 15937724 12202534 6885577 2704224
38221 2704224 964981 1910187 8116361 18853741 25082002 20110144 11679448 12172021
$$ [...]
##END NTUPLES=NMR SPECTRUM
##END=
