##TITLE=31Pdec_75CAA
 aceton-d6
  24 sc
 28.11.2023
##JCAMPDX= 6.0         $$ Bruker NMR JCAMP-DX V2.0
##DATA TYPE= NMR SPECTRUM
##DATA CLASS= NTUPLES
##ORIGIN= UXNMR, Bruker Analytische Messtechnik GmbH
##OWNER= root
$$ XWIN-NMR		Version 3.5
$$ Tue Nov 28 13:57:48 2023 Russian Standard Time (UT+4h)  she@DPX200
##.OBSERVE FREQUENCY= 81.013821
##.OBSERVE NUCLEUS= ^31P
##.ACQUISITION MODE= SIMULTANEOUS
##.ACQUISITION SCHEME= undefined
##.AVERAGES= 24
##.DIGITISER RES= 16
##SPECTROMETER/DATA SYSTEM= spect
##.PULSE SEQUENCE= zgpg30
##.SOLVENT NAME= CDCl3
##.SHIFT REFERENCE= (INTERNAL, CDCl3, 0, 248.564)
##AUDIT TRAIL= $$ (NUMBER, WHEN, WHO, WHERE, WHAT)
$$ ##TITLE= Audit trail, XWIN-NMR		Version 3.5
$$ ##JCAMPDX= 5.01
$$ ##ORIGIN= Bruker BioSpin GmbH
$$ ##OWNER= she
$$ F:/spectra/data/she/nmr/P31/1/pdata/1/auditp.txt
$$ ##AUDIT TRAIL=  $$ (NUMBER, WHEN, WHO, WHERE, WHAT)
(   1,<2023-11-28 13:56:35.96 +0400>,<she>,<DPX200>,
      <created by zg, POWCHK disabled, PULCHK disabled
       configuration hash MD5:
       00 E9 B6 7A A2 85 ED C7 34 08 36 98 17 FE 4E 26
       data hash MD5: 32K
       0B DC 18 9D 8F 1B 0E 53 C8 AF 2E 8E F8 38 2C 2D>)
(   2,<2023-11-28 13:56:42.07 +0400>,<she>,<DPX200>,
      <Start of raw data processing
       efp BC_mod = 2 LB = 10 FT_mod = 6 PKNL = 1 PHC0 = -11691.59 PHC1 = -51.10563 SI = 64K 
       data hash MD5: 64K
       B1 CE A0 C0 99 C2 BF 75 78 3A C5 EC 48 14 6B FD>)
(   3,<2023-11-28 13:57:08.21 +0400>,<she>,<DPX200>,
      <pk PHC0 = 58.62716 PHC1 = -150.8 
       data hash MD5: 64K
       5F B2 11 CB 6D 35 C3 8A 3B 87 DF 70 CD 2B 77 8D>)
(   4,<2023-11-28 13:57:11.37 +0400>,<she>,<DPX200>,
      <abs ABSG = 5 
       data hash MD5: 64K
       0E B7 B6 81 E8 69 08 69 18 42 CF F2 3F 52 A1 71>)
(   5,<2023-11-28 13:57:19.78 +0400>,<she>,<DPX200>,
      <abs ABSG = 5 
       data hash MD5: 64K
       64 EE DB 72 77 A4 D7 15 15 91 56 74 E7 E0 17 58>)
$$ ##END=
$$ 
$$ hash MD5
$$ AB 75 D8 3A AD 7D CE 9D D4 4A 6B B1 60 9C B9 44
##$RELAX= 
##$RELAX= 
##$RELAX= 
##$RELAX= 
##$RELAX= 
##$RELAX= 
##$RELAX= 
##$RELAX= 
##$RELAX= 
$$ Bruker specific parameters
$$ --------------------------
##$DU= <F:/spectra>
##$EXPNO= 1
##$NAME= <P31>
##$PROCNO= 1
##$TYPE= <nmr>
##$USER= <she>
##$AMP= (0..31)
100 100 100 100 100 100 100 100 100 100 100 100 100 100 100 100 100 100 
100 100 100 100 100 100 100 100 100 100 100 100 100 100 
##$AQSEQ= 0
##$AQ_mod= 1
##$AUNM= <au_zg>
##$AUTOPOS= <>
##$BF1= 81.014009
##$BF2= 200.13
##$BF3= 200.13
##$BF4= 200.13
##$BF5= 200.13
##$BF6= 200.13
##$BF7= 200.13
##$BF8= 200.13
##$BYTORDA= 1
##$CFDGTYP= 0
##$CFRGTYP= 5
##$CHEMSTR= <none>
##$CNST= (0..31)
1 1 145 1 1 1 1 1 1 1 1 1 1 1 1 1 1 1 1 1 1 1 1 1 1 1 1 1 1 1 1 1 
##$CPDPRG= <waltz16>
##$CPDPRG1= <>
##$CPDPRG2= <waltz16>
##$CPDPRG3= <>
##$CPDPRG4= <mlev>
##$CPDPRG5= <mlev>
##$CPDPRG6= <mlev>
##$CPDPRG7= <mlev>
##$CPDPRG8= <mlev>
##$CPDPRGB= <>
##$CPDPRGT= <>
##$D= (0..31)
0 1 0 0 0 0 0 0 0 0 0 0.03 2e-05 3e-06 0 0 0 0 0 0 0 0 0 0 0 0 0 0 0 0 
0 0 
$$ [...]
##$SUBNAM3= <"">
##$SUBNAM4= <"">
##$SUBNAM5= <"">
##$SUBNAM6= <"">
##$SUBNAM7= <"">
##$SUBNAM8= <"">
##$SUBNAM9= <"">
##$SW= 501.771253377433
##$SWIBOX= (0..15)
0 1 3 0 0 0 0 0 0 0 0 0 0 0 0 0 
##$SW_h= 40650.406504065
##$TD= 32768
##$TD0= 1
##$TE= 0
##$TE2= 300
##$TE3= 300
##$TEG= 300
##$TL= (0..7)
0 120 53 12 22 120 120 120 
##$TP= (0..7)
150 150 150 150 150 150 150 150 
##$TP07= 0
##$TPNAME0= <>
##$TPNAME1= <>
##$TPNAME2= <>
##$TPNAME3= <>
##$TPNAME4= <>
##$TPNAME5= <>
##$TPNAME6= <>
##$TPNAME7= <>
##$TPOAL= (0..7)
0.5 0.5 0.5 0.5 0.5 0.5 0.5 0.5 
##$TPOFFS= (0..7)
0 0 0 0 0 0 0 0 
##$TUNHIN= 0
##$TUNHOUT= 0
##$TUNXOUT= 0
##$USERA1= <user>
##$USERA2= <user>
##$USERA3= <user>
##$USERA4= <user>
##$USERA5= <user>
##$V9= 5
##$VALIST= <valist>
##$VCLIST= <CCCCCCCCCCCCCCC>
##$VD= 0
##$VDLIST= <DDDDDDDDDDDDDDD>
##$VPLIST= <PPPPPPPPPPPPPPP>
##$VTLIST= <TTTTTTTTTTTTTTT>
##$WBST= 1024
##$WBSW= 4
##$XGAIN= (0..3)
0 0 0 0 
##$XL= 0
##$YL= 0
##$YMAX_a= 4196
##$YMIN_a= -4444
##$ZGOPTNS= <>
##$ZL1= 120
##$ZL2= 120
##$ZL3= 120
##$ZL4= 120
##$ABSF1= 248.5645
##$ABSF2= -253.2056
##$ABSG= 5
##$ABSL= 3
##$ALPHA= 0
##$AQORDER= 0
##$ASSFAC= 0
##$ASSFACI= 0
##$ASSFACX= 0
##$ASSWID= 0
##$AUNMP= <proc_1d>
##$AZFE= 0.1
##$AZFW= 0.5
##$BCFW= 0
##$BC_mod= 2
##$BYTORDP= 0
##$COROFFS= 0
##$CY= -3
##$DATMOD= 1
##$DC= 0
##$DFILT= <>
##$DTYPP= 0
##$F1P= 0
##$F2P= 0
##$FCOR= 1
##$FTSIZE= 65536
##$FT_mod= 6
##$GAMMA= 0
##$GB= 0
##$INTBC= 1
##$INTSCL= 6.047779e-11
##$ISEN= 30
##$LB= 10
##$LEV0= 0
##$LPBIN= 0
##$MAXI= 10000
##$MC2= 0
##$MEAN= 0
##$ME_mod= 0
##$MI= 50
##$NCOEF= 0
##$NC_proc= -10
##$NLEV= 6
##$NOISF1= 182.463
##$NOISF2= 159.3651
##$NSP= 0
##$NTH_PI= 0
##$NZP= 0
##$OFFSET= 248.5645
##$PC= 4
##$PHC0= -11632.96
##$PHC1= -201.9056
##$PH_mod= 1
##$PKNL= yes
##$PPARMOD= 0
##$PSCAL= 0
##$PSIGN= 0
##$REVERSE= no
##$SF= 81.0140089999694
##$SI= 65536
##$SIGF1= 159.3651
##$SIGF2= -187.1042
##$SINO= 113.3802
##$SIOLD= 16384
##$SREGLST= <1H.CDCl3>
##$SSB= 0
##$STSI= 65536
##$STSR= 0
##$SW_p= 40650.406504065
##$SYMM= 0
##$S_DEV= 0
##$TDeff= 32768
##$TDoff= 0
##$TI= <>
##$TILT= no
##$TM1= 0
##$TM2= 0
##$TOPLEV= 0
##$USERP1= <user>
##$USERP2= <user>
##$USERP3= <user>
##$USERP4= <user>
##$USERP5= <user>
##$WDW= 1
##$XDIM= 65536
##$YMAX_p= 346600471
##$YMIN_p= -23802348
$$ End of Bruker specific parameters
$$ ---------------------------------
##NTUPLES= NMR SPECTRUM
##VAR_NAME=  FREQUENCY,     SPECTRUM/REAL,   SPECTRUM/IMAG
##SYMBOL=    X,             R,               I
##VAR_TYPE=  INDEPENDENT,   DEPENDENT,       DEPENDENT
##VAR_FORM=  AFFN,          ASDF,            ASDF
##VAR_DIM=   65536,         65536,           65536
##UNITS=     HZ,            ARBITRARY UNITS, ARBITRARY UNITS
##FACTOR=    0.620285442955139, 1,           1
##FIRST=     20137.2065510682, 0,            0
##LAST=      -20513.1999529968, 0,           0
##MIN=       -20513.1999529968, -23802348,   0
##MAX=       20137.2065510682, 346600471,    0
$$ Real data points
##PAGE= N=1
##DATA TABLE= (X++(R..R)), XYDATA
$$ [...]
42476g840528j02685j11883j04462p6925l2048K1690P5645J26666J77477K31250
42466g635803K85123L28171L45641L26567K69693J84278Q6432o100p9236j27770
42456f023004j58268j85006k18266k52374k63601k20862j02903Q7486L18821N38414
42446f479563O89808P32577O55337M77684K42908M690j89740l14554l69956l72970
42436d923779l41767k85455k04489r7325L3444J78612L23277M50089N43157N90781
42426c733455N86545N29591M24746K82501J18806m5022j83360k70076k85386k23191
42416b798301r5149P0943K37995L69025M35895M25440L42680K10377O3091o4296
42406h02300j49183j87849j92209j79289j60476j37013j03577n5958L880O8842
$$ y = [-7840528, -7943213, -8055096, -8159558, -8236483, -8268531, -8246841, -8171196, -8044530, -7867053, -7635803, -7350680, -7022509, -6676868, -6350301, -6080608, -5896330, -5809898, -5815998, -5895234, -6023004, -6181272, -6366278, -6584544, -6836918, -7100519, -7321381, -7424284, -7336798, -7017977, -6479563, -5789755, -5057178, -4401841, -3924157, -3681249, -3676559, -3866299, -4180853, -4550809, -4923779, -5265546, -5551001, -5755490, -5852815, -5819371, -5640759, -5317482, -4867393, -4324236, -3733455, -3146910, -2617319, -2192573, -1910072, -1791266, -1836288, -2019648, -2289724, -2575110, -2798301, -2893450, -2822507, -2584512, -2215487, -1779592, -1354152, -1011472, -801095, -738004, -802300, -951483, -1139332, -1331541, -1510830, -1671306, -1808319, -1911896, -1967854, -1963974, -1895132]
42396a895132J31131J84933K26099K51676K61105K57073K43682K22924J92565
42387G6056J47017Q0699p661j11923k19312l16144l95850m63801n34412o20713
42377b366044p22143q19049q78984q71535p82093o16903l99368j62097O1938K47283
42367g308995L79823M54023M66735M14942L00372J35063n8952k54999m25668n43638
42357f441294n84464n34661m00148k07426M216J94347L31624M00374M02534L54357
42347f480541K79573K03179J48166J33312J69807K57956L87156N39799O96259
42338c665334Q38237R49985J018711J035818R99879R20002Q15608P09509O16930
42329D239345N38197M60933L69944K57440J27195q229j33734k37237l12295l58324
$$ y = [-1895132, -1764001, -1579068, -1352969, -1101293, -840188, -583115, -339433, -116509, 76056, 223073, 303772, 296111, 184188, -35124, -351268, -747118, -1210919, -1745331, -2366044, -3088187, -3907236, -4786220, -5657755, -6439848, -7056751, -7456119, -7618216, -7556278, -7308995, -6929172, -6475149, -6008414, -5593472, -5293100, -5158037, -5216989, -5471988, -5897656, -6441294, -7025758, -7560419, -7960567, -8167993, -8163777, -7969430, -7637806, -7237432, -6834898, -6480541, -6200968, -5997789, -5849623, -5716311, -5546504, -5288548, -4901392, -4361593, -3665334, -2827097, -1877112, -858401, 177417, 1177296, 2097298, 2912906, 3622415, 4239345, 4777542, 5238475, 5608419, 5865859, 5993054, 5984825, 5851091, 5613854, 5301559, 4943235]
42319D943235l79742l84636l82270l79606l78312l73926l57614l19946k55523
42310A731660j65965n8438O0207J88473L28481M77725O21796P35683P93841P82292
42300E495755P05376N83821M44933L09304J81129M8647j05059k88356m93746o99844
42290F181960q78679j003543j055787j030124r36122p93827o25471m48390k72433
42281h62416j01199O5197K26574L78836N11754O11015O64126O66442O22852N44485
42271C327666M43379L28942K07657Q4764l4245j43763k39865l22046l92668m53498
42261B806323n02387n34388n47824n50084n57148n86754o50616p50535q78233
42252b751646j016608j142056j229024j255718j207554j077188q64454n80215
$$ y = [4943235, 4563493, 4178857, 3796587, 3416981, 3038669, 2664743, 2307129, 1987183, 1731660, 1565695, 1507257, 1567464, 1755937, 2084418, 2562143, 3183939, 3919622, 4713463, 5495755, 6201131, 6784952, 7229885, 7539189, 7720318, 7768965, 7663906, 7375550, 6881804, 6181960, 5303281, 4299738, 3243951, 2213827, 1277705, 483878, -141593, -589983, -862416, -963615, -898418, -671844, -293008, 218746, 829761, 1493887, 2160329, 2783181, 3327666, 3771045, 4099987, 4307644, 4392408, 4358163, 4214400, 3974535, 3652489, 3259821, 2806323, 2303936, 1769548, 1221724, 671640, 114492, -472262, -1122878, -1873413, -2751646, -3768254, -4910310, -6139334, -7395052, -8602606, -9679794, -10544248, -11124463]
42244a1124463k52258P4416L48529N30943O09064N97872N28311M32014L31492
42235g924080K39120J62047J07372Q2612R0951J25884J71800K12526K42419K71442
42225f217907L19356M02198N20080O54948P79288Q67997R04146Q77209P80878
42216a11807O15884L94380J38318j28999l91133o39956q71097j078480j251734
42207c324624j377611j445225j452519j408835j329920j227818j102446r40521
42199a3609519p22901m37963r5194K69338O01586Q49163R80865R96062R21784
42190a0246779Q00940O76027N73777M98390M37399L74957L02337K21276J43788
42181f217888R0928Q7267J48827K71277M28484N83356P02907P68652P79286P46722
$$ y = [-11124463, -11376721, -11302305, -10953776, -10422833, -9813769, -9215897, -8687586, -8255572, -7924080, -7684960, -7522913, -7415541, -7332929, -7241978, -7116094, -6944294, -6731768, -6489349, -6217907, -5898551, -5496353, -4976273, -4321325, -3542037, -2674040, -1769894, -892685, -111807, 504077, 898457, 1036775, 907776, 516643, -123313, -994410, -2072890, -3324624, -4702235, -6147460, -7599979, -9008814, -10338734, -11566552, -12668998, -13609519, -14332420, -14770383, -14865577, -14596239, -13994653, -13145490, -12164625, -11168563, -10246779, -9445839, -8769812, -8196035, -7697645, -7260246, -6885289, -6582952, -6361676, -6217888, -6126960, -6039693, -5890866, -5619589, -5191105, -4607749, -3904842, -3136190, -2356904, -1610182]
42171a610182O87675O14542N30759M32866L15934J77880K1750j42269k96167m18409
42161C14379m93783n22374n19203n03039m82790m53093m02577l26703k33644j39414
42151c762241n8619J031L8284N5185N4720M0511J8387j828p367J2239N8881J23695
42139c427122J90694K42815K66585K54821K08071J34170M4971m8137j36513k13129
42129b482774k70356l00069k97112k63695k10973j55527j12297q8177q0265p9219
42119d340464p4861o0233l2360R422O4927J32489K07008K79433L39729L81785
42109c093125M06568M20624M30623M37279M32371M01079L29254K12448O2067r5232
42099e6044k25220k97662k96748k26086j06493L2174J61312K61249L23203L46069
$$ y = [-1610182, -922507, -307965, 222794, 655660, 971594, 1149474, 1171224, 1028955, 732788, 314379, -179404, -701778, -1220981, -1724020, -2206810, -2659903, -3062480, -3389183, -3622827, -3762241, -3820860, -3819829, -3781545, -3726360, -3671640, -3631129, -3612742, -3614570, -3621937, -3609698, -3550817, -3427122, -3236428, -2993613, -2727028, -2472207, -2264136, -2129966, -2084995, -2133132, -2269645, -2482774, -2753130, -3053199, -3350311, -3614006, -3824979, -3980506, -4092803, -4180980, -4261245, -4340464, -4415325, -4475558, -4507918, -4498496, -4433569, -4301080, -4094072, -3814639, -3474910, -3093125, -2686557, -2265933, -1835310, -1398031, -965660, -564581, -235327, -22879, 39188, -56044, -281264, -578926, -875674, -1101760, -1208253, -1176079, -1014767, -753518, -430315, -84246]
42089h4246L31457K80543J93825P2884p7330k46564m18772n74146o93453p62876
42079a978678p77025p38661o55002n32053l70521j67178P7972L53937O36565Q93345
42069c257299J091095J202596J211972J119615R44643P21411M89348K80526J11232
42060C915139j8145j15459j86539k29282k35625j98710j18948n062J29176K69231
42050C205776M02720N20420O16140O86847P33858P63720P86073Q07721Q25836
42041I349111Q25371P83868O82407N17021L03280P0273j52680l47972n13161o55736
42031A0861782p84340r01951j003679j078985j116611j109458j057484r68477
42023B840797q57224p42740o43070n69142n21357m91563m69646m50381m35925
$$ y = [-84246, 247211, 527754, 721579, 794463, 717133, 470569, 51797, -522349, -1215802, -1978678, -2755703, -3494364, -4149366, -4681419, -5051940, -5219118, -5141146, -4787209, -4150644, -3257299, -2166204, -963608, 248364, 1367979, 2312622, 3034033, 3523381, 3803907, 3915139, 3896994, 3781535, 3594996, 3365714, 3130089, 2931379, 2812431, 2807369, 2936545, 3205776, 3608496, 4128916, 4745056, 5431903, 6165761, 6929481, 7715554, 8523275, 9349111, 10174482, 10958350, 11640757, 12157778, 12461058, 12531331, 12378651, 12030679, 11517518, 10861782, 10077442, 9175491, 8171812, 7092827, 5976216, 4866758, 3809274, 2840797, 1983573, 1240833, 597763, 28621, -492736, -984299, -1453945, -1904326, -2340251]
42014b340251m32295m43020m65353m91566n12849n21769n13027m85171m43526
42005f648827m00430l69434l56152l52665l40655l02231k31802j40990n2712J2021
41995i183877M5670N6939O4330Q5488J27630J82612K29109K42263K06245J21479
41985g822112J460j37428k84388m35474n89323p42404q86655j009666j097094
41976a3003084j137121j124849j063233r59561q20685o51061m54223k35338k570
41967a9451725K32807M57206O56268Q17087R30746R95170J017656J014635J006393
41958a2323757J008362J024350J046279J060330J055943J033629J007601J000164
41950d087099J029023J094702J176892J242568J260262J211682J095481R23881
$$ y = [-2340251, -2772546, -3215566, -3680919, -4172485, -4685334, -5207103, -5720130, -6205301, -6648827, -7049257, -7418691, -7774843, -8127508, -8468163, -8770394, -9002196, -9143186, -9195898, -9183877, -9138207, -9081268, -9016938, -8931450, -8803820, -8621208, -8392099, -8149836, -7943591, -7822112, -7820652, -7958080, -8242468, -8677942, -9267265, -10009669, -10896324, -11905990, -13003084, -14140205, -15265054, -16328287, -17287848, -18108533, -18759594, -19213817, -19449155, -19451725, -19218918, -18761712, -18105444, -17288357, -16357611, -15362441, -14344785, -13330150, -12323757, -11315395, -10291045, -9244766, -8184436, -7128493, -6094864, -5087263, -4087099, -3058076, -1963374, -786482, 456086, 1716348, 2928030, 4023511, 4947392]
41942D947392P16651M96693K87853J12447j3604q6023j13371j12251r9632q7586
41932F048569q2740q8661j07814j41841j91589k58060l43021m47081n66034o89348
41922C132380q02585q90965r40692r39519q80165p65636o10332m33780k51394
41913c382688o9592J12389K97019M83337O64230Q27052R56984J040902J069437
41904A999070J037682R46483Q03975O24681M25399K21113K4949j48347k80366
41895E654639l52864l56246k96151j92096o8681N3529J60644K41865K86000K83101
41885E413740K30120J35278J7295j00324j96645k58549k81736k68231k22923j51566
41875D316459o0797M0725J41604K28972K92203L27315L38802L37405L35491L42742
$$ y = [4947392, 5664043, 6160736, 6448589, 6561036, 6547432, 6461409, 6348038, 6235787, 6136155, 6048569, 5965829, 5877168, 5769354, 5627513, 5435924, 5177864, 4834843, 4387762, 3821728, 3132380, 2329795, 1438830, 498138, -441381, -1321546, -2087182, -2697514, -3131294, -3382688, -3452280, -3339891, -3042872, -2559535, -1895305, -1068253, -111269, 929633, 1999070, 3036752, 3983235, 4787210, 5411891, 5837290, 6058403, 6083352, 5935005, 5654639, 5301775, 4945529, 4649378, 4457282, 4388601, 4442130, 4602774, 4844639, 5130639, 5413740, 5643860, 5779138, 5796433, 5696109, 5499464, 5240915, 4959179, 4690948, 4468025, 4316459, 4255662, 4296387, 4437991, 4666963, 4959166, 5286481, 5625283, 5962688, 6298179, 6640921]
41865F640921L63060L92295M17629M20641L84334L00977J76294K7635j22256k51766
41855H749764l43793l86184l72347l04290j95903p1964L8921J13977J43076J29818
41845G501075Q7805L4467j5631n6902r6437j52637k46808l90008n72377p62346
41835E330201r16873r96589r77987q58684o55876m00029j26613J30739L43851
41826H72140M91737N62515N55102M78867L50961J93377L0494j14086k22433k87461
41816B911213l15551l24620l37195l70663m29551n04556n78352o33372o56906
41807a239553o42653n90383n04452l91976k62067j26395J207J08007J86536K36086
41797c225643K61417K71225K76852K88878L11291L37381L51222L33823K70241
$$ y = [6640921, 7003981, 7396276, 7813905, 8234546, 8618880, 8919857, 9096151, 9123786, 9001530, 8749764, 8405971, 8019787, 7647440, 7343150, 7147247, 7075283, 7114204, 7228181, 7371257, 7501075, 7588880, 7623347, 7607716, 7550814, 7454377, 7301740, 7054932, 6664924, 6092547, 5330201, 4413328, 3416739, 2438752, 1580068, 924192, 524163, 397550, 528289, 872140, 1363877, 1926392, 2481494, 2960361, 3311322, 3504699, 3535193, 3421107, 3198674, 2911213, 2595662, 2271042, 1933847, 1563184, 1133633, 629077, 50725, -582647, -1239553, -1882206, -2472589, -2977041, -3369017, -3631084, -3757479, -3756272, -3648265, -3461729, -3225643, -2964226, -2693001, -2416149, -2127271, -1815980, -1478599, -1127377, -793554, -523313]
41788e23313J55227l351j84889l61629n07534o05641o50127o43428n91942n03711
41778d420338l88512k57998j23521P066J29400K38385L24643L77265L91046L70494
41768c352070L26379K69395K07580J48214R9153O6658N1936N0008N1647M6299
41758b034801K4228k2284r7608k00651l22790m48005n56370o29533o55709o32775
41748e576298n68986m80293l83863k90701k02423j14479k2718P1696J61396K35815
41738g170854K87028L15879L33639L56018L93036M43322M97917N50053O02317
41729c391645O65775P51694Q61228R79336J077818J127731J114622J046190R46080
41720E178829Q37945P31763O22045M97246L51172J88023K0352j35003k59066l31605
$$ y = [-523313, -368086, -371437, -556326, -917955, -1425489, -2031130, -2681257, -3324685, -3916627, -4420338, -4808850, -5066848, -5190369, -5183303, -5053903, -4815518, -4490875, -4113610, -3722564, -3352070, -3025691, -2756296, -2548716, -2400502, -2301349, -2234691, -2182755, -2132747, -2081100, -2034801, -2010573, -2032857, -2130465, -2331116, -2653906, -3101911, -3658281, -4287814, -4943523, -5576298, -6145284, -6625577, -7009440, -7300141, -7502564, -7617043, -7639761, -7568065, -7406669, -7170854, -6883826, -6567947, -6234308, -5878290, -5485254, -5041932, -4544015, -3993962, -3391645, -2725870, -1974176, -1112948, -133612, 944206, 2071937, 3186559, 4232749, 5178829, 6016774, 6748537, 7370582, 7867828, 8219000, 8407023, 8427375, 8292372, 8033306, 7701701]
41710G701701l33757k53768r3676J26929L72916O01145P70524Q50949Q28835P08258
41700A1280056N07694K53820k4629l00461n49371p51285q93269r73142j001366
41691G548047r98223r85208r73664r58267r21309q45787p27691n79101m21479
41682A37318k75399j53727o1609j686K0998m96o9370j79562l14627m50209n57719
41671a906088o09715n88006m91511l38298j59651J0293J44230K27981K62556K61853
41661c186356K46492K35534K38211K49000K50125K22692J60593P7071j245m7919
41651a555802m8472m238P1310J60364K48524L28674L98999M57283M96063N02629
41641A055334M64679L78950K57433J25666J1965o6146j08471j26620j31142j21844
$$ y = [7701701, 7367944, 7114176, 7020500, 7147429, 7520345, 8121490, 8892014, 9742963, 10571798, 11280056, 11787750, 12041570, 12016941, 11716480, 11167109, 10415824, 9522555, 8549413, 7548047, 6549824, 5564616, 4590952, 3632685, 2711376, 1865589, 1137898, 558797, 137318, -138081, -291808, -353417, -355103, -334105, -334601, -403971, -583533, -898160, -1348369, -1906088, -2515803, -3103809, -3595320, -3933618, -4093269, -4082976, -3938746, -3710765, -3448209, -3186356, -2939864, -2704330, -2466119, -2217119, -1966994, -1744302, -1583709, -1506638, -1507883, -1555802, -1604274, -1608512, -1537202, -1376838, -1128314, -799640, -400641, 56642, 552705, 1055334, 1520013, 1898963, 2156396, 2282062, 2294027, 2227881, 2119410, 1992790, 1861648, 1739804]
41631A739804q8852k2735P5335J91436L05036L96795M52680M65346M36361L78609
41621D329815L13700K62270K32783K17236J96792J52965P7652k1957j24586k01771
41611E434899k28351j92159r7992L6222J88027L38268M74023N86965O70763P20659
41601G931324P35108P16664O70346O01135N13724M15164L17264K35182J81899
41592A2317810J61949J68052J82561J83081J49744P0646n6993k28849m34882o57705
41582A1855414q70693j041376j142016j161739j110798j012381q87315p43384
41574C885712n77333l86810j81107J8565J88262L11062L79879L94289L57352K75804
41564D665675J61474L1042r5677j97386k54173k53945k00721j18340m4300j5580
$$ y = [1739804, 1650952, 1628217, 1703552, 1894988, 2200024, 2596819, 3049499, 3514845, 3951206, 4329815, 4643515, 4905785, 5138568, 5355804, 5552596, 5705561, 5783213, 5761256, 5636670, 5434899, 5206548, 5014389, 4916397, 4952619, 5140646, 5478914, 5952937, 6539902, 7210665, 7931324, 8666432, 9383096, 10053442, 10654577, 11168301, 11583465, 11900729, 12135911, 12317810, 12479759, 12647811, 12830372, 13013453, 13163197, 13233843, 13176850, 12948001, 12513119, 11855414, 10984721, 9943345, 8801329, 7639590, 6528792, 5516411, 4629096, 3885712, 3308379, 2921569, 2740462, 2759027, 2947289, 3258351, 3638230, 4032519, 4389871, 4665675, 4827149, 4858191, 4762514, 4565128, 4310955, 4057010, 3856289, 3737949, 3693649, 3678069]
41554C678069n4131j59599l11732m79307o29978p37207p84002p64600o83852n53506
41544a479845l87899k03270k0619J34501K39849K86984K84062K47762J92259J24948
41534e81268N0552k2878q2806j17302j21568r9202n6457M036Q1741J69460K47998
41523e27694K92294K84418K21789J15739j4425j45920k55559l23733l38130k94470
41513i85691j94714m6399J35286L25489M92281O05145O45632O13405N23838L99535
41503B513807K62791J33113K7177m3928q0539r7524j18940j65532k42844l38282
41493A849299m29243m96829n35832n54555n65447n73680n71250n39174m55024
41484b871735l01091p0067K32410N87496R64144J321321J612335J792365J828643
$$ y = [3678069, 3623938, 3464339, 3152607, 2673300, 2043322, 1306115, 522113, -242487, -926339, -1479845, -1867744, -2071014, -2091633, -1957132, -1717283, -1430299, -1146237, -898475, -706216, -581268, -530716, -553594, -636400, -753702, -875270, -974472, -1030929, -1026893, -945152, -775692, -527694, -235400, 49018, 270807, 386546, 372121, 226201, -29358, -353091, -691221, -985691, -1180405, -1226804, -1091518, -766029, -273748, 331397, 977029, 1590434, 2114272, 2513807, 2776598, 2909711, 2936888, 2892960, 2812421, 2714897, 2595957, 2430425, 2187581, 1849299, 1420056, 923227, 387395, -167160, -732607, -1306287, -1877537, -2416711, -2871735, -3172826, -3242893, -3010483, -2422987, -1458843, -137522, 1474813, 3267178, 5095821]
41475E095821J710342J453951J101124P09262L37935L5558j70281k76798l03360
41466I693554k82496k47214k19790k06569j99720j83472j42038o7372L6115J53295
41456H334293K66559L64755M45436N09029N50681N57092N11287M02691K36469
41447A2178292L5585j67034l41987m73477n59823o06167o16957n94102n40726
41438H313604m65305l81141l00780k30441j69842j17107p2954l9727j7188o4K0310
41427F539365N1613R5304J42392J73631J67287J12133J7180q9700j73858k08732
41417F826615j84962j10867o742J02955J96867K62068K95913L03357K91051K62428
41407H238683K17550J57351Q7667J8767l9782q4673j19969j52147j82885k05995
$$ y = [5095821, 6806163, 8260114, 9361238, 10070500, 10408435, 10443993, 10273712, 9996914, 9693554, 9411058, 9163844, 8944054, 8737485, 8537765, 8354293, 8212255, 8144883, 8180998, 8334293, 8600852, 8965607, 9411043, 9920072, 10470753, 11027845, 11539132, 11941823, 12178292, 12213877, 12046843, 11704856, 11231379, 10671556, 10065389, 9448432, 8854330, 8313604, 7848299, 7467158, 7166378, 6935937, 6766095, 6648988, 6576034, 6536307, 6519119, 6519055, 6539365, 6590978, 6686282, 6828674, 7002305, 7169592, 7281725, 7298905, 7209205, 7035347, 6826615, 6641653, 6530786, 6524044, 6626999, 6823866, 7085934, 7381847, 7685204, 7976255, 8238683, 8456233, 8613584, 8701251, 8720018, 8680236, 8595563, 8475594, 8323447, 8140562, 7934567]
41397G934567k12127j97893j71544j50139j50529j81362k41267l22539m15950
41388E891217n13472o08656o95725p68058q17074q33824q14178p64305p00786
41379f24861o43764o08107n98627o10331o30989o44691o37461o03551n47789m81060
41369f631231m12092l41659k62540j64211l9210J11699K78236M43767N90546P03205
41359e723490P69506P80602P33137O31571M87680L16807J34094m6477k11272l47371
41349b475213m44711m97802n05984m73994m13987l45850k91718k65744k66538
41340e981541k78813k83354k68014k32733j86625j40389r9600o2928k5442J6791
41330g542648O4912J18810J79251K47742L24656M07884M93390N76473O52277P15499
$$ y = [7934567, 7722440, 7524547, 7353003, 7202864, 7052335, 6870973, 6629706, 6307167, 5891217, 5377745, 4769089, 4073364, 3305306, 2488232, 1654408, 840230, 75925, -624861, -1268625, -1876732, -2475359, -3085690, -3716679, -4361370, -4998831, -5602382, -6150171, -6631231, -7043323, -7384982, -7647522, -7811733, -7850943, -7739244, -7461008, -7017241, -6426695, -5723490, -4953984, -4173382, -3440245, -2808674, -2320994, -2004187, -1870093, -1916570, -2127842, -2475213, -2919924, -3417726, -3923710, -4397704, -4811691, -5157541, -5449259, -5715003, -5981541, -6260354, -6543708, -6811722, -7044455, -7231080, -7371469, -7471069, -7533997, -7559439, -7542648, -7477736, -7358926, -7179675, -6931933, -6607277, -6199393, -5706003, -5129530, -4477253, -3761754]
41320c761754P60644P83114P79899P48884O87568N93306M66190L13426J52195
41311A523472P625r4882j39043j22514n4440M9862J70991K84461L62957L84947
41301B373436L43964K50135J23253j5258j45254k46981l01498k94023k17411p3464
41291A796899J27150L64857O11573Q33249R94771J065945J027672Q78130O36752
41282H336998L41693L8458k36272m66303o55845q18113r60786j078288j156090
41273C345452j183557j165284j121880j079563j056183j052662j053014j031149
41265e397840r61174q28073o34589l99849j49640R5336L24697N34282P18245Q66053
41255e832552R67452J019897J030721J011788R71750R12216Q29960P22561N93703
$$ y = [-3761754, -3001110, -2217996, -1438097, -689213, -1645, 591661, 1057851, 1371277, 1523472, 1531097, 1436215, 1297172, 1174658, 1120218, 1170080, 1341071, 1625532, 1988489, 2373436, 2717400, 2967535, 3090788, 3075530, 2930276, 2683295, 2381797, 2087774, 1870363, 1796899, 1924049, 2288906, 2900479, 3733728, 4728499, 5794444, 6822116, 7700246, 8336998, 8678691, 8717149, 8480877, 8014574, 7358729, 6540616, 5579830, 4501542, 3345452, 2161895, 996611, -125269, -1204832, -2261015, -3313677, -4366691, -5397840, -6359014, -7187087, -7821676, -8221525, -8371165, -8275829, -7951132, -7416850, -6698605, -5832552, -4865100, -3845203, -2814482, -1802694, -830944, 81272, 911232, 1633793, 2227496]
41246B227496M55168L24049K15658J35507P5467J7940n2677j37476k18327k66131
41236B776674k58061j92117q8862J9726J04904J49574J48131J02756K1875p8235
41226B706365j72968k34346k40863j86291q1772M9243J78673K79898L31349L19553
41216B948841K42912J15321l3864j66424k47312k55783j89371o0646J08326K90780
41206B752780M60849O00365P02584P68631Q00132P96282P58503O96524O27564
41197H964214N67022N17260M63255L79543K45165N7396j64610l87751n78342p13266
41187I349886p85108q00955p75712p23105o50044n58202m50141l33206k18411
41178D055002j17562m2479n457j8037q7114k10036l70778n39280o76223p43424
$$ y = [2227496, 2682664, 3006713, 3222371, 3357878, 3433345, 3451285, 3398608, 3261132, 3042805, 2776674, 2518613, 2326496, 2237634, 2257360, 2362264, 2511838, 2659969, 2762725, 2784600, 2706365, 2533397, 2299051, 2058188, 1871897, 1790125, 1839368, 2018041, 2297939, 2629288, 2948841, 3191753, 3307074, 3273210, 3106786, 2859474, 2603691, 2414320, 2353674, 2462000, 2752780, 3213629, 3813994, 4516578, 5285209, 6085341, 6881623, 7640126, 8336650, 8964214, 9531236, 10048496, 10511751, 10891294, 11136459, 11193855, 11029245, 10641494, 10063152, 9349886, 8564778, 7763823, 6988111, 6265006, 5614962, 5056760, 4606619, 4273413, 4055002, 3937440, 3894961, 3889504, 3871467, 3784353, 3574317, 3203539, 2664259, 1988036, 1244612]
41168A244612p15765n88735l78594j16625J58815M09518O02455P13220P30229
41159B059130O60355N32024L89614K78492K28550K46426L19010M22087N27285
41150E662973O06725O38683O14003N38123M25338K89444J38694k2166j87433l48813
41140H355571m96068o16474o93129p06114o38877m86839k62767M519K77363N18631
41130E255816O98565P97148Q03972P18625N51559L22768N7730k16569m73430o87730
41120G828454q38809r13655r07679q23378o70003m64926k34018p829J85461L26272
41110C479890M05180M20091L73145K71581J31836j8801j47002k22506k25734j51463
41100D316217j0514J69623L48057M80486N33230M94408L76173K07283K0805j56092
$$ y = [1244612, 528847, -59888, -438482, -555107, -396292, 13226, 615681, 1328901, 2059130, 2719485, 3251509, 3641123, 3919615, 4148165, 4394591, 4713601, 5135688, 5662973, 6269698, 6908381, 7522384, 8060507, 8485845, 8775289, 8913983, 8891817, 8704384, 8355571, 7859503, 7243029, 6549900, 5843786, 5204909, 4718070, 4455303, 4459822, 4737185, 5255816, 5954381, 6751529, 7555501, 8274126, 8825685, 9148453, 9206183, 8989614, 8516184, 7828454, 6989645, 6075990, 5168311, 4344933, 3674930, 3210004, 2975986, 2968157, 3153618, 3479890, 3885070, 4305161, 4678306, 4949887, 5081723, 5062922, 4915920, 4693414, 4467680, 4316217, 4305703, 4475326, 4823383, 5303869, 5837099, 6331507, 6707680, 6914963, 6935768, 6779676]
41090F779676l05403m15797m79340m91351m52589l70367k56501j22894K2560J76479
41080D084473L35368M89136O19812P09187P50222P51618P30682P00725O63872
41071I835095O13918N44740M56774L57937K60380J76220J14111P6965O0960N6633
41061A2553733N2665M1279K2241K953n264P443M4202R7569J49427J77481J67038
41050A3310767J20560N6672j606m0728o2671q0627j09025j54852k14716k78283
41040A2545491l34734l76885m00376m01350l78289l37951k98282k81682l01479
41031I434463l52304m12925m59831m81270m82148m77972m83549n04181n33406
41022E246877n56297n54454n09519m05512k32469P269K93505N89263Q50269J037555
$$ y = [6779676, 6474273, 6058476, 5579136, 5087785, 4635196, 4264829, 4008328, 3885434, 3907994, 4084473, 4419841, 4908977, 5528789, 6237976, 6988198, 7739816, 8470498, 9171223, 9835095, 10449013, 10993753, 11450527, 11808464, 12068844, 12245064, 12359175, 12436140, 12497100, 12553733, 12606398, 12647677, 12669918, 12672871, 12667607, 12675050, 12719252, 12816821, 12966248, 13143729, 13310767, 13431327, 13487999, 13486393, 13445665, 13382994, 13302367, 13193342, 13038490, 12823774, 12545491, 12210757, 11833872, 11433496, 11032146, 10653857, 10315906, 10017624, 9735942, 9434463, 9082159, 8669234, 8209403, 7728133, 7245985, 6768013, 6284464, 5780283, 5246877, 4690580, 4136126, 3626607, 3221095, 2988626, 2995895, 3289400, 3878663, 4728932, 5766487]
41012E766487J125656J104060R75564P54979M67716J46204j75844m69186p13140
41003H982496q97042j018270j076852j069315r86395q18066n64535k46546R3796
40994B399271M04827O43286P86506Q32834P94830O93450N55483M10688K86711
40985G807886K04348J75277K00891K70923L63821M51498N06996N10926M53984
40976A0946550L35953J63144n3672k98931n49894p75646r41543j018980r95629
40967F811352q80582p02376n00944l16501j79324j04007q9800j25301j94817k84181
40957C433519l84719m93800o10802p30102q35708r02802r07674q41545p19493
40948b993126n77205m55515l80785l52249l43816l19274k51757j35806J4122J75416
$$ y = [5766487, 6892143, 7996203, 8971767, 9726746, 10194462, 10340666, 10164822, 9695636, 8982496, 8085454, 7067184, 5990332, 4921017, 3934622, 3116556, 2552021, 2305475, 2399271, 2804098, 3447384, 4233890, 5066724, 5861554, 6555004, 7110487, 7521175, 7807886, 8012234, 8187511, 8388402, 8659325, 9023146, 9474644, 9981640, 10492566, 10946550, 11282503, 11445647, 11391975, 11093044, 10543150, 9767504, 8825961, 7806981, 6811352, 5930770, 5228394, 4727450, 4410949, 4231625, 4127618, 4037818, 3912517, 3717700, 3433519, 3048800, 2555000, 1944198, 1214096, 378388, -524414, -1432088, -2273633, -2993126, -3570331, -4025846, -4406631, -4758880, -5102696, -5421970, -5673727, -5809533, -5795411, -5619995]
40938e619995L29859M69314N93438P03392P96397Q64320Q96653Q85278Q27440
40929G46096P25817N87953M27408K65071J27370M0235K1590P5905J92619L48727
40919C558791N15007O64025P76892Q45743Q71317Q57986Q10245P33141O35104
40910A0268251N28926M28314L42223K71982K13727J64005J24063R9406R4563J06405
40900A2641865J20880J15951O9486l1222j81284l54821n10582o07212o20919n54219
40890A0087923m31363k86603j54090o2173l0118o6241j67827l21918n05705o88524
40880G373361q38523r32288r61158r30682q56331p59942o66781o00092n72661
40871B54903n79559n97553n93311n37903m20866k56571p9400O9646J58444J74903
$$ y = [-5619995, -5290136, -4820822, -4227384, -3523992, -2727595, -1863275, -966622, -81344, 746096, 1471913, 2059866, 2487274, 2752345, 2879715, 2919950, 2941540, 3017445, 3210064, 3558791, 4073798, 4737823, 5514715, 6360458, 7231775, 8089761, 8900006, 9633147, 10268251, 10797177, 11225491, 11567714, 11839696, 12053423, 12217428, 12341491, 12440897, 12535460, 12641865, 12762745, 12878696, 12948182, 12916960, 12735676, 12380855, 11870273, 11263061, 10642142, 10087923, 9656560, 9369957, 9215867, 9153694, 9123576, 9057335, 8889508, 8567590, 8061885, 7373361, 6534838, 5602550, 4641392, 3710710, 2854379, 2094437, 1427656, 827564, 254903, -324656, -922209, -1515520, -2053423, -2474289, -2730860, -2810260, -2740614, -2582170, -2407267]
40861b407267J29879N1339k7191p8235q6984n1919J8169J08413K02991K90648
40851a850157L68358M40226N12031N85272O54244P06153P22299O80368N60191
40842C378985L53220P1084k52952n71638q36822j012329j082590j054781r53942
40833a961765q13111o63134n26788m18110l43851l03883k90648k90317k87256
40824e898863k69924k34371j83263j22018n5030J5654Q9020J62646K31764K91196
40814e973189L38442L74029L98048M06911L94903L59517L04986K41090J80348
40805b974915J37670J31100J78606K89253M54143O44653Q20962R46566J001003
40796A629041R84767R15125Q15520P03977N86720M61008L24898J85533N8135m3688
$$ y = [-2407267, -2277388, -2226049, -2253240, -2331475, -2418459, -2470378, -2452209, -2343796, -2140805, -1850157, -1481799, -1041573, -529542, 55730, 709974, 1416127, 2138426, 2818794, 3378985, 3732205, 3803289, 3550337, 2978699, 2141877, 1129548, 46958, -1007823, -1961765, -2774876, -3438010, -3964798, -4382908, -4726759, -5030642, -5321290, -5611607, -5898863, -6168787, -6403158, -6586421, -6708439, -6763469, -6747815, -6658795, -6496149, -6264385, -5973189, -5634747, -5260718, -4862670, -4455759, -4060856, -3701339, -3396353, -3155263, -2974915, -2837245, -2706145, -2527539, -2238286, -1784143, -1139490, -318528, 628038, 1629041, 2613808, 3528933, 4344453, 5048430, 5635150, 6096158, 6421056, 6606589, 6664724, 6621036]
40786F621036j17735j74885k31912l01126l83299m67029n33849n65158n46523
40777C299520m68542l27850j31426R8606L26532N14268O36733O91216O94276O68757
40767F002090O30092N80886N16048M33434L41695K59871K09039K01580K34866
40758I409601K92858L53440L96272M07784L83665L29389K57474J81027J07422
40749A2118932L7218l1611r9504j65442k29752k95381l66445m45942n33707o23812
40739I364554p02023p46774p36120o57808n15995l30495j30101N5298K00901K91092
40729F092529L21309K96965K30514J39453M6412k1557l7776J6564J47453L48380
40719G580246O03432Q89237J175447J426350J605489J682719J641824J486102
$$ y = [6621036, 6503301, 6328416, 6096504, 5795378, 5412079, 4945050, 4411201, 3846043, 3299520, 2830978, 2503128, 2371702, 2470308, 2796840, 3311108, 3947841, 4639057, 5333333, 6002090, 6632182, 7213068, 7729116, 8162550, 8504245, 8764116, 8973155, 9174735, 9409601, 9702459, 10055899, 10452171, 10859955, 11243620, 11573009, 11830483, 12011510, 12118932, 12156150, 12124539, 12025035, 11859593, 11629841, 11334460, 10968015, 10522073, 9988366, 9364554, 8662531, 7915757, 7179637, 6521829, 6005834, 5675339, 5545238, 5600536, 5801437, 6092529, 6413838, 6710803, 6941317, 7080770, 7127182, 7105625, 7067849, 7084413, 7231866, 7580246, 8183678, 9072915, 10248362, 11674712, 13280201, 14962920, 16604744, 18090846]
40711A8090846J238779R37174O22967L33232R4680p9485j90543k51611k80674
40702B0515365k92753k96214k94487k89303k81156k67333k41760j99439j43272
40693A8209648q7558n3742n9706j09087j87766k69835l29181l49821l30220k80745
40683A6151987k17109j54038j02219o8560n7009o7591r4778j28183j57174j76904
40673A4928422j91492k11344k45589k94244l45243l78034l70722l06436j77439
40664A2407879J1929K43264M84849O96544Q38174Q79699Q11083O47768M27200
40655A7448389J96137m789j51432k38519k76293k84004k81932k84668k98965l26044
40645A5497880l64743m12456m64911n17070n65264o08788o49515o89129p24744
$$ y = [18090846, 19329625, 20266799, 20889766, 21222998, 21317678, 21238193, 21047650, 20796039, 20515365, 20222612, 19926398, 19631911, 19342608, 19061452, 18794119, 18552359, 18352920, 18209648, 18122090, 18068348, 18008642, 17899555, 17711789, 17441954, 17112773, 16762952, 16432732, 16151987, 15934878, 15780840, 15678621, 15610061, 15553052, 15485461, 15390683, 15262500, 15105326, 14928422, 14736930, 14525586, 14279997, 13985753, 13640510, 13262476, 12891754, 12585318, 12407879, 12419808, 12663072, 13147921, 13844465, 14682639, 15562338, 16373421, 17021189, 17448389, 17644526, 17639737, 17488305, 17249786, 16973493, 16689489, 16407557, 16122889, 15823924, 15497880, 15133137, 14720681, 14255770, 13738700, 13173436, 12564648, 11915133, 11226004, 10501260]
40636A0501260p45869p36797o84883n89149m61789l21437j84365o0167M7179J37012
40626F900995K11386K74995L32742L85056M25171M42739M32617M01588L66167
40617A0173456L42294L34895L35024L25533K90797K25390J37826M6615l1152r2155
40607A2088523j50005k24375l23056m30608n12316n30452m62204l10129j01969
40598I043409J18646L06812M31591M86501M90783M80436M92445N48786O47043
40589A3046452P61151Q50988Q75967Q07493O37447L81781P8134k23861m78328
40580A6737224o58673p64585q16607q42223q61400q77909q78849q42379p51040
40571I443559o04546m24456k47546j11162l7744k4734m3971n2216r675J01922
$$ y = [10501260, 9755391, 9018594, 8333711, 7744562, 7282773, 6961336, 6776971, 6716804, 6763983, 6900995, 7112381, 7387376, 7720118, 8105174, 8530345, 8973084, 9405701, 9807289, 10173456, 10515750, 10850645, 11185669, 11511202, 11801999, 12027389, 12165215, 12211830, 12180678, 12088523, 11938518, 11714143, 11391087, 10960479, 10448163, 9917711, 9455507, 9145378, 9043409, 9162055, 9468867, 9900458, 10386959, 10877742, 11358178, 11850623, 12399409, 13046452, 13807603, 14658591, 15534558, 16342051, 16979498, 17361279, 17439413, 17215552, 16737224, 16078551, 15313966, 14497359, 13655136, 12793736, 11915827, 11036978, 10194599, 9443559, 8839013, 8414557, 8167011, 8055849, 8018105, 7993371, 7949400, 7897184, 7887509, 7989431]
40561G989431K70852M60127O21587P12522P09408O15219M58049K80814J25404
40552A2243413J7951l7914n7014o1366o9219r0081j25817j73945k29843k87027
40542A1129138l36574l67480l69582l38675k80058k07010j34734p3901k7235J0581
40532I004470N0408J03660J76147K63646L51478M17722M38770L96498K85958J20102
40522A1608859p1942k53179l90308m63653m71450m26799l49686k59326j70273
40513H752243r0799k1189M6740J25567K24547L44138M76692O10779P33909Q32174
40503A2034801Q89742Q91146Q26563O97906N22574L31511J60564L8061k5285l8878
40493A6328705k6380j4859k4451o2998j26649k03883k79449l37056l62435l47791
$$ y = [7989431, 8260283, 8720410, 9341997, 10054519, 10763927, 11379146, 11837195, 12118009, 12243413, 12261364, 12223450, 12166436, 12105070, 12035851, 11945770, 11819953, 11646008, 11416165, 11129138, 10792564, 10425084, 10055502, 9716827, 9436769, 9229759, 9095025, 9021124, 8993889, 9004470, 9054878, 9158538, 9334685, 9598331, 9949809, 10367531, 10806301, 11202799, 11488757, 11608859, 11536917, 11283738, 10893430, 10429777, 9958327, 9531528, 9181842, 8922516, 8752243, 8661444, 8640255, 8686995, 8812562, 9037109, 9381247, 9857939, 10468718, 11202627, 12034801, 12924543, 13815689, 14642252, 15340158, 15862732, 16194243, 16354807, 16392868, 16367583, 16328705, 16302325, 16287466, 16263015, 16200017, 16073368, 15869485, 15590036, 15252980, 14890545, 14542754]
40483A4542754k95495k17513j29850m5593K8942R3445J50336K01780K48690K91426
40473A4868922L31341L71855M18426M77220N52734O44540P44202Q34927Q96354
40464B0140521R13625Q85480Q25737P56527O97173O54958O22143N79879N06061
40455B6582104L83370K05257k0793k73603n23304p40122r02760j002164j040292
40446B2667693j026892r76675r06720q33488p70290p25881p03414o98842p00028
40437A5325463o88978o47550n63739m35278k69718q2823J03058K61605L68261
40428A3370301M08822L86015L18130K29357J38589N4551k1172q8617j47076j96631
40418A4452269k40524k85477l38965m03885m72697n25511n36106m84843l71175
$$ y = [14542754, 14247259, 14029746, 13899896, 13854303, 13883245, 13976690, 14127026, 14328806, 14577496, 14868922, 15200263, 15572118, 15990544, 16467764, 17020498, 17665038, 18409240, 19244167, 20140521, 21054146, 21939626, 22765363, 23521890, 24219063, 24874021, 25496164, 26076043, 26582104, 26965474, 27170731, 27149938, 26876335, 26353031, 25612909, 24710149, 23707985, 22667693, 21640801, 20664126, 19757406, 18923918, 18153628, 17427747, 16724333, 16025491, 15325463, 14636485, 13988935, 13425196, 12989918, 12720200, 12637377, 12740435, 13002040, 13370301, 13779123, 14165138, 14483268, 14712625, 14851214, 14905765, 14884593, 14795976, 14648900, 14452269, 14211745, 13926268, 13587303, 13183418, 12710721, 12185210, 11649104, 11164261, 10793086]
40409A0793086k17424o1206N9113J18718J14351O2933q542p6517j29796j69315
40399A0485401k01256k30130k56034k75672k84925k82129k71189k62386k68892
40390H152788k99708l52715m11733m50126m40901l69594k43173q8861N7315J65475
40380E718767K21968K30971K09790J81826J69003J84355K27402K85754L42614
40371G772450L84041M00183L82238L22885K23678J02485q950p8206q5963k9961
40361I384880Q0940K33841M12561N93392P43764Q30116Q32825P58083O36705N08774
40351A5015881M04081L31328K81600K40486J97863J48968Q9229J1068r1591k13406
40341A6415507l30785m05729m00569k96374j04870J33215L63700N41295O47570
$$ y = [10793086, 10575662, 10514456, 10573569, 10692287, 10806638, 10869571, 10861029, 10784512, 10654716, 10485401, 10284145, 10054015, 9797981, 9522309, 9237384, 8955255, 8684066, 8421680, 8152788, 7853080, 7500365, 7088632, 6638506, 6197605, 5828011, 5584838, 5495977, 5553292, 5718767, 5940735, 6171706, 6381496, 6563322, 6732325, 6916680, 7144082, 7429836, 7772450, 8156491, 8556674, 8938912, 9261797, 9485475, 9587960, 9579010, 9500804, 9414841, 9384880, 9465820, 9699661, 10112222, 10705614, 11449378, 12279494, 13112319, 13870402, 14507107, 15015881, 15419962, 15751290, 16032890, 16273376, 16471239, 16620207, 16709436, 16720504, 16628913, 16415507, 16084722, 15678993, 15278424, 14982050, 14877180, 15010395, 15374095, 15915390, 16562960]
40332A6562960O95526P19135P54302Q21625R19399J028758J125736J191421J214885
40323B5033747J190625J116566R95870Q40343O70730N11831L84376K97766K47893
40314C1289747K21314K02805J80556J45969R1204R828r8561k24890l53127m67227
40304C0997618n56291o13618o31624n98597n01931l37281j18059J21628L34127
40295B8095972M73243N10317M43517K95670J02072j04235l00860m74841o16585
40286B8424270p16580p67206p65487p13003o14471m78800l21855j65750l2322
40277B3848796O4695J22149J43643J34437R9984M8193p853n0059n9711k5398M9299
40266B4368175J43815K27385K71911K63467K05952J15817J2553q8320j76219k42993
$$ y = [16562960, 17258486, 17977621, 18731923, 19553548, 20472947, 21501705, 22627441, 23818862, 25033747, 26224372, 27340938, 28336808, 29177151, 29847881, 30359712, 30744088, 31041854, 31289747, 31511061, 31713866, 31894422, 32040391, 32131595, 32141423, 32042862, 31817972, 31464845, 30997618, 30441327, 29827709, 29196085, 28597488, 28095557, 27758276, 27640217, 27761845, 28095972, 28569215, 29079532, 29523049, 29818719, 29920791, 29816556, 29515696, 29040855, 28424270, 27707690, 26940484, 26174997, 25461994, 24847523, 24368723, 24046868, 23881118, 23848796, 23913491, 24035640, 24179283, 24313720, 24413704, 24461897, 24454044, 24403985, 24344274, 24318876, 24368175, 24511990, 24739375, 25011286, 25274753, 25480705, 25596522, 25609075, 25520755, 25344536, 25101543]
40256B5101543k82587k95037k90089k84449k92730l18867l54394l83545l90658
40247B2209187l65369l04138k09081q6379N4054J98706L33264M48331N43909O27936
40237B3450420P09396P90934Q65177R15557R21031Q63875P37877N52237L28542
40228C0135046R3217j29811l23629m80464o01843o95947p72164q35328q83528
40219B5505549r11038r13944q93097q50954p84578o81896n26565l09790m1223
40210A9592464K48498N16006P20445Q38207Q69872Q36609P69801P00611O53289
40201B5745802O41623O66880P17597P72436Q06081P97273P37007O33230N07365
40192C2025294L82533K71141J71258P3993k5481j22463k05562k63853k92194k91384
$$ y = [25101543, 24818956, 24523919, 24233830, 23949381, 23656651, 23337784, 22983390, 22599845, 22209187, 21843818, 21539680, 21330599, 21244220, 21298274, 21496980, 21830244, 22278575, 22822484, 23450420, 24159816, 24950750, 25815927, 26731484, 27652515, 28516390, 29254267, 29806504, 30135046, 30228263, 30098452, 29774823, 29294359, 28692516, 27996569, 27224405, 26389077, 25505549, 24594511, 23680567, 22787470, 21936516, 21151938, 20470042, 19943477, 19633687, 19592464, 19840962, 20356968, 21077413, 21915620, 22785492, 23622101, 24391902, 25092513, 25745802, 26387425, 27054305, 27771902, 28544338, 29350419, 30147692, 30884699, 31517929, 32025294, 32407827, 32678968, 32850226, 32924219, 32898738, 32776275, 32570713, 32306860, 32014666, 31723282]
40182C1723282k63903k09225j22685J704J66943L69409N95886Q21735J012873
40173C4096019J134135J162075J096051R60739P97361O47079N35163M64807M22651
40164D1316080L89898L50628K94026K13006J02572m0356k14993m13162o17044
40155D1380655q01577r41026j015274j012659r30624p76697n68621l30860q7873
40146C4915444J40943L40519M95470N88368O05833N49460M41712L19768K20377
40137C8617894J66486J63005K00167K59076L17653L58307L75966L81221L94728
40128D1234503M34807N05128N90157O61919O94805O78703O21670N41744M56257
40119D6419693L76971L12024K68974K53827K65802K92558L11095K96575K35591
$$ y = [31723282, 31459379, 31250154, 31127469, 31129173, 31296116, 31665525, 32261411, 33083146, 34096019, 35230154, 36392229, 37488280, 38449019, 39246380, 39893459, 40428622, 40893429, 41316080, 41705978, 42056606, 42350632, 42563638, 42666210, 42625854, 42410861, 41997699, 41380655, 40579078, 39638052, 38622778, 37610119, 36679495, 35902798, 35334177, 35003317, 34915444, 35056387, 35396906, 35892376, 36480744, 37086577, 37636037, 38077749, 38397517, 38617894, 38784380, 38947385, 39147552, 39406628, 39724281, 40082588, 40458554, 40839775, 41234503, 41669310, 42174438, 42764595, 43426514, 44121319, 44800022, 45421692, 45963436, 46419693, 46796664, 47108688, 47377662, 47631489, 47897291, 48189849, 48500944, 48797519, 49033110]
40110D9033110J35895K5295o1061r7238p6072o340R7690K24415L65652N13439
40100E0154785O59203P96185R21133J032896J130352J212348J278750J329944
40092E8515596J364701J378568J363919J311010J209405J050523Q31649N60088
40084F7585459K54889n5879l41865n78292p50952q56618q99944q89419q34454
40075F2632925p44451o29772n02660l75453k55776j42508k7072R9621K39127L81533
40065F0675514N07874N97679O38581O33434O00759N67510N57748N83429O41665
40056F6004193P18391P95140Q55353Q88790Q93978Q78106Q53292Q29807Q10026
40047G3527076P86987P48347O83045N87604M69756L47475K42963J74694J52853
$$ y = [49033110, 49169005, 49194300, 49133239, 49036001, 48959929, 48953589, 49051279, 49275694, 49641346, 50154785, 50813988, 51610173, 52531306, 53564202, 54694554, 55906902, 57185652, 58515596, 59880297, 61258865, 62622784, 63933794, 65143199, 66193722, 67025371, 67585459, 67840348, 67784469, 67442604, 66864312, 66113360, 65256742, 64356798, 63467379, 62632925, 61888474, 61258702, 60756042, 60380589, 60124813, 59982305, 59955233, 60054854, 60293981, 60675514, 61183388, 61781067, 62419648, 63053082, 63653841, 64221351, 64779099, 65362528, 66004193, 66722584, 67517724, 68373077, 69261867, 70155845, 71033951, 71887243, 72717050, 73527076, 74314063, 75062410, 75745455, 76333059, 76802815, 77150290, 77393253, 77567947, 77720800]
40038G7720800J80006K52945L61586M86937O04609O95607P57375Q05701Q64840
40029H2730406R52327J068030J193125J298372J356508J352433J286573J170637
40021I2408411J019211Q43165O49611M47859K55582R8021j682l5023j4378L2204
40011I5702981P3705Q7370O2478j622r7369k08489l10842l79022l96742l63766
40001I4168682k94208k08059j22169m5047K4211R4324J78436K89368M34622O12766
39991I5132926Q12624J015992J202934J357437J470784J541933J575906J581669
39983A05692205J570168J552495J538127J532762J535860J539344J529794J494111
39975A17984866J425490J326272J207499J087139R87542R30556R29983R84588
$$ y = [77720800, 77900806, 78153751, 78515337, 79002274, 79606883, 80302490, 81059865, 81865566, 82730406, 83682733, 84750763, 85943888, 87242260, 88598768, 89951201, 91237774, 92408411, 93427622, 94270787, 94920398, 95368257, 95623839, 95721860, 95720178, 95685155, 95670777, 95702981, 95776686, 95864056, 95926534, 95924912, 95827543, 95619054, 95308212, 94929190, 94532448, 94168682, 93874474, 93666415, 93544246, 93499199, 93523410, 93617734, 93796170, 94085538, 94520160, 95132926, 95945550, 96961542, 98164476, 99521913, 100992697, 102534630, 104110536, 105692205, 107262373, 108814868, 110352995, 111885757, 113421617, 114960961, 116490755, 117984866, 119410356, 120736628, 121944127, 123031266, 124018808, 124949364, 125879347, 126863935]
39967A26863935J076239J175451J252505J289048J284040J250758J207521J169393
39959A36568890J146304J146026J175963J240507J336828J454060J576806J689629
39951A47335013J779435J836449J856266J842692J807778J766459J728225J692285
39943A61644602J650206J593728J521823J442712J370634J319580J296375J295788
39935A73135448J301003J290569J248898J173865J076615R74371Q82219Q09971
39927A81892959P65035P56662P95892Q89849J034545J212074J394937J555425
39919A90297378J674536J745698J771952J759888J715358J643741J553002J455727
39911B03617280J368152J307338J287940J318474J396930J508381J627936J728747
$$ y = [126863935, 127940174, 129115625, 130368130, 131657178, 132941218, 134191976, 135399497, 136568890, 137715194, 138861220, 140037183, 141277690, 142614518, 144068578, 145645384, 147335013, 149114448, 150950897, 152807163, 154649855, 156457633, 158224092, 159952317, 161644602, 163294808, 164888536, 166410359, 167853071, 169223705, 170543285, 171839660, 173135448, 174436451, 175727020, 176975918, 178149783, 179226398, 180200769, 181082988, 181892959, 182657994, 183414656, 184210548, 185100397, 186134942, 187347016, 188741953, 190297378, 191971914, 193717612, 195489564, 197249452, 198964810, 200608551, 202161553, 203617280, 204985432, 206292770, 207580710, 208899184, 210296114, 211804495, 213432431, 215161178]
39903B15161178J790018J800781J760560J680216J582199J495469J444283J437788
39895B28152492J468784J521598J580851J634342J671212J680979J655924J594677
39887B40960859J504614J402579J313590J265334J277990J354170J476757J617575
39879B52173468J750678J859969J936666J971881J953696J872949J733623J559259
39871B66812189J389660J268491J228236J279738J410124J588220J774023J929209
39863B78679890K026200K053291K014469J924941J805144J675282J551387J444111
39855B93174715J361041J310521J301953J339831J415253J502968J568807J584561
39847C04559650J541808J456900J364389J302196J295290J344826J426757J500381
$$ y = [215161178, 216951196, 218751977, 220512537, 222192753, 223774952, 225270421, 226714704, 228152492, 229621276, 231142874, 232723725, 234358067, 236029279, 237710258, 239366182, 240960859, 242465473, 243868052, 245181642, 246446976, 247724966, 249079136, 250555893, 252173468, 253924146, 255784115, 257720781, 259692662, 261646358, 263519307, 265252930, 266812189, 268201849, 269470340, 270698576, 271978314, 273388438, 274976658, 276750681, 278679890, 280706090, 282759381, 284773850, 286698791, 288503935, 290179217, 291730604, 293174715, 294535756, 295846277, 297148230, 298488061, 299903314, 301406282, 302975089, 304559650, 306101458, 307558358, 308922747, 310224943, 311520233, 312865059, 314291816, 315792197]
39839C15792197J523629J469326J335695J146375R40347P56964O23176N47707
39831C24135416N22840N30579N49016N57053N38978M90519M24355L69788L63543
39822C28482087M34827N92220Q18551J075443J315252J495918J593004J603856
39814C37411158J543140J433574J297144J149493R97936Q43383O85499N27540
39806C45888867L75924K34684J00996l2051j67555k99927m17995n12839n82868
39797C44587236o32235o64600o77506o62552o12487n30820m35722l53332l04265
39788C39713717k92913l06680l24595l29046l13823k84908k55122k37305k40475
39779C37128850k69511l25474m04748m98698n96048o87439p69668q47973r36018
$$ y = [315792197, 317315826, 318785152, 320120847, 321267222, 322207569, 322964533, 323587709, 324135416, 324658256, 325188835, 325737851, 326294904, 326833882, 327324401, 327748756, 328118544, 328482087, 328916914, 329509134, 330327685, 331403128, 332718380, 334214298, 335807302, 337411158, 338954298, 340387872, 341685016, 342834509, 343832445, 344675828, 345361327, 345888867, 346264791, 346499475, 346600471, 346568420, 346400865, 346100938, 345682943, 345170104, 344587236, 343955001, 343290401, 342612895, 341950343, 341337856, 340807036, 340371314, 340017982, 339713717, 339420804, 339114124, 338789529, 338460483, 338146660, 337861752, 337606630, 337369325, 337128850, 336859339, 336533865, 336129117, 335630419, 335034371, 334346932, 333577264, 332729291, 331793273]
39770C31793273j052378j212567j418980j654532j884919k069285k174580k187439
39762C18138593k118460j996713j856638j724560j612190j519198j440015j368525
39754C04502294j298761j224493j141051j049250r58394q85342q48991q62258
39746B96233754r25197j022631j127956j212238j255323j254133j223492j188286
39738B87024498j171203j183416j223328j282241j351604j427083j507920j593606
39730B76284097j681040j764519j837645j894278j927941j932608j907334j861077
39722B61477655j811246j775107j761071j766785j783058j797793j797443j769198
39714B47215954j706390j614463j512289j426227j379236j380351j420062j474454
$$ y = [331793273, 330740895, 329528328, 328109348, 326454816, 324569897, 322500612, 320326032, 318138593, 316020133, 314023420, 312166782, 310442222, 308830032, 307310834, 305870819, 304502294, 303203533, 301979040, 300837989, 299788739, 298830345, 297945003, 297096012, 296233754, 295308557, 294285926, 293157970, 291945732, 290690409, 289436276, 288212784, 287024498, 285853295, 284669879, 283446551, 282164310, 280812706, 279385623, 277877703, 276284097, 274603057, 272838538, 271000893, 269106615, 267178674, 265246066, 263338732, 261477655, 259666409, 257891302, 256130231, 254363446, 252580388, 250782595, 248985152, 247215954, 245509564, 243895101, 242382812, 240956585, 239577349, 238196998, 236776936, 235302482]
39706B35302482j515986j525498j499508j449975j396755j356368j332956j316820
39698B23908616j291115j241503j162003j054277r23117p73095o09249m40233
39690B16414024k79468j41616l7061K9982N7683M1749k4880j47376l24580n48426
39680B15040031q06284j083006j361325j621827j843943k008882k104092k127196
39672B02083476k086717j998931j883317j759380j645202j556156j503063j490001
39664A88160709j511674j550799j578321j560200j470091j300969j067920q00794
39656A77319941n32809k92570j02571J8504N4805l088j51800l71596o29654q88459
39646A74420703j114086j281543j378550j408812j392113j357383j329983j319697
$$ y = [235302482, 233786496, 232260998, 230761490, 229311515, 227914760, 226558392, 225225436, 223908616, 222617501, 221375998, 220213995, 219159718, 218236601, 217463506, 216854257, 216414024, 216134556, 215992940, 215955879, 215985861, 216043544, 216085293, 216060413, 215913037, 215588457, 215040031, 214233747, 213150741, 211789416, 210167589, 208323646, 206314764, 204210672, 202083476, 199996759, 197997828, 196114511, 194355131, 192709929, 191153773, 189650710, 188160709, 186649035, 185098236, 183519915, 181959715, 180489624, 179188655, 178120735, 177319941, 176787132, 176494562, 176391991, 176410495, 176465300, 176462212, 176310412, 175938816, 175309162, 174420703, 173306617, 172025074, 170646524, 169237712, 167845599, 166488216, 165158233, 163838536]
39638A63838536j316868j299207j245571j148919j020978q86648p72410o95433
39630A55452502o57886o47856o46480o38422o20044n99945n91940o06116o43923
39621A49799890o99132p63186q31869r09088j004703j127762j280880j459551
39613A41723719j653923j848764k022088k147314k200401k167342k046749j847806
39605A25789332j587996j292455r92417p19171m94874l26358k07403j28467q6316
39596A19953875q6333j36866k40772l89363n60682p22430q39801q86528q53903
39587A15237197p52333o05139m40392k86578j72010j23197j58638k80818m72564
39578A11945528p01333r29476j125324j270721j362712j409282j421624j407342
$$ y = [163838536, 162521668, 161222461, 159976890, 158827971, 157806993, 156920345, 156147935, 155452502, 154794616, 154146760, 153500280, 152861858, 152241814, 151641869, 151049929, 150443813, 149799890, 149100758, 148337572, 147505703, 146596615, 145591912, 144464150, 143183270, 141723719, 140069796, 138221032, 136198944, 134051630, 131851229, 129683887, 127637138, 125789332, 124201336, 122908881, 121916464, 121197293, 120702419, 120376061, 120168658, 120040191, 119953875, 119867542, 119730676, 119489904, 119100541, 118539859, 117817429, 116977628, 116091100, 115237197, 114484864, 113879725, 113439333, 113152755, 112980745, 112857548, 112698910, 112418092, 111945528, 111244195, 110314719, 109189395, 107918674, 106555962, 105146680, 103725056, 102317714]
39570A02317714j368115j301789j205973j080712r29758p60962n86129m20327
39562I4663949k80105j80049j28188j22929j53901k05728k61637l05894l27172
39553I2698346l23409l04155k85767k80471k86528k86819k57556j82533o5331
39544I0425777O7801J77266K28090K06835J27061J9723q5045j72258k43998l10514
39534I0440738l79778m53075n26767n95259o51547o86316o89003o52367n78019
39525H5228607m78529l74078k86010k31353k19614k50758l15052l97756m88583
39516H2186874n88701p07081q46861r93374j115353j179696j168535j086310r53519
39507G3547444p93734o23400m49875k76798j11697L0360J30719J77020J71248
$$ y = [102317714, 100949599, 99647810, 98441837, 97361125, 96431367, 95670405, 95084276, 94663949, 94383844, 94203795, 94075607, 93952678, 93798777, 93593049, 93331412, 93025518, 92698346, 92374937, 92070782, 91785015, 91504544, 91218016, 90931197, 90673641, 90491108, 90425777, 90493578, 90670844, 90898934, 91105769, 91232830, 91252553, 91167508, 90995250, 90751252, 90440738, 90060960, 89607885, 89081118, 88485859, 87834312, 87147996, 86458993, 85806626, 85228607, 84750078, 84376000, 84089990, 83858637, 83639023, 83388265, 83073213, 82675457, 82186874, 81598173, 80891092, 80044231, 79050857, 77935504, 76755808, 75587273, 74500963, 73547444, 72753710, 72130310, 71680435, 71403637, 71291940, 71322300, 71453019, 71630039, 71801287]
39498G1801287J28519O7071j453p3015j44638k08977k56188k80721k85927k82186
39488G0463772k80538k87174l02377l22447l40256l42997l11499k26465q0319
39479F7969700J13971L24650N12990O47590P13583P13379O60054N67734M45127
39470G2668778K96556J29248l9729j83520k73354k88934k25134r2652Q5152K76602
39460G2353013M47036N65980O14896N91921N10937L95362K69558J51538N0478
39451G5950719k9823q5190j09689j01549p0833m0050l5168p3812j58822k79212
39441G4966571m14942n42533o41586p01632p26010p29034p27011p28583p30819
39432F9024421p23910p00957o65429o30595o12087o19865o54600p08227p66065
$$ y = [71801287, 71929806, 71996877, 71995424, 71922409, 71777771, 71568794, 71312606, 71031885, 70745958, 70463772, 70183234, 69896060, 69593683, 69271236, 68930980, 68587983, 68276484, 68050019, 67969700, 68083671, 68408321, 68921311, 69568901, 70282484, 70995863, 71655917, 72223651, 72668778, 72965334, 73094582, 73054853, 72871333, 72597979, 72309045, 72083911, 71991259, 72076411, 72353013, 72800049, 73366029, 73980925, 74572846, 75083783, 75479145, 75748703, 75900241, 75950719, 75920896, 75835706, 75726017, 75624468, 75553635, 75513585, 75478417, 75404605, 75245783, 74966571, 74551629, 74009096, 73367510, 72665878, 71939868, 71210834, 70483823, 69755240, 69024421, 68300511, 67599554, 66934125, 66303530, 65691443, 65071578, 64416978, 63708751, 62942686]
39423F2942686q10125q24256p99538p36466o43175n32289m18054l13082k25524
39414E7640177j60219j24440j32025j98772l30378n12865p13920q94802j024979
39405E3547777j091016j095508j048570r59756q36965o91025n38319l96860k79268
39396D6610490j89236j23436p5935m2087k0771j4572k7583o1959j15562j81916
39386D5757433k51971l15965l64426l88512l81525l42736k81148k14583j62680
39377D3053887j38501j44542j74385k17029k61859l03425l43574l88260m41040
39368D0641272m99633n58580o14017o65045p11661p53109p88202q15657q32905
39359C4402463q34444q11511p53654o52533n07240l28600j38842L4069J64167
$$ y = [62942686, 62132561, 61308305, 60508767, 59772301, 59129126, 58596837, 58178783, 57865701, 57640177, 57479958, 57355518, 57223493, 57024721, 56694343, 56181478, 55467558, 54572756, 53547777, 52456761, 51361253, 50312683, 49352927, 48515962, 47824937, 47286618, 46889758, 46610490, 46421254, 46297818, 46221883, 46179796, 46159025, 46144453, 46116870, 46054911, 45939349, 45757433, 45505462, 45189497, 44825071, 44436559, 44055034, 43712298, 43431150, 43216567, 43053887, 42915386, 42770844, 42596459, 42379430, 42117571, 41814146, 41470572, 41082312, 40641272, 40141639, 39583059, 38969042, 38303997, 37592336, 36839227, 36051025, 35235368, 34402463, 33568019, 32756508, 32002854, 31350321, 30843081, 30514481, 30375639, 30409708, 30573875]
39350C0573875K33387K34538J72037N9974q2940k39815l99780n58109p14152q69335
39340B8409680j025401j182065j334758j474489j590033j670504j706268j688698
39332A6737464j610593j468708j267716j022568p55876m90031k39500r995J94769
39323A0067246L65780M88500N50060N47917M94029M12624L32486K76658K54434
39314A3789734K60312K80190K99709L09212L03466K78869K31894J61056P1156
39305A5985598k4974j10622j73261k09521k22951k17589j93435j46138o8987M4098
39295A4662218J93617L68559N44710O91926P88084Q30699Q37410Q34343Q39437
39286B0591003Q50950Q47656Q00556O89065N11995K87213M2000j97199m08896
$$ y = [30573875, 30807262, 31041800, 31213837, 31273811, 31190871, 30951056, 30551276, 29993167, 29279015, 28409680, 27384279, 26202214, 24867456, 23392967, 21802934, 20132430, 18426162, 16737464, 15126871, 13658163, 12390447, 11367879, 10612003, 10121972, 9882472, 9872477, 10067246, 10433026, 10921526, 11471586, 12019503, 12513532, 12926156, 13258642, 13535300, 13789734, 14050046, 14330236, 14629945, 14939157, 15242623, 15521492, 15753386, 15914442, 15985598, 15960624, 15850002, 15676741, 15467220, 15244269, 15026680, 14833245, 14687107, 14618120, 14662218, 14855835, 15224394, 15769104, 16461030, 17249114, 18079813, 18917223, 19751566, 20591003, 21441953, 22289609, 23090165, 23779230, 24291225, 24578438, 24620438, 24423239, 24014343]
39277B4014343n75761o84864p31279p20674o66842n86174m94597m08056l42243
39268A8803853l07841l03980l16643l25933l18748k98313k83542k98137l55795
39259A5994921m49813n52170o22715o24593n39027l72320j52096Q3909L00373
39250A3066469M72969N90453O50082O49966N85212M52301K58261K5692k11313
39241A6540092m17051n63024o32541o22203n41685m11798k60296j15514J088Q0568
39231A3057636J26145J45264J38522R3843q680j83501m26333p09822r91443j229180
39221A0012451j395701j483524j500275j458728j367858j229343j041243q06722
39213b70943n41486k73391l3516J55182K83900L56329L83023L77064L53394L29698
$$ y = [24014343, 23438582, 22753718, 22022439, 21301765, 20634923, 20048749, 19554152, 19146096, 18803853, 18496012, 18192032, 17875389, 17549456, 17230708, 16932395, 16648853, 16350716, 15994921, 15545108, 14992938, 14370223, 13745630, 13206603, 12834283, 12682187, 12766096, 13066469, 13539438, 14129891, 14779973, 15429939, 16015151, 16467452, 16725713, 16751405, 16540092, 16123041, 15560017, 14927476, 14305273, 13763588, 13351790, 13091494, 12975980, 12977068, 13057636, 13183781, 13329045, 13467567, 13561410, 13552730, 13369229, 12942896, 12233074, 11241631, 10012451, 8616750, 7133226, 5632951, 4174223, 2806365, 1577022, 535779, -270943, -812429, -1085820, -1119336, -964154, -680254, -323925, 59098, 436162, 789556, 1119254]
39203A119254L24482L50511M07295M79716N45353N85070N88842N55088M88581
39194E444192M01042L12008K45195K19964K42703L03306L78771M42811M77949
39185H467941M84188M78658M85733N23604N95156O87092P75966Q37513Q56080
39176A4191931Q31280P79101P25746O95530O98104P22280P41462P28800O73118
39167B0787352N85712M94665M31674M19429M64496N56194O70376P76375Q44298
39158B6030571Q49802P76433O18325L83996R7514k06980m95591p43497r38347
39149B6372226j079798j177963j250107j313866j378622j439812j479545j473829
39141A5778684j404413j270732j094605r11942p54539o34152n39500m46395l32468
$$ y = [1119254, 1443736, 1794247, 2201542, 2681258, 3226611, 3811681, 4400523, 4955611, 5444192, 5845234, 6157242, 6402437, 6622401, 6865104, 7168410, 7547181, 7989992, 8467941, 8952129, 9430787, 9916520, 10440124, 11035280, 11722372, 12498338, 13335851, 14191931, 15023211, 15802312, 16528058, 17223588, 17921692, 18643972, 19385434, 20114234, 20787352, 21373064, 21867729, 22299403, 22718832, 23183328, 23739522, 24409898, 25186273, 26030571, 26880373, 27656806, 28275131, 28659127, 28756641, 28549661, 28054070, 27310573, 26372226, 25292428, 24114465, 22864358, 21550492, 20171870, 18732058, 17252513, 15778684, 14374271, 13103539, 12008934, 11096992, 10342453, 9708301, 9168801, 8722406, 8389938]
39132H389938j88444k3066J39189K68097L42797L63159L48256L21691K95197K63821
39122A0520635K15235J43141N3007m2093j28890j98620k48907k84606l16241l54344
39112I358317m02151m52728m93275n13600n13287n03716n04105n32765n97409
39103D845281o89303p84582q51967q62730p98552o54387m36778j60660J52088
39094b41590M71959P62689R87268J118455J148017J088930R69411Q23011O79829
39085G807979N60752M74435M17229L77501L43151L07803K71937K39895K16461
39076A1017143K05052K06924K21374K47203K84424L33445L91594M50326M96668
39067A3854153N18826N12373M82850M42161M00297L58387L09208K44848J64038
$$ y = [8389938, 8201494, 8178428, 8317617, 8585714, 8928511, 9291670, 9639926, 9961617, 10256814, 10520635, 10735870, 10879011, 10932018, 10889925, 10761035, 10562415, 10313508, 10028902, 9712661, 9358317, 8956166, 8503438, 8010163, 7496563, 6983276, 6479560, 5975455, 5442690, 4845281, 4155978, 3371396, 2519429, 1656699, 858147, 203760, -233018, -393678, -241590, 230369, 993058, 1980326, 3098781, 4246798, 5335728, 6305139, 7128150, 7807979, 8368731, 8843166, 9260395, 9637896, 9981047, 10288850, 10560787, 10800682, 11017143, 11222195, 11429119, 11650493, 11897696, 12182120, 12515565, 12907159, 13357485, 13854153, 14372979, 14885352, 15368202, 15810363, 16210660, 16569047, 16878255, 17123103, 17287141]
39058A7287141P2766k0678j10044j91724k63263l22252l66374l94165m06252m05727
39048A4879428l96525l80879l59329l34539l15738l18637l59085m43861n64591
39039A1406244o99123q20431r08266r56754r73022r67920r45585q99315q16082
39030C419746o84942n03230k78805l0503K12440M15013N46622N92843N62039M83580
39020D734803L99067L49341L60806M36242N55410O85443P94401Q60494Q74464
39011A0050471Q38064P62115O64698N67585M89744M40217M14773L99221L77146
39002A5004034L37202K76669K01140J21088M6452j8077p3847j24664j72542k16045
38992A5381410k50994k71538k71497k47279k01784j46524r9925q2049j07768j80648
$$ y = [17287141, 17359907, 17339229, 17229185, 17037461, 16774198, 16451946, 16085572, 15691407, 15285155, 14879428, 14482903, 14102024, 13742695, 13408156, 13092418, 12773781, 12414696, 11970835, 11406244, 10707121, 9886690, 8978424, 8021670, 7048648, 6080728, 5135143, 4235828, 3419746, 2734804, 2231574, 1952769, 1922266, 2134706, 2549719, 3096341, 3689184, 4251223, 4734803, 5133870, 5483211, 5844017, 6280259, 6835669, 7521112, 8315513, 9176007, 10050471, 10888535, 11650650, 12315348, 12882933, 13372677, 13812894, 14227667, 14626888, 15004034, 15341236, 15617905, 15819045, 15940133, 15986585, 15968508, 15894661, 15769997, 15597455, 15381410, 15130416, 14858878, 14587381, 14340102, 14138318, 13991794, 13891869, 13809820, 13702052, 13521404]
38982A3521404k90394m15649n31052o14846o53746o44649n94442n17907m32788
38973H825931l52943k83691k22450j63078r9016k3469P0053J83799L11232M37388
38963H683756N44677O18855O50739O34741N67817M49920K85394Q5143j30724l32512
38953A2057806m85982n62217n47935m51388l01421j39619q193O1839N8238j0405
38943I670723j17383k25457k98587l13770k66611j67803l4590J15809K66734L98357
38933I027422M85498N02174M32881K83713Q4529j20940k91533m02690m52315m57394
38923I091345m43588m32526m33467m43976m57643m71297m85512m99082n03569
38914D920685m83109m20280l04187j36053P0644K95146N16162P16799Q86157J018626
$$ y = [13521404, 13231010, 12815361, 12284309, 11669463, 11015717, 10371068, 9776626, 9258719, 8825931, 8472988, 8189297, 7966847, 7803769, 7704753, 7681284, 7751337, 7935136, 8246368, 8683756, 9228433, 9847288, 10498027, 11132768, 11700585, 12150505, 12435899, 12521042, 12390318, 12057806, 11571824, 11009607, 10461672, 10010284, 9708863, 9569244, 9561051, 9622890, 9681128, 9670723, 9553340, 9327883, 9029296, 8715526, 8448915, 8281112, 8246522, 8362331, 8629065, 9027422, 9512920, 10015094, 10447975, 10731688, 10816217, 10695277, 10403744, 10001054, 9548739, 9091345, 8647757, 8215231, 7781764, 7337788, 6880145, 6408848, 5923336, 5424254, 4920685, 4437576, 4017296, 3713109, 3577056, 3647700, 3942846, 4459008, 5175807, 6061964, 7080590]
38904G080590J112542J168336J186085J163781J098813R92467Q53381O96041N35164
38895A5887200L81240K40627J18767K2278m2150p1123o7852m3175j2728R374J7286
38884A6439744J6519K1308M7191J02100J80018K61385L21372L41734L18424K60197
38874A8309992J80565Q9838q319j15742k36032l69973n11990o49780p67759q52454
38864A5068346q97205r04776q86972q60189q37694q22903q08631p82642p35206
38855G532128o64137n76240m85719m09428l59967l40030l41465l48904l44970
38846C661268l15108k52073j58790m6611P1820J90181L10149M35710N65931O93235
38836E155712Q07921R03179R75099J019075J028536R98587R30442Q31327P10672
$$ y = [7080590, 8193132, 9361468, 10547553, 11711334, 12810147, 13802614, 14655995, 15352036, 15887200, 16268440, 16509067, 16627834, 16650112, 16607962, 16536839, 16468987, 16425812, 16413084, 16422458, 16439744, 16456263, 16477571, 16524762, 16626862, 16806880, 17068265, 17389637, 17731371, 18049795, 18309992, 18490557, 18580395, 18572076, 18456334, 18220302, 17850329, 17338339, 16688559, 15920800, 15068346, 14171141, 13266365, 12379393, 11519204, 10681510, 9858607, 9049976, 8267334, 7532128, 6867991, 6291751, 5806032, 5396604, 5036637, 4696607, 4355142, 4006238, 3661268, 3346160, 3094087, 2935297, 2888686, 2960506, 3150687, 3460836, 3896546, 4462477, 5155712, 5963633, 6866812, 7841911, 8860986, 9889522, 10888109, 11818551, 12649878, 13360550]
38827A3360550N77480M40982L11097J95565R6125Q647p2019j46813k11397k59299
38817A4300918k86231k92943k85984k76168k74030k83443k97798l03571k90130
38808A1710620k57492k14730j71177j30139r0742n3852k3961n134L797R569K0182
38797A0796941L9570O4809Q7033R4883P7943K8790n5539j71835l09927m54980
38787A0197688n92041p09610q00558q62483q99247r21611r43418r73844j011116
38778B483760j042451j049655j015497r27128p77249n66186l05564k0397K54814
38769b965553M86197O51441P44503P71303P40524O57059N22963L44499J39210
38760B092146o2283k21680l04035k91032j90872l8406J16894K29211K69814K28765
$$ y = [13360550, 13938030, 14379012, 14690109, 14885674, 14981799, 14990446, 14918427, 14771614, 14560217, 14300918, 14014687, 13721744, 13435760, 13159592, 12885562, 12602119, 12304321, 12000750, 11710620, 11453128, 11238398, 11067221, 10937082, 10846340, 10792488, 10768527, 10763393, 10767190, 10776759, 10796941, 10836511, 10901320, 10988353, 11083236, 11161179, 11189969, 11134430, 10962595, 10652668, 10197688, 9605647, 8896037, 8095479, 7232996, 6333749, 5412138, 4468720, 3494876, 2483760, 1441309, 391654, -623843, -1550971, -2328220, -2894406, -3199970, -3220367, -2965553, -2479356, -1827915, -1083412, -312109, 428415, 1085474, 1608437, 1952936, 2092146, 2029863, 1808183, 1504148, 1213116, 1022244, 983838, 1100732, 1329943, 1599757, 1828522]
38750A828522J08246q3593l32891o16979r03549j154833j334599j414215j375917
38741e279808j214499r39513n77559j70914K30795N84240Q64541J069093J211771
38732d221853J311413J380275J416955J406817J330770J178613R58930O98405
38724E460325M31537J89428m363j31654j78862j42136l4145J15527K69315L94676
38714F369648M73925N07085N08200M97293M90916M95176N04092N03044M74606
38705A0823985M04283K85348J22347o8076k60346m27051n47822o16184o40328
38696I076156o36641o19955n97164n67698n28423m77898m17911l53495k93128
38687D583843k48930k35375k64929l40202m46483n51688o18192o20936n59085
$$ y = [1828522, 1936768, 1853175, 1520284, 903305, -244, -1155077, -2489676, -3903891, -5279808, -6494307, -7433820, -8011379, -8182293, -7951498, -7367258, -6502717, -5433624, -4221853, -2910440, -1530165, -113210, 1293607, 2624377, 3802990, 4761920, 5460325, 5891862, 6081290, 6076927, 5945273, 5766411, 5624275, 5590130, 5705657, 5974972, 6369648, 6843573, 7350658, 7858858, 8356151, 8847067, 9342243, 9846335, 10349379, 10823985, 11228268, 11513616, 11635963, 11567887, 11307541, 10880490, 10332668, 9716484, 9076156, 8439515, 7819560, 7222396, 6654698, 6126275, 5648377, 5230466, 4876971, 4583843, 4334913, 4099538, 3834609, 3494407, 3047924, 2496236, 1878044, 1257108, 698023]
38678F98023m53712l36024k36326j77942j73003k18091k93373l69077m16725m17991
38668b394241l66998k68136j33720J7193J61372K77535L54093L93064M06094M05131
38658a148613L95427L76859L51459L28763L22777L42810L86776M42723M96312
38649B295293N36899N57933N54421N22745M63947L86495L04750K34168J86787
38640F043438J68831J79340K09061K41623K58970K49354K12602J58701J01473
38631G823393N2748K0410R043K0164N1460R6665J46900J93227K30214K59964K93212
38620I197400L43505M16285N01252N75619O16203O11087N63611M88192M01443
38611A3714597L12664K18764J08120k7455j80531l24650m22774m43312l76216
$$ y = [698023, 244311, -91713, -328039, -505981, -678984, -897075, -1190448, -1559525, -1976250, -2394241, -2761239, -3029375, -3163095, -3145902, -2984530, -2706995, -2352902, -1959838, -1553744, -1148613, -753186, -376327, -24868, 303895, 626672, 969482, 1356258, 1798981, 2295293, 2832192, 3390125, 3944546, 4467291, 4931238, 5317733, 5622483, 5856651, 6043438, 6212269, 6391609, 6600670, 6842293, 7101263, 7350617, 7563219, 7721920, 7823393, 7876141, 7896551, 7905594, 7925758, 7977218, 8073883, 8220783, 8414010, 8644224, 8904188, 9197400, 9540905, 9957190, 10458442, 11034061, 11650264, 12261351, 12824962, 13313154, 13714597, 14027261, 14246025, 14354145, 14326690, 14146159, 13821509, 13398735, 12955423, 12579207]
38602A2579207k40761p9731N7689J33501J28642M1088j17075l19152n25234o92260
38592A0965914p89936q12169p76777p15155o58566o26761o22327o32280o36134
38583D695809o16491n66300m88548l89108k69089j24462M5441K28070L96636N20459
38573C432417N79061N69543N03777L99664K73353J36208l910j39912k64361l70700
38563E115140m54910n15205n49333n52003n15489m34208l10705j58358K129J50598
38553A777656K73777L65076M18852M25714L75072K64471J08146o3313k13349l12940
38543C419162l48201l18740k30680r0956R3055L09203N35653P40708Q90146R59256
38533E958606R42571Q55459P27142N89408M66112L67304K89982K24368J61339
$$ y = [12579207, 12338446, 12258715, 12316404, 12449905, 12578547, 12619635, 12502560, 12183408, 11658174, 10965914, 10175978, 9363809, 8587032, 7871877, 7213311, 6586550, 5964223, 5331943, 4695809, 4079318, 3513018, 3024470, 2635362, 2366273, 2241811, 2287252, 2515322, 2911958, 3432417, 4011478, 4581021, 5084798, 5484462, 5757815, 5894023, 5890113, 5750201, 5485840, 5115140, 4660230, 4145025, 3595692, 3043689, 2528200, 2093992, 1783287, 1624929, 1627058, 1777656, 2051433, 2416509, 2835361, 3261075, 3636147, 3900618, 4008764, 3945451, 3732102, 3419162, 3070961, 2752221, 2521541, 2430585, 2523640, 2832843, 3368496, 4109204, 4999350, 5958606, 6901177, 7756636, 8483778, 9073186, 9539298, 9906602, 10196584, 10420952, 10582291]
38524A0582291R6371K9368l6616r5515j38687j57762j48943j15372o5867j1620
38514I937648L6430O8802P8186O0191J3612o0178j57813k72973l93884n01612
38504H808409n72463n85944n35503m35947l21583k33993k05009k43906l35438
38495E338623m48709n51120o20307o49694o47342o30123o15700o14587o25130
38486f4089o33832o20970n68111m64088l08813j15406R1533K84510M46168N77226
38476a375872O91632Q02034R07426R92090J034924J021119R49067Q30438O85545
38467F538403N37286M05394L01284K24265J62005R7441J9589o8467j49531j99788
38457G867881j99566j42881m2169P4692J75281K36625K54228K40778K15911J94623
$$ y = [10582291, 10678662, 10708030, 10671414, 10575899, 10437212, 10279450, 10130507, 10015135, 9949268, 9937648, 9974078, 10042880, 10121066, 10181257, 10194869, 10134691, 9976878, 9703905, 9310021, 8808409, 8235946, 7650002, 7114499, 6678552, 6356969, 6122976, 5917967, 5674061, 5338623, 4889914, 4338794, 3718487, 3068793, 2421451, 1791328, 1175628, 561041, -64089, -697921, -1318891, -1887002, -2351090, -2659903, -2775309, -2683776, -2399266, -1953098, -1375872, -684240, 117794, 1025220, 2017310, 3052234, 4073353, 5022420, 5852858, 6538403, 7075689, 7481083, 7782367, 8006632, 8168637, 8266078, 8285667, 8217200, 8067669, 7867881, 7668315, 7525434, 7483265, 7557957, 7733238, 7969863, 8224091, 8464869, 8680780, 8875403]
38447H875403J81814J74590J67091J52126J20084O0931k8063j34827k33748k96559
38437I038842l04303k51793j44354O754J85581L70902N37397O59575P16491O95948
38427A1511040N98445M39801K49126O0621r6636k04254k53351k41300j71697n7256
38417A1834539P9175K09299L09074L68354L94070M03879M14622M34873M66220
38408A4914105N08103N57803O05475O32622O19491N56462M49893L18650J85271
38399A9347875O7447k7205j02192j68715k38642l16752l96205m60303m90060m73527
38389A6741721m11423l16872k11328j19865o6912p1756j43807k78988m58723o53021
38379A4009026q28354r58461j033061j059268j055067j039096j022285j005310
$$ y = [8875403, 9057217, 9231807, 9398898, 9551024, 9671108, 9732039, 9703976, 9569149, 9335401, 9038842, 8734539, 8482746, 8338392, 8345146, 8530727, 8901629, 9439026, 10098601, 10815092, 11511040, 12109485, 12549286, 12798412, 12859033, 12762397, 12558143, 12304792, 12063492, 11891795, 11834539, 11913714, 12123013, 12432087, 12800441, 13194511, 13598390, 14013012, 14447885, 14914105, 15422208, 15980011, 16585486, 17218108, 17837599, 18394061, 18843954, 19162604, 19347875, 19415322, 19388117, 19285925, 19117210, 18878568, 18561816, 18165611, 17705308, 17215248, 16741721, 16330298, 16013426, 15802098, 15682233, 15615321, 15543565, 15399758, 15120770, 14662047, 14009026, 13180672, 12222211, 11189150, 10129882, 9074815, 8035719, 7013434, 6008124]
38371F008124r82590r49964r10571q74487q52999q52131q69082q92205r04191
38362b080096q88296q35468p48019o37303n17503m00007k90935j91618j00222
38353f689467j2345Q0498J92059L37457N23704P41293R64701J162301J308691
38344a391108J393228J422800J418223J403463J391104J373597J328257J233404
38336I572968J083571Q93029O86672M86080L00348J26496m2351k07758l62211
38327A2536844m92979n90060o51809o83660o91440o76150o35664n71237m90587
38318G053258m03279l13035k14865r9220M1188K06172L85375N58749P01412P91438
38308H707193Q15910P72072O66016N12963L37977J71818L9935m9655j10762j71807
$$ y = [6008124, 5025534, 4075570, 3164999, 2290512, 1437513, 585382, -283700, -1175905, -2080096, -2968392, -3803860, -4551879, -5189182, -5706685, -6106692, -6397627, -6589245, -6689467, -6701812, -6621314, -6429255, -6091798, -5568094, -4826801, -3862100, -2699799, -1391108, 2120, 1424920, 2843143, 4246606, 5637710, 7011307, 8339564, 9572968, 10656539, 11549568, 12236240, 12722320, 13022668, 13149164, 13106813, 12899055, 12536844, 12043865, 11453805, 10801996, 10118336, 9426896, 8750746, 8115082, 7543845, 7053258, 6649979, 6336944, 6122079, 6022859, 6064047, 6270219, 6655594, 7214343, 7915755, 8707193, 9523103, 10295175, 10961191, 11474154, 11812131, 11983949, 12023884, 11974229, 11863467, 11691660]
38298A1691660k61671l97478n80315p98399j033023j264112j475103j656609j805928
38289B419022j920809j991706k000684j929792j772961j541839j261966r63299
38281a0964034o70872l98582j47385R0771L24029N52126P65024R49461J096986
38272h402476J206876J283660J333437J361475J370326J358586J322023J257398
38264B091305J165744J052501R25431P92978O63561N44405M40036L51808K78532
38255H306301K17008J62130J07853M9381j4841q2328j46382j95864k15933j91311
38245G996014j12496J6695J73921L20433M13139M22355L44890K04365L9762j09777
38235I709301k16550k69490k73005k40734j87916j26980o8024k0974M405Q54l4023
$$ y = [11691660, 11429989, 11032511, 10452196, 9653797, 8620774, 7356662, 5881559, 4224950, 2419022, 498213, -1493493, -3494177, -5423969, -7196930, -8738769, -10000735, -10964034, -11634906, -12033488, -12180873, -12090102, -11766073, -11213947, -10448923, -9499462, -8402476, -7195600, -5911940, -4578503, -3217028, -1846702, -488116, 833907, 2091305, 3257049, 4309550, 5234981, 6027959, 6691520, 7235925, 7675961, 8027769, 8306301, 8523309, 8685439, 8793292, 8842673, 8827832, 8745504, 8599122, 8403258, 8187325, 7996014, 7883518, 7900213, 8074134, 8394567, 8807706, 9230061, 9574951, 9779316, 9819078, 9709301, 9492751, 9223261, 8950256, 8709522, 8521606, 8394626, 8326602, 8305628, 8310033, 8310887, 8276864]
38224H276864r6748j77993k64073l40563l97200m30779m43725m39131m15547l64910
38214D906195k75768j41078L3202K24132L96346N14652N59551N37453M78241M19919
38204G652845L89541L92726M16315M38198M36165L94096L07451J86290N1437p5135
38194A0589929j77659k46127k72401k51139j86588r7646j4193L4247L0138k6847
38184I381714j22666k36714l49120m43525n05551n21023m78056l72988k15840
38175F136231l0950J47745K84006L46973L19785K08605M6547j15147k28287k69460
38165F846048k47958j96699j55481j57618k22854l53740n34363p33515r13417
38156C330403j041023j097302j081674j010847r12706q16672p43115o95942o62670
$$ y = [8276864, 8180116, 8002123, 7738050, 7397487, 7000287, 6569508, 6125783, 5686652, 5271105, 4906195, 4630427, 4489349, 4522551, 4746683, 5143029, 5657681, 6217232, 6754685, 7232926, 7652845, 8042386, 8435112, 8851427, 9289625, 9725790, 10119886, 10427337, 10613627, 10665064, 10589929, 10412270, 10166143, 9893742, 9642603, 9456015, 9358369, 9344176, 9378423, 9408561, 9381714, 9259048, 9022334, 8673214, 8229689, 7724138, 7203115, 6725059, 6352071, 6136231, 6105281, 6253026, 6537032, 6884005, 7203790, 7412395, 7458942, 7343795, 7115508, 6846048, 6598090, 6401391, 6245910, 6088292, 5865438, 5511698, 4977335, 4243820, 3330403, 2289380, 1192078, 110404, -900443, -1813149, -2629821, -3372936, -4068878, -4731548]
38147d731548o22940n60231m68107l47479k00913l2657J45512L11500M39584N12107
38137e555172N26571M94209M33919L65653L04126K53767K08203J55797Q7395N76
38127b724956j00979k09800l15851m06937m70007m93810m72324m07452l09401
38118e911517j93976p8042K4460J04708J59417J89338J95701J76641J27385M5496
38108e160389o2344j77851k76009l35349l48161l24359k85315k50682k27042k06239
38098g653740j73165j15692l0455P5968J87863K82828L37654L37307K83044J94634
38088f273754J04586M7176M7575J15507K44528M15344O01443P75760R16294J007887
38078a997654J040068J004930Q99196P29646N15958K86625O9692j15122k58341
$$ y = [-4731548, -5354488, -5914719, -6382826, -6730305, -6931218, -6963875, -6818363, -6506863, -6067279, -5555172, -5028601, -4534392, -4100473, -3734820, -3430694, -3176927, -2968724, -2812927, -2725532, -2724956, -2825935, -3035735, -3351586, -3758523, -4228530, -4722340, -5194664, -5602116, -5911517, -6105493, -6183535, -6159075, -6054367, -5894950, -5705612, -5509911, -5333270, -5205885, -5160389, -5222733, -5400584, -5676593, -6011942, -6360103, -6684462, -6969777, -7220459, -7447501, -7653740, -7826905, -7942597, -7973052, -7897084, -7709221, -7426393, -7088739, -6751432, -6468388, -6273754, -6169168, -6121992, -6074417, -5958910, -5714382, -5299038, -4697595, -3921835, -3005541, -1997654, -957586, 47344, 946540, 1676186, 2192144, 2478769, 2548461, 2433339, 2174998]
38069B174998l57399m12875m28070m11062l74996l34012k97214k65640k34502
38060i40772j97897j52197r6976l4485L1667R8429J64732K30711K95045L52685
38050b49058L95094M12783L98737L51557K77299J89341J06193M8017L2248O8226
38040B030437J52031K64905L78143M63217N02191M93243M49010L88337L24735
38031E446249K57451J72076N2565j02292k70415m13281m93529m90968m07902k64171
38021C485783q8176R1062K48970L67245M33084M38717L84436K83649J63399N5910
38011E864079j4540l9844k5983J5841P7201J54836K47976L53991M65279N68668
38001G667504O47205O84032O67796N98064M87834L60623K42666J53476R8412O6103
$$ y = [2174998, 1817599, 1404724, 976654, 565592, 190596, -143416, -440630, -706270, -940772, -1138669, -1290866, -1387842, -1422327, -1390660, -1292231, -1127499, -896788, -601743, -249058, 146036, 558819, 957556, 1309113, 1586412, 1775753, 1881946, 1929963, 1962211, 2030437, 2182468, 2447373, 2825516, 3288733, 3790924, 4284167, 4733177, 5121514, 5446249, 5703700, 5875776, 5928341, 5826049, 5555634, 5142353, 4648824, 4157856, 3749954, 3485783, 3397607, 3488669, 3737639, 4104884, 4537968, 4976685, 5361121, 5644770, 5808169, 5864079, 5849539, 5809695, 5783712, 5799553, 5876754, 6031590, 6279566, 6633557, 7098836, 7667504, 8314709, 8998741, 9666537, 10264601, 10752435, 11113058, 11355724, 11509200, 11607612, 11673715]
37991A1673715L2788k6560j24854k55242l94330n13852n92607o21959o04351n49070
37981H023678m69295l81258l03432k53911k46390k86344l68532m76191n82903
37972D655422o58120o75600o21687n00395l33771j56734o524Q9986J24344J04906
37962B021827M7801l1963j23825k20374l15584m04528m83589n50076o01251o33220
37952a294782o39846o12396n41345m20885k54121n4985J55220L54738N27086O62316
37942b119000P54484P98442P88632P20698N95469M23922K30656N2771o7398r4292
37932B084384j1232J72931M25853P01090R50093J132583J223933J219901J137246
37923I036782J007328Q62988P25257N98667M77724L57734K40676J33496M4008
$$ y = [11673715, 11706503, 11679943, 11555089, 11299847, 10905517, 10391665, 9799058, 9177099, 8572748, 8023678, 7554383, 7173125, 6869693, 6615782, 6369392, 6083048, 5714516, 5238325, 4655422, 3997302, 3321702, 2700015, 2199620, 1865849, 1709115, 1702591, 1792577, 1916921, 2021827, 2069628, 2037665, 1913840, 1693466, 1377882, 973354, 489765, -60311, -661562, -1294782, -1934628, -2547024, -3088369, -3509254, -3763375, -3818360, -3663140, -3308402, -2781316, -2119000, -1364516, -566074, 222558, 943256, 1538725, 1962647, 2193303, 2246074, 2178676, 2084384, 2073152, 2246083, 2671936, 3373026, 4323119, 5455702, 6679635, 7899536, 9036782, 10044110, 10907098, 11632355, 12231022, 12708746, 13066480, 13307156, 13440652, 13484660]
37914A3484660k1010n7030o5959o1169o6491j06399j93078l19451m62128n91519
37904A1540426o83397p26645p24114o87063o27592n53906m69590l74759k67508
37895F425852j46146j2850J23261K46916L42834M04825M41850M75484N28143O08345
37885I438514P02471P78629Q00960P46804O18114M41571K57272J01546p708p6025
37875A3802148j25581j80571k53232l38544m19910m81073n16579n35519n57641
37866A0393498o04162o87760q06699r45834j082536j193182j257706j262930j205110
37857A347579j089891r27809p27134m89542k13385R6446M19618P20666R59853
37848I6401J107233J150729J095374R57446P57995N17390K51736k6998l06097
$$ y = [13484660, 13463650, 13406620, 13340661, 13279492, 13213001, 13106602, 12913524, 12594073, 12131945, 11540426, 10857029, 10130384, 9406270, 8719207, 8091615, 7537709, 7068119, 6693360, 6425852, 6279706, 6266856, 6390117, 6637033, 6979867, 7384692, 7826542, 8302026, 8830169, 9438514, 10140985, 10919614, 11720574, 12467378, 13085492, 13527063, 13784335, 13885881, 13878173, 13802148, 13676567, 13495996, 13242764, 12904220, 12484310, 12003237, 11486658, 10951139, 10393498, 9789336, 9101576, 8294877, 7349043, 6266507, 5073325, 3815619, 2552689, 1347579, 257688, -670121, -1397255, -1886797, -2100182, -2003736, -1584118, -863452, 96401, 1203634, 2354363, 3449737, 4407183, 5165178, 5682568, 5934304, 5907306, 5601209]
37839E601209n65564p75765r03355r24090q35815o63581m52716k52569r8696k174
37829A26884M8550P4334Q9276R3155P6873L3949l2744j12591j92328k59726l06041
37818c60409l28179l29200l15985k96166k76405k60925k49053k33960k05454j55292
37808c011028q0561J6753J32008K59418L92148N21540O37279P30555P99440Q51307
37798A248859Q97967R46234R91766J020442J014657R60214Q52280O98841N18512
37789I149772L31698J51406j8321j75791l15128m27173n06074n53668n77040n82049
37779F477632n68669n31397m63995l65452k43383j12053J3756J23453K09423K62003
37769D801318K67688K14150R8520o7218k56707m35578n72332o50077o72631o60855
$$ y = [5601209, 5035645, 4259880, 3356525, 2432435, 1596620, 933039, 480323, 227754, 129058, 126884, 175434, 249768, 339044, 432199, 509072, 543021, 510277, 397686, 205358, -54368, -360409, -688588, -1017788, -1333773, -1629939, -1906344, -2167269, -2416322, -2650282, -2855736, -3011028, -3091589, -3074836, -2942828, -2683410, -2291262, -1769722, -1132443, -401888, 397552, 1248859, 2146826, 3093060, 4084826, 5105268, 6119925, 7080139, 7932419, 8631260, 9149772, 9481470, 9632876, 9614555, 9438764, 9123636, 8696463, 8190389, 7636721, 7059681, 6477632, 5908963, 5377566, 4913571, 4548119, 4304736, 4192683, 4206439, 4329892, 4539315, 4801318, 5069006, 5283156, 5381676, 5314458, 5057751, 4622173, 4049841, 3399764, 2727133, 2066278]
37759B066278o42405o42120o76237p48274q46033r43618j010934j025588r78735
37750e447666q72281p12644n07439k66114j767K67688N19024P24873Q59057R06152
37740d531117Q69492P70502O38471M98324L64937K45691J45658O9115J6016k2489
37730i35400o3566j24953k14273l23693m33919n23248n74256n75785n23768m23474
37720d716335k90768j48715j9874Q1357J51901J97421K26166K43629K51232K48888
37710c775098K38263K24093K13146K11390K20014K31995K32546K05492J43118
37701a855041N3223m2323j17867j57058j59923j39191j09437p8082m4795q146
37691b658640K7600N2312N7514M5630L1908L5266O4533J12095J60246J93528K05729
$$ y = [2066278, 1423873, 781753, 105516, -642758, -1488791, -2432409, -3443343, -4468931, -5447666, -6319947, -7032591, -7540030, -7806144, -7807911, -7540223, -7021199, -6296326, -5437269, -4531117, -3661625, -2891123, -2252652, -1754328, -1389391, -1143700, -998042, -928927, -912911, -935400, -998966, -1123919, -1338192, -1661885, -2095804, -2619052, -3193308, -3769093, -4292861, -4716335, -5007103, -5155818, -5175692, -5094335, -4942434, -4745013, -4518847, -4275218, -4023986, -3775098, -3536835, -3312742, -3099596, -2888206, -2668192, -2436197, -2203651, -1998159, -1855041, -1801818, -1844141, -1962008, -2119066, -2278989, -2418180, -2527617, -2605699, -2650494, -2658640, -2631040, -2578728, -2521214, -2475584, -2443676, -2408410, -2343877, -2231782, -2071536, -1878008, -1672279]
37680a672279J97398J69343J19535M5391n2013j65973k85569l98488m92503n55466
37670c090624n75940n46483m68210l52862k19630q7518L2405J40261K44190L53220
37660d571191M70764N91812P03605P88631Q29662Q16439P51474O51077N39790
37651A572063M40537L65661L14111K76139K41603K05458J67624J30138R5828O8332
37641C877494N0545M1154L2896J5080k1340p9777j56903k43998l29971m04768
37631B780412m61366m95687n06070m94065m65355m28045l88134l45596k94709
37622a098615k28702j45730n2581L6227J04141J40629J46666J33402J14078R4488
37612g55997O9235K6973l9175j24102k11727k83328l26547l39209l26506k94443
$$ y = [-1672279, -1474881, -1305538, -1186003, -1140612, -1192625, -1358598, -1644167, -2042655, -2535158, -3090624, -3666564, -4213047, -4681257, -5034119, -5253749, -5341267, -5308862, -5168601, -4924411, -4571191, -4100427, -3508615, -2805010, -2016379, -1186717, -370278, 381196, 1032273, 1572063, 2012600, 2378261, 2692372, 2968511, 3210114, 3415572, 3583196, 3713334, 3809162, 3877494, 3928039, 3969193, 4002089, 4017169, 3995829, 3916052, 3759149, 3515151, 3185180, 2780412, 2319046, 1823359, 1317289, 823224, 357869, -70176, -458310, -803906, -1098615, -1327317, -1473047, -1525628, -1489401, -1385260, -1244631, -1097965, -964563, -850485, -755997, -686762, -659789, -698964, -823066, -1034793, -1318121, -1644668, -1983877, -2310383, -2604826]
37602b604826k44247j71923p3928M5095J69615K78786L55951L94175L95073L65003
37592a091226L13529K53788K01470J71440J74368K14812K89840L87786M89442
37583A405249N74022O27544O47589O40533O14030N71366N11633M33679L39426
37574F365071K34210J24997J8074q2216j72526k47353k96405l06330k67478j81679
37564E188365o5627N2890J44310J87397J74202J07059q725j68965l67855n92741
37554D650310q23328j037051j216424j353567j450029j512105j543599j540283
37546e826076j490391j381598j210312r87759p39624m98972k95678j48181o2070
37537a2640661l4243n7066j19749k08835l09730m07059m81811n09058m63074l30874
$$ y = [-2604826, -2849073, -3020996, -3094924, -3049829, -2880214, -2601428, -2245477, -1851302, -1456229, -1091226, -777697, -523909, -322439, -150999, 23369, 238181, 528021, 915807, 1405249, 1979271, 2606815, 3254404, 3894937, 4508967, 5080333, 5591966, 6025645, 6365071, 6599281, 6724278, 6742352, 6660136, 6487610, 6240257, 5943852, 5637522, 5370044, 5188365, 5122738, 5175628, 5319938, 5507335, 5681537, 5788596, 5779871, 5610906, 5243051, 4650310, 3826982, 2789931, 1573507, 219940, -1230089, -2742194, -4285793, -5826076, -7316467, -8698065, -9908377, -10896136, -11635760, -12134732, -12430410, -12578591, -12640661, -12674904, -12731970, -12851719, -13060554, -13370284, -13777343, -14259154, -14768212, -15231286, -15562160]
37527a5562160j25677J10824L21425M55181M86514M23068L00688J69398P6082
37518a3344657M9762R4569J92909L16229M37341N38495O12853O60017O79241O65987
37508i097254O15404N29745M21722L09353K06342J16187L3898m7496j30913k13176
37498g256188k87083l44701l78639l81119l44150k62825j39177J7546J94262L77539
37488h804535N54829P14345Q45315R39063R90843J002174R82153R45329R05790
37479i24694Q70022Q32408P75919O78470N22735L04858L7793k51595n29793p65965
37469A550158r41142j053361j114682j141054j142179j118334j064441r76628
37461g001663q57198p16885n73618m46846l49416k82976k41382k19359k18086
$$ y = [-15562160, -15687837, -15577013, -15255588, -14800407, -14313893, -13890825, -13590137, -13420739, -13344657, -13294895, -13200326, -13007417, -12691188, -12253847, -11715352, -11102499, -10442482, -9763241, -9097254, -8481850, -7952105, -7530383, -7221030, -7014688, -6898501, -6864603, -6912099, -7043012, -7256188, -7543271, -7887972, -8266611, -8647730, -8991880, -9254705, -9393882, -9376336, -9182074, -8804535, -8249706, -7535361, -6690046, -5750983, -4760140, -3757966, -2775813, -1830484, -924694, -54672, 777736, 1553655, 2232125, 2754860, 3059718, 3097511, 2845916, 2316123, 1550158, 609016, -444345, -1559027, -2700081, -3842260, -4960594, -6025035, -7001663, -7858861, -8575746, -9149364, -9596210, -9945626, -10228602, -10469984, -10689343, -10907429]
37452a0907429k42264k91506l54033m07794m27567l93063k94450j33960P6002
37443a3376064L17155N69406Q12393J024492J182403J264705J259751J173542
37435e772217J031126Q68454P19071O04438N32974N04441N12689N44544N79055
37426A24575N91482N60974M77390L43846J74826q593j84752l36837m56036n41489
37416G45386n97450o29241o40042o30219n99330n49187m85632m16886l48719k79398
37406d430718j98902r4506M0061J98127L61086N06517O18235O91623P31124P43060
37396h34293P31071O98703O55644O19740O10858O40715P06259P90587Q69971R22857
37386F412112R37261R14071Q65401Q09008P61029P29801P12824O97757O66778
$$ y = [-10907429, -11149693, -11441199, -11795232, -12203026, -12630593, -13023656, -13318106, -13452066, -13376064, -13058909, -12489503, -11677110, -10652618, -9470215, -8205510, -6945759, -5772217, -4741091, -3872637, -3153566, -2549128, -2016154, -1511713, -999024, -454480, 124575, 716057, 1277031, 1754421, 2098267, 2273093, 2264500, 2079748, 1742911, 1286875, 745386, 147936, -481305, -1121347, -1751566, -2350896, -2900083, -3385715, -3802601, -4151320, -4430718, -4629620, -4724126, -4684065, -4485938, -4124852, -3618335, -3000100, -2308477, -1577353, -834293, -103222, 595481, 1251125, 1870865, 2481723, 3122438, 3828697, 4619284, 5489255, 6412112, 7349373, 8263444, 9128845, 9937853, 10698882, 11428683, 12141507, 12839264, 13506042]
37377A3506042O02565M94079L40719J53615m6636k34793l86443m82643n13505
37368A3433000m80037l92577k65461j11215O1142K42274M17253N64660O62163
37359A4131202O95009O61459N71706M41888K87798J21867m6507k09873l62830
37350A6291719n02652o28419p38283q27495q89825r21041r20429q89118q28886
37341I145571p44780o48141n53578m69642l91610l04403j94082n8953Q6456K14747
37331F081585K93574K96445K14355O3552j16157k73922l66163l72189l00461j83742
37321E336877o5989J3707L4488l15o6807j31837j66371j54420r4254O265J35385
37310D846729K80319M27147N60269O63243P20529P19526O53643N26737L56057
$$ y = [13506042, 14108607, 14602686, 14943405, 15097020, 15050384, 14815591, 14429148, 13946505, 13433000, 12952963, 12560386, 12294925, 12183710, 12244852, 12487126, 12904379, 13469039, 14131202, 14826211, 15487670, 16059376, 16501264, 16789062, 16910929, 16864422, 16654549, 16291719, 15789067, 15160648, 14422365, 13594870, 12705045, 11784004, 10863575, 9974457, 9145571, 8400791, 7752650, 7199072, 6729430, 6337820, 6033417, 5839335, 5780382, 5866838, 6081585, 6375159, 6671604, 6885959, 6949511, 6833354, 6559432, 6193269, 5821080, 5520619, 5336877, 5270888, 5284595, 5319083, 5318768, 5251961, 5120124, 4953753, 4799333, 4705079, 4711344, 4846729, 5127048, 5554195, 6114464, 6777707, 7498236, 8217762, 8871405, 9398142, 9754199]
37301I754199J69379m258j44893k46788l16772l68504m15626m64923n11352n38329
37291F912133n25109m58217l40246j90934m0067Q3875J63675J97294J93956J65386
37281F161746J18743N6734j5816q5785j32670j36902q9658K457J20151K39101
37271F238101L37982M03115M28943M16213L70374L00510K17799J33397N7141k147
37261H901428l6323l9405j1009M0200R5710J31191J25359O9930k5482j37162k37595
37250H876842l06595l38720l45205l50133l81768m61732n95561p67183r39048
37241D390897j059839j080140r71460p39358m22967q0810K29608M68179O17900
37232A352010O80236O66586N92896M78812L46792K17020R9831q538j22733k58787
$$ y = [9754199, 9923578, 9919320, 9774427, 9527639, 9210867, 8842363, 8426737, 7961814, 7450462, 6912133, 6387024, 5928807, 5588561, 5397627, 5357560, 5441435, 5605110, 5802404, 5996360, 6161746, 6280489, 6337223, 6321407, 6235622, 6102952, 5966050, 5876392, 5878849, 5999000, 6238101, 6576083, 6979198, 7408141, 7824354, 8194728, 8495238, 8713037, 8846434, 8903575, 8901428, 8865105, 8825700, 8814691, 8854891, 8950601, 9081792, 9207151, 9277081, 9251599, 9114437, 8876842, 8570247, 8231527, 7886322, 7536189, 7154421, 6692689, 6097128, 5329945, 4390897, 3331058, 2250918, 1279458, 540100, 117133, 36323, 265931, 734110, 1352010, 2032246, 2698832, 3291728, 3770540, 4117332, 4334352, 4434183, 4425645, 4302912, 4044125]
37222D044125m23042o04930p77653r07105r64009r31980q08397o01796l31515
37213b306302k9454K61450M95903O38528O72537O01082M43421K29667m293k21923
37203G80616l91220m89518n07606m52277l45210k16645r5857l594M9480N8992
37193a612839K2732n9427j81862l30530m85346o26707p40421q16970q46841q17925
37183f496136p18737n45659l08814l1898K54882N25438P65476R72260J146656
37174d436532J283547J367673J377689J296066J119208Q62236N55712K36287o2764
37165C599122l16265n07396o27200o75360o60127n94894m92422l60555k02589
37156h37686k2241J70125L54647N05856O01784O32226O00331N17528L97185K52065
$$ y = [4044125, 3621083, 3016153, 2238500, 1331395, 367386, -564594, -1372991, -1974787, -2306302, -2335756, -2074306, -1578403, -939875, -267338, 333744, 777165, 1006832, 1002539, 780616, 389396, -100122, -607728, -1060005, -1405215, -1621860, -1717717, -1721311, -1671831, -1612839, -1590107, -1649534, -1831396, -2161926, -2647272, -3273979, -4014400, -4831370, -5678211, -6496136, -7214873, -7760532, -8069346, -8101244, -7846362, -7320924, -6555448, -5583188, -4436532, -3152985, -1785312, -407623, 888443, 2007651, 2869887, 3425599, 3661886, 3599122, 3282857, 2775461, 2148261, 1472901, 812774, 217880, -274542, -635097, -837686, -859927, -689802, -335155, 170701, 772485, 1404711, 2005042, 2522570, 2919755, 3171820]
37146C171820R5528n6959j88656k84749l36536l44994l22097k88657k68764k82278
37136H93658l37744m28325n33286o25593o82563o94099o64197o06021n34346m59859
$$ y = [3171820, 3267348, 3210389, 3021733, 2736984, 2400448, 2055454, 1733357, 1444700, 1175936, 893658, 555914, 127589, -405697, -1031290, -1713853, -2407952, -3072149, -3678170, -4212516, -4672375]
$$ [...]
##END NTUPLES=NMR SPECTRUM
##END=
