##TITLE=31Pdec_75CAA-2
 aceton-d6
  24 sc
 29.11.2023
##JCAMPDX= 6.0         $$ Bruker NMR JCAMP-DX V2.0
##DATA TYPE= NMR SPECTRUM
##DATA CLASS= NTUPLES
##ORIGIN= UXNMR, Bruker Analytische Messtechnik GmbH
##OWNER= root
$$ XWIN-NMR		Version 3.5
$$ Wed Nov 29 14:02:55 2023 Russian Standard Time (UT+4h)  she@DPX200
##.OBSERVE FREQUENCY= 81.013821
##.OBSERVE NUCLEUS= ^31P
##.ACQUISITION MODE= SIMULTANEOUS
##.ACQUISITION SCHEME= undefined
##.AVERAGES= 24
##.DIGITISER RES= 16
##SPECTROMETER/DATA SYSTEM= spect
##.PULSE SEQUENCE= zgpg30
##.SOLVENT NAME= Acetone
##.SHIFT REFERENCE= (INTERNAL, Acetone, 0, 248.564)
##AUDIT TRAIL= $$ (NUMBER, WHEN, WHO, WHERE, WHAT)
$$ ##TITLE= Audit trail, XWIN-NMR		Version 3.5
$$ ##JCAMPDX= 5.01
$$ ##ORIGIN= Bruker BioSpin GmbH
$$ ##OWNER= she
$$ F:/spectra/data/she/nmr/P31/1/pdata/1/auditp.txt
$$ ##AUDIT TRAIL=  $$ (NUMBER, WHEN, WHO, WHERE, WHAT)
(   1,<2023-11-29 14:01:42.15 +0400>,<she>,<DPX200>,
      <created by zg, POWCHK disabled, PULCHK disabled
       configuration hash MD5:
       00 E9 B6 7A A2 85 ED C7 34 08 36 98 17 FE 4E 26
       data hash MD5: 32K
       F5 BB A3 79 F7 9C 07 AE 45 B0 E8 EE 78 43 0C 96>)
(   2,<2023-11-29 14:01:44.20 +0400>,<she>,<DPX200>,
      <Start of raw data processing
       efp BC_mod = 2 LB = 10 FT_mod = 6 PKNL = 1 PHC0 = -11586.02 PHC1 = -328.5055 SI = 64K 
       data hash MD5: 64K
       D2 E7 0F 2C C5 31 FB D0 B2 1F 62 0B C6 BA B5 74>)
(   3,<2023-11-29 14:02:11.20 +0400>,<she>,<DPX200>,
      <pk PHC0 = 120.1755 PHC1 = -291.4 
       data hash MD5: 64K
       D8 02 34 A2 EF 61 3F CE 31 E0 39 9E 2F 15 86 7F>)
(   4,<2023-11-29 14:02:15.21 +0400>,<she>,<DPX200>,
      <abs ABSG = 5 
       data hash MD5: 64K
       86 14 6C DA 07 C5 B0 F6 52 B8 D8 14 CB 3F 2E 27>)
$$ ##END=
$$ 
$$ hash MD5
$$ 29 9C FB 78 AF B0 08 32 0C 5C 85 BE 9A 58 12 15
##$RELAX= 
##$RELAX= 
##$RELAX= 
##$RELAX= 
##$RELAX= 
##$RELAX= 
##$RELAX= 
##$RELAX= 
##$RELAX= 
$$ Bruker specific parameters
$$ --------------------------
##$DU= <F:/spectra>
##$EXPNO= 1
##$NAME= <P31>
##$PROCNO= 1
##$TYPE= <nmr>
##$USER= <she>
##$AMP= (0..31)
100 100 100 100 100 100 100 100 100 100 100 100 100 100 100 100 100 100 
100 100 100 100 100 100 100 100 100 100 100 100 100 100 
##$AQSEQ= 0
##$AQ_mod= 1
##$AUNM= <au_zg>
##$AUTOPOS= <>
##$BF1= 81.014009
##$BF2= 200.13
##$BF3= 200.13
##$BF4= 200.13
##$BF5= 200.13
##$BF6= 200.13
##$BF7= 200.13
##$BF8= 200.13
##$BYTORDA= 1
##$CFDGTYP= 0
##$CFRGTYP= 5
##$CHEMSTR= <none>
##$CNST= (0..31)
1 1 145 1 1 1 1 1 1 1 1 1 1 1 1 1 1 1 1 1 1 1 1 1 1 1 1 1 1 1 1 1 
##$CPDPRG= <waltz16>
##$CPDPRG1= <>
##$CPDPRG2= <waltz16>
##$CPDPRG3= <>
##$CPDPRG4= <mlev>
##$CPDPRG5= <mlev>
##$CPDPRG6= <mlev>
##$CPDPRG7= <mlev>
##$CPDPRG8= <mlev>
##$CPDPRGB= <>
##$CPDPRGT= <>
##$D= (0..31)
0 1 0 0 0 0 0 0 0 0 0 0.03 2e-05 3e-06 0 0 0 0 0 0 0 0 0 0 0 0 0 0 0 0 
0 0 
##$DATE= 1701252101
##$DBL= (0..7)
120 120 120 11 120 120 24 19 
##$DBP= (0..7)
150 150 150 150 150 150 150 150 
##$DBP07= 0
##$DBPNAM0= <>
$$ [...]
##$SUBNAM3= <"">
##$SUBNAM4= <"">
##$SUBNAM5= <"">
##$SUBNAM6= <"">
##$SUBNAM7= <"">
##$SUBNAM8= <"">
##$SUBNAM9= <"">
##$SW= 501.771253377433
##$SWIBOX= (0..15)
0 1 3 0 0 0 0 0 0 0 0 0 0 0 0 0 
##$SW_h= 40650.406504065
##$TD= 32768
##$TD0= 1
##$TE= 0
##$TE2= 300
##$TE3= 300
##$TEG= 300
##$TL= (0..7)
0 120 53 12 22 120 120 120 
##$TP= (0..7)
150 150 150 150 150 150 150 150 
##$TP07= 0
##$TPNAME0= <>
##$TPNAME1= <>
##$TPNAME2= <>
##$TPNAME3= <>
##$TPNAME4= <>
##$TPNAME5= <>
##$TPNAME6= <>
##$TPNAME7= <>
##$TPOAL= (0..7)
0.5 0.5 0.5 0.5 0.5 0.5 0.5 0.5 
##$TPOFFS= (0..7)
0 0 0 0 0 0 0 0 
##$TUNHIN= 0
##$TUNHOUT= 0
##$TUNXOUT= 0
##$USERA1= <user>
##$USERA2= <user>
##$USERA3= <user>
##$USERA4= <user>
##$USERA5= <user>
##$V9= 5
##$VALIST= <valist>
##$VCLIST= <CCCCCCCCCCCCCCC>
##$VD= 0
##$VDLIST= <DDDDDDDDDDDDDDD>
##$VPLIST= <PPPPPPPPPPPPPPP>
##$VTLIST= <TTTTTTTTTTTTTTT>
##$WBST= 1024
##$WBSW= 4
##$XGAIN= (0..3)
0 0 0 0 
##$XL= 0
##$YL= 0
##$YMAX_a= 2672
##$YMIN_a= -2510
##$ZGOPTNS= <>
##$ZL1= 120
##$ZL2= 120
##$ZL3= 120
##$ZL4= 120
##$ABSF1= 248.5645
##$ABSF2= -253.2056
##$ABSG= 5
##$ABSL= 3
##$ALPHA= 0
##$AQORDER= 0
##$ASSFAC= 0
##$ASSFACI= 0
##$ASSFACX= 0
##$ASSWID= 0
##$AUNMP= <proc_1d>
##$AZFE= 0.1
##$AZFW= 0.5
##$BCFW= 0
##$BC_mod= 2
##$BYTORDP= 0
##$COROFFS= 0
##$CY= -3
##$DATMOD= 1
##$DC= 0
##$DFILT= <>
##$DTYPP= 0
##$F1P= 0
##$F2P= 0
##$FCOR= 1
##$FTSIZE= 65536
##$FT_mod= 6
##$GAMMA= 0
##$GB= 0
##$INTBC= 1
##$INTSCL= 6.047779e-11
##$ISEN= 30
##$LB= 10
##$LEV0= 0
##$LPBIN= 0
##$MAXI= 10000
##$MC2= 0
##$MEAN= 0
##$ME_mod= 0
##$MI= 50
##$NCOEF= 0
##$NC_proc= -11
##$NLEV= 6
##$NOISF1= 182.463
##$NOISF2= 159.3651
##$NSP= 0
##$NTH_PI= 0
##$NZP= 0
##$OFFSET= 248.5645
##$PC= 4
##$PHC0= -11465.84
##$PHC1= -619.9055
##$PH_mod= 1
##$PKNL= yes
##$PPARMOD= 0
##$PSCAL= 0
##$PSIGN= 0
##$REVERSE= no
##$SF= 81.0140089999694
##$SI= 65536
##$SIGF1= 159.3651
##$SIGF2= -187.1042
##$SINO= 113.3802
##$SIOLD= 16384
##$SREGLST= <1H.CDCl3>
##$SSB= 0
##$STSI= 65536
##$STSR= 0
##$SW_p= 40650.406504065
##$SYMM= 0
##$S_DEV= 0
##$TDeff= 32768
##$TDoff= 0
##$TI= <>
##$TILT= no
##$TM1= 0
##$TM2= 0
##$TOPLEV= 0
##$USERP1= <user>
##$USERP2= <user>
##$USERP3= <user>
##$USERP4= <user>
##$USERP5= <user>
##$WDW= 1
##$XDIM= 65536
##$YMAX_p= 481699856
##$YMIN_p= -62581746
$$ End of Bruker specific parameters
$$ ---------------------------------
##NTUPLES= NMR SPECTRUM
##VAR_NAME=  FREQUENCY,     SPECTRUM/REAL,   SPECTRUM/IMAG
##SYMBOL=    X,             R,               I
##VAR_TYPE=  INDEPENDENT,   DEPENDENT,       DEPENDENT
##VAR_FORM=  AFFN,          ASDF,            ASDF
##VAR_DIM=   65536,         65536,           65536
##UNITS=     HZ,            ARBITRARY UNITS, ARBITRARY UNITS
##FACTOR=    0.620285442955139, 1,           1
##FIRST=     20137.2065510682, 0,            0
##LAST=      -20513.1999529968, 0,           0
##MIN=       -20513.1999529968, -62581746,   0
##MAX=       20137.2065510682, 481699856,    0
$$ Real data points
##PAGE= N=1
##DATA TABLE= (X++(R..R)), XYDATA
$$ [...]
12995b5229345J248121J883333K401701K705115K728025K459000J945430J282043
12987h576577N90130q144m17592n92218n40523l10991L1243M21545Q01932J122605
12977g478590J345861J452221J444469J346986J200049J049602R34761Q78355
12969B173714Q85529R49455J056922J186949J304614J361129J309147J127292
12961A1354751Q34391M78964J12215k31500n33112p77065r48621j043093j071845
12952H175085j054313j003896r23391q13735o84942n56856m48062l62156k83363
12943B044371j87703o3984P0652J74440K03845J40267K278j64122l09715m04880
12933A505449m48118m58444m60264m71349m97536n30992n49602n21037m15973
$$ y = [-25229345, -23981224, -22097891, -19696190, -16991075, -14263050, -11804050, -9858620, -8576577, -7986447, -7994591, -8412183, -9004401, -9544924, -9855915, -9824672, -9403127, -8601195, -7478590, -6132729, -4680508, -3236039, -1889053, -689004, 360598, 1295359, 2173714, 3059243, 4008698, 5065620, 6252569, 7557183, 8918312, 10227459, 11354751, 12189142, 12668106, 12780321, 12548821, 12015709, 11238644, 10290023, 9246930, 8175085, 7120772, 6116876, 5193485, 4379750, 3694808, 3137952, 2689890, 2327734, 2044371, 1856668, 1792684, 1863336, 2037776, 2241621, 2381888, 2384166, 2220044, 1910329, 1505449, 1057331, 598887, 138623, -332726, -830262, -1361254, -1910856, -2431893, -2847866]
12924b847866k27435J5694K52870M14636M52277L58993J74302k7428j59890j54574
12914a748421J0904K99849O29639R06282J061378J072871R63697P83844N86413
12905D566456M09745K74511J92901J75298K24293L23856M40101N35987N84732
12896G727880N69748M77393K97058L1880k90494o18678q92522j065832j125369
12887E111064j094931j021337r50129r03379q67905p97510o31012l22327J30969
12878a346497O76967J221897J657833J894745J889535J663351J296670Q99808
12870I854309N72180L70195K95349L01704L16976K71085J24785j11986l81633
12861A1612964o03376p11756o89001n70870m21513k93922k01432j16192O420J92056
$$ y = [-2847866, -3075301, -3059607, -2806737, -2392101, -1939824, -1580831, -1406529, -1433957, -1593847, -1748421, -1737517, -1437668, -808029, 98253, 1159631, 2232502, 3196199, 3980043, 4566456, 4976201, 5250712, 5443613, 5618911, 5843204, 6167060, 6607161, 7143148, 7727880, 8297628, 8775021, 9072079, 9103959, 8813465, 8194787, 7302265, 6236433, 5111064, 4016133, 2994796, 2044667, 1141288, 273383, -524127, -1155139, -1477466, -1346497, -669530, 552367, 2210200, 4104945, 5994480, 7657831, 8954501, 9854309, 10426489, 10796684, 11092033, 11393737, 11710713, 11981798, 12106583, 11994597, 11612964, 11009588, 10297832, 9608831, 9037961, 8616448, 8322526, 8121094, 8004902, 8011322, 8203378]
12851H203378M20732O26555P26551O61861M25990O4894l46369p33359j042443
12842I007790j246264j339569j333434j249985j114569r46037p53688n46207l43715
12833A34322j76969o9821j8986J1183P2914K05843M09981O37891Q14849Q76264
12823B897471P96862N93296L05519k3926l60256o77008r51017j155451j257876
12814A67614j230698j070664q11651n18130k62954j03950o9779j56331l31773
12805d388316n48236p55520r10308r79452r43193q03252n90544l61304j77619
12796a0457744q2478q4776j61534k72664l79059m57065n05042n39102n79171o32653
12786a4151288o85375p04766o53348n06291k65458L7277L50205O19785Q05401
$$ y = [8203378, 8624110, 9250665, 9977216, 10639077, 11065067, 11129961, 10783592, 10050233, 9007790, 7761526, 6421957, 5088523, 3838538, 2723969, 1777932, 1024244, 478037, 134322, -42647, -112468, -131454, -120271, -47357, 158486, 568467, 1206358, 2021207, 2897471, 3694333, 4287629, 4593148, 4569222, 4208966, 3531958, 2580941, 1425490, 167614, -1063084, -2133748, -2945399, -3463529, -3726483, -3830433, -3900212, -4056543, -4388316, -4936552, -5692072, -6602380, -7581832, -8525025, -9328277, -9918821, -10280125, -10457744, -10540222, -10624998, -10786532, -11059196, -11438255, -11895320, -12400362, -12939464, -13518635, -14151288, -14836663, -15541429, -16194777, -16701068, -16966526, -16929249, -16579044, -15959259, -15153858]
12777a5153858Q84649Q53139P25607N37306L37474J71728O2693L280l1742o3889
12767a1673613r3201r5435l5960J07187L24645N73382P92222R24973R37611Q23149
12757g415040N96936K88334o6840m31142p67511j041147j224525j304843j288174
12748a2653952j195100j049557q68410o58451m21218j60311J14988L91438O54943
12739a5845630Q90304J078315J195715J221265J144722R73277P33463M68685K31192
12730g908692O8625J1747P1857K47079N25676Q78355J247979J554083J718071
12721a585220J694958J490937J158374P76084M27373J82015Q2287J33846L05273
12712D665927N38310P64973R23900R70972Q84908O71025L63540K2155k82001m90447
$$ y = [-15153858, -14269209, -13416070, -12690463, -12153157, -11815683, -11643955, -11581262, -11577982, -11609724, -11673613, -11766814, -11862249, -11898209, -11791022, -11466377, -10892995, -10100773, -9175800, -8238189, -7415040, -6818104, -6529770, -6596610, -7027752, -7795263, -8836410, -10060935, -11365778, -12653952, -13849052, -14898609, -15767019, -16425470, -16846688, -17006999, -16892011, -16500573, -15845630, -14955326, -13877011, -12681296, -11460031, -10315309, -9342032, -8608569, -8139884, -7908692, -7840067, -7828320, -7756463, -7509384, -6983708, -6105353, -4857374, -3303291, -1585220, 109738, 1600675, 2759049, 3535133, 3962506, 4144521, 4226808, 4360654, 4665927, 5204237, 5969210, 6893110, 7864082, 8748990, 9420015, 9783555, 9805710, 9523709, 9033262]
12702I033262n81858n82581n54123n62755o48641q12058j022475j241765j446148
12693A580858j634454j819434k009115k191556k334240k398478k356947k200572
12685a5363938j932299j558808j092453n62230j9257M75320Q74891J164691J356974
12676a6657109J469049J504150J450267J293528J031676O78220K59406j90218
12668i161031o31971j027351j341098j542606j609872j538980j353090j099623
12660a9305622q33089n94654m01898k51362j27043q509J22446K76091M51489O38226
12650b0033925Q23955J004165J186757J385296J603827J825393K014765K133590
12642h056177K157033K083082J932971J744057J556346J396883J270180J160702
$$ y = [9033262, 8451404, 7868823, 7314700, 6751945, 6103304, 5291246, 4268771, 3027006, 1580858, -53596, -1873030, -3882145, -6073701, -8407941, -10806419, -13163366, -15363938, -17296237, -18855045, -19947498, -20509728, -20528985, -20053665, -19178774, -18014083, -16657109, -15188060, -13683910, -12233643, -10940115, -9908439, -9230219, -8970813, -9161031, -9793002, -10820353, -12161451, -13704057, -15313929, -16852909, -18205999, -19305622, -20138711, -20733365, -21135263, -21386625, -21513668, -21522177, -21399731, -21123640, -20672151, -20033925, -19209970, -18205805, -17019048, -15633752, -14029925, -12204532, -10189767, -8056177, -5899144, -3816062, -1883091, -139034, 1417312, 2814195, 4084375, 5245077]
12634E245077J045053R05095P34186N34648L10596O2639k11341n10007q21276
12625G294670j118116j359679j498473j491933j314239r64533m70741J10682P02117
12616a10245J222249J608767J834113J906225J858191J735692J585524J444124
12608A3084640J329735J245411J192417J180553J221889J310811J409627J456933
12600B3432016J395957J202406Q92541N09431J00393l00200o77359j032961j377792
12591B4144432j722015k068090k408500k727021l000981l204185l312639l313915
12583B387086l216089l047958k845049k627618k388384k103956j763048j387405
12575a6992421j027658p39475n59232m91842n11089n69476o15556o13142n52324
$$ y = [5245077, 6290130, 7195225, 7929411, 8464059, 8774655, 8837294, 8625953, 8115946, 7294670, 6176554, 4816875, 3318402, 1826469, 512230, -452303, -923044, -812362, -110245, 1112004, 2720771, 4554884, 6461109, 8319300, 10054992, 11640516, 13084640, 14414375, 15659786, 16852203, 18032756, 19254645, 20565456, 21975083, 23432016, 24827973, 26030379, 26922920, 27432351, 27532744, 27232544, 26555185, 25522224, 24144432, 22422417, 20354327, 17945827, 15218806, 12217825, 9013640, 5701001, 2387086, -829003, -3876961, -6722010, -9349628, -11738012, -13841968, -15605016, -16992421, -18020079, -18759554, -19318786, -19810628, -20321717, -20891193, -21506749, -22119891, -22672215]
12566b2672215m45915l14438j68848l81K15207M98032Q39406J190346J474850
12557a9383956J621825J596765J416173J138954Q40684N84047L99540K83372K09437
12548a1293159J47025P6850p24p0340j17785j45648j74390k27118l11662m14243
12538a2531194n06859n60166n55242m92657l96847l10004k73209l03569l83608
12529a6313355m72332n30927n45229n30993n20915n42537n98784o61009o79768
12520b1395849o09360m31959j65728J47129M61355P44135R79996J170193J331408
12511a7768680J491254J675296J887591K096625K239903K249454K085560J759183
12503b283814J330250Q83608M96433K13626M0845m5764q2280j02331j29457j74614
$$ y = [-22672215, -23118130, -23432568, -23601416, -23601797, -23386590, -22888558, -22049152, -20858806, -19383956, -17762131, -16165366, -14749193, -13610239, -12769555, -12185508, -11785968, -11502596, -11293159, -11146134, -11069284, -11070008, -11140348, -11258133, -11403781, -11578171, -11805289, -12116951, -12531194, -13038053, -13598219, -14153461, -14646118, -15042965, -15352969, -15626178, -15929747, -16313355, -16785687, -17316614, -17861843, -18392836, -18913751, -19456288, -20055072, -20716081, -21395849, -22005209, -22437168, -22602896, -22455767, -21994412, -21250277, -20270281, -19100088, -17768680, -16277426, -14602130, -12714539, -10617914, -8378011, -6128557, -4042997, -2283814, -953564, -69956, 426477, 640103, 680948, 635184, 552904, 450573, 321116, 146502]
12493A46502k35844l00737l53525l84211l92353l81558l50114k87793j82406k9882
12483b751921J59658L61383N38530O48966O57508N50798L45553Q4456j76998l84686
12473C3247m96960m93115l78939j86286L4892K28993L46543L52660K33195m88
12463c26258l10539o40388r32521j148708j280039j340260j348860j316784j241842
12454i886199j111787r10704o27153k62580J64157O19210J060741J445792J735367
12445g773156J899181J920056J795925J538889J172956P31659K55228k12762o29032
12436F98944r55543j166342j252481j220038j082944q60583n85854l15009j23518
12427f863368q2382k27057n38556r49108j370056j726447j977524k112448k130999
$$ y = [146502, -89342, -390079, -743604, -1127815, -1520168, -1901726, -2251840, -2539633, -2722039, -2751921, -2592263, -2230880, -1692350, -1043384, -385876, 164922, 510475, 594931, 417933, 33247, -463713, -956828, -1335767, -1522053, -1487161, -1258168, -911625, -558965, -325770, -326258, -636797, -1277185, -2209706, -3358414, -4638453, -5978713, -7327573, -8644357, -9886199, -10997986, -11908690, -12535843, -12798423, -12634266, -12015056, -10954315, -9508523, -7773156, -5873975, -3953919, -2157994, -619105, 553851, 1285510, 1540738, 1327976, 698944, -256599, -1422941, -2675422, -3895460, -4978404, -5838987, -6424841, -6739850, -6863368, -6945750, -7172807, -7711363, -8660471, -10030527, -11756974, -13734498, -15846946, -17977945]
12418a7977945k031798j819194j515898j160941p91147m25184o5844K85348O18496
12409b4884107R18035J171177J374496J537958J686227J853023K066975K336811
12401a1939405K646587K962303L242046L444004L534223L496126L337224L086121
12393A3809229K780204K451391K117371J780409J432057J060906O60215K32982
12385B6324764k06652o35859j028974j363900j624183j795377j861865j812064
12377A5995890j651205j411253j147916r23691p84299p39650p60555p95888q01248
12368F980185p60085o84059n96745n14931m38002l47964k19573l7004J92408M37252
12358D011482O53321P96504Q29908P29170M92264J50593k30285n68404p96830
$$ y = [-17977945, -20009743, -21828937, -23344835, -24505776, -25296923, -25722107, -25787951, -25502603, -24884107, -23966072, -22794895, -21420399, -19882441, -18196214, -16343191, -14276216, -11939405, -9292818, -6330515, -3088469, 355535, 3889758, 7385884, 10723108, 13809229, 16589433, 19040824, 21158195, 22938604, 24370661, 25431567, 26091782, 26324764, 26118112, 25482253, 24453279, 23089379, 21465196, 19669819, 17807954, 15995890, 14344685, 12933432, 11785516, 10861825, 10077526, 9337876, 8577321, 7781433, 6980185, 6220100, 5536041, 4939296, 4424365, 3986363, 3638399, 3418826, 3381822, 3574230, 4011482, 4664803, 5461307, 6291215, 7020385, 7512649, 7663242, 7432957, 6864553, 6067723]
12349F067723q92393q83680q31840p96063q05557q52430r03342r18797q71043
12340a687422p55237n88989l99526k07850k3687J45561K84447L72293L98748L77041
12330b084621L42052L35371L89732N20472P21530R62455J191246J350845J405257
12321E134339J357172J241466J099200R53686Q05947O47978M78517L08848J57230
12312A2184383L8083m7531j15591j94000l09454m73039o74036q86191j081292
12303H441332j240576j357828j434022j467010j442983j337934j132301q30283
12295a801605m68553j06873J92633L84998M53837M14483L09290J94930J24020
12286c02840J27204K03660L26471M61697N88577P04174Q09267Q91881R26297Q85996
$$ y = [6067723, 5175330, 4291650, 3459810, 2663747, 1858190, 1005760, 102418, -816379, -1687422, -2442659, -3031648, -3431174, -3639024, -3662711, -3517150, -3232703, -2860410, -2461662, -2084621, -1742569, -1407198, -1017466, -496994, 224536, 1186991, 2378237, 3729082, 5134339, 6491511, 7732977, 8832177, 9785863, 10591810, 11239788, 11718305, 12027153, 12184383, 12222466, 12174935, 12059344, 11865344, 11555890, 11082851, 10408815, 9522624, 8441332, 7200756, 5842928, 4408906, 2941896, 1498913, 160979, -971322, -1801605, -2270158, -2377031, -2184398, -1799400, -1345563, -931080, -621790, -426860, -302840, -175636, 28024, 354495, 816192, 1404769, 2108943, 2918210, 3810091, 4736388, 5622384]
12276E622384P54485N26845K11392j60397n24680p93240q82567p50763m23167
12267C580292O846M05273O44013O46637M12514J0639m49576q54910j118393j195881
12257B087454j089029q37674n04227j52713J70788M46555O74656Q60944J007415
12248B664169J110546J162428J150582J059136Q74737N94875K32652j84401o18706
12239H046018j025977j356687j559491j592258j441181j137534p55978l87473
12231a210561r9707Q9919K11743L16543M44147O06795P91756R75287J137351J269996
12221D533269J376441J461869J522624J544255J512676J430245J322282J228281
12213A5931942J185700J217451J326025J491138J670946J811136J861412J790052
$$ y = [5622384, 6376869, 6903714, 7115106, 6954709, 6430029, 5636789, 4754222, 4003459, 3580292, 3587138, 3992411, 4636424, 5283061, 5695575, 5706214, 5256638, 4401728, 3283335, 2087454, 998425, 160751, -343476, -496189, -325401, 121154, 795810, 1656754, 2664169, 3774715, 4937143, 6087725, 7146861, 8021598, 8616473, 8849125, 8664724, 8046018, 7020041, 5663354, 4103863, 2511605, 1070424, -67110, -823088, -1210561, -1310268, -1220349, -1008606, -692063, -247916, 358879, 1150635, 2125922, 3263273, 4533269, 5909710, 7371579, 8894203, 10438458, 11951134, 13381379, 14703661, 15931942, 17117642, 18335093, 19661118, 21152256, 22823202, 24634338, 26495750, 28285802]
12205B8285802J586543J252941P95321K26432m20870j081983j665541k078865
12197B6899780k261627k207816j963973j608127j223614q78738o14956m43066
12189A5697863l48335l03469k82230k64698k32921j65788m2863J42851L73019
12180A4573429O03459P77633Q47836P93398O26906L85851J15135j49493l88979
12171A8185175n98105p76920r22675j025817j069658j031306q83217n98925j66992
12162A1111560L90903J012514J611917K115884K494424K760895K942382L046815
12154B7487294L053880K933248K670566K279299J792592J246222O68343Q2773
12146D2214217m80654r81496j376700j636053j753932j750469j663422j535603
$$ y = [28285802, 29872345, 31125286, 31920607, 32147039, 31726169, 30644186, 28978645, 26899780, 24638153, 22430337, 20466364, 18858237, 17634623, 16755885, 16140929, 15697863, 15349528, 15046059, 14763829, 14499131, 14266210, 14100422, 14057559, 14200410, 14573429, 15176888, 15954521, 16802357, 17595755, 18222661, 18608512, 18723647, 18574154, 18185175, 17587070, 16810150, 15887475, 14861658, 13792000, 12760694, 11877477, 11278552, 11111560, 11502463, 12514977, 14126894, 16242778, 18737202, 21498097, 24440479, 27487294, 30541174, 33474422, 36144988, 38424287, 40216879, 41463101, 42131444, 42214217, 41733563, 40752067, 39375367, 37739314, 35985382, 34234913, 32571491, 31035888]
12138C1035888j402979j288691j206416j168978j190612j276001j404892j530775
12130B0566544j601340j586778j492996j350321j189672j025397q53479o59925
12122A0806636m30676j59396J46872M65420P61086R94179J128920J138883J009328
12113A5861252P38368L38929j57777o98971j212362j618409j850989j876831j704348
12104G818862j380639r81023n93382k96365j35024j05226j58183k24979k48515
12095C695526k06506j15786j8450M0707L3098m6463j83514l51463n17224o45256
12085A684669p03000o67805n31459k99605J2127L80740P75497J157267J481505
12076C289936J705767J798821J747813J561916J271878R24607N72432K60148J6063
$$ y = [31035888, 29632909, 28344218, 27137802, 25968824, 24778212, 23502211, 22097319, 20566544, 18965204, 17378426, 15885430, 14535109, 13345437, 12320040, 11466561, 10806636, 10375960, 10216564, 10363436, 10828856, 11589942, 12584121, 13713041, 14851924, 15861252, 16599620, 16938549, 16780772, 16081801, 14869439, 13251030, 11400041, 9523210, 7818862, 6438223, 5457200, 4863818, 4567453, 4432429, 4327203, 4169020, 3944041, 3695526, 3489020, 3373234, 3354784, 3395491, 3428589, 3382126, 3198612, 2847149, 2329925, 1684669, 981669, 313864, -217595, -517200, -505073, -124333, 651164, 1808431, 3289936, 4995703, 6794524, 8542337, 10104253, 11376131, 12300738, 12873170, 13133318, 13149381]
12067A3149381j48752k34302k43511j76250k7790K06155N17922Q76145J223764
12058A5142762J490532J613758J556673J318237R33154M60805l6628n18239r75613
12049B0985441j422943j873488k318854k723103l033192l199239l193862l020136
12041B00624k705015k286064j802803j295426q03641l59825J9120L31732N81473
12032h119825P64852Q70185Q89269Q30915P22298N95966M75036L70057K86685
12023b314562K31626K08655K10047K13896J91148J17492j6629k02727m18680o36986
12013b416720q29437r65225j008694r26143p02256l55752N7913M61266P81692
12004e903356R77874J050624J029768R45290Q04745N94308L00577o6205m64838
$$ y = [13149381, 13000629, 12766327, 12522816, 12346566, 12318776, 12524931, 13042853, 13918998, 15142762, 16633294, 18247052, 19803725, 21121962, 22055116, 22515921, 22479293, 21961054, 20985441, 19562498, 17689010, 15370156, 12647053, 9613861, 6414622, 3220760, 200624, -2504391, -4790455, -6593258, -7888684, -8692325, -9052150, -9033030, -8701298, -8119825, -7354973, -6484788, -5595519, -4764604, -4042306, -3446340, -2971304, -2601247, -2314562, -2082936, -1874281, -1664234, -1450338, -1259190, -1141698, -1158327, -1361054, -1779734, -2416720, -3246157, -4211382, -5220076, -6146219, -6848475, -7204227, -7146314, -6685048, -5903356, -4925482, -3874858, -2845090, -1899800, -1095055, -500747, -200170, -266375, -731213]
11995g31213q34770j118641j285443j344904j344705j348294j403743j522920
11987a0934633j683678j848725j982716k055933k040246j909928j651038j271648
11979b5378545q04683l02004J77587N83512Q86739J084045J190818J229051J218932
11970b0114548J174203J096160R68504P64249M69832J12864k31450m68404n33263
11961a6761853m29701k30074l6779O8553N5370n9266k35400m34485o31595q17353
11951a9512583r95351j177664j378235j604070j845439k070001k228075k271659
11943c3083077k177593j958347j652142j300982r33545n63161j98452J44151M37077
11934d1286071O51084P69924P96678P45571O28116M47889K07785p9896l91049
$$ y = [-731213, -1565983, -2684624, -3970067, -5314971, -6659676, -8007970, -9411713, -10934633, -12618311, -14467036, -16449752, -18505685, -20545931, -22455859, -24106897, -25378545, -26183228, -26485232, -26307645, -25724133, -24837394, -23753349, -22562531, -21333480, -20114548, -18940345, -17844185, -16875681, -16111432, -15641600, -15528736, -15760186, -16228590, -16761853, -17191554, -17421628, -17458407, -17389854, -17334484, -17393750, -17629150, -18063635, -18695230, -19512583, -20507934, -21685598, -23063833, -24667903, -26513342, -28583343, -30811418, -33083077, -35260670, -37219017, -38871159, -40172141, -41105686, -41668847, -41867299, -41723148, -41286071, -40634987, -39865063, -39068385, -38322814, -37694698, -37246809, -37039024, -37118920, -37509969]
11925c7509969o96143r69111j192974j360076j467803j513739j495176j413650
11917d7618641j279042j107764r16446p16846n14649l10602j03042J06717L07789
11908e2152526M78927N98454O59499O77412O81541O96751P28592P61513P68777
11899d6101060P26441O25249M78039L20312K00786J63100K27693L85548O07839
11890d2366053Q63975J135572J418002J709730J996656K242139K391502K392228
11882b8216249K220620J899745J496841J099413P81235N75607M69132M16795L66360
11873a8890501K77678J31077p1091l05223n31636p08277q09521q38055q20384
11864b2565933p88960p63625p42916p06518o24864m73342k49345J5002K56281
$$ y = [-37509969, -38206112, -39175223, -40368197, -41728273, -43196076, -44709815, -46204991, -47618641, -48897683, -50005447, -50921893, -51638739, -52153388, -52463990, -52567032, -52460315, -52152526, -51673599, -51075145, -50415646, -49738234, -49056693, -48359942, -47631350, -46869837, -46101060, -45374619, -44749370, -44271331, -43951019, -43750233, -43587133, -43359440, -42973892, -42366053, -41502078, -40366506, -38948504, -37238774, -35242118, -32999979, -30608477, -28216249, -25995629, -24095884, -22599043, -21499630, -20718395, -20142788, -19673656, -19256861, -18890501, -18612823, -18481746, -18552837, -18858060, -19389696, -20097973, -20907494, -21745549, -22565933, -23354893, -24118518, -24861434, -25567952, -26192816, -26666158, -26915503, -26900501, -26644220]
11855b6644220M04473M16973K99242R8465j21753l05123m12633m23145l34481
11846b7022202j65676M7535K68097M76153O76855Q89699J124949J363527J556521
11837b0784542J647423J602756J429840J170949Q81885O12698M01483K78345K67961
11828a2491202L82483O07193Q90896J152802J306193J286613J070007O75148J54453
11819d965414m20450r74392j443133j784479j984806k059823k047192j990333
11811a7670022j919197j838974j733285j578354j358804j077701p57891m34561
11803b8368789j42075R8978K89012M49026O12075Q06278J033942J260159J423774
11794b2537620J467670J368213J144585Q46360N32692K55804N2042o2134r1130
$$ y = [-26644220, -26239747, -25822774, -25523532, -25425067, -25546820, -25851943, -26264576, -26687721, -27022202, -27187878, -27140343, -26872246, -26396093, -25719238, -24829539, -23704590, -22341063, -20784542, -19137119, -17534363, -16104523, -14933574, -14051689, -13438991, -13037508, -12759163, -12491202, -12108719, -11501526, -10610630, -9457828, -8151635, -6865022, -5795015, -5119867, -4965414, -5385864, -6360256, -7803389, -9587868, -11572674, -13632497, -15679689, -17670022, -19589219, -21428193, -23161478, -24739832, -26098636, -27176337, -27934228, -28368789, -28510864, -28411886, -28122874, -27673848, -27061773, -26255495, -25221553, -23961394, -22537620, -21069950, -19701737, -18557152, -17710792, -17178100, -16922296, -16870254, -16932388, -17023518]
11785a7023518n7294Q006P9292J51958K46341L94115O13275Q88727J172245J402518
11775a2124335J534171J560606J517190J459999J430574J429562J417696J342313
11767d32224J170091R06504N93856K90033L7415j60842l39045n39288p74709j013444
11757b61653j193138j252700j161192r32531o23088l13011p7627L7840K8250p7802
11747e826652k32547l84310m90900n29167m97864m13442l02401j93343j08674
11738h979300n6592k7589L68M9711J30764K34899L35740L98651L95954L20927
11728g196467J91202L8100j10568k41296l53872m55506n59717o89506q74245j134339
11718a1386214j462458j816941k133207k344643k401255k281580j998000j593454
$$ y = [-17023518, -17080812, -17072806, -16993514, -16841556, -16595215, -16201100, -15587825, -14699098, -13526853, -12124335, -10590164, -9029558, -7512368, -6052369, -4621795, -3192233, -1774537, -432224, 737867, 1644371, 2238227, 2528260, 2565675, 2404833, 2065788, 1526500, 751791, -261653, -1454791, -2707491, -3868683, -4801214, -5424302, -5737313, -5814940, -5777100, -5748850, -5826652, -6059199, -6443509, -6934409, -7463576, -7961440, -8374882, -8677283, -8870626, -8979300, -9035892, -9063481, -9063113, -9013402, -8882638, -8647739, -8311999, -7913348, -7517394, -7196467, -7005265, -6967165, -7077733, -7319029, -7672901, -8128407, -8688124, -9377630, -10251875, -11386214, -12848672, -14665613, -16798820, -19143463, -21544718, -23826298, -25824298, -27417752]
11710b7417752j127336o55308k14398J78398N16465P92593R95247J114048J149972
11701b4668071J122977J071495J042931J078624J198747J393128J623429J838549
11693a4298191J997551K088526K132781K171662K242382K355063K483138K572679
11685C745591K565589K423750K142827J752322J305372Q63832M84021K07065N4583
11676A5544952K7657J08629K67910M74783P03928R30475J119377J225213J210149
11667B1613073J067635Q30444N54075K87234M9982j67490l87892o25151q72235
11658B2349675j103723j287574j396583j414482j337253j171603r31785o36985
11650A3069687l12086Q430K78304M44335M58872K95437l9244n02884j027652j539239
$$ y = [-27417752, -28545088, -29200396, -29414794, -29236396, -28719931, -27927338, -26932091, -25818043, -24668071, -23545094, -22473599, -21430668, -20352044, -19153297, -17760169, -16136740, -14298191, -12300640, -10212114, -8079333, -5907671, -3665289, -1310226, 1172912, 3745591, 6311180, 8734930, 10877757, 12630079, 13935451, 14799283, 15283304, 15490369, 15544952, 15572609, 15681238, 15949148, 16423931, 17127859, 18058334, 19177711, 20402924, 21613073, 22680708, 23511152, 24065227, 24352461, 24402443, 24234953, 23847061, 23221910, 22349675, 21245952, 19958378, 18561795, 17147313, 15810060, 14638457, 13706672, 13069687, 12757601, 12766031, 13044335, 13488670, 13947542, 14242979, 14203735, 13700851, 12673199, 11133960]
11640A1133960j976408k301983k502127k577717k535255k382944k132032j798824
11632g073330j403006r62862m91276N466N26739J073754J640535K202194K710308
11623a771478L103011L324767L342286L148437K757000K194786J495084O95260
11615A8289153j58137r99467j740806k286463k562382k543843k264866j805371
11607C927818j265235p39147l01258N96J47172J49309M4199j17665k90096m42915
11597A112778n63595o53607p23583p85135q40122q77282q84533q66686q46402
11588e928167q40820q34478p76965o10861l08337J09305N77395J010626J330074
11579f272228J484809J462582J289084J019782P27738M86858L51165L36536M14406
$$ y = [11133960, 9157552, 6855569, 4353442, 1775725, -759530, -3142474, -5274506, -7073330, -8476336, -9439198, -9930474, -9925008, -9398269, -8324515, -6683980, -4481786, -1771478, 1331533, 4656300, 7998586, 11147023, 13904023, 16098809, 17593893, 18289153, 18131016, 17131549, 15390743, 13104280, 10541898, 7998055, 5733189, 3927818, 2662583, 1923436, 1622178, 1622774, 1769946, 1919255, 1963454, 1845789, 1555693, 1112778, 549183, -104424, -828007, -1613142, -2453264, -3330546, -4215079, -5081765, -5928167, -6768987, -7603465, -8380430, -8991291, -9299628, -9190323, -8612928, -7602302, -6272228, -4787419, -3324837, -2035753, -1015971, -288233, 198625, 549790, 886326, 1300732]
11570A300732N21813N85862N56152M32684K70571J50340J27743J97211K94065
11561D437173L29543K32422k3797m14189q74550j326670j703915j962683k078336
11552c385002k038957j848364j533675j144688p40866l74360p9254J29876K53729
11543a0761561L03732K99980K69758K42211K38410K62937L04217L43824L67856
11534h128636L73405L67498L59386L50026L26440K67846J61110J2860j52948l09840
11524f372853m43529n57398o69947q09603j008150j290660j662959k102513k558254
11515a7475866k959759l232098l312036l162468k782527k210614j517236p86494
11507c7439098r1247N25826J053434J495216J849253K098486K216010K178934
$$ y = [1300732, 1822545, 2408407, 2964559, 3397243, 3667814, 3818154, 3945897, 4143108, 4437173, 4766716, 4999138, 4975341, 4561152, 3686602, 2359932, 656017, -1306666, -3385002, -5423959, -7272323, -8805998, -9950686, -10691552, -11065912, -11145166, -11015290, -10761561, -10457829, -10157849, -9888091, -9645880, -9407470, -9144533, -8840316, -8496492, -8128636, -7755231, -7387733, -7028347, -6678321, -6351881, -6084035, -5922925, -5910065, -6063013, -6372853, -6816382, -7373780, -8043727, -8853330, -9861480, -11152140, -12815099, -14917612, -17475866, -20435625, -23667723, -26979759, -30142227, -32924754, -35135368, -36652604, -37439098, -37530345, -37004519, -35951085, -34455869, -32606616, -30508130, -28292120, -26113186]
11499b6113186J983300J654894J250727Q47261N18506L13952K45358K85881L81840
11490a8631467M74949N25457N21459M68899L75206K45741R5589m0651j17911j04394
11480a6187123R28J72363L77596N94630Q12548J020315J197445J314472J340692
11471i356134J254146J052419P61809M36741J43189o7927j81314k20378k34048
11462f411497k76198l85788n73340q18466j079708j312127j484181j586671j630460
11453a5558436j634785j612658j562098j468353j315053j096966q27471n37104
11445b5612924k63655l8334J24538K28176K84455L02710K85138K32097J51643
11436b4306156O3728n342l3460r677O5986J86718L42255N19457P00714Q62012
$$ y = [-26113186, -24129886, -22474992, -21224265, -20377004, -19858498, -19544546, -19299188, -19013307, -18631467, -18156518, -17631061, -17109602, -16640703, -16265497, -16019756, -15924167, -15964818, -16082729, -16187123, -16186195, -16013832, -15636236, -15041606, -14229058, -13208743, -12011298, -10696826, -9356134, -8101988, -7049569, -6287760, -5851019, -5707830, -5775757, -5957071, -6177449, -6411497, -6687695, -7073483, -7646823, -8465289, -9544997, -10857124, -12341305, -13927976, -15558436, -17193221, -18805879, -20367977, -21836330, -23151383, -24248349, -25075820, -25612924, -25876579, -25914913, -25790375, -25562199, -25277744, -24975034, -24689896, -24457799, -24306156, -24242428, -24247770, -24281230, -24290907, -24224921, -24038203, -23695948, -23176491, -22475777, -21613765]
11426b1613765R74233J011089R62202Q43191O93665N60808M75945M36848M06909
11417a5248875L33184J73921q0043m00750p35179j025622j228820j326399j323544
11408b0862127j239620j099553r30796p61581o13972m94888l95429l01545k05677
11399b6905188j07867p923J00253K26163L76892N54481P56638R77301J206758
11390b2822492J433240J645366J832142J979793K069322K079384J994805J816442
11382g971998J566099J282708J011615P93712O59444O25938O92783Q37975J021483
11373E19759J198937J337163J421023J450009J431168J373260J282705J161829
11365A1175853J010746Q30523O22990L88181J26044j55493m34884o82682q75025
$$ y = [-21613765, -20639532, -19628443, -18666241, -17823050, -17129385, -16568577, -16092632, -15655784, -15248875, -14915691, -14741770, -14821813, -15222563, -15957742, -16983364, -18212184, -19538583, -20862127, -22101747, -23201300, -24132096, -24893677, -25507649, -26002537, -26397966, -26699511, -26905188, -27013055, -27020978, -26920725, -26694562, -26317670, -25763189, -25006551, -24029250, -22822492, -21389252, -19743886, -17911744, -15931951, -13862629, -11783245, -9788440, -7971998, -6405899, -5123191, -4111576, -3317864, -2658420, -2032482, -1339699, -501724, 519759, 1718696, 3055859, 4476882, 5926891, 7358059, 8731319, 10014024, 11175853, 12186599, 13017122, 13640112, 14028293, 14154337, 13998844, 13563960, 12881278, 12006253]
11356A2006253j002182j065729j070485j020398r19417p72153n82344l54055j00453
11347E119037J43959L19957L58711K11624j21656n85076j084360j522262j831495
11338A008439j988768k007319j920029j766788j588140j417622j270094j134891
11330a2085212r83555p89695n47501k77027j4391K05918L65484M63754N07126
11321a3155099M96497M26566K98481J32675l3019j61350k35041k60411k52446
11312a2743147k17005j48425m2826R1296K39300L94860N61913P38129Q96743R86206
11302i242956R49557P49440L84957j04832o49794j166768j581785j849905j966004
11293a4478090j961268j884968j778881j657561j504281j281932r50758m85286
$$ y = [12006253, 11004071, 9938342, 8867857, 7847459, 6928042, 6155889, 5573545, 5219490, 5119037, 5262996, 5582953, 5941664, 6153288, 6031632, 5446556, 4362196, 2839934, 1008439, -980329, -2987648, -4907677, -6674465, -8262605, -9680227, -10950321, -12085212, -13068767, -13858462, -14405963, -14682990, -14697381, -14491463, -14125979, -13662225, -13155099, -12658602, -12232036, -11933555, -11800880, -11833899, -11995249, -12230290, -12490701, -12743147, -12960152, -13108577, -13151403, -13060107, -12820807, -12425947, -11864034, -11125905, -10229162, -9242956, -8293399, -7543959, -7159002, -7263834, -7913628, -9080396, -10662181, -12512086, -14478090, -16439358, -18324326, -20103207, -21760768, -23265049, -24546981, -25497739, -25983025]
11285b5983025J12891Q08096J531270K190221K689539K956242K961975K730137
11277a0002654K323168J817706J282679P70122L17338m7705l05071m47860m89803
11268d782080m66888m26489m07348m23509m63711n05772n35077n56211n93148
11259i160233o78387q34848j058597j312823j538564j677507j694865j591208
11251a9547032j398206j160814r15675o78131m44140k01508O0215L45067O46813
11242b3293411R44399J203959J393406J502270J550484J577786J621783J700077
11234a1799247J805292J911355J984440J993535J918421J753672J507258J194853
11226B269579Q35544M54049Q5614k27626m52891n82594o32542o22595n59223m35785
$$ y = [-25983025, -25870134, -25062038, -23530768, -21340547, -18651008, -15694766, -12732791, -10002654, -7679486, -5861780, -4579101, -3808979, -3491641, -3539346, -3844417, -4292277, -4782080, -5248968, -5675457, -6082805, -6506314, -6970025, -7475797, -8010874, -8567085, -9160233, -9838620, -10673468, -11732065, -13044888, -14583452, -16260959, -17955824, -19547032, -20945238, -22106052, -23021727, -23699858, -24143998, -24345506, -24285291, -23940224, -23293411, -22349012, -21145053, -19751647, -18249377, -16698893, -15121107, -13499324, -11799247, -9993955, -8082600, -6098160, -4104625, -2186204, -432532, 1074726, 2269579, 3105123, 3559172, 3644786, 3417160, 2964269, 2381675, 1749133, 1126538, 567315, 131530]
11216A31530k45625Q124L13060O51862J003608J342818J639712J862150J978310
11207H685549J961484J798272J497479J094468O47523K26328j05467l09247l84189
11198A5112200l65322l05865k53888k37271k63128l27042m24309n58246p40882
11189A1636247r80838j261829j529314j702831j709427j512800j118896n64643
11181A255669R1061P68717J373676J814561K027799J994327J741866J335011Q57292
11172A3259979L88919j3940l30267n70341p59388r18477j053552j156667j214848
11163G631418j219259j170986j083414r80414q89001q28862q05154q08726q21706
11154i76104q23453p94966p23460o08644m68262l37401k57417k57815l42100m87590
$$ y = [131530, -114095, -105971, 207089, 858951, 1862559, 3205377, 4845089, 6707239, 8685549, 10647033, 12445305, 13942784, 15037252, 15684775, 15911103, 15805636, 15496389, 15112200, 14746878, 14441013, 14187125, 13949854, 13686726, 13359684, 12935375, 12377129, 11636247, 10655409, 9393580, 7864266, 6161435, 4452008, 2939208, 1820312, 1255669, 1346730, 2115447, 3489123, 5303684, 7331483, 9325810, 11067676, 12402687, 13259979, 13648898, 13634958, 13304691, 12734350, 11974962, 11056485, 10002933, 8846266, 7631418, 6412159, 5241173, 4157759, 3177345, 2288344, 1459482, 654328, -154398, -976104, -1799557, -2594523, -3317983, -3926627, -4394889, -4732290, -4989707, -5247522, -5589622, -6077212]
11144f077212o58218q18944r41980j005527r92211q91274p02040m34675j07394
11135a2629475K57612O36551J003117J325516J565319J682204J644797J442815
11127c071544J093953O42413J50915l10261o76312r04000r87463r64077r01591
11118e927967q68887r05082j003590j118734j190108j171787j052122q55336o26566
11109a4720179m10820k37613j17301m7703k4322m5882j10993k10153l23178m27160
11099a6675304n08366n66167o05143o23897o12514n61046m69712l49550k12676
11090b1184375o3133J00684K73763M35214N52133N93999N46981M19716K38045
11081a8086973L0557j88371m26319p02151j020791j350179j617178j726821j596305
$$ y = [-6077212, -6735430, -7554374, -8496354, -9501881, -10494092, -11385366, -12087406, -12522081, -12629475, -12371863, -11735312, -10732195, -9406679, -7841360, -6159156, -4514359, -3071544, -1977591, -1335178, -1184263, -1494524, -2170836, -3074836, -4062299, -5026376, -5927967, -6796854, -7701936, -8705526, -9824260, -11014368, -12186155, -13238277, -14093613, -14720179, -15130999, -15368612, -15485913, -15533616, -15557938, -15603820, -15714813, -15924966, -16248144, -16675304, -17183670, -17749837, -18354980, -18978877, -19591391, -20152437, -20622149, -20971699, -21184375, -21247508, -21146824, -20873061, -20437847, -19885714, -19291715, -18744734, -18325018, -18086973, -18056416, -18244787, -18671106, -19373257, -20394048, -21744227, -23361405, -25088226, -26684531]
11072b6684531j189023n34913K71710J096989J806359K303179K552818K583021
11064a7794391K461357K262500K043072J834207J647339J481620J326891J165911
11056c571494R80779P61529N09174K29405p7343m18750q01186j213771j618570
11047e220227j956260k166580k213157k098655j861488j556539j232427r18274
11039a9223607o24002l48655q8974J56062L85036N96438P90476R68489J131639
11030a6257098J281043J417152J534426J615036J633212J573844J450127J299931
11022d452327J160795J045944R41275Q20599O62593M60094K23190k2743k47126
11013E92294m29698n70301o85121p94389r12000j040602j169197j273332j321584
$$ y = [-26684531, -27873554, -28408467, -28136757, -27039768, -25233409, -22930230, -20377412, -17794391, -15333034, -13070534, -11027462, -9193255, -7545916, -6064296, -4737405, -3571494, -2590715, -1829186, -1320012, -1090607, -1167950, -1586700, -2387886, -3601657, -5220227, -7176487, -9343067, -11556224, -13654879, -15516367, -17072906, -18305333, -19223607, -19847609, -20196264, -20285238, -20129176, -19744140, -19147702, -18357226, -17388737, -16257098, -14976055, -13558903, -12024477, -10409441, -8776229, -7202385, -5752258, -4452327, -3291532, -2245588, -1304313, -483714, 178879, 638973, 862163, 839420, 592294, 162596, -407705, -1092826, -1887215, -2799215, -3839817, -5009014, -6282346, -7603930]
11004g603930j287357j158671r41108o56555l41109m0122K02218L54841M06363
10995a1065430L65320K57988J24391Q878n3208m3282M4832K14926M71569Q13092
10985h860924J223022J668585K104874K478745K733087K818599K714322K444209
10977I324519K072244J673444J299700R65212O59087L69866J01072j30114l03878
10968A6031152m08548m46709m36389m06887l89128m03695m52789n21510n87900
10959A1977597o34457o52637o38873n89543n02263l81915k42687j02163K6864
10950H259923J39060K33290L09119L66140M03575M18254M04558L60956K99948
10941A1194823K50598K46857L08810M32186N93720P64562R18984J034823J091644
$$ y = [-7603930, -8891287, -10049958, -10991066, -11647621, -11988730, -12028852, -11826634, -11471793, -11065430, -10700110, -10442122, -10317731, -10308853, -10362061, -10405343, -10360511, -10145585, -9674016, -8860924, -7637902, -5969317, -3864443, -1385698, 1347389, 4165988, 6880310, 9324519, 11396763, 13070207, 14369907, 15335119, 15994206, 16364072, 16465144, 16335030, 16031152, 15622604, 15175895, 14739506, 14332619, 13943491, 13539796, 13087007, 12565497, 11977597, 11343140, 10690503, 10051630, 9462087, 8959824, 8577909, 8335222, 8233059, 8259923, 8398983, 8632273, 8941392, 9307532, 9711107, 10129361, 10533919, 10894875, 11194823, 11445421, 11692278, 12001088, 12433274, 13026994, 13791556, 14710540, 15745363, 16837007]
10932A6837007J071205R58768P43813M22574L547m88694j016240j535108k001135
10923A4995737k373568k620810k729803k712870k604514k447768k277542k110344
10915d881482j945422j775518j599609j427946j274487j141478j009458q44331
10907a5899731o19969l39862l9244K35639M55552O23398P68424R27036J123716
10898a2765041J361729J625371J888310K119433K282584K336396K243833J991861
10890C084476J608794J164839P52045M52791L11624L22808M38625N93424P30969
10881I460395Q22539Q70155Q96366R25982R67638J004601J000049R12467P10698
10872A7570890L82552o0261n77563j101068j548082j847630j965316j911841j732648
$$ y = [16837007, 17908212, 18866980, 19610793, 20033367, 20036914, 19548220, 18531980, 16996872, 14995737, 12622169, 10001359, 7271556, 4558686, 1954172, -493596, -2771138, -4881482, -6826904, -8602422, -10202031, -11629977, -12904464, -14045942, -15055400, -15899731, -16519700, -16859562, -16898806, -16663167, -16207615, -15584217, -14815793, -13888757, -12765041, -11403312, -9777941, -7889631, -5770198, -3487614, -1151218, 1092615, 3084476, 4693270, 5858109, 6610154, 7062945, 7374569, 7697377, 8136002, 8729426, 9460395, 10282934, 11153089, 12049455, 12975437, 13943075, 14947676, 15947725, 16860192, 17570890, 17953442, 17893181, 17315618, 16214550, 14666468, 12818838, 10853522, 8941681, 7209033]
10863G209033j488460j237737j024721q71999p77508p18356o62445n84290m76984
10854f33467l52664k31228j27383m7907M98N828m1573j34815k46617l41851l94221
10843b545400l91749l30443k07741k3812K12672M81967P56024J002891J189882
10834A44291J287179J274043J144923R09339N85364J95990k24070o19144r19233
10825C778682j067873j051921r07853p00249m91703l24111k14772j60220j42720
10816a282740j38751j27965r9625n5062n830L3077N3326O0529P2395J08009J75336
10805a207301K64799L53010M15530M42051M44106M49308M86624N73565P12137
10796B933829Q92000J096035J305422J502544J670598J791770J848494J829243
$$ y = [7209033, 5720573, 4482836, 3458115, 2586116, 1808608, 1090252, 427807, -156483, -633467, -986131, -1217359, -1344742, -1392649, -1392151, -1386323, -1427896, -1562711, -1809328, -2151179, -2545400, -2937149, -3267592, -3475333, -3499145, -3286473, -2804506, -2048482, -1045591, 144291, 1431470, 2705513, 3850436, 4759775, 5345139, 5541129, 5317059, 4697915, 3778682, 2710809, 1658888, 751035, 50786, -440917, -765028, -979800, -1140020, -1282740, -1421491, -1549456, -1649081, -1704143, -1709973, -1676896, -1623570, -1563041, -1490646, -1382637, -1207301, -942502, -589492, -173962, 268089, 712195, 1161503, 1648127, 2221692, 2933829, 3825829, 4921864, 6227286, 7729830, 9400428, 11192198, 13040692, 14869935]
10788A4869935J734229J575966J374413J149354R11476O55143L60326Q450l96234
10779B2243058q17310j197758j482767j637294j651977j542492j346745j116993
10771A1449722r04656p44044o45480o00740n93009o02240o05838n82112n19883
10762E651720m27225l29184k53775k17235k19824k52250l03356l61910m15212
10753B871749m52067m71285m87349n24655o02162p20099q58391r86792j079955
10744c311006j130410j153347j178532j231385j315270j407593j470170j463152
10736a3660865j354905j129517p94050l81308N5909M55903P59357R21379R24630
10727a4203467P85544N44154K42336r0366m30306p41292r66219j042339r32197
$$ y = [14869935, 16604164, 18180130, 19554543, 20703897, 21615373, 22270516, 22630842, 22639292, 22243058, 21425748, 20227990, 18745223, 17107929, 15455952, 13913460, 12566715, 11449722, 10545066, 9801022, 9155542, 8554802, 7961793, 7359553, 6753715, 6171603, 5651720, 5224495, 4895311, 4641536, 4424301, 4204477, 3952227, 3648871, 3286961, 2871749, 2419682, 1948397, 1461048, 936393, 334231, -385868, -1244259, -2231051, -3311006, -4441416, -5594763, -6773295, -8004680, -9319950, -10727543, -12197713, -13660865, -15015770, -16145287, -16939337, -17320645, -17264736, -16808833, -16049476, -15128097, -14203467, -13417923, -12873769, -12631433, -12721799, -13152105, -13893397, -14859616, -15901955, -16834152]
10718a6834152o47582k48570J80824N62803Q45297J007939J059551J029435R52837
10709a2091618Q56727P54741O51361N45809M29795K84476Q3894j95911n68067
10700i248793j028850j553710k096105k592385k974630l189222l213552l060218
10692b8957465k763969k360787j876352j330895p50010j67551L81103Q67950J277705
10683c5680271J607840J862464K043389K148309K181075K162766K126043K092530
10675a9455855K053771J974330J814282J553104J200755P93844L83036J9990k50502
10666i913245l94196l92470k50740l915K88886N60302P53547Q35700Q01798O70420
10656g043913M74139K49553K9918j59535l04370m00506m49060m48832l92357k69305
$$ y = [-16834152, -17481734, -17730304, -17549480, -16986677, -16141380, -15133441, -14073890, -13044455, -12091618, -11234891, -10480150, -9828789, -9282980, -8853185, -8568709, -8484815, -8680726, -9248793, -10277643, -11831353, -13927458, -16519843, -19494473, -22683695, -25897247, -28957465, -31721434, -34082221, -35958573, -37289468, -38039478, -38207029, -37825926, -36957976, -35680271, -34072431, -32209967, -30166578, -28018269, -25837194, -23674428, -21548385, -19455855, -17402084, -15427754, -13613472, -12060368, -10859613, -10065769, -9682733, -9662743, -9913245, -10307441, -10699911, -10950651, -10954566, -10665680, -10105378, -9351831, -8516131, -7714333, -7043913, -6569774, -6320221, -6290303, -6449838, -6754208, -7154714, -7603774, -8052606, -8444963, -8714268]
10646h714268p4916J82427M78413P74409J021303J165254J157076R66028N95049
10637b449225R0530m61242r54532j295976j433336j366194j134428p94482l98391
10628a0197276J6059M25429Q15549J174243J483545J714903J831367J798134J597593
10619F59546J241886P76804K75210j78234n07250o64379o44413m83653k43546
10610B31971J2877K38932M09252N15280N60560N61147N47538N60637O39495Q06721
10600E084410J058997J365169J671418J914493K042128K032086J897310J673824
10592A8739835J400948J106144P99813M79654J42166k04606n36408q20026j025970
10583B0081550j137247j152030j083116r55140p98815o44370n16959m33211l97832
$$ y = [-8714268, -8789184, -8606757, -8128344, -7353935, -6332632, -5167378, -4010302, -3044274, -2449225, -2358695, -2819937, -3774469, -5070445, -6503781, -7869975, -9004403, -9798885, -10197276, -10181217, -9755788, -8940239, -7765996, -6282451, -4567548, -2736181, -938047, 659546, 1901432, 2678236, 2953446, 2775212, 2267962, 1603583, 959170, 475517, 231971, 244848, 483780, 893032, 1408312, 1968872, 2530019, 3077557, 3638194, 4277689, 5084410, 6143407, 7508576, 9179994, 11094487, 13136615, 15168701, 17066011, 18739835, 20140783, 21246927, 22046740, 22526394, 22668560, 22463954, 21927546, 21107520, 20081550, 18944303, 17792273, 16709157, 15754017, 14955202, 14310832, 13793873, 13360662, 12962830]
10574A2962830m04019m40472m99214n75175o58771p32358p76320p78023p34544
10565G363934o49381n30455l93175k64301j79386j72354k64128m58706p46135
10556C705913j103822j492513j855113k127270k256123k215415k010470j674414
10548a1029227j257644q12321l78727J8780L67996O66467R23240J157321J387118
10539h956997J616062J825041J977912K038579J991036J850448J658595J468141
10531E468817J325273J255454J254169J288437J314031J300836J249540J190544
10523A5647101J169645J229826J395539J664346K007823K377943K715507K964290
10515C1172020L092281L107331L051421K977485K929251K935970L016138L183278
$$ y = [12962830, 12558811, 12118339, 11619125, 11043950, 10385179, 9652821, 8876501, 8098478, 7363934, 6714553, 6184098, 5790923, 5526622, 5347236, 5174882, 4910754, 4452048, 3705913, 2602091, 1109578, -745535, -2872805, -5128928, -7344343, -9354813, -11029227, -12286871, -13099192, -13477919, -13459139, -13091143, -12424676, -11501436, -10344115, -8956997, -7340935, -5515894, -3537982, -1499403, 491633, 2342081, 4000676, 5468817, 6794090, 8049544, 9303713, 10592150, 11906181, 13207017, 14456557, 15647101, 16816746, 18046572, 19442111, 21106457, 23114280, 25492223, 28207730, 31172020, 34264301, 37371632, 40423053, 43400538, 46329789, 49265759, 52281897, 55465175]
10507E5465175L453614L852384M411797N162839O131227P338740Q802921J0537222
10499A05155919J2559463J4901164J7600521K0680764K4131487K7891492L1810154
10492B54730964L5579746L8658525M0217824L9183759L4497400K5640213J3191425
10485D81699856j043600j4603069k5352684l2235090l5359739l5562651l3871406
10478C03671617l1171009k8086607k4987901k2054118j9361329j6946065j4824524
10471A46240064j2990995j1422332j0087552q953583p990049p175294o496387
10464H1123872n941419n493922n134258m841612m593644m368735m150520l927143
10456D2672619l686069l415084l111849k790502k477592k202939j992508j862590
$$ y = [55465175, 58918789, 62771173, 67182970, 72345809, 78477036, 85815776, 94618697, 105155919, 117715382, 132616546, 150217067, 170897831, 195029318, 222920810, 254730964, 290310710, 328969235, 369187059, 408370818, 442868218, 468508431, 481699856, 480656256, 466053187, 440700503, 408465413, 373105674, 337543023, 303671617, 272500608, 244414001, 219426100, 197371982, 178010653, 161064588, 146240064, 133249069, 121826737, 111739185, 102785602, 94795553, 87620259, 81123872, 75182453, 69688531, 64554273, 59712661, 55119017, 50750282, 46599762, 42672619, 38986550, 35571466, 32459617, 29669115, 27191523, 24988584, 22996076, 21133486]
10448B1133486j814577j834453j897358j971091k017037j995524j879442j668289
10440F055715j392389j104528q62624p09479o58792o95209p86047q93414r80846
10431b027613j019396r97451r28244q46024p90241p85947q30517q93790r32149
10422a0051372r08432q06048o32919m19384k13542p1292l9482j38865l57499o58700
10412a4297535r97091j331074j624116j838405j932551j870479j635380j237560
10404b6764191p13314j19538M74830J003900J422740J715746J889204J957261
10396a9133362J935697J846755J725672J617767J563437J579199J648662J731058
10388e485115J780628J762584J658774J467734J204343Q97077N80119K84204L2329
$$ y = [21133486, 19318909, 17484456, 15587098, 13616007, 11598970, 9603446, 7724004, 6055715, 4663326, 3558798, 2696174, 1986695, 1327903, 632694, -153353, -1046767, -2027613, -3047009, -4044460, -4972704, -5818728, -6608969, -7394916, -8225433, -9119223, -10051372, -10959804, -11765852, -12398771, -12818155, -13031697, -13102989, -13142471, -13281336, -13638835, -14297535, -15294626, -16625700, -18249816, -20088221, -22020772, -23891251, -25526631, -26764191, -27477505, -27597043, -27122213, -26118313, -24695573, -22979827, -21090623, -19133362, -17197665, -15350910, -13625238, -12007471, -10444034, -8864835, -7216173, -5485115, -3704487, -1941903, -283129, 1184605, 2388948, 3286025, 3866144, 4150348, 4182677]
10379D182677j59101k78291l18871k83422j86316n0522J03224K67076M43941O30502
10369D350897Q00090R03150Q87986P27846M36508O2786l32890p05471j038965
10360F091937j340377j623128j894486k152944k390985k597076k755473k845929
10352a1508461k846242k739554k524660k223227j877353j535918j234849r80953
10344b7471217p49768n02031k10434J21448M60902P63364R89064J109870J111246
10335b4377556R97023P95347N57319L44688K12146J92174K86377M64585O73998
10326a9853899Q58424R78699J020070R81254Q57141O33265K97787j40156o40788
10317a5008203j139369j564001j856857j988225j956639j779090j483005j106434
$$ y = [4182677, 4023576, 3745285, 3426414, 3142992, 2956676, 2906154, 3009378, 3276454, 3720395, 4350897, 5150987, 6054137, 6942123, 7669969, 8106477, 8169263, 7836373, 7130902, 6091937, 4751560, 3128432, 1233946, -918998, -3309983, -5907059, -8662532, -11508461, -14354703, -17094257, -19618917, -21842144, -23719497, -25255415, -26490264, -27471217, -28220985, -28723016, -28933450, -28812002, -28351100, -27587736, -26598672, -25488802, -24377556, -23380533, -22585186, -22027867, -21683179, -21471033, -21278859, -20992482, -20527897, -19853899, -18995475, -18016776, -16996706, -16015452, -15158311, -14525046, -14227259, -14367415, -15008203, -16147572, -17711573, -19568430, -21556655, -23513294, -25292384, -26775389, -27881823]
10309b7881823o99990l20510j6186J87303K91578L20850L11222K97408L01014
10300b7209134L25545L60184L88025L92249L58331K76353J46616j5171j80370
10291b5157372l18551m08848m42691m18567l36854j99825j4792K03707M34443
10282b6659350O52947Q36559R66987J027051R96397Q56364O06724K82365m5861
10273b0479817k90684l79537k83168k9187L06909O30487Q61318R54700R04103
10264a7804876P32654M83080K09045l4477k02862k73077k49749j62822n7442J9648
10254a7340878L3429k7761j44482k68527l40285l15475j85101K5536K77835N44773
10244a7740936Q21202J113549J419507J715297J959927K111475K143209K051219
$$ y = [-27881823, -28581813, -28902323, -28918509, -28731206, -28439628, -28118778, -27807556, -27510148, -27209134, -26883589, -26523405, -26135380, -25743131, -25384800, -25108447, -24961831, -24977002, -25157372, -25475923, -25884771, -26327462, -26746029, -27082883, -27282708, -27297500, -27093793, -26659350, -26006403, -25169844, -24202857, -23175806, -22179409, -21323045, -20716321, -20433956, -20479817, -20770501, -21150038, -21433206, -21462393, -21155484, -20524997, -19663679, -18708979, -17804876, -17072222, -16589142, -16380097, -16414574, -16617436, -16890513, -17140262, -17303084, -17360526, -17340878, -17307449, -17335210, -17479692, -17748219, -18088504, -18403979, -18589080, -18563544, -18285709, -17740936, -16919734, -15806185, -14386678, -12671381, -10711454, -8599979, -6456770, -4405551]
10236d405551J852926J579856J268129R49677O45593L61855Q8475j94178n00132
10227A646650q20429j116995j335698j431722j390039j228901r89105p21195m77935
10218g865369l08143k46145l00418m51826o64130q96711j108858j257770j301259
10209a4400629j209876r80977o43491k48477J50684N18104Q42595J126105J361543
10200a3484419J518872J552607J426063J135340P19235K51951j76923m88391o36801
10191h182466o19642m70733k43766K202K10346L32145L38329K31879N2091j37585
10181h487200k73117l11824k42085q0420J36934L61516N40218O28386O08076N00126
10171f619390L56741K35135J69369J58859J77102J89524J68862J04470O198r8638
$$ y = [-4405551, -2552625, -972769, 295360, 1245037, 1890630, 2252485, 2340960, 2146782, 1646650, 826221, -290774, -1626472, -3058194, -4448233, -5677134, -6666239, -7387434, -7865369, -8173512, -8419657, -8720075, -9171901, -9836031, -10732742, -11841600, -13099370, -14400629, -15610505, -16591482, -17234973, -17483450, -17332766, -16814662, -15972067, -14845962, -13484419, -11965547, -10412940, -8986877, -7851537, -7132302, -6880351, -7057274, -7545665, -8182466, -8802108, -9272841, -9516607, -9514405, -9304059, -8971914, -8633585, -8401706, -8349615, -8487200, -8760317, -9072141, -9314226, -9394646, -9257712, -8896196, -8355978, -7727592, -7119516, -6619390, -6262649, -6027514, -5858145, -5699286, -5522184, -5332660, -5163798, -5059328, -5053130, -5151768]
10161e151768j76791k05792j87115j48140j31447j75538k94550m66532o39101
10152g576774p52950p70531o91501n47299l84097k48491j79456k01082l14427
10143a1666608m95112p01217q86525j010952j045993r77541q07285n52140k42939
10134a8386312P6766L54893N42358O10258N63632M41417K98975J79891R2726Q432
10124a5216964j18450l18996n90093q95515j182289j399686j512120j504143j380148
10115b4118404j161767q82843n79592k76816K1950L31095O66592J028258J393725
10106b3577802J727767J999663K197548K332440K431570K525324K632844K749806
10098d980840K842610K854388K725022K418508J944423J361973P64422K50650
$$ y = [-5151768, -5328559, -5534351, -5721466, -5869606, -6001053, -6176591, -6471141, -6937673, -7576774, -8329724, -9100255, -9791756, -10339055, -10723152, -10971643, -11151099, -11352181, -11666608, -12161720, -12862937, -13749462, -14760414, -15806407, -16783948, -17591233, -18143373, -18386312, -18309546, -17954653, -17412295, -16802037, -16238405, -15796988, -15498013, -15318122, -15225396, -15216964, -15335414, -15654410, -16244503, -17140018, -18322307, -19721993, -21234113, -22738256, -24118404, -25280171, -26163014, -26742606, -27019422, -26997472, -26666377, -25999785, -24971527, -23577802, -21850035, -19850372, -17652824, -15320384, -12888814, -10363490, -7730646, -4980840, -2138230, 716158, 3441180, 5859688, 7804111, 9166084, 9930506, 10181156]
10090A0181156j04505k69664k59383j21050Q5359L04741M96260O36110P18277
10081A1667301P54463P68848P84496Q08258Q27487Q23497P89942P39328O93415
10072A8657035O67811O62321O60698O38458N76020M71194L41941K15462J10977
10063B3001917K9642m0675j09830j70708j96350j51948j4869K09384M84114P52535
10053B3793212R57429J060608J052893R49162P71867N35213K42753r9491m65702
10044B8797944q05568j060554j192463j203919j135416j042879r74621r62948
10036B0419576j028195j181318j416925j703623j984602k192831k271708k188716
10028F451658j938272j538956j030185m67193Q8683N83018R79314J264475J448485
$$ y = [10181156, 10076651, 9806987, 9547604, 9426554, 9511913, 9816654, 10312914, 10949024, 11667301, 12421764, 13190612, 13975108, 14783366, 15610853, 16434350, 17224292, 17963620, 18657035, 19324846, 19987167, 20647865, 21286323, 21862343, 22333537, 22675478, 22890940, 23001917, 23031559, 22990884, 22881054, 22710346, 22513996, 22362048, 22347179, 22556563, 23040677, 23793212, 24750641, 25811249, 26864142, 27813304, 28585171, 29120384, 29363137, 29263646, 28797944, 27992376, 26931822, 25739359, 24535440, 23400024, 22357145, 21382524, 20419576, 19391381, 18210063, 16793138, 15089515, 13104913, 10912082, 8640374, 6451658, 4513386, 2974430, 1944245, 1477052, 1565735, 2148753, 3128067, 4392542, 5841027]
10019E841027J558621J628058J681272J722745J736068J695549J584432J408827
10011A8856599J199002R98450Q48438P75111P81337Q43816R18355R55204R19444
10002B7095756Q05798O39917M66942L35333K83880L33749M81746O93132R01026
9993C2037279J022258R88137P73514M06906m1398m84172q45397j084222j205163
9984C1567742j246530j251763j241204j201770j098651q99969n99611k25900J67107
9975B3969451N18510P79013R23843R60005R25748Q77876Q68637R23026J028972
9966C1775081J145004J221075J222266J143393J006789Q46015O87700N43752M17086
9957D0008161L13763K49690K44678L08182M29767N82508P34747Q59832R40548
$$ y = [5841027, 7399648, 9027706, 10708978, 12431723, 14167791, 15863340, 17447772, 18856599, 20055601, 21054051, 21902489, 22677600, 23458937, 24302753, 25221108, 26176312, 27095756, 27901554, 28541471, 29008413, 29343746, 29627626, 29961375, 30443121, 31136253, 32037279, 33059537, 34047674, 34821188, 35228094, 35186696, 34702524, 33857127, 32772905, 31567742, 30321212, 29069449, 27828245, 26626475, 25527824, 24627855, 24028244, 23802344, 23969451, 24487961, 25266974, 26190817, 27150822, 28076570, 28954446, 29823083, 30746109, 31775081, 32920085, 34141160, 35363426, 36506819, 37513608, 38359623, 39047323, 39591075, 40008161, 40321924, 40571614, 40816292, 41124474, 41554241, 42136749, 42871496, 43731328, 44671876]
9948D4671876R71356R58995R18386Q64418Q05275P41432O69811N90873N14629
9939E1707051M59623M43437M73239N45445O51439P79349R11561J027434J113636
9930E8112214J172987J224311J294946J408857J572106J764998J953236K114066
9922G0617721K253990K401542K585253K819326L106449L450485L867058M383092
9914I5484916N023082N791629O668371P620625Q622709R668174J0769865J1946836
9906A61596207J3199322J4482386J5691460J6657198J7136059J6799730J5245205
9899B70807567J2041282O823272n34118r668033j9541965k8566351l5121253l8224255
9891A58016146l7892682l4969807l0610336k5815116k1234682j7192097j3781212
$$ y = [44671876, 45643232, 46602227, 47520613, 48385031, 49190306, 49931738, 50601549, 51192422, 51707051, 52166674, 52610111, 53083350, 53628795, 54280234, 55059583, 55971144, 56998578, 58112214, 59285201, 60509512, 61804458, 63213315, 64785421, 66550419, 68503655, 70617721, 72871711, 75273253, 77858506, 80677832, 83784281, 87234766, 91101824, 95484916, 100507998, 106299627, 112967998, 120588623, 129211332, 138879506, 149649371, 161596207, 174795529, 189277915, 204969375, 221626573, 238762632, 255562362, 270807567, 282848849, 289672121, 289138003, 279469970, 259928005, 231361654, 196240401, 158016146, 120123464, 85153657, 54543321, 28728205, 7493523, -9698574, -23479786]
9884b3479786j0960989q630959o682342n023372l591313k359322j331285n22378
9876f2581746N9826M21885N84506N84084M71986L06866J45466L7023J7002R6539
9866e9856563K54707M41810N92486O43642N55470L30791K0000k96741n40815o60165
9856e8515378o36407m77550k07173J41943N29657R11314J245526J502972J669796
9847e3835300J746535J748844J708618J665466J646111J646595J634657J572058
9839d0466416J439659J248493J032160Q27120O53010N04758L60393J96800J553
9830c4202470k24321m69218p14569r38312j119550j244667j312551j334849j329087
9821d2889594j308233j274257j219849j135004j012896q53829o68068m75080k95198
$$ y = [-23479786, -34440775, -43071734, -49754076, -54777448, -58368761, -60728083, -62059368, -62581746, -62521920, -62100035, -61515529, -60931445, -60459459, -60152593, -60007127, -59970104, -59953102, -59856563, -59601856, -59160046, -58567560, -57923918, -57368448, -57037657, -57017657, -57314398, -57855213, -58515378, -59151785, -59629335, -59836508, -59694565, -59164908, -58253594, -57008068, -55505096, -53835300, -52088765, -50339921, -48631303, -46965837, -45319726, -43673131, -42038474, -40466416, -39026757, -37778264, -36746104, -35918984, -35265974, -34761216, -34400823, -34204023, -34202470, -34426791, -34896009, -35610578, -36548890, -37668440, -38913107, -40225658, -41560507, -42889594, -44197827, -45472084, -46691933, -47826937, -48839833, -49693662, -50361730, -50836810, -51132008]
9812e1132008j36566J2533J78504L88128O56004R81131J350593J743413K130660
9803d3827608K474635K733026K869574K865631K724219K463824K108252J682081
9795b3906366J215276P50346L41265L9157j29284j77816j60201j50669k12819
9786b2391111l71725o04035q51810j051821j163506j181445j128777j037858r28899
9777c0710987p97112o15578l53875k734M11793Q36405J216633J521142J745760
9768b6748553J897444J976414J973254J880032J701043J452319J152463Q15009
9760a3900575M49404O8486l05762o44301r18500j105153j186283j150142r98984
9751a9691810p57856m72519j94052L8431K04494K97697L18174K69566J60067L488
$$ y = [-51132008, -51268574, -51256041, -51077537, -50689409, -50033405, -49052274, -47701681, -45958268, -43827608, -41352973, -38619947, -35750373, -32884742, -30160523, -27696699, -25588447, -23906366, -22691090, -21940744, -21599479, -21560322, -21689606, -21867422, -22027623, -22178292, -22391111, -22762836, -23366871, -24218681, -25270502, -26434008, -27615453, -28744230, -29782088, -30710987, -31508099, -32123677, -32477552, -32480286, -32068493, -31232088, -30015455, -28494313, -26748553, -24851109, -22874695, -20901441, -19021409, -17320366, -15868047, -14715584, -13900575, -13451171, -13382685, -13688447, -14332748, -15251248, -16356401, -17542684, -18692826, -19691810, -20449666, -20922185, -21116237, -21077806, -20873312, -20575615, -20257441, -19987875, -19827808, -19824320]
9741a9824320j81966l75313n52125o83386p40042p05521n87936m19430k40609
9732b4310648q2280M1377J25913J64977J44474M6995j36181l93668o91699r83213
9722b6073953j221817j371957j412436j336760j154179q90737n86475k86042k5366
9713c4359722J78576L28985M41687N33389O09296O53640O30094M98389K41520
9704c0244146j15167n08322q61202j111318j226567j206155j069341q37687n19960
9695c7699865j10148L97792R86547J599383K144781K523480K664685K550667K216767
9686b2725911J731079J168960N93892M7695m49846q91795j269971j566157j755239
9677b5117293j815604j736455j517561j166212o97946j41832M54936J029584J515624
$$ y = [-19824320, -20006286, -20381599, -20933724, -21617110, -22357152, -23062673, -23650609, -24070039, -24310648, -24392928, -24351551, -24225638, -24060661, -23916187, -23869192, -24005373, -24399041, -25090740, -26073953, -27295770, -28667727, -30080163, -31416923, -32571102, -33461839, -34048314, -34334356, -34359722, -34181146, -33852161, -33410474, -32877085, -32267789, -31614149, -30984055, -30485666, -30244146, -30359313, -30867635, -31728837, -32840155, -34066722, -35272877, -36342218, -37179905, -37699865, -37810013, -37412221, -36425674, -34826291, -32681510, -30158030, -27493345, -24942678, -22725911, -20994832, -19825872, -19231980, -19184285, -19634131, -20525926, -21795897, -23362054, -25117293, -26932897, -28669352, -30186913, -31353125, -32051071, -32192903, -31737967, -30708383, -29192759]
9668b9192759J859973K036959K052143J934892J724849J459468J167174Q66562
9660a6090739N69285K84125K0600k09223l91261n11436n57507n20946m00698k08425
9650a8016225K9083K74371M89557O47759P41755P86915Q14978Q59233R40509J065811
9640a1366254J238849J466384J746773K048076K299386K411142K315265J998965
9632D158586J511400R42933L92693n9045l67165n27681n74097n63242n53246n82281
9622C778855o56816p52833q28978q47562p94819o88234n64768m58801l87172l50759
9612b551887l45726l70676m24031m97335n73425o32280o59623o50851o06800n24810
9602g837444l92851j92296R1315M56039Q77613J314325J720800K063218K326974
$$ y = [-29192759, -27332786, -25295827, -23243684, -21308792, -19583943, -18124475, -16957301, -16090739, -15521454, -15237329, -15216729, -15425952, -15817213, -16328649, -16886156, -17407102, -17807800, -18016225, -17987142, -17712771, -17223214, -16575455, -15833700, -15046785, -14231807, -13372574, -12432065, -11366254, -10127405, -8661021, -6914248, -4866172, -2566786, -155644, 2159621, 4158586, 5669986, 6612919, 7005612, 6946567, 6579402, 6051721, 5477624, 4914382, 4361136, 3778855, 3122039, 2369206, 1540228, 692666, -102153, -790387, -1355155, -1813956, -2201128, -2551887, -2897613, -3268289, -3692320, -4189655, -4763080, -5395360, -6054983, -6705834, -7312634, -7837444, -8230295, -8422591, -8331276, -7875237, -6997624, -5683299, -3962499, -1899281, 427693]
9593D27693K512622K623890K657003K598946K435362K161601J788825J341446
9585A8547388Q48767L37022j73537o65701j119367j507406j797324j959069j975316
9576A0535457j849213j606590j291942r58859o57398m22968k70918j97620j85589
9567C094360k10267k47563k80877l05104l25608l52895l95487m54138n19465n73376
9557e70420n92439n51485m29018k17166O6041L70943O25147P55931P16323N04557
9547F78414J70352j96117m93328o47101o39494n09732l26132j48017j168J23263
9537a989060K53634M19886O40698R16826J229870J546550J827375K035644K142364
9528I023787K126594J975197J686421J276700P84598K65926k19358o21797r12663
$$ y = [427693, 2940315, 5564205, 8221208, 10820154, 13255516, 15417117, 17205942, 18547388, 19396155, 19733177, 19559640, 18893939, 17774572, 16267166, 14469842, 12510773, 10535457, 8686244, 7079654, 5787712, 4828853, 4171455, 3748487, 3477569, 3279949, 3094360, 2884093, 2636530, 2355653, 2050549, 1724941, 1372046, 976559, 522421, 2956, -570420, -1162859, -1714344, -2143362, -2360528, -2294487, -1923544, -1298397, -542466, 173857, 678414, 848766, 652649, 159321, -487780, -1127274, -1637006, -1963138, -2111155, -2112323, -1989060, -1735426, -1315540, -674842, 241984, 1471854, 3018404, 4845779, 6881423, 9023787, 11150381, 13125578, 14811999, 16088699, 16873297, 17139223, 16919865, 16298068, 15385405]
9519A5385405j088571j170899j198625j214487j250625j322093j429457j563608
9511E147040j707890j840715j943236k008777k045608k069747k093174k115816
9503a0677923k126168k109965k060721j983028j884068j759967j589799j343468
9495b5535107r97855n51586l2910N01835R82037J347610J573302J676056J698674
9486a9337944J680686J637156J559707J436818J276353J112947R95892R67436
9478h670949J045128J214755J433720J643364J788187J835628J786513J670142
9470C746488J526833J386941J256320J115609R35001O96231M06375R2815k15092
9461A0947521m99785p52065r56235j082141j096226r84673p69479n03687k49179
$$ y = [15385405, 14296834, 13125935, 11927310, 10712823, 9462198, 8140105, 6710648, 5147040, 3439150, 1598435, -344801, -2353578, -4399186, -6468933, -8562107, -10677923, -12804091, -14914056, -16974777, -18957805, -20841873, -22601840, -24191639, -25535107, -26532962, -27084548, -27117458, -26615623, -25633586, -24285976, -22712674, -21036618, -19337944, -17657258, -16020102, -14460395, -13023577, -11747224, -10634277, -9638385, -8670949, -7625821, -6411066, -4977346, -3333982, -1545795, 289833, 2076346, 3746488, 5273321, 6660262, 7916582, 9032191, 9967192, 10663423, 11069798, 11162613, 10947521, 10447736, 9695671, 8739436, 7657295, 6561069, 5576396, 4806917, 4303230, 4054051]
9452D054051n2622O6170J10347R4012L3099n4512j43160j98966j92374j17444
9442C598601o08J12784J86513K14685K20476K36532K84725L69081M81299O09223
9432F313311P41847Q71791R97525J123527J255738J394564J530574J644567J708923
9423A7582367J689719J553859J283251Q88643M11488q9928n61481r68073j295371
9414B0494474j540969j703757j779591j765747j670275j519586j359304j245994
9406G909251j229849j333516j538852j793389k036174k227135k360364k454292
9398g064320k528286k582816k594542k526598k345180k032121j588628j033128
9390b4295619l98627K68724R12508J472229J891762K128621K164019K011562J718490
$$ y = [4054051, 4001429, 4067599, 4177946, 4271958, 4305057, 4250545, 4107385, 3908419, 3716045, 3598601, 3597993, 3710777, 3897290, 4111975, 4332451, 4568983, 4853708, 5222789, 5704088, 6313311, 7055158, 7926949, 8924474, 10048001, 11303739, 12698303, 14228877, 15873444, 17582367, 19272086, 20825945, 22109196, 22997839, 23409327, 23319399, 22757918, 21789845, 20494474, 18953505, 17249748, 15470157, 13704410, 12034135, 10514549, 9155245, 7909251, 6679402, 5345886, 3807034, 2013645, -22529, -2249664, -4610028, -7064320, -9592606, -12175422, -14769964, -17296562, -19641742, -21673863, -23262491, -24295619, -24694246, -24425522, -23513014, -22040785, -20149023, -18020402, -15856383, -13844821, -12126331]
9381a2126331J354474R91969O89232M83292L90016M04811N03557O48260P96903
9372e863817R10604R54874R02315P43865N01193K22309m5270k84910n17498p77501
9362c253836j079704j404520j710270j958041k129181k227301k269618k276625
9354a8309096k265136k245250k219639k183140k121447k009851j815729j508537
9346c4677825j075850n36830N6942O36050J135328J511553J750671J866678J896364
9337b7436919J889866J894312J932842J989864K015280J950265J760969J458868
9329a2544653J095313P36725M38925K34512J32746J22808J75529K47587K93773
9320i066735K84624K17907J13989k636j21051k46889l90961n57394p42729r42273
$$ y = [-12126331, -10771857, -9779888, -9090656, -8607364, -8217348, -7812537, -7308980, -6660720, -5863817, -4953213, -3998339, -3096024, -2352159, -1850966, -1628657, -1673927, -1958837, -2476335, -3253836, -4333540, -5738060, -7448330, -9406371, -11535552, -13762853, -16032471, -18309096, -20574232, -22819482, -25039121, -27222261, -29343708, -31353559, -33169288, -34677825, -35753675, -36290505, -36233563, -35597513, -34462185, -32950632, -31199961, -29333283, -27436919, -25547053, -23652741, -21719899, -19730035, -17714755, -15764490, -14003521, -12544653, -11449340, -10712615, -10273690, -10039178, -9906432, -9783624, -9608095, -9360508, -9066735, -8782111, -8564204, -8450215, -8452851, -8573902, -8820791, -9211752, -9769146, -10511875, -11454148]
9310a1454148j151462j359006j542706j677908j752489j772537j752234j698834
9302b4161324j607892j471887j292791j088003q86892p21066o12954n67033n68176
9293c2978018n89119o03832n99490n80784n65181n72117o11095o74473p39469
9284c8513578p78628p71155p07254n86037m14830k13264j4189J47728K55910L24529
9274d1270768L92872N06225O97553R79586J346776J780349K250507K715287L122327
9265b7479286L419679L571981L568884L417660L129070K713302K190133J599392
9257c869185R96644M35163n0824m48889p57311r70516j072207j040332q59111
9248g636568n29817p5584M59010J012785J518871J921913K195460K349575K422411
$$ y = [-11454148, -12605610, -13964616, -15507322, -17185230, -18937719, -20710256, -22462490, -24161324, -25769216, -27241103, -28533894, -29621897, -30508789, -31229855, -31842809, -32409842, -32978018, -33567137, -34170969, -34770459, -35351243, -35916424, -36488541, -37099636, -37774109, -38513578, -39292206, -40063361, -40770615, -41356652, -41771482, -41984746, -41998935, -41851207, -41595297, -41270768, -40877896, -40371671, -39674118, -38694532, -37347756, -35567407, -33316900, -30601613, -27479286, -24059607, -20487626, -16918742, -13501082, -10372012, -7658710, -5468577, -3869185, -2872541, -2437378, -2488202, -2937091, -3694402, -4664918, -5737125, -6777457, -7636568, -8166385, -8241969, -7782959, -6770174, -5251303, -3329390, -1133930, 1215645, 3638056]
9239C638056K457797K479644K478843K423721K288671K078808J829875J584517
9231B1259932J366828J175321R95129Q14168O28566M34110K13070o7784m38101
9222B6381239q92681j374174j790907k062969k163908k128008k021122j899442
9214A2048028j785124j671538j549573j433094j362762j383014j507486j698322
9206c42885j875025j946487j844741j542531j052900m20520K87074R88409J601021
9197f148585K058490K325812K405986K334157K161566J936291J688307J423400
9189A0185424J126403P72406L43586j54192o83948j185320j593752j860408j964807
9180D985392j919922j771303j587506j438759j370120j385178j452462j530188
$$ y = [3638056, 6095853, 8575497, 11054340, 13478061, 15766732, 17845540, 19675415, 21259932, 22626760, 23802081, 24797210, 25611378, 26239944, 26674054, 26887124, 26819340, 26381239, 25488558, 24114384, 22323477, 20260508, 18096600, 15968592, 13947470, 12048028, 10262904, 8591366, 7041793, 5608699, 4245937, 2862923, 1355437, -342885, -2217910, -4164397, -6009138, -7551669, -8604569, -9025089, -8738015, -7749606, -6148585, -4090095, -1764283, 641703, 2975860, 5137426, 7073717, 8762024, 10185424, 11311827, 12084233, 12427819, 12273627, 11589679, 10404359, 8810607, 6950199, 4985392, 3065470, 1294167, -293339, -1732098, -3102218, -4487396, -5939858, -7470046]
9172g470046j590855j629358j652984j664483j650458j581084j420958j146856
9164a9807082p63790l09093J59481N83823R20198J142274J237602J205258J055822
9155a4575507Q10336M97833J54479j75528m42162n98762o15649m91120k53485
9146a5689565M8269L62098O49241Q88709J068672J176851J202428J146660J026951
9137h119686Q67211O85900M96320L16467J71677Q2513N0236N6423P7683J01611
9127e213645J31743J80242K53604L38688L98420L85240K68419N6157k07423m70812
9117c879367p06980r23180j142400j373812j597163j772699j866599j870993j806039
9108a6939232j709237j624545j594952j650712j789614j962136k081126k059204
$$ y = [-7470046, -9060901, -10690259, -12343243, -14007726, -15658184, -17239268, -18660226, -19807082, -20570872, -20879965, -20720484, -20136661, -19216463, -18074189, -16836587, -15631329, -14575507, -13765171, -13267338, -13112859, -13288387, -13730549, -14329311, -14944960, -15436080, -15689565, -15641296, -15279198, -14629957, -13741248, -12672576, -11495725, -10293297, -9146637, -8119686, -7252475, -6566575, -6070255, -5753788, -5582111, -5499598, -5449362, -5392939, -5315256, -5213645, -5081902, -4901660, -4648056, -4309368, -3910948, -3525708, -3257289, -3201132, -3408555, -3879367, -4586347, -5509527, -6651927, -8025739, -9622902, -11395601, -13262200, -15133193, -16939232, -18648469, -20273014, -21867966, -23518678, -25308292, -27270428, -29351554, -31410758]
9100c1410758j852023j477841j002473n04021m1219L61031P10052J034428J368248
9091c2814576J733613K127145K516857K851154L075249L148152L055689K817345
9083a1489372K484315K126961J814125J591748J469761J422775J404252J367463
9075B192028J282576J141304R49324P15277M45628J47438j65294m66890p19798
9066E521593q80915r14048q03505n60690k19899J72055N64000R03115J137038
9057D918744J222717J142952R21176O21262L27481J14961K7673P2586K24428M32599
9047A0026579O30530P53535P62648O59412M77580K55962J4774k44536n17978p78956
9037A2039550r80193j076543j048618r09454o93692m41207j85694M9339K48963
$$ y = [-31410758, -33262781, -34740622, -35743095, -36247116, -36288335, -35927304, -35217252, -34182824, -32814576, -31080963, -28953818, -26436961, -23585807, -20510558, -17362406, -14306717, -11489372, -9005057, -6878096, -5063971, -3472223, -2002462, -579687, 824565, 2192028, 3474604, 4615908, 5565232, 6280509, 6726137, 6873575, 6708281, 6241391, 5521593, 4640678, 3726630, 2923125, 2362435, 2142536, 2314591, 2878591, 3781706, 4918744, 6141461, 7284413, 8205589, 8826851, 9154332, 9269293, 9296966, 9369552, 9593980, 10026579, 10657109, 11410644, 12173292, 12832704, 13310284, 13566246, 13581020, 13336484, 12818506, 12039550, 11059357, 9982814, 8934196, 8024742, 7331050, 6889843, 6704149, 6753488, 7002451]
9028G002451M02077M96542N18286M56737L14695J16233r4457k65062l51541l29261
9018H266700j95366L3290L23206O31444R18756J161009J348250J473005J521554
9009A5481848J477722J333768J096442P83796M17349J5962m05243q30543j237224
9000A8133877j594004j868435k038992k101949k067222j946985j746466j464016
8992C305808j099825o65822j88592K96493P54757J158623J488480J730055J872133
8983H652110J907660J838119J676889J447260J176902Q94151O26061L91865J91569
8974A8802586J963k08977m57495p30901r96921j223786j391600j488159j498927
8965A0807783j404601j191313q66660m68272n5585L11319N91398P69130Q48485
$$ y = [7002451, 7404528, 7901070, 8419356, 8876093, 9190788, 9307021, 9212564, 8947502, 8595961, 8266700, 8071334, 8104624, 8427830, 9059274, 9978030, 11139039, 12487289, 13960294, 15481848, 16959570, 18293338, 19389780, 20173576, 20590925, 20606887, 20201644, 19371101, 18133877, 16539873, 14671438, 12632446, 10530497, 8463275, 6516290, 4769824, 3305808, 2205983, 1540161, 1351569, 1648062, 2402819, 3561442, 5049922, 6779977, 8652110, 10559770, 12397889, 14074778, 15522038, 16698940, 17593091, 18219152, 18611017, 18802586, 18804549, 18595572, 18138077, 17407176, 16410255, 15186469, 13794869, 12306710, 10807783, 9403182, 8211869, 7345209, 6876937, 6821352, 7132671, 7724069, 8493199, 9341684]
8956I341684Q43886P74956O64188N33138L96683K60120J23787p605j20231j96698
8946A2613908k26280k09644j56378q3028j5690J0034l9969j79692l90382o24779
8936A0698100q27866r63762j033681j073193j129356j233047j384902j560990
8928A491303j729559j866388j962320k021939k054824k063985k039515j963221
8920a4210448j821062j613424j355516j069451p76835m98675k60867r6281l6459
8911b1739018r5363k55933m70491o77537q26485q95837q94194q45344p68836o68199
8901b8137237n32142l46390j09595J56382M09918O06078P14712P28879O63061
8892b5846334N47801M22693L23741K67220K41773K17904J68930Q7720j0872r9991
$$ y = [9341684, 10185570, 10960526, 11624714, 12157852, 12554535, 12814655, 12938442, 12930837, 12810606, 12613908, 12387628, 12177984, 12021606, 11938578, 11922888, 11932922, 11892953, 11713261, 11322879, 10698100, 9870234, 8906472, 7872791, 6799598, 5670242, 4437195, 3052293, 1491303, -238256, -2104644, -4066964, -6088903, -8143727, -10207712, -12247227, -14210448, -16031510, -17644934, -19000450, -20069901, -20846736, -21345411, -21606278, -21702559, -21739018, -21834381, -22090314, -22560805, -23238342, -24064827, -24960664, -25854858, -26700202, -27469038, -28137237, -28669379, -29015769, -29125364, -28968982, -28559064, -27952986, -27238274, -26509395, -25846334, -25298533, -24875840, -24552099, -24284879, -24043106, -23825202, -23656272, -23568552, -23579424, -23679415]
8882b3679415j54633j61460j20694m1638O2506J76262K81587L60173L99375L98808
8872b2479129L74024L54765L75011M55735N89285P37969Q50452Q85647Q29301
8863a7026940O96248N20641L40612J84383O3921k2486q3154j26788j58066j74443
8853a5786072j67759j33996q4911m7932m9220r2840j55249k00491k02611j57225
8843a7078306p5711K9636J54892K99869M54513N90997O71754O68273N73992M00737
8833a3309354J65171j18836m33886p46860j006076j154958j154644j000138p20201
8824a9479782l64045J4206L65321O49758Q42173R36377R46522R01425Q35254P81501
8814a3571290P72727Q40838J010697J287420J646836K038558K401041K678178
$$ y = [-23679415, -23834048, -23995508, -24116202, -24157840, -24095334, -23919072, -23637485, -23277312, -22877937, -22479129, -22105105, -21750340, -21375329, -20919594, -20330309, -19592340, -18741888, -17856241, -17026940, -16330692, -15810051, -15469439, -15285056, -15221135, -15243621, -15326775, -15453563, -15611629, -15786072, -15953831, -16087827, -16172738, -16220670, -16269890, -16362730, -16517979, -16718470, -16921081, -17078306, -17154017, -17124381, -16969489, -16669620, -16215107, -15624110, -14952356, -14284083, -13710091, -13309354, -13144183, -13263019, -13696905, -14443765, -15449841, -16604799, -17759443, -18759581, -19479782, -19843827, -19829621, -19464300, -18814542, -17972369, -17035992, -16089470, -15188045, -14352791, -13571290, -12798563, -11957725, -10947028, -9659608, -8012772, -5974214, -3573173, -894995]
8806h94995K827427K818744K631872K259394J715046J039467K95454m46609j123950
8797A1121850j688437k106016k356564k439559k382271k241253k089747j991092
8789f173089j968814j991572j986205j873802j606875j187331o62159j07232L92006
8780a7165073P60745R53154R61773Q13380N56219K48483m7457k69508l65288l06220
8770a3859792r8594K16296N73990R04888J150826J275010J263326J119028Q57070
8761f597952N04197J03572k84887n95309p75127q04209p07069n53597m43397m73085
8751a0626863o98069j108853j635317k175593k633193k944009l081931l044918
8743b7948746k836273k457634j917227j242216m83243K90377J000316J572050
$$ y = [-894995, 1932432, 4751176, 7383048, 9642442, 11357488, 12396955, 12692409, 12245800, 11121850, 9433413, 7327397, 4970833, 2531274, 149003, -2092250, -4181997, -6173089, -8141903, -10133475, -12119680, -13993482, -15600357, -16787688, -17449847, -17557079, -17165073, -16404328, -15451174, -14489401, -13676021, -13119802, -12871319, -12918776, -13188284, -13553572, -13859792, -13958386, -13742090, -13168100, -12263212, -11112386, -9837376, -8574050, -7455022, -6597952, -6093755, -5990183, -6275070, -6870379, -7645506, -8449715, -9156784, -9710381, -10153778, -10626863, -11324932, -12433785, -14069102, -16244695, -18877888, -21821897, -24903828, -27948746, -30785019, -33242653, -35159880, -36402096, -36885339, -36594962, -35594646, -34022596]
8735c4022596J950638K114397K078885J889254J606622J294408J006333P76384
8727b1305675O13131N01800M14603L24914K17873R1215n2972k17620m12328o45549
8717b0470608r13618j194860j452634j645135j736878j708219j562201j327563
8709c2011716j053424p92540n79792m20852l00239k01705j25185r0610j29183
8700c5705246k66929n06077q13212j123225j359056j456037j378537j124591p20763
8691d4453673k10753L57132R36045J476871J922168K210698K296042K167145J854586
8682c1443739J418711R30094M54407M3679k70340m80354n99100o45374o30299
8673c1222315n54731m17246k22490J7213K85438N66605Q50962J138071J434237
$$ y = [-34022596, -32071958, -29957561, -27878676, -25989422, -24382800, -23088392, -22082059, -21305675, -20692544, -20190744, -19776141, -19451227, -19233354, -19142139, -19195111, -19412731, -19825059, -20470608, -21384226, -22579086, -24031720, -25676855, -27413733, -29121952, -30684153, -32011716, -33065140, -33857680, -34437472, -34858324, -35158563, -35360268, -35485453, -35576063, -35705246, -35972175, -36478252, -37291464, -38414689, -39773745, -41229782, -42608319, -43732910, -44453673, -44664426, -44307294, -43371249, -41894378, -39972210, -37761512, -35465470, -33298325, -31443739, -30025028, -29094934, -28640527, -28596848, -28867188, -29347542, -29946642, -30592016, -31222315, -31777046, -32194292, -32416782, -32399569, -32114131, -31547526, -30696564, -29558493, -28124256]
8664b8124256J742174K048884K322187K521324K616940K607313K517547K379207
8656i368680K204506J976429J663962J249532P46397J95200l52800q50957j262892
8647c799303j561016j725452j747691j635790j413936j113879p64615l89442j2200
8638a4163324L34434O07236P60669P62153O07849L31222j707l11715n34747o47067
8628a2254997o72977o68060o86606p54249q62706r84435j090739j160134j177831
8619b0312734j134249j026190q57936o39373l81930r5804K08756N16211Q00815
8610b2922434J028227J166166J198696J133575R96298Q14979O07876L82621J45312
8601a5448684r0166l00303m56654n31678n02569l54070q1536L05419P78250J284965
$$ y = [-28124256, -26382082, -24333198, -22011011, -19489687, -16872747, -14265434, -11747887, -9368680, -7164174, -5187745, -3523783, -2274251, -1527854, -1332654, -1685454, -2536411, -3799303, -5360319, -7085771, -8833462, -10469252, -11883188, -12997067, -13761682, -14151124, -14163324, -13828890, -13221654, -12460985, -11698832, -11090983, -10759761, -10761468, -11073183, -11607930, -12254997, -12927974, -13596034, -14282640, -15036889, -15899595, -16884030, -17974769, -19134903, -20312734, -21446983, -22473173, -23331109, -23970482, -24352412, -24448216, -24239460, -23723249, -22922434, -21894207, -20728041, -19529345, -18395770, -17399472, -16584493, -15976617, -15593996, -15448684, -15538850, -15839153, -16295807, -16827485, -17330054, -17684124, -17765660, -17460241, -16681991, -15397026]
8591a5397026J751432K095639K252877K197650J947439J548362J057416N34161
8583b012050L9675l68738o51141p97171q25614p72406o78734n86473n35584n55199
8573g743435o49687p90599r23352r87610r42466p84758n50848l00002q9554M2190
8563a3720121P7838J5352j32773l34548n39135o92513p62335p54081p04995o59801
8553a8207112o46619o68519p10403p49204p59030p13847n94129l97680j47970
8544b3594513J07239L09438M11187L96733K90988J52157N1525M8304J68278L95361
8534b1263303O81646R70313J215749J389953J479846J486250J424751J319979
8526a1294816J193094J055067R13897P86290O97405O65860O87969P36104P72815
$$ y = [-15397026, -13645594, -11549955, -9297078, -7099428, -5151989, -3603627, -2546211, -2012050, -1972375, -2341113, -2992254, -3789425, -4615039, -5387445, -6066179, -6652652, -7188236, -7743435, -8393122, -9183721, -10107073, -11094683, -12037149, -12821907, -13372755, -13672757, -13762311, -13720121, -13642283, -13626931, -13759704, -14094252, -14633387, -15325900, -16088235, -16842316, -17547311, -18207112, -18853731, -19522250, -20232653, -20981857, -21740887, -22454734, -23048863, -23446543, -23594513, -23487274, -23177836, -22766649, -22369916, -22078928, -21926771, -21875246, -21826942, -21658664, -21263303, -20581657, -19611344, -18395595, -17005642, -15525796, -14039546, -12614795, -11294816, -10101722, -9046655, -8132758, -7346468, -6649063, -5983203, -5295234, -4559130, -3786315]
8517c786315P69542P16875O21813M98561L63151K35034J38369R5149J12417J74317
8507f1087K46429K89511K74000J89292M7104j19993k65535l42493l19886j94198
8497b56856J1923K62779N24535P72076R86509J149769J243233J252144J172061
8488G118173J011201P85729N12208K05186j18138m33298p11630r29176j073543
8479F366712j145255j156873j131098j094537j066690j052107j043762j035287
8471b358897j030785j043881j087977j166463j269907j380741j480074j550698
8463a2369423j575506j536539j419589j222912r62933o71752l87159j40436N2719
8454b0233530J94609L00183L85933M58605N10241N23731M87052M08038L18356
$$ y = [-3786315, -3016773, -2299898, -1678085, -1179524, -816373, -581339, -442970, -347821, -235404, -61087, 185342, 474853, 748853, 938145, 985249, 865256, 599721, 257228, -62658, -256856, -244933, 17846, 542381, 1314457, 2300966, 3450735, 4693968, 5946112, 7118173, 8129374, 8915103, 9427311, 9632497, 9514359, 9081061, 8369431, 7440255, 6366712, 5221457, 4064584, 2933486, 1838949, 772259, -279848, -1323610, -2358897, -3389682, -4433563, -5521540, -6688003, -7957910, -9338651, -10818725, -12369423, -13944929, -15481468, -16901057, -18123969, -19086902, -19758654, -20145813, -20286249, -20233530, -20038921, -19738738, -19352805, -18894200, -18383959, -17860228, -17373176, -16965138, -16646782]
8445a6646782K59882K58666L03771L48720L38192K42986P9311r8879k25788k50173
8435a5390094j51228N6603L28132O02110Q24494R69802J046425J081911J100504
8426i531341J111130J112740J106708J100437J097707J087338J044642R47738
8418i22901P95467O11283M29526K75702J56871O8144N778k8514l6590l4254m7752
8407A272760r6111j75340k59248l15844l26187k93870k41576j96899j74835j68881
8397i76031j60113j39523j24698j55004k67903m74057p46472j026644j242776
8388e313221j334468j276337j089587q33683n82740m00640l24775l57925m65994
8379a1979370n86440o52327o24056n08480l51169k06876j07936m9240L260Q7668
$$ y = [-16646782, -16386900, -16128234, -15824463, -15475743, -15137551, -14894565, -14815254, -14914133, -15139921, -15390094, -15541322, -15484719, -15156587, -14554477, -13729983, -12760181, -11713756, -10631845, -9531341, -8420211, -7307471, -6200763, -5100326, -4002619, -2915281, -1870639, -922901, -127434, 483849, 913375, 1189077, 1345948, 1414092, 1419870, 1391356, 1354766, 1320512, 1272760, 1176649, 1001309, 742061, 426217, 100030, -193840, -435416, -632315, -807150, -976031, -1136144, -1275667, -1400365, -1555369, -1823272, -2297329, -3043801, -4070445, -5313221, -6647689, -7924026, -9013613, -9847296, -10430036, -10830676, -11155451, -11513376, -11979370, -12565810, -13218137, -13842193, -14350673, -14701842, -14908718, -15016654, -15065894, -15062634, -14974966]
8369a4974966K22669M02388O11218Q41087J091978J355898J603546J789840J874319
8360e182023J838799J689918J448116J133249P56739L24661j50991o42041j104205
8351A12222j488784j757376j889368j880423j738817j485521j155861p96439m56339
8342a2536706j78661L164O6788N294j65948m05952o53380q40693r13317q46988
8332a6466399o54452l76748o4061K41276N10811P26451Q75217R48482R46935Q87316
8322a2425172Q03818P39015P27738P84590R02355J058091J219260J348034J407876
8313c434395J374077J243289J035355P84999N27341K84950O3233j45027l51658
8304A382164n67612q00722j054123j324585j602365j873032k120101k327741k482188
$$ y = [-14974966, -14752297, -14349909, -13738691, -12897604, -11805626, -10449728, -8846182, -7056342, -5182023, -3343224, -1653306, -205190, 928059, 1684798, 2009459, 1858468, 1216427, 112222, -1376562, -3133938, -5023306, -6903729, -8642546, -10128067, -11283928, -12080367, -12536706, -12715367, -12712203, -12645415, -12640121, -12806069, -13212021, -13865401, -14706094, -15619411, -16466399, -17120851, -17497599, -17561660, -17320384, -16809573, -16083122, -15207905, -14259423, -13312488, -12425172, -11621354, -10882339, -10154601, -9370011, -8467656, -7409565, -6190305, -4842271, -3434395, -2060318, -817029, 218326, 1003325, 1530666, 1815616, 1878849, 1733822, 1382164, 814552, 13830, -1040293, -2364878, -3967243, -5840275, -7960376, -10288117, -12770305]
8295a2770305k569749k572795k471615k257320j947349j587086j232742r28517
8287b8337478o92869n15252l58782j71207R1209M36306Q25968J193495J475279
8278b6053331J634575J666984J592819J445454J260972J071417R02143P70693
8270a5708274O83363O29430N78990M91117L32828J00445j70364m15741n72743
8261a4050949o09248n36129l97354k50317j50688j43649k54030m73782p57486
8252a7623632j037078j251514j372457j408951j390692j343683j273410j162497
8244b7863914r82135p11980l59549L2019L95096O63826Q01060Q10203P26584N97301
8234b5891489M64631L61253L11886L30286M09618N17437O07122O42820O21109
$$ y = [-12770305, -15340054, -17912849, -20384464, -22641784, -24589133, -26176219, -27408961, -28337478, -29030347, -29545599, -29904381, -30075588, -29984379, -29548073, -28722105, -27528610, -26053331, -24418756, -22751772, -21158953, -19713499, -18452527, -17381110, -16478967, -15708274, -15024911, -14395481, -13816491, -13325374, -12992546, -12892101, -13062465, -13478206, -14050949, -14660197, -15196326, -15593680, -15843997, -15994685, -16138334, -16392364, -16866146, -17623632, -18660710, -19912224, -21284681, -22693632, -24084324, -25428007, -26701417, -27863914, -28846049, -29558029, -29917578, -29885559, -29490463, -28826637, -28025577, -27215374, -26488790, -25891489, -25426858, -25065605, -24753719, -24423433, -24013815, -23496378, -22889256, -22246436, -21625327]
8225b1625327N75056N60135O30767Q16004J101514J426834J703584J847823J808897
8216a1154713J580618J194933P07890J85811l06378p15195j006774j172204j227963
8207a1913975j208947j154633j094809j042888r98800r55896r05293q36216p35223
8198b0846680n87779l83800j25853J64285M45763O66765P77194P42141N54913
8189a8593051K47406j08870m18036n88963n64409l35629O1487N61331J086209
8180a8652525J564249J947315K223417K414532K557594K679600K783057K848715
8172C65954K848436K756129K552011K224647J776284J230508O35413N6374m40101
8163A4005655q03538j009490j060372r81052q13256o08415m16522k72257j85490
$$ y = [-21625327, -21050271, -20490136, -19859369, -19043365, -17941851, -16515017, -14811433, -12963610, -11154713, -9574095, -8379162, -7671272, -7485461, -7791839, -8507034, -9513808, -10686012, -11913975, -13122922, -14277555, -15372364, -16415252, -17414052, -18369948, -19275241, -20111457, -20846680, -21434459, -21818259, -21944112, -21779827, -21334064, -20667299, -19890105, -19147964, -18593051, -18345645, -18454515, -18872551, -19461514, -20025923, -20361552, -20300065, -19738734, -18652525, -17088276, -15140961, -12917544, -10503012, -7945418, -5265818, -2482761, 365954, 3214390, 5970519, 8522530, 10747177, 12523461, 13753969, 14389382, 14445756, 14005655, 13202117, 12192627, 11132255, 10151203, 9337947, 8729532, 8313010, 8040753, 7855263]
8154G855263j43470j24577j14172j11472j24118j57764k10833k78492l60876m67180
8144E762309o10210p93588j000711j195979j340429j411216j409610j352072j253787
8135d605293j119524r48116p44217n25450l18227j46576k5296L5997K4871p2734
8125h444565k59222n12954p91120j046566j244590j369139j419729j405229j337408
8116a7830522j225252j072224q78066o43348l73577q1459K13368M88137P23529
8107b0679414R08638J040868J122555J159172J160323J139811J111802J084999
8099a1951246J059114J025399R69618Q75890P32105N38320L15422J06554l5274
8090f364098p0115R213J74323L76056N64297O99207P51507P00538N38640K80663
$$ y = [7855263, 7711793, 7587216, 7473044, 7361572, 7237454, 7079690, 6868857, 6590365, 6229489, 5762309, 5152099, 4358511, 3357800, 2161821, 821392, -589824, -1999434, -3351506, -4605293, -5724817, -6672933, -7417150, -7942600, -8260827, -8407403, -8432699, -8396702, -8371831, -8444565, -8703787, -9216741, -10007861, -11054427, -12299017, -13668156, -15087885, -16493114, -17830522, -19055774, -20127998, -21006064, -21649412, -22022989, -22104448, -21891080, -21402943, -20679414, -19770776, -18729908, -17607353, -16448181, -15287858, -14148047, -13036245, -11951246, -10892132, -9866733, -8897115, -8021225, -7289120, -6750800, -6435378, -6328824, -6364098, -6434213, -6425000, -6250677, -5874621, -5310324, -4611117, -3859610, -3159072, -2620432, -2339769]
8080b339769l1387l37111n77730p15269p39221o59726m96676k74717k5309K11180
8070e985735L90573M77499M59345L53341K01420N3901m9744r1533p1474M156J30543
8059d127708L01881N03962P11037Q90424J011449J054615J018738R23585Q05082
8050C093065P03215O47461O45569O79395P09314O86776N71042L42932J0127l95809
8040G693087q26958j228297j547490j744134j796827j707367j502317j231689
8032c891992r64032p76546p39463q95982j243783j727656k250177k698718k978883
8023a8167232l041203k890419k573816k155489j690973j214818p43842k89954
8015c2767746J26902M74694P19797Q47453Q76044Q49883Q13705P89759P75617
$$ y = [-2339769, -2371156, -2708267, -3285997, -4001266, -4740487, -5400213, -5896889, -6171606, -6196915, -5985735, -5595162, -5117663, -4658318, -4304977, -4103557, -4049656, -4099400, -4190933, -4262407, -4258251, -4127708, -3825827, -3321865, -2610828, -1720404, -708955, 345660, 1364398, 2287983, 3093065, 3796280, 4443741, 5089310, 5768705, 6478019, 7164795, 7735837, 8078769, 8088896, 7693087, 6866129, 5637832, 4090342, 2346208, 549381, -1157986, -2660303, -3891992, -4856024, -5632570, -6372033, -7268015, -8511798, -10239454, -12489631, -15188349, -18167232, -21208435, -24098854, -26672670, -28828159, -30519132, -31733950, -32477792, -32767746, -32640844, -32166150, -31446353, -30598900, -29722856, -28872973, -28059268, -27269509, -26493892]
8006b6493892P60306P41046P26894P30160P56948Q06751Q81107R91165J153180
7997a8946335J372376J628560J877196K066092K155776K131464K002861J795390
7989c916620J539249J262585R90930P48626N55636M19372L29121K60363J87312
7980B376574R4300k1796j57037l06035m62089o14448p49973q60367r46520j011800
7970b659191j048278j030106r23794p10711m06966o6803K35379M37141N16008
7961e657321M94700M19949L31244K42220J43986K1421j32502l12133n01755o78418
7951e628609q11670q64230q01179o08671l11125K7329L20693M88186M77773K79869
$$ y = [-26493892, -25733586, -24992540, -24265646, -23535486, -22778538, -21971787, -21090680, -20099515, -18946335, -17573959, -15945399, -14068203, -12002111, -9846335, -7714871, -5712010, -3916620, -2377371, -1114786, -123856, 624770, 1180406, 1599778, 1928899, 2189262, 2376574, 2470874, 2449078, 2292041, 1986006, 1523917, 909469, 159496, -700871, -1647391, -2659191, -3707469, -4737575, -5661369, -6372080, -6779046, -6845849, -6610470, -6173329, -5657321, -5162621, -4742672, -4411428, -4169208, -4025222, -4003801, -4136303, -4448436, -4950191, -5628609, -6440279, -7304509, -8105688, -8714359, -9025484, -8998155, -8677462, -8189276, -7711503, -7431634]
$$ [...]
##END NTUPLES=NMR SPECTRUM
##END=
