##TITLE=31Pdec_75C4
 aceton-d6
  64 sc
 23.11.2023
##JCAMPDX= 6.0         $$ Bruker NMR JCAMP-DX V2.0
##DATA TYPE= NMR SPECTRUM
##DATA CLASS= NTUPLES
##ORIGIN= UXNMR, Bruker Analytische Messtechnik GmbH
##OWNER= root
$$ XWIN-NMR		Version 3.5
$$ Thu Nov 23 15:24:50 2023 Russian Standard Time (UT+4h)  she@DPX200
##.OBSERVE FREQUENCY= 81.013821
##.OBSERVE NUCLEUS= ^31P
##.ACQUISITION MODE= SIMULTANEOUS
##.ACQUISITION SCHEME= undefined
##.AVERAGES= 64
##.DIGITISER RES= 16
##SPECTROMETER/DATA SYSTEM= spect
##.PULSE SEQUENCE= zgpg30
##.SOLVENT NAME= Acetone
##.SHIFT REFERENCE= (INTERNAL, Acetone, 0, 248.564)
##AUDIT TRAIL= $$ (NUMBER, WHEN, WHO, WHERE, WHAT)
$$ ##TITLE= Audit trail, XWIN-NMR		Version 3.5
$$ ##JCAMPDX= 5.01
$$ ##ORIGIN= Bruker BioSpin GmbH
$$ ##OWNER= she
$$ F:/spectra/data/she/nmr/P31/1/pdata/1/auditp.txt
$$ ##AUDIT TRAIL=  $$ (NUMBER, WHEN, WHO, WHERE, WHAT)
(   1,<2023-11-23 15:23:47.54 +0400>,<she>,<DPX200>,
      <continue with go, POWCHK disabled, PULCHK disabled
       configuration hash MD5:
       00 E9 B6 7A A2 85 ED C7 34 08 36 98 17 FE 4E 26
       data hash MD5: 32K
       7D B4 1D B7 A6 3A 8E B8 9D D3 E1 DA 24 47 3B D6>)
(   2,<2023-11-23 15:23:50.64 +0400>,<she>,<DPX200>,
      <Start of raw data processing
       efp BC_mod = 2 LB = 10 FT_mod = 6 PKNL = 1 PHC0 = -11325.48 PHC1 = -23.5066 SI = 64K 
       data hash MD5: 64K
       3F 3F 74 F7 AC 56 E6 8F 23 72 CE 4A 4E CF 08 B6>)
(   3,<2023-11-23 15:24:08.62 +0400>,<she>,<DPX200>,
      <pk PHC0 = -3.30294 PHC1 = 0 
       data hash MD5: 64K
       D1 16 58 1D 3B 2A F8 49 76 F4 8C BC 6C DE 53 A4>)
(   4,<2023-11-23 15:24:27.40 +0400>,<she>,<DPX200>,
      <pk PHC0 = -592.743 PHC1 = 561.6008 
       data hash MD5: 64K
       DF 09 AC D2 23 2B E7 60 5A 01 D7 73 DC AA E9 FA>)
$$ ##END=
$$ 
$$ hash MD5
$$ E7 74 F2 1B CA 04 1C 4D B3 F7 26 F1 DC 53 57 4E
##$RELAX= 
##$RELAX= 
##$RELAX= 
##$RELAX= 
##$RELAX= 
##$RELAX= 
##$RELAX= 
##$RELAX= 
##$RELAX= 
$$ Bruker specific parameters
$$ --------------------------
##$DU= <F:/spectra>
##$EXPNO= 1
##$NAME= <P31>
##$PROCNO= 1
##$TYPE= <nmr>
##$USER= <she>
##$AMP= (0..31)
100 100 100 100 100 100 100 100 100 100 100 100 100 100 100 100 100 100 
100 100 100 100 100 100 100 100 100 100 100 100 100 100 
##$AQSEQ= 0
##$AQ_mod= 1
##$AUNM= <au_zg>
##$AUTOPOS= <>
##$BF1= 81.014009
##$BF2= 200.13
##$BF3= 200.13
##$BF4= 200.13
##$BF5= 200.13
##$BF6= 200.13
##$BF7= 200.13
##$BF8= 200.13
##$BYTORDA= 1
##$CFDGTYP= 0
##$CFRGTYP= 5
##$CHEMSTR= <none>
##$CNST= (0..31)
1 1 145 1 1 1 1 1 1 1 1 1 1 1 1 1 1 1 1 1 1 1 1 1 1 1 1 1 1 1 1 1 
##$CPDPRG= <waltz16>
##$CPDPRG1= <>
##$CPDPRG2= <waltz16>
##$CPDPRG3= <>
##$CPDPRG4= <mlev>
##$CPDPRG5= <mlev>
##$CPDPRG6= <mlev>
##$CPDPRG7= <mlev>
##$CPDPRG8= <mlev>
##$CPDPRGB= <>
##$CPDPRGT= <>
##$D= (0..31)
0 1 0 0 0 0 0 0 0 0 0 0.03 2e-05 3e-06 0 0 0 0 0 0 0 0 0 0 0 0 0 0 0 0 
0 0 
##$DATE= 1700738549
##$DBL= (0..7)
120 120 120 11 120 120 24 19 
##$DBP= (0..7)
150 150 150 150 150 150 150 150 
##$DBP07= 0
$$ [...]
##$SUBNAM2= <"">
##$SUBNAM3= <"">
##$SUBNAM4= <"">
##$SUBNAM5= <"">
##$SUBNAM6= <"">
##$SUBNAM7= <"">
##$SUBNAM8= <"">
##$SUBNAM9= <"">
##$SW= 501.771253377433
##$SWIBOX= (0..15)
0 1 3 0 0 0 0 0 0 0 0 0 0 0 0 0 
##$SW_h= 40650.406504065
##$TD= 32768
##$TD0= 1
##$TE= 0
##$TE2= 300
##$TE3= 300
##$TEG= 300
##$TL= (0..7)
0 120 53 12 22 120 120 120 
##$TP= (0..7)
150 150 150 150 150 150 150 150 
##$TP07= 0
##$TPNAME0= <>
##$TPNAME1= <>
##$TPNAME2= <>
##$TPNAME3= <>
##$TPNAME4= <>
##$TPNAME5= <>
##$TPNAME6= <>
##$TPNAME7= <>
##$TPOAL= (0..7)
0.5 0.5 0.5 0.5 0.5 0.5 0.5 0.5 
##$TPOFFS= (0..7)
0 0 0 0 0 0 0 0 
##$TUNHIN= 0
##$TUNHOUT= 0
##$TUNXOUT= 0
##$USERA1= <user>
##$USERA2= <user>
##$USERA3= <user>
##$USERA4= <user>
##$USERA5= <user>
##$V9= 5
##$VALIST= <valist>
##$VCLIST= <CCCCCCCCCCCCCCC>
##$VD= 0
##$VDLIST= <DDDDDDDDDDDDDDD>
##$VPLIST= <PPPPPPPPPPPPPPP>
##$VTLIST= <TTTTTTTTTTTTTTT>
##$WBST= 1024
##$WBSW= 4
##$XGAIN= (0..3)
0 0 0 0 
##$XL= 0
##$YL= 0
##$YMAX_a= 6310
##$YMIN_a= -6877
##$ZGOPTNS= <>
##$ZL1= 120
##$ZL2= 120
##$ZL3= 120
##$ZL4= 120
##$ABSF1= 0
##$ABSF2= 0
##$ABSG= 0
##$ABSL= 0
##$ALPHA= 0
##$AQORDER= 0
##$ASSFAC= 0
##$ASSFACI= 0
##$ASSFACX= 0
##$ASSWID= 0
##$AUNMP= <proc_1d>
##$AZFE= 0.1
##$AZFW= 0.5
##$BCFW= 0
##$BC_mod= 2
##$BYTORDP= 0
##$COROFFS= 0
##$CY= -3
##$DATMOD= 1
##$DC= 0
##$DFILT= <>
##$DTYPP= 0
##$F1P= 0
##$F2P= 0
##$FCOR= 1
##$FTSIZE= 65536
##$FT_mod= 6
##$GAMMA= 0
##$GB= 0
##$INTBC= 1
##$INTSCL= 6.047779e-11
##$ISEN= 30
##$LB= 10
##$LEV0= 0
##$LPBIN= 0
##$MAXI= 10000
##$MC2= 0
##$MEAN= 0
##$ME_mod= 0
##$MI= 50
##$NCOEF= 0
##$NC_proc= -10
##$NLEV= 6
##$NOISF1= 182.463
##$NOISF2= 159.3651
##$NSP= 0
##$NTH_PI= 0
##$NZP= 0
##$OFFSET= 248.5645
##$PC= 4
##$PHC0= -11921.52
##$PHC1= 538.0942
##$PH_mod= 1
##$PKNL= yes
##$PPARMOD= 0
##$PSCAL= 0
##$PSIGN= 0
##$REVERSE= no
##$SF= 81.0140089999694
##$SI= 65536
##$SIGF1= 159.3651
##$SIGF2= -187.1042
##$SINO= 113.3802
##$SIOLD= 16384
##$SREGLST= <1H.CDCl3>
##$SSB= 0
##$STSI= 65536
##$STSR= 0
##$SW_p= 40650.406504065
##$SYMM= 0
##$S_DEV= 0
##$TDeff= 32768
##$TDoff= 0
##$TI= <>
##$TILT= no
##$TM1= 0
##$TM2= 0
##$TOPLEV= 0
##$USERP1= <user>
##$USERP2= <user>
##$USERP3= <user>
##$USERP4= <user>
##$USERP5= <user>
##$WDW= 1
##$XDIM= 65536
##$YMAX_p= 356969152
##$YMIN_p= -46192867
$$ End of Bruker specific parameters
$$ ---------------------------------
##NTUPLES= NMR SPECTRUM
##VAR_NAME=  FREQUENCY,     SPECTRUM/REAL,   SPECTRUM/IMAG
##SYMBOL=    X,             R,               I
##VAR_TYPE=  INDEPENDENT,   DEPENDENT,       DEPENDENT
##VAR_FORM=  AFFN,          ASDF,            ASDF
##VAR_DIM=   65536,         65536,           65536
##UNITS=     HZ,            ARBITRARY UNITS, ARBITRARY UNITS
##FACTOR=    0.620285442955139, 1,           1
##FIRST=     20137.2065510682, 0,            0
##LAST=      -20513.1999529968, 0,           0
##MIN=       -20513.1999529968, -46192867,   0
##MAX=       20137.2065510682, 356969152,    0
$$ Real data points
##PAGE= N=1
##DATA TABLE= (X++(R..R)), XYDATA
$$ [...]
13054A2770911R74943Q67720P42091O19304N23887M70103M53601M51506M31371
$$ 12770911 13745854 14613574 15355665 15974969 16498856 16968959 17422560 17874066 18305437
13045A8305437L64391K34338L8253k15364n04315p90459j027352j177589j226259
$$ 18305437 18669828 18904166 18942419 18727055 18222740 17432281 16404929 15227340 14001081
13036A4001081j179147j050077q51467n95787l03010m045K64665M71693N98294
$$ 14001081 12821934 11771857 10920390 10324603 10021593 10017548 10282213 10753906 11352200
13027A1352200O38246N92559M66068K69577K4605k34979m67694o34774p11882
$$ 11352200 11990446 12583005 13049073 13318650 13343255 13108276 12640582 12005808 11293926
13018A1293926o95444n99178m44452k54005n3490J25346K48143K87175K28891
$$ 11293926 10598482 9999304 9554852 9300847 9247357 9372703 9620846 9908021 10136912
13009A0136912P6239j51185m18011o79030q91887j029721j084452j059361r58650
$$ 10136912 10213151 10061966 9643955 8964925 8073038 7043317 5958865 4899504 3940854
13000C940854p82720n31898k14990J43856N05131Q21671J050142J160630J140341
$$ 3940854 3158134 2626236 2411246 2555102 3060233 3881904 4932046 6092676 7233017
12991G233017R91335P25434L61409p2298n32310r61257j301145j513953j594897
$$ 7233017 8224352 8949786 9311195 9238897 8706587 7745330 6444185 4930232 3335335
12982C335335j568325j471292j339861j206558j102490j052423j061726j107520
$$ 3335335 1767010 295718 -1044143 -2250701 -3353191 -4405614 -5467340 -6574860
12974f574860j146177j135359j055919r19367p57935o06438m88722m15095l85991
$$ -6574860 -7721037 -8856396 -9912315 -10831682 -11589617 -12196055 -12684777 -13099872 -13485863
12965a3485863l92738m13964m17145l72956k74599j44083j7598P7528J34961J64483
$$ -13485863 -13878601 -14292565 -14709710 -15082666 -15357265 -15501348 -15518946 -15441418 -15306457 -15141974
12955a5141974J80110J92808K09824K35105K67019K95079K99987K59453J57908
$$ -15141974 -14961864 -14769056 -14559232 -14324127 -14057108 -13762029 -13462042 -13202589 -13044681
12946a3044681m362k06884m11716n73517o54872o40022n37812l70066j53797J07728
$$ -13044681 -13049043 -13255927 -13667643 -14241160 -14896032 -15536054 -16073866 -16443932 -16597729 -16490001
12936a6490001M17083P64995J118656J426666J638113J723188J682951J545268
$$ -16490001 -16072918 -15307923 -14189267 -12762601 -11124488 -9401300 -7718349 -6173081
12928f173081J353454J155815R97816R13707R17176R96372J117915J237784J312612
$$ -6173081 -4819627 -3663812 -2665996 -1752289 -835113 161259 1279174 2516958 3829570
12919C829570J307768J203338R99068P16041L92435P4258j94778l80861m64447
$$ 3829570 5137338 6340676 7339744 8055785 8448220 8522478 8327700 7946839 7482392
12910G482392m41923l24585j35285R5405L32439N40638O92707P78651Q09077Q07205
$$ 7482392 7040469 6715884 6580599 6676004 7008443 7549081 8241788 9020439 9829516 10636721
12900A0636721P94018P77092P49486O96702O06047M74189L10196J32519l7622
$$ 10636721 11430739 12207831 12957317 13654019 14260066 14734255 15044451 15176970 15139348
12891A5139348j80390k76169l03915k45926r8245J21658L76431O18249Q00451
$$ 15139348 14958958 14682789 14378874 14132948 14034703 14156361 14532792 15151041 15951492
12882A5951492Q87661Q63089P31333N14833K44690m9443l44688o23139q67059
$$ 15951492 16839153 17702242 18433575 18948408 19193098 19143655 18798967 18175828 17308769
12873A7308769j058168j184472j249259j272292j278188j277922j256755j179272
$$ 17308769 16250601 15066129 13816870 12544578 11266390 9988468 8731713 7552441
12865G552441j011522p47342m20326r1213J80741L60473M38538M17465L03103
$$ 7552441 6540919 5793577 5373251 5282038 5462779 5823252 6261790 6679255 6982358
12856F982358J11796j17579l26392m58594m86273m18019k86178j26027L8494J97780
$$ 6982358 7094154 6976575 6650183 6191589 5705316 5287297 5001119 4875092 4913586 5111366
12846E111366L51284M98123O28752P24360P66751P51699O93796O18104N45625
$$ 5111366 5462650 5960773 6589525 7313885 8080636 8832335 9526131 10144235 10689860
12837A0689860M83171M22001L43047K25391N5760j63298m09984o47329q34507
$$ 10689860 11173031 11595032 11938079 12163470 12219230 12055932 11645948 10998619 10164112
12828A0164112r40906r55949q89727p65941o13356m60519l33185k51551k26325
$$ 10164112 9223206 8267257 7377530 6611589 5998233 5537714 5204529 4952978 4726653
12819D726653k55216l22081m00442m61720m85138m63895m04028l18156k19424
$$ 4726653 4471437 4149356 3748914 3287194 2802056 2338161 1934133 1615977 1396553
12810A396553j18831k5147N4996J17833J63455J95767K21299K48101K85060L39326
$$ 1396553 1277722 1252575 1307571 1425404 1588859 1784626 2005925 2254026 2539086 2878412
12800B878412M10226M83966N36564N45686N01160M04256K58275O1811j88814m91925
$$ 2878412 3288638 3772604 4309168 4854854 5356014 5760270 6018545 6080356 5891542 5399617
12790E399617q33978j186378j506460j745291j862515j842360j701931j486934
$$ 5399617 4565639 3379261 1872801 127510 -1735005 -3577365 -5279296 -6766230
12782f766230j255230j053623q97788p67451o21483m24117j66104J29578M16405
$$ -6766230 -8021460 -9075083 -9972871 -10740322 -11361805 -11785922 -11952026 -11822448 -11406043
12773a1406043O40548P58247P49093O21135M07076J55040q2357k59618l49862
$$ -11406043 -10765495 -10007248 -9258155 -8637020 -8229944 -8074904 -8157261 -8416879 -8766741
12764h766741l52541k92774k11093j46906j20568j20529j03722j4190J86590M95511
$$ -8766741 -9119282 -9412056 -9623149 -9770055 -9890623 -10011152 -10114874 -10129064 -9942474 -9446963
12754i446963Q65487J224860J504003J654767J658685J527607J299281J027411
$$ -9446963 -8581476 -7356616 -5852613 -4197846 -2539161 -1011554 287727 1315138
12746A315138P66833N58053M16890L33103K78283K19470J32356Q224j47467l21981
$$ 1315138 2081971 2640024 3056914 3390017 3668300 3887770 4020126 4028350 3880883 3558902
12736C558902n02350o78353q41621r84831j104580j206039j302588j406929j519377
$$ 3558902 3056552 2378199 1536578 551747 -552833 -1758872 -3061460 -4468389 -5987766
12727e987766j624095j697570j721709j689539j599196j444153j212065q96405
$$ -5987766 -7611861 -9309431 -11031140 -12720679 -14319875 -15764028 -16976093 -17872498
12719a7872498n11826r8508K90513O10676Q41270R87707J074183J133378J195617
$$ -17872498 -18384324 -18482832 -18192319 -17581643 -16740373 -15752666 -14678483 -13545105 -12349488
12710a2349488J277938J376546J468264J522187J514832J439235J303539J122766
$$ -12349488 -11071550 -9695004 -8226740 -6704553 -5189721 -3750486 -2446947 -1324181
12702a324181R11280O80395M40366K03455j4279j94219l20447l87461m04907l94180
$$ -1324181 -412901 267494 707860 911315 897036 702817 382370 -5091 -409998 -804178
12692h04178l77877l69144l67408l61796l39619k95898k38859j86562j54868j45008
$$ -804178 -1182055 -1551199 -1918607 -2280403 -2620022 -2915920 -3154779 -3341341 -3496209 -3641217
12682c641217j41205j20720o8026J7574J23960K32962L26288L89282M13098L94849
$$ -3641217 -3782422 -3903142 -3971168 -3953594 -3829634 -3596672 -3270384 -2881102 -2468004 -2073155
12672b073155L36070K42781J29662K4336l6265j9308Q8447K72354M91095O85349
$$ -2073155 -1737085 -1494304 -1364642 -1340306 -1376571 -1395879 -1307432 -1035078 -543983 141366
12662A41366P93478P72912O19159L70090R0732j53349l19753l99122m08365l72990
$$ 141366 934844 1707756 2326915 2697005 2787737 2634388 2314635 1915513 1507148 1134158
12652A134158l10040k21810j01000N9896K61428M93203P32549R47166J102159
$$ 1134158 824118 602308 501308 561204 822632 1315835 2048384 2995550 4097709
12643D097709J169020J134246J006061Q15159O03930M06312K31089O1357j29979
$$ 4097709 5266729 6400975 7407036 8222195 8826125 9232437 9463526 9524883 9394904
12634I394904l59669o19890q76283j079393j184734j170164j040326q18616n36393
$$ 9394904 9035235 8415345 7539062 6459669 5274935 4104771 3064445 2245829 1709436
12625A709436k27678P0416L16380M67395M89634L72310J35257j78051n17296q38282
$$ 1709436 1481758 1552174 1868554 2335949 2825583 3197893 3333150 3155099 2637803 1799521
12615A799521j105285j289786j374745j362300j275037j146741j009631q87633
$$ 1799521 694236 -595550 -1970295 -3332595 -4607632 -5754373 -6764004 -7651637
12607g651637p97298p49630p46335p73425q02457q04829p70352p14159o65384
$$ -7651637 -8448935 -9198565 -9944900 -10718325 -11520782 -12325611 -13095963 -13810122 -14475506
12598a4475506o46845o60303o84281o82454o17499m65016k21824R4539M52958
$$ -14475506 -15122351 -15782654 -16466935 -17149389 -17766888 -18231904 -18453728 -18359189 -17906231
12589a7906231Q17478J154982J441462J665136J823718J917171J942373J894934
$$ -17906231 -17088753 -15933771 -14492309 -12827173 -11003455 -9086284 -7143911 -5248977
12581e248977J776265J598316J380617J141718Q91957O32335L58541O6246k44158
$$ -5248977 -3472712 -1874396 -493779 647939 1539896 2172231 2530772 2597018 2352860
12572B352860n63295q70444j136231j330912j434087j440714j361641j219732
$$ 2352860 1789565 919121 -217110 -1548022 -2982109 -4422823 -5784464 -7004196
12564g004196j042522q52318o56825m44994j91446J30848N33545R98622J474921
$$ -7004196 -8046718 -8899036 -9555861 -10000855 -10192301 -10061453 -9527908 -8529286 -7054365
12555g054365J889932K173028K279190K202307J973789J650328J298258R79750
$$ -7054365 -5164433 -2991405 -712215 1490092 3463881 5114209 6412467 7392217
12547G392217P41299O03164N52092N44282N23752M51096L26671J91961J05716
$$ 7392217 8133516 8736680 9288772 9833054 10356806 10807902 11134573 11326534 11432250
12538A1432250J08924K00704L38670M60250N09673M56797L03172P8015j71491
$$ 11432250 11541174 11741878 12080548 12540798 13050471 13507268 13810440 13888455 13716964
12529A3716964l92675n40802n91903n51878m56976l62206l20752l63932m91255
$$ 13716964 13324289 12783487 12191584 11639706 11182730 10820524 10499772 10135840 9644585
12520I644585o73989q68938j035654j149286j203402j203507j158664j078522
$$ 9644585 8970596 8101658 7066004 5916718 4713316 3509809 2351145 1272623
12512A272623r75415q65393p64402o82532o20985n72869n25734m64935l79031
$$ 1272623 297208 -568185 -1332587 -2015119 -2636104 -3208973 -3734707 -4199642 -4578673
12503d578673k67383j46384m8585j1590o0038j89619l62648n19219n99143n63297
$$ -4578673 -4846056 -4992440 -5041025 -5052615 -5112653 -5302272 -5664920 -6184139 -6783282 -7346579
12493g346579m03318j36571K06627N92961R88205J355193J654332J850054J921273
$$ -7346579 -7749897 -7886468 -7679841 -7086880 -6098675 -4743482 -3089150 -1239096 682177
12484F82177J870446J725113J528603J323624J138126R80582Q43384P08104N49779
$$ 682177 2552623 4277736 5806339 7129963 8268089 9248671 10092055 10800159 11349938
12475A1349938L42610O8833k72078o58353j047588j385459j620853j723395j695291
$$ 11349938 11692548 11761381 11489303 10830950 9783362 8397903 6777050 5053655 3358364
12466C358364j570280j400371j239375j131762j106981j173031j307377j453955
$$ 3358364 1788084 387713 -851662 -1983424 -3090405 -4263436 -5570813 -7024768
12458g024768j537608j494822j302932r87367o02838k04370J70884N02658P75329
$$ -7024768 -8562376 -10057198 -11360130 -12347497 -12950335 -13154705 -12983821 -12481163 -11705834
12449a1705834R69025J062479J045245R29578P53019N68861M28067L59955L59625
$$ -11705834 -10736809 -9674330 -8629085 -7699507 -6946488 -6377627 -5949560 -5589605 -5229980
12440e229980L88349L88784L10269J33302j19377l92596o25051p76216q36710
$$ -5229980 -4841631 -4452847 -4142578 -4009276 -4128653 -4521249 -5146300 -5922516 -6759226
12431f759226q18222p35307n94953l98479j49523J38022M33658O88753Q46539
$$ -6759226 -7577448 -8312755 -8907708 -9306187 -9455710 -9317688 -8884030 -8195277 -7348738
12422g348738Q63962P32920M85293J79249j21336l62101n05181n31339m39421
$$ -7348738 -6484776 -5751856 -5266563 -5087314 -5208650 -5570751 -6075932 -6607271 -7046692
12413g046692k43731K9050L42642O55886R31353J143961J282775J345246J331960
$$ -7046692 -7290423 -7261373 -6918731 -6262845 -5331492 -4187531 -2904756 -1559510 -227550
12404b27550J249361J116751R65962Q27798P13806O09226M85209L22563J29824
$$ -227550 1021811 2138562 3104524 3932322 4646128 5255354 5740563 6063126 6192950
12395F192950n7807j98550k69437k78688k55354k23919j84610j16282P05J61900
$$ 6192950 6135143 5936593 5667156 5388468 5133114 4909195 4724585 4608303 4609008 4770908
12385D770908L35464M78999N61263N73723N28588M48899L56891K65230J75084
$$ 4770908 5106372 5585371 6146634 6720357 7248945 7697844 8054735 8319965 8495049
12376H495049Q2516j1427r5280j51364j67351j48403j22409j32352k15515l79445
$$ 8495049 8577565 8566138 8470858 8319494 8152143 8003740 7881331 7748979 7533464 7154019
12366G154019n91577p92359r24046r55582q89879p54991n89219m27237k89214
$$ 7154019 6562442 5770083 4846037 3890455 3000576 2245585 1656366 1229129 939915
12357I39915j74942o7288N3955J95130L40897M61611N29684N31250M65156L33507
$$ 939915 764973 697685 751640 946770 1287667 1749278 2278962 2810212 3275368 3608875
12347C608875J35137j30699m53093q00161j120910j360794j484095j489943j411377
$$ 3608875 3744012 3613313 3160220 2360059 1239149 -121645 -1605740 -3095683 -4507060
12338d507060j297744j191473j111931j052426r88441q91244p40642n32150k77611
$$ -4507060 -5804804 -6996277 -8108208 -9160634 -10149075 -11040319 -11780961 -12313111 -12590722
12329a2590722k029K60687M74191O11026O65623O59221O29775O12461O25029O66616
$$ -12590722 -12592751 -12332064 -11857873 -11246847 -10581224 -9922003 -9292228 -8679767 -8054738 -7388122
12319g388122P25527P86538Q34829Q59862Q59382Q38862Q04823P58207O94255
$$ -7388122 -6662595 -5876057 -5041228 -4181366 -3321984 -2483122 -1678299 -920092 -225837
12310b25837O06826M90729L40776J53265o7014k99696n10203o62258p35001p34261
$$ -225837 380989 871718 1212494 1365759 1298745 999049 488846 -173412 -908413 -1642674
12300a642674o90197o41942o19056o32008o76521p44813q32314r35889j049970
$$ -1642674 -2332871 -2974813 -3593869 -4225877 -4902398 -5647211 -6479525 -7415414 -8465384
12291h465384j168667j292934j433304j601528j796095j994161k157011k244554
$$ -8465384 -9634051 -10926985 -12360289 -13961817 -15757912 -17752073 -19909084 -22153638
12283b2153638k228623k098417j857436j514944j078541n56239K9483O26741J156158
$$ -22153638 -24382261 -26480678 -28338114 -29853058 -30931599 -31487838 -31458355 -30831614 -29675456
12274b9675456J536079J717327J705193J556093J352486J169378J047561R85297
$$ -29675456 -28139377 -26422050 -24716857 -23160764 -21808278 -20638900 -19591339 -18606042
12266a8606042R51078R08072Q35454P37438O40118N79860N86690O68861Q07599
$$ -18606042 -17654964 -16746892 -15911438 -15174000 -14533882 -13954022 -13367332 -12698471 -11890872
12257a1890872R65949J104408J192559J214312J172166J091470J016651R94099
$$ -11890872 -10924923 -9820515 -8627956 -7413644 -6241478 -5150008 -4133357 -3139258
12249c139258J049746J177001J342234J501643J618486J673663J666876J608893
$$ -3139258 -2089512 -912511 429723 1931366 3549852 5223515 6890391 8499284
12241H499284J510436J376375J207940J006181P69765M91148J60796k19753o27634
$$ 8499284 10009720 11386095 12594035 13600216 14369981 14861129 15021925 14802172 14174538
12232A4174538j021853j357874j603298j746169j793609j762376j666603j511319
$$ 14174538 13152685 11794811 10191513 8445344 6651735 4889359 3222756 1711437
12224A711437j297238j032943p43976m71524k61270j47079j35171j95705k68934
$$ 1711437 414199 -618744 -1362720 -1834244 -2095514 -2242593 -2377764 -2573469 -2842403
12215b842403k86802k00746j271K80575N89135Q67707J076765J198231J226756
$$ -2842403 -3129205 -3329951 -3331222 -3050647 -2461512 -1593805 -517040 681191 1907947
12206A907947J157756R82879O96111L04913j62691o60066j130861j518504j772174
$$ 1907947 3065703 4048582 4744693 5049606 4886915 4226849 3095988 1577484 -194690
12197a94690j851770j736835j438590j005990n17321n9395K94403M98131N39015
$$ -194690 -2046460 -3783295 -5221885 -6227875 -6745196 -6804591 -6510188 -6012057 -5473042
12188e473042M38341K47046L2843j39229k23715k00332o8707J58894M58686P91580
$$ -5473042 -5034701 -4787655 -4754812 -4894041 -5117756 -5318088 -5386795 -5227901 -4769215 -3977635
12178c977635J103301J335399J443660J412235J254080R99036O79617L23387m6383
$$ -3977635 -2874334 -1538935 -95275 1316960 2571040 3570076 4249693 4573080 4526697
12169D526697m06024p27648r79115j128918j155092j054601q48299n78097k97075
$$ 4526697 4120673 3393025 2413910 1284992 129900 -924701 -1773000 -2351097 -2648172
12160b648172n6856J02901J60459J14373j6221j93835l69877m97676n47286n14654
$$ -2648172 -2705028 -2602127 -2441668 -2327295 -2343516 -2537351 -2907228 -3404904 -3952190 -4466844
12150d466844m19520k92798j60877l5498Q7067K20180L78736N70845P90874J018033
$$ -4466844 -4886364 -5179162 -5340039 -5375537 -5288470 -5068290 -4689554 -4118709 -3327835 -2309802
12140b309802J223311J379835J467281J468406J366915J154063Q38164M45060
$$ -2309802 -1086491 293344 1760625 3229031 4595946 5750009 6588173 7033233
12132G033233Q513m38895q67365j249928j568567j822709k028722k206204k359647
$$ 7033233 7041746 6602851 5735486 4485558 2916991 1094282 -934440 -3140644 -5500291
12123e500291k468863k495115k399110k159561j781496j292419p34077j57432
$$ -5500291 -7969154 -10464269 -12863379 -15022940 -16804436 -18096855 -18830932 -18988364
12115a8988364L80584Q25482J139655J313967J366993J331582J237309J098600
$$ -18988364 -18607780 -17782298 -16642643 -15328676 -13961683 -12630101 -11392792 -10294192
12107a0294192R14375O79430M01500J13005j32429k79638k97652j96328k3768
$$ -10294192 -9379817 -8700387 -8298887 -8185882 -8318311 -8597949 -8895601 -9091929 -9115697
12098i115697J54348K82031L32759L13050K50748J76484J08807M9944q100p3727
$$ -9115697 -8961349 -8679318 -8346559 -8033509 -7782761 -7606277 -7497470 -7447526 -7455626 -7529353
12088g529353j49526k31817l12622l81040m24720m32889l98868l19104j91103
$$ -7529353 -7678879 -7910696 -8223318 -8604358 -9029078 -9461967 -9860835 -10179939 -10371042
12079a0371042j6636J89066L91843N47299O20646O02245N07207L63538K02241
$$ -10371042 -10387678 -10198612 -9806769 -9259470 -8638824 -8036579 -7529372 -7165834 -6963593
12070f963593N5338m4434o9536p260J35242L34669N60151P80739R69935J109090
$$ -6963593 -6908255 -6952689 -7022225 -7029485 -6894243 -6559574 -5999423 -5218684 -4248749 -3139659
12060c139659J190193J215468J191999J124792J015079Q66824O95612N29882M00414
$$ -3139659 -1949466 -733998 458001 1582793 2597872 3464696 4160308 4690190 5090604
12051E090604L24433K95990K89487K74052K29481J54455O3065k6681j04780j75537
$$ 5090604 5415037 5711027 6000514 6274566 6504047 6658502 6721567 6694886 6590106 6414569
12041F414569k56497l70890n35850p51294r96432j236826j436411j565152j599600
$$ 6414569 6158072 5787182 5251332 4500038 3503606 2266780 830369 -734783 -2334383
12032b334383j523331j334339j056304p42204m62255k80164k30265l06444m65992
$$ -2334383 -3857714 -5192053 -6248357 -6990561 -7452816 -7732980 -7963245 -8269689 -8735681
12023h735681o45527p83747q43958q27050p67649p14460p05397p50385q28718
$$ -8735681 -9381208 -10164955 -11008913 -11835963 -12603612 -13318072 -14023469 -14773854 -15602572
12014a5602572q99655r19968q60432p14318m95847k32724M1046K89828M80836
$$ -15602572 -16502227 -17422195 -18282627 -18996945 -19492792 -19725516 -19684470 -19394642 -18913806
12005a8913806N89949O07388N41371M19452K86772J98129K02932L27879N65810
$$ -18913806 -18323857 -17716469 -17175098 -16755646 -16468874 -16270745 -16067813 -15739934 -15174124
11996a5174124Q76221J197181J464407J631196J681776J632629J522182J394845
$$ -15174124 -14297903 -13100722 -11636315 -10005119 -8323343 -6690714 -5168532 -3773687
11988c773687J286000J211505J163774J116670J038989R10472P30875N16912K91307
$$ -3773687 -2487687 -1276182 -112408 1004262 2043251 2953723 3684598 4201510 4492817
11979D492817P3755j19656k71367l60392l69112k95066j57770N737J53566K51431
$$ 4492817 4566572 4446916 4175549 3815157 3446045 3150979 2993209 2998946 3152512 3403943
11969C403943K79525K34117J25924k4423j93229l59522n06165o16924o74651o64442
$$ 3403943 3683468 3917585 4043509 4019086 3825857 3466335 2960170 2343246 1668595 1004153
11959A004153n80651m33113k48936o8214O6411J24489J00626J7089q7877j79697
$$ 1004153 423502 -9611 -258547 -326761 -260350 -135861 -35235 -18146 -106023 -285720
11949b85720k42137k77773k96814l04874k98380k67439k00056q3045R8905L60731
$$ -285720 -527857 -805630 -1102444 -1407318 -1705698 -1973137 -2173193 -2256238 -2157333 -1796602
11939a796602P07970J125014J569398J978409K285646K438796K411280K206392
$$ -1796602 -1088632 36382 1605780 3584189 5869835 8308631 10719911 12926303
11931A2926303J854823J405991R15092M32273k11l45056n69774o54108n99961
$$ 12926303 14781126 16187117 17102209 17534482 17534271 17189215 16619441 15965333 15365372
11922A5365372m35325k08938K1497K03412L02309L08967K37284J14303l0863j74367
$$ 15365372 14930047 14721109 14742606 14946018 15248327 15557294 15794578 15908881 15878018 15703651
11912A5703651l02069m13429n22633o51493q13405r96570j158668j239785j188920
$$ 15703651 15401582 14988153 14465520 13814027 13000622 12004052 10845384 9605599 8416679
11903H416679r90244o74319l08310K8592K71617L88539L85363K99213J80139O9274
$$ 8416679 7426435 6752116 6443806 6472398 6744015 7132554 7517917 7817130 7997269 8066543
11893H066543j4204o9586j00432j03835p1176L534J15295K43632L54046M08228
$$ 8066543 8052339 7982753 7882321 7778486 7707310 7710844 7826139 8069771 8423817 8832045
11883H832045L81448K76602J23109l9858j83495k98908l91319m66057n19325n42565
$$ 8832045 9213493 9490095 9613204 9573346 9389851 9090943 8699624 8233567 7714242 7171677
11873G171677n35655n13933m99913n07664n34910n66383n79736n48446m46349
$$ 7171677 6636022 6122089 5622176 5114512 4579602 4013219 3433483 2885037 2438688
11864B438688k57348J5732L50382P10117J050405J323439J484276J498292J347509
$$ 2438688 2181340 2197072 2547454 3257571 4307976 5631415 7115691 8613983 9961492
11855I961492J035281N89133N8198m97291j020102j465861j805998k027053k129222
$$ 9961492 10996773 11585906 11644104 11146813 10126711 8660850 6854852 4827799 2698577
11846B698577k124833k037856j904919j773907j695015j705375j814782j999061
$$ 2698577 573744 -1464112 -3369031 -5142938 -6837953 -8543328 -10358110 -12357171
11838a2357171k203360k356020k390706k267710j983085j563774j057589n25174
$$ -12357171 -14560531 -16916551 -19307257 -21574967 -23558052 -25121826 -26179415 -26704589
11830b6704589l0666L73835O65155Q55707R84066J094497J215668J348483J469340
$$ -26704589 -26735255 -26361420 -25696265 -24840558 -23856492 -22761995 -21546327 -20197844 -18728504
11821a8728504J548036J568980J540098J483110J415841J344058J268915J198134
$$ -18728504 -17180468 -15611488 -14071390 -12588280 -11172439 -9828381 -8559466 -7361332
11813g361332J145208J115902J097040J059929R74450Q20884N93568L00394l7929
$$ -7361332 -6216124 -5100222 -4003182 -2943253 -1968803 -1147919 -554351 -253957 -291886
11804b91886l90011p18810r88519j172560j262124j270041j223608j148875j059498
$$ -291886 -681897 -1400707 -2389226 -3561786 -4823910 -6093951 -7317559 -8466434 -9525932
11795i525932r59111q51706p48055o63534o11038n93129n96353n92415n49290
$$ -9525932 -10485043 -11336749 -12084804 -12748338 -13359376 -13952505 -14548858 -15141273 -15690563
11786a5690563m46918k87010r1332J08595K84673M23386N29844O21267P14078
$$ -15690563 -16137481 -16424491 -16515823 -16407228 -16122555 -15699169 -15169325 -14548058 -13833980
11777a3833980Q14872R21374J028691J131765J220974J276561J270366J178061
$$ -13833980 -13019108 -12097734 -11069043 -9937278 -8716304 -7439743 -6169377 -4991316
11769d991316R96056P50784M91217K67564J09829J9232k4840m9248p2497r7854
$$ -4991316 -3995260 -3244476 -2753259 -2485695 -2375866 -2356634 -2381474 -2430722 -2503219 -2601073
11759b601073j16302j16414r4897o1795l7575m3596r1032j75323k80407l89619
$$ -2601073 -2717375 -2833789 -2928686 -2990481 -3028056 -3071652 -3162684 -3338007 -3618414 -4008033
11749d008033m94415n94380o90687p80715q59065r23501r80222j043672j129680
$$ -4008033 -4502448 -5096828 -5787515 -6568230 -7427295 -8350796 -9331018 -10374690 -11504370
11740a1504370j244811j377862j499882j574963j576696j499883j359944j182301
$$ -11504370 -12749181 -14127043 -15626925 -17201888 -18778584 -20278467 -21638411 -22820712
11732b2820712r91669q08416o50067n31674m63666m50942m94758n93516p39147
$$ -22820712 -23812381 -24620797 -25270864 -25802538 -26266204 -26717146 -27211904 -27805420 -28544567
11723b8544567r12221j082032j213150j273415j238229j091526q27736m56374
$$ -28544567 -29456788 -30538820 -31751970 -33025385 -34263614 -35355140 -36182876 -36639250
11715c6639250m960M85484R71591J417569J796894K088301K274610K348381K318925
$$ -36639250 -36644210 -36158726 -35187135 -33769566 -31972672 -29884371 -27609761 -25261380 -22942455
11706b2942455K212584K064472J906763J760010J631201J518269J416620J321640
$$ -22942455 -20729871 -18665399 -16758636 -14998626 -13367425 -11849156 -10432536 -9110896
11698i110896J225681J115333R75709Q00617N99963L98311K26885J15153Q4511
$$ -9110896 -7885215 -6769882 -5794173 -4993556 -4393593 -3995282 -3768397 -3653244 -3568733
11689c568733J43204K82843M78303O91493Q77693R94297J011921R24691P53564
$$ -3568733 -3425529 -3142686 -2664383 -1972890 -1095197 -100900 911021 1835712 2589276
11680B589276N39901L32451J72800Q2087N2285M8568K6280m5221j67660l16826
$$ 2589276 3129177 3461628 3634428 3716515 3768800 3817368 3843648 3798427 3630767 3313941
11670C313941m57268n55912n88515n41863m15226k20246K2373K87758N50289P84928
$$ 3313941 2856673 2300761 1712246 1170383 755157 534911 557284 845042 1395331 2180259
11660B180259R68901J085537J129087J106940J036025R33890Q09276O58641M71746
$$ 2180259 3149160 4234697 5363784 6470724 7506749 8440639 9249915 9908556 10380302
11651A0380302K43102j8235k87370n32426p29345q75124r92523j122572j306530
$$ 10380302 10623404 10605169 10317799 9785373 9056028 8180904 7188381 6065809 4759279
11642D759279j564931j884549k220937k514787k712434k780352k709332k510598
$$ 4759279 3194348 1309799 -911138 -3425925 -6138359 -8918711 -11628043 -14138641
11634a4138641k208669j835417j426752j019840o47777l32732q2932J03291K30526
$$ -14138641 -16347310 -18182727 -19609479 -20629319 -21277096 -21609828 -21692760 -21589469 -21358943
11625b1358943L03991L33815L39630L48111L82494M50312N37150O10746O34027
$$ -21358943 -21054952 -20721137 -20381507 -20033396 -19650902 -19200590 -18663440 -18052694 -17418667
11616a7418667N80863M47381K53968L7796j59704l03720l70992l50826k47445
$$ -17418667 -16837804 -16390423 -16136455 -16098659 -16258363 -16562083 -16933075 -17283901 -17531346
11607a7531346q4148R7790K51468L42808L62758L26062K61253K00068J69426J84976
$$ -17531346 -17615494 -17517704 -17266236 -16923428 -16560670 -16234608 -15973355 -15773287 -15603861 -15418885
11597a5418885K47352L44383M59009N76784O86905P77129Q29466Q23184P44736
$$ -15418885 -15171533 -14827150 -14368141 -13791357 -13104452 -12327323 -11497857 -10674673 -9929937
11588i929937N97918M07659K15778P0341J1051N4998J90420L84021N97470Q00487
$$ -9929937 -9332019 -8924360 -8708582 -8638241 -8627190 -8572192 -8381772 -7997751 -7400281 -6599794
11578f599794R72309J095643J153534J133633J035391Q73225O73000M64017K70887
$$ -6599794 -5627485 -4531842 -3378308 -2244675 -1209284 -336059 336941 800958 1071845
11569A071845J08904j5894j03464j55903j75066j62912j24740p2484k3701M960
$$ 1071845 1180749 1164855 1061391 905488 730422 567510 442770 370286 346585 351545
11559C51545M558k5414q2135j63555k66987l85548n08410o24321p21740p83150
$$ 351545 356103 330689 248554 84999 -181988 -567536 -1075946 -1700267 -2422007 -3205157
11549c205157p81098o86030m84669j94822J36986M54181P11654Q87351R81015
$$ -3205157 -3986255 -4672285 -5156954 -5351776 -5214790 -4760609 -4048955 -3161604 -2180589
11540b180589J004562R70710Q86201P53649N80080L84432J97346N3839j6071M888
$$ -2180589 -1176027 -205317 680884 1434533 2014613 2399045 2596391 2650230 2634159 2639047
11530B639047J16298K99707N24338P56344R65710J127765J221987J232639J152462
$$ 2639047 2755345 3055052 3579390 4335734 5301444 6429209 7651196 8883835 10036297
11521A0036297R86448P52122M75127J82663j00875l53991n56874o93710p59277
$$ 10036297 11022745 11774867 12249994 12432657 12331782 11977791 11420917 10727207 9967930
11512I967930p64596p35242p01079o82706o83431o92538o97650o96493o99179
$$ 9967930 9203334 8468092 7767013 7084307 6400876 5708338 5010688 4314195 3615016
11503C615016p21467p77297q76372j023232j211032j410770j566487j607231j475193
$$ 3615016 2893549 2116252 1239880 216648 -994384 -2405154 -3971641 -5578872 -7054065
11494g054065j155796o91043j66481L21260O98152R31080J025776J010936R19664
$$ -7054065 -8209861 -8900904 -9067385 -8746125 -8047973 -7116893 -6091117 -5080181 -4160517
11485d160517P77141N97470L86973J49393j09462l78271o39894q77028j081630
$$ -4160517 -3383376 -2785906 -2398933 -2249540 -2359002 -2737273 -3377167 -4254195 -5335825
11476e335825j259813j425729j588002j739368j855941j904052j849971j670677
$$ -5335825 -6595638 -8021367 -9609369 -11348737 -13204678 -15108730 -16958701 -18629378
11468a8629378j364396r56663m96991m5341L46919O53255Q76364J036442J150380
$$ -18629378 -19993774 -20950437 -21447428 -21492769 -21145850 -20492595 -19616231 -18579789 -17429409
11459a7429409J218545J230623J183607J092428R81740Q67484P47104O07831M45689
$$ -17429409 -16210864 -14980241 -13796634 -12704206 -11722466 -10854982 -10107878 -9500047 -9054358
11450i054358K79571J49842J02852J71722L64398O62570J027359J406381J741685
$$ -9054358 -8774787 -8624945 -8522093 -8350371 -7985973 -7323403 -6296044 -4889663 -3147978
11441c147978J980841K090290K064622J925729J711397J459422J195320R28637
$$ -3147978 -1167137 923153 2987775 4913504 6624901 8084323 9279643 10208280
11433A0208280O57461L76373Q2618k22100n33285q45599j151544j436536j674784
$$ 10208280 10865741 11242114 11324732 11102632 10569347 9723748 8572204 7135668 5460884
11424E460884j832415j878996j800215j602677j308961r48870n53044j50589K30566
$$ 5460884 3628469 1749473 -50742 -1653419 -2962380 -3911250 -4464294 -4614883 -4384317
11415d384317N61876Q12932R53983R63456Q37347N95152K78561n8080l63154o02521
$$ -4384317 -3822441 -3009509 -2055526 -1092070 -254723 340429 618990 560910 197756 -404765
11405d04765p65125q56029q83400q50621p58904o15735m40108k59443j00706J7386
$$ -404765 -1169890 -2025919 -2909319 -3759940 -4518844 -5134579 -5574687 -5834130 -5934836 -5917450
11395e917450Q5721J00780O1078l2212j73139l51251n52752p57689r34718j042537
$$ -5917450 -5831729 -5730949 -5669871 -5702083 -5875222 -6226473 -6779225 -7536914 -8471632 -9514169
11385i514169j043070r18567o79171l57071M223L56349O48718Q33753Q77286P69944
$$ -9514169 -10557239 -11475806 -12154977 -12512048 -12507825 -12151476 -11502758 -10669005 -9791719 -9021775
11375i021775N33154K16073j16300l99495n83688o40836n65985l77205j14774
$$ -9021775 -8488621 -8272548 -8388848 -8788343 -9372031 -10012867 -10578852 -10956057 -11070831
11366a1070831J64718M01920N51117N91495N29798L95824K31866P6275n3662j68715
$$ -11070831 -10906113 -10504193 -9953076 -9361581 -8831783 -8435959 -8204093 -8127818 -8181480 -8350195
11356h350195k97370m63839o69429q88417j077941j193717j203753j096426q82423
$$ -8350195 -8647565 -9111404 -9780833 -10669250 -11747191 -12940908 -14144661 -15241087 -16123510
11347a6123510n91679k67337M1860K90675M47584N03441M74158L94906L07082
$$ -16123510 -16715189 -16982526 -16940666 -16649991 -16202407 -15698966 -15224808 -14829902 -14522820
11338a4522820K42329K09820J93832J64993R9169j0003j53737l18829m91119o47809
$$ -14522820 -14280491 -14070671 -13876839 -13711846 -13612677 -13622680 -13776417 -14095246 -14586365 -15234174
11328a5234174p52405p65889o68612m72749k13591P2328L64670O61728R68959
$$ -15234174 -15986579 -16752468 -17421080 -17893829 -18107420 -18035092 -17670422 -17008694 -16039735
11319a6039735J281609J572107J791223J885017J819278J598172J267236Q99665
$$ -16039735 -14758126 -13186019 -11394796 -9509779 -7690501 -6092329 -4825093 -3925428
11311c925428N72741L45682K47970K79551M17101O20819Q41341J028404J140303
$$ -3925428 -3352687 -3007005 -2759035 -2479484 -2062383 -1441564 -600223 428181 1568484
11302A568484J151258J055573Q67953O19013L46796Q9208j19280k50246k88800
$$ 1568484 2719742 3775315 4643268 5262281 5609077 5698285 5579005 5328759 5039959
11293E039959k43247j46616m5058J9580K1342m8054j82549l64381n65059p48075
$$ 5039959 4796712 4650096 4605038 4624618 4645960 4597906 4415357 4050976 3485917 2737842
11283B737842q76857r27824r03032q34547p76361p86250r04471j136778j448906
$$ 2737842 1860985 933161 30129 -804418 -1580779 -2367029 -3271500 -4408278 -5857184
11274e857184j776476k047082k204312k222935k111241j902934j643068j372953
$$ -5857184 -7633660 -9680742 -11885054 -14107989 -16219230 -18122164 -19765232 -21138185
11266b1138185j119711q95189p03154n47689m35442l70464l47205l47998l46504
$$ -21138185 -22257896 -23153085 -23856239 -24403928 -24839370 -25209834 -25557039 -25905037 -26251541
11257b6251541l13953k25687o9092J47199L88713O02828P38017P63533O78067
$$ -26251541 -26565494 -26791181 -26860273 -26713074 -26324361 -25721533 -24983516 -24219983 -23541916
11248b3541916N05455K83483N1863j57640l26433m47863n21081n45183n17272
$$ -23541916 -23036461 -22752978 -22701115 -22858755 -23185188 -23633051 -24154132 -24699315 -25216587
11239b5216587m34367k96217j06689J26550L92131O72428R39696J156849J287380
$$ -25216587 -25650954 -25947171 -26053860 -25927310 -25535179 -24862751 -23923055 -22766206 -21478826
11230b1478826J310216J228807J067980Q62578O46875M49053K88150J69988Q3155
$$ -21478826 -20168610 -18939803 -17871823 -17009245 -16362370 -15913317 -15625167 -15455179 -15372024
11221a5372024L22j11104k71609m74515o83103q43097r04660q42264o61528l89339
$$ -15372024 -15371702 -15482806 -15754415 -16228930 -16912033 -17755130 -18659790 -19502054 -20163582 -20552921
11211b0552921n4417L27099P50701J210498J686916K143942K533669K802674K900011
$$ -20552921 -20607338 -20280239 -19529538 -18319040 -16632124 -14488182 -11954513 -9151839 -6251828
11202f251828K789979K467602J968940J368696P63460K44869j27233l38641m14302
$$ -6251828 -3461849 -994247 974693 2343389 3106849 3351718 3224485 2885844 2471542
11193B471542l98667l39227k81789k69513l33651m76963o64612q34088r20402
$$ 2471542 2072875 1733648 1451859 1182346 848695 371732 -292880 -1126968 -2047370
11184b047370q82156p15910m53855j46324J63122M56480P40860J027796J307472
$$ -2047370 -2929526 -3645436 -4099291 -4245615 -4082493 -3626013 -2885153 -1857357 -549885
11175e49885J538798J664530J641259J463428J166835Q12588M63987J69015m6446
$$ -549885 988913 2653443 4294702 5758130 6924965 7737553 8201540 8370555 8324109
11166H324109j76766k30383k22324j67278p4916N0940K09188L96154O01248Q06179
$$ 8324109 8147343 7916960 7694636 7527358 7452442 7503382 7712570 8108724 8709972 9516151
11156I516151R87812J122190J186827J161247J029047P84172M39711L3413l75475
$$ 9516151 10503963 11626153 12812980 13974227 15003274 15787446 16227157 16260570 15885095
11147A5885095p18401r33652r79462q40186n27308p9411M38888R44905J356630
$$ 15885095 15166694 14233042 13253580 12413394 11886086 11806675 12245563 13190468 14547098
11138A4547098J615245J697037J607239J364118R88439N04760n2053o34919j190129
$$ 14547098 16162343 17859380 19466619 20830737 21819176 22323936 22271883 21636964 20446835
11129B0446835j666372k022319k231040k283188k191124j992573j747058j519228
$$ 20446835 18780463 16758144 14527104 12243916 10052792 8060219 6313161 4793933
11121D793933j353469j254994j191272j113244r82137p86045n39578k70844o322
$$ 4793933 3440464 2185470 994198 -119046 -1101183 -1887228 -2426806 -2697650 -2703972
11112b703972K36395M45368O07326P06518P31885O86044N87790M66332L51398
$$ -2703972 -2467577 -2022209 -1414883 -708365 23520 709564 1297354 1763686 2115084
11103B115084K64503K14388J96869J97775J97164J74544J15603J8618j04201k33184
$$ 2115084 2379587 2593975 2790844 2988619 3185783 3360327 3475930 3494548 3390347 3157163
11093C157163l51898m54737n47235o40483p43006q53017r54814j023610j038504
$$ 3157163 2805265 2350528 1803293 1162810 419804 -433213 -1388027 -2411637 -3450141
11084c450141r94972r06269p91788o62447n15601l42883j43108P0194K70795M28318
$$ -3450141 -4445113 -5351382 -6143170 -6805617 -7321218 -7664101 -7807209 -7737015 -7466220 -7037902
11074g037902N17899N27318M60316L36437J87778N2356l6332o0855k5973M5831
$$ -7037902 -6520003 -5992685 -5532369 -5195932 -5008154 -4955798 -4992130 -5052985 -5078958 -5033127
11064e033127J26401J91699K23829K09925J45790M3002p0356j60815k04864j95626
$$ -5033127 -4906726 -4715027 -4491198 -4281273 -4135483 -4092481 -4162837 -4323652 -4528516 -4724142
11054d724142j36578l0363J26585L39827O07211R10165J210802J456939J594313
$$ -4724142 -4860720 -4891083 -4764498 -4424671 -3817460 -2907295 -1696493 -239554 1354759
11045A354759J582283J407798J092872O92445K81340o7551l06286m25193m49556
$$ 1354759 2937042 4344840 5437712 6130157 6411497 6343946 6037660 5612467 5162911
11036E162911m22938l88113l75113l97989m56596n40531o34978p27486q12396
$$ 5162911 4739973 4351860 3976747 3578758 3122162 2581631 1946653 1219167 406771
11027D06771q89842r59855j015778j041905j017983r29070p75238n74528l56148
$$ 406771 -483071 -1442926 -2458704 -3500609 -4518592 -5447662 -6222900 -6797428 -7153576
11018g153576j47529L6931J98674L48495M95918O41762P77899Q92204R73850J016950
$$ -7153576 -7301105 -7264174 -7065500 -6717005 -6221087 -5579325 -4801426 -3909222 -2935372 -1918422
11008a918422J024255J011127J004606J032526J106923J214604J323581J399597
$$ -1918422 -894167 116960 1121566 2154092 3261015 4475619 5799200 7198797
11000G198797J418421J366513J235939J024251P41922M19484J03796j59432l47408
$$ 7198797 8617218 9983731 11219670 12243921 12985843 13405327 13509123 13349691 13002283
10991A3002283m69914n57065o33366o99582p37406p30176o79424o04897n33702
$$ 13002283 12532369 11975304 11341938 10642356 9904950 9174774 8495350 7890453 7356751
10982G356751m90866m95759n59966o83234q50615j035342j207226j341252j420621
$$ 7356751 6865885 6370126 5810160 5126926 4276311 3240969 2033743 692491 -728130
10973g28130j433574j369034j217174r75489o54759k79451J16482M93860Q10870
$$ -728130 -2161704 -3530738 -4747912 -5723401 -6378160 -6657611 -6541129 -6047269 -5236399
10964e236399J027005J110755J048949Q53036N58929K20134j03245l55168m90788
$$ -5236399 -4209394 -3098639 -2049690 -1196654 -637725 -417591 -520836 -876004 -1366792
10955a366792m81186l19347k7597L39812P05583R88919J127465J093211Q98537
$$ -1366792 -1847978 -2167325 -2194922 -1855110 -1149527 -160608 966857 2060068 2958605
10946B958605N91644K41827q1990l30947m85174n49636n43013m88090m07889l26532
$$ 2958605 3550249 3792076 3710086 3379139 2893965 2344329 1801316 1313226 905337 578805
10936E78805k71622k74531l65113n59466q45012j173045j468010j653447j682211
$$ 578805 307183 32652 -332461 -891927 -1736939 -2909984 -4377994 -6031441 -7713652
10927g713652j553392j305925r94642o65793l46620m9665K18624M54355O57299
$$ -7713652 -9267044 -10572969 -11567611 -12233404 -12580024 -12629689 -12411065 -11956710 -11299411
10918a1299411Q30646R76886J093798J174921J213957J208925J163372J085721
$$ -11299411 -10468765 -9491879 -8398081 -7223160 -6009203 -4800278 -3636906 -2551185
10910b551185R88997Q91253Q14418P79197P96067Q56556R31531R80757R70485
$$ -2551185 -1562188 -670935 143483 922680 1718747 2575303 3506834 4487591 5458076
10901E458076Q88495P47260N75672M08371K79439K17736K37502L25831M38029
$$ 5458076 6346571 7093831 7669503 8077874 8357313 8575049 8812551 9138382 9576411
10892I576411N09786M82541L27883N7738k82946o34512r41828j167394j296648
$$ 9576411 10086197 10568738 10896621 10954359 10671413 10036901 9095073 7927679 6631031
10883F631031j336659j309444j241858j156282j066657r79423q94375q02560o85171
$$ 6631031 5294372 3984928 2743070 1586788 520131 -459292 -1353667 -2156227 -2841398
10874b841398n19483k92000j1049K90725N67633P80003R08816R56719R37693Q66494
$$ -2841398 -3360881 -3652881 -3663930 -3373205 -2805572 -2025569 -1116753 -160034 777659 1644153
10864A644153P56039O20399M76448L41896K32098J56539J13666Q5898M0659n8989
$$ 1644153 2400192 3020591 3497039 3838935 4071033 4227572 4341238 4427136 4467795 4408806
10854D408806k37414m91308p85015j061341j264778j364591j363522j288679j174426
$$ 4408806 4171392 3680084 2895069 1833728 568950 -795641 -2159163 -3447842 -4622268
10845d622268j049258r30185q21288p14346n92962m40700k50698l2447J87720
$$ -4622268 -5671526 -6601711 -7422999 -8137345 -8730307 -9171007 -9421705 -9454152 -9266432
10836i266432L74104M95322N37697N09933M35227L36235K24676J03343k3082j40810
$$ -9266432 -8892328 -8397006 -7859309 -7349376 -6914149 -6577914 -6353238 -6249895 -6272977 -6413787
10826f413787k31120k81398k91881k73739k43593k20276k23159k68443l63740
$$ -6413787 -6644907 -6926305 -7218186 -7491925 -7735518 -7955794 -8178953 -8447396 -8811136
10817h811136n04906o77602q62287j039536j192741j307337j368536j361238j273285
$$ -8811136 -9316042 -9993644 -10855931 -11895467 -13088208 -14395545 -15764081 -17125319 -18398604
10808a8398604j099677q45144n24870j63356K10185N70186R02004J201827J468447
$$ -18398604 -19498281 -20343425 -20868295 -21031651 -20821466 -20251280 -19349276 -18147449 -16679002
10799a6679002J693525J858271J939285J919664J798520J594094J340318J079388
$$ -16679002 -14985477 -13127206 -11187921 -9268257 -7469737 -5875643 -4535325 -3455937
10791c455937Q51656O83230N75105N01267M20098K93785J04870j37805m04779
$$ -3455937 -2604281 -1921051 -1345946 -844679 -424581 -130796 -25926 -163731 -568510
10782e68510o59818q75286j040240j155896j223402j236293j185147j069648r06449
$$ -568510 -1228328 -2103614 -3143854 -4299750 -5523152 -6759445 -7944592 -9014240 -9920689
10773i920689p25843n59352m26188l26630k45939j65473p3130L2944J46736K58038
$$ -9920689 -10646532 -11205884 -11632072 -11958702 -12204641 -12370114 -12443244 -12410300 -12263564 -12005526
10763a2005526L54459M23069M53733M43296L97722L30469K58660J99569J68000
$$ -12005526 -11651067 -11227998 -10774265 -10330969 -9933247 -9602778 -9344118 -9144549 -8976549
10754h976549J72787K11959K70429L25221L57361L61746L46009L19326K81950
$$ -8976549 -8803762 -8591803 -8321374 -7996153 -7638792 -7277046 -6931037 -6611711 -6329761
10745f329761K24957J38209J6521j41039l32493n46573p51901q96524r27520q20516
$$ -6329761 -6104804 -5966595 -5950074 -6091113 -6423606 -6970179 -7722080 -8618604 -9546124 -10366640
10735a0366640n95706l06220q402K62091M93266O84124Q32546R33126R81337R75803
$$ -10366640 -10962346 -11268566 -11276968 -11014877 -10521611 -9837487 -9004941 -8071815 -7090478 -6114675
10725f114675R16680Q05318O49748M72971L14870K21137K23212L22607M90823
$$ -6114675 -5197995 -4392677 -3742929 -3269958 -2955088 -2733951 -2510739 -2188132 -1697309
10716a697309O83771Q59226R87351J052988J053134R91921Q75197P08851N02934
$$ -1697309 -1013538 -154312 833039 1886027 2939161 3931082 4806279 5515130 6018064
10707F018064K76576N6362j32200k73253l63986m13602m39859m63069m98951n55250
$$ 6018064 6294640 6351002 6218802 5945549 5581563 5167961 4728102 4265033 3766082 3210832
10697C210832o34517p38512q67978j017885j173949j314547j417210j466087j457245
$$ 3210832 2576315 1837803 969825 -48060 -1222009 -2536556 -3953766 -5419853 -6877098
10688f877098j399639j311456j213338j120924j039002r59619q65166p34319n47570
$$ -6877098 -8276737 -9588193 -10801531 -11922455 -12961457 -13921076 -14786242 -15520561 -16068131
10679a6068131k92463K9391L96396P70139J109728J386721J588317J709492J745627
$$ -16068131 -16360594 -16331203 -15934807 -15164668 -14054940 -12668219 -11079902 -9370410 -7624783
10670g624783J692871J552937J336616J064948P68048M79569K27312K5615j25889
$$ -7624783 -5931912 -4378975 -3042359 -1977411 -1209363 -729794 -502482 -476867 -602756
10661f02756k39350l35876m41868n81149p65174r88843j234778j480218j699912
$$ -602756 -842106 -1177982 -1619850 -2200999 -2966173 -3955016 -5189794 -6670012 -8369924
10652h369924j866337j953501j945178j840452j650825j392887j085322p52025
$$ -8369924 -10236261 -12189762 -14134940 -15975392 -17626217 -19019104 -20104426 -20856451
10644b0856451m23695j31413J04030K77837L98377M80385N39774N91167O46991
$$ -20856451 -21280146 -21411559 -21307529 -21029692 -20631315 -20150930 -19611156 -19019989 -18372998
10635a8372998P17866Q13479R41053J099867J275232J438732J557682J608968
$$ -18372998 -17655132 -16841653 -15900600 -14800733 -13525501 -12086769 -10529087 -8920119
10627h920119J588117J507740J387314J241547J073968Q77901O43261L65233N0112
$$ -8920119 -7332002 -5824262 -4436948 -3195401 -2121433 -1243532 -600271 -235038 -184926
10618a84926k84842o15922r16256j154866j295588j302679j153405q49454m18785
$$ -184926 -469768 -1085690 -2001946 -3156812 -4452400 -5755079 -6908484 -7757938 -8176723
10609h176723R1824O25958J123229J524315J781284J872364J811668J645219J434051
$$ -8176723 -8084899 -7458941 -6335712 -4811397 -3030113 -1157749 653919 2299138 3733189
10600C733189J233292J075903R66519Q88282Q20493P56396P07724O93522P24348
$$ 3733189 4966481 6042384 7008903 7897185 8717678 9474074 10181798 10875320 11599668
10591A1599668P93817Q78592R41746R38902Q30303N96730K50495j65918n93401
$$ 11599668 12393485 13272077 14213823 15152725 15983028 16579758 16830253 16664335 16070934
10582A6070934r75307j273287j473184j580962j615112j600550j561749j511926
$$ 16070934 15095627 13822340 12349156 10768194 9153082 7552532 5990783 4478857
10574D478857j443847j333704j160325r26780o67467m35767k82039k36230l02587
$$ 4478857 3035010 1701306 540981 -385799 -1053266 -1489033 -1771072 -2007302 -2309889
10565b309889m63864o88046r34159j159151j327497j419809j435001j384977j286392
$$ -2309889 -2773753 -3461799 -4395958 -5555109 -6882606 -8302415 -9737416 -11122393 -12408785
10556a2408785j154409j000214q30318o44446m31486j69389J63950N71755J026377
$$ -12408785 -13563194 -14563408 -15393726 -16038172 -16469658 -16639047 -16475097 -15903342 -14876965
10547a4876965J476711J870411K173857K377357K486560K509814K451808K317924
$$ -14876965 -13400254 -11529843 -9355986 -6978629 -4492069 -1982255 469553 2787477
10539B787477K124063J900174J681535J494326J345754J221247J086695Q97583
$$ 2787477 4911540 6811714 8493249 9987575 11333329 12554576 13641271 14538854
10531A4538854O16846K33847k27561p14088j153766j468570j591447j486019j159322
$$ 14538854 15155700 15389547 15161986 14447898 13294132 11825562 10234115 8748096 7588774
10522G588774o60568o7371N35585J079988J530897J889070K179999K438789K696699
$$ 7588774 6928206 6860835 7396420 8476408 10007305 11896375 14076374 16515163 19211862
10513A9211862K969980L255052L536384L803785M065479M347865M684965N105393
$$ 19211862 22181842 25436894 28973278 32777063 36842542 41190407 45875372 50980765
10505E0980765N622636O234288O932206P715404Q595026R592114J0737233J2072693
$$ 50980765 56603401 62837689 69769895 77485299 86080325 95672439 106409672 118482365
10497A18482365J3650183J5521440J7721330K0233911K2935351K5530368K7509396
$$ 118482365 132132548 147653988 165375318 185609229 208544580 234074948 261584344
10490B61584344K8146923K6583786K2071564J4385308M197227o929232j7065097
$$ 261584344 289731267 316315053 338386617 352771925 356969152 350039920 332974823
10483C32974823k4676687k9123721l0635888k9932573k7826999k5004297k1953444
$$ 332974823 308298136 279174415 248538527 218605954 190778955 165774658 143821214
10476A43821214j8974899j6225389j3776853j1658604r871571q392644p183926
$$ 143821214 124846315 108620926 94844073 83185469 73313898 64921254 57737328
10469E7737328o201063n395538m718611m131243l611304l151090k749796k407973
$$ 57737328 51536265 46140727 41422116 37290873 33679569 30528479 27778683 25370710
10461B5370710k125496j902649j742822j651007j624076j640871j664666j657370
$$ 25370710 23245214 21342565 19599743 17948736 16324660 14683789 13019123 11361753
10453A1361753j591511j451544j230374r29603n63430j60786K38286N92558Q71815
$$ 11361753 9770242 8318698 7088324 6158721 5595291 5434505 5672791 6265349 7137164
10444G137164J062656J162437J167637J069206Q58796N38433J25984l44023q22113
$$ 7137164 8199820 9362257 10529894 11599100 12457896 12996329 13122313 12778290 11956177
10435A1956177j248640j562544j713195j673716j453004j100264o95906l29853
$$ 11956177 10707537 9144993 7431798 5758082 4305078 3204814 2508908 2179055
10427B179055p5882K8536q530j37943k87619l89435m05416l42383k46985j80916
$$ 2179055 2103173 2131709 2123179 1985236 1697617 1308182 902766 560383 313398 132482
10417A32482j88918k79498m28447n96135p42215q32666q44868p73164o29749m37543
$$ 132482 -56436 -335934 -764381 -1360516 -2102731 -2935397 -3780265 -4553429 -5183178 -5620721
10407e620721k19446R818K45753M88657P32652R57743J133969J236081J256615
$$ -5620721 -5840167 -5830349 -5584596 -5095939 -4363287 -3405544 -2271575 -1035494 221121
10398B21121J207954J114841J003963Q94701P93584O94412N83307M45059K69058
$$ 221121 1429075 2543916 3547879 4442580 5236164 5930576 6513883 6958942 7228000
10389G228000N5220j82779m22081o42326q34830j000890j141121j245392j291639
$$ 7228000 7283220 7100441 6678360 6036034 5201204 4200314 3059193 1813801 522162
10380E22162j255518j125713r13936o50818l70736r9147J48391L60223N26102
$$ 522162 -733356 -1859069 -2773005 -3423823 -3794559 -3893706 -3745315 -3385092 -2858990
10371b858990O40735P07196P35052P35027P15719O85510O57414O50560O83425
$$ -2858990 -2218255 -1511059 -776007 -40980 674739 1360249 2017663 2668223 3351648
10362C351648P61595Q69152R70903J025168J001266Q93981P26902N40338L69880
$$ 3351648 4113243 4982395 5953298 6978466 7979732 8873713 9600615 10140953 10510833
10353A0510833K30353J15157P151j10422k49108m14775o08153q24769j053330
$$ 10510833 10741186 10856343 10863494 10753072 10503964 10089189 9481036 8656267 7602937
10344G602937j273431j456724j574855j610398j562681j444921j276730j077733
$$ 7602937 6329506 4872782 3297927 1687529 124848 -1320073 -2596803 -3674536
10336c674536q64489o50131m45900k62913j12215l522N4511N2037k1970j73198
$$ -3674536 -4539025 -5189156 -5635056 -5897969 -6010184 -6013706 -5959195 -5907158 -5929128 -6102326
10326f102326l92184o50744r10684j139218j317881j438021j490198j461117j342386
$$ -6102326 -6494510 -7145254 -8055938 -9195156 -10513037 -11951058 -13441256 -14902373 -16244759
10317a6244759j141319q82145n96574l12016m3876K07337M54236P13927R93423
$$ -16244759 -17386078 -18268223 -18864797 -19176813 -19220689 -19013352 -18559116 -17845189 -16851766
10308a6851766J276773J523750J683010J712769J597456J352047J013808O29060
$$ -16851766 -15574993 -14051243 -12368233 -10655464 -9058008 -7705961 -6692153 -6063093
10300f063093K44009r7543l55593n01578n30791m68931l63749k65006k05978j97253
$$ -6063093 -5819084 -5916627 -6272220 -6773798 -7304589 -7773520 -8137269 -8402275 -8608253 -8805506
10290h805506k31794k92224l54202l88297l66462k74518j24559M2409J68894K04246
$$ -8805506 -9037300 -9329524 -9683726 -10072023 -10438485 -10713003 -10837562 -10795153 -10626259 -10422013
10280a0422013J26309n1639k92568n56966q18131j061585j272573j426213j492128
$$ -10422013 -10295704 -10347343 -10639911 -11196877 -12015008 -13076593 -14349166 -15775379 -17267507
10271a7267507j451295j310507j101345q64078o28528m04580j86645L2415K47679
$$ -17267507 -18718802 -20029309 -21130654 -21994732 -22623260 -23027840 -23214485 -23182070 -22934391
10262b2934391M38841N80542O58827O80097O64857O32227N88828N31089M58229
$$ -22934391 -22495550 -21915008 -21256181 -20576084 -19911227 -19279000 -18690172 -18159083 -17700854
10253a7700854L84813L41493L60893M57096O14012P92370R50805J065237J133163
$$ -17700854 -17316041 -16974548 -16613655 -16156559 -15542547 -14750177 -13799372 -12734135 -11600972
10244a1600972J162653J157558J111577J014982Q67321O85348M99914L44099K40542
$$ -11600972 -10438319 -9280761 -8169184 -7154202 -6286881 -5601533 -5101619 -4757520 -4516978
10235d516978J94929J97216K27629K63418K84267K75372K27668J35491o103k01334
$$ -4516978 -4322049 -4124833 -3897204 -3633786 -3349519 -3074147 -2846479 -2710988 -2717091 -2918425
10225b918425m49960p42345j056924j361952j621432j803042j884214j852551
$$ -2918425 -3368385 -4110730 -5167654 -6529606 -8151038 -9954080 -11838294 -13690845
10217a3690845j701194j425031j023314n07734R0134P16975J303231J776591K081986
$$ -13690845 -15392039 -16817070 -17840384 -18348118 -18257984 -17541009 -16237778 -14461187 -12379201
10208a2379201K200027K151806J985359J753217J496337J240523R99489P76784
$$ -12379201 -10179174 -8027368 -6042009 -4288792 -2792455 -1551932 -552443 224341
10200B24341N66495L57984J46027n9577k32864l40647l55338k63565o7970K13905
$$ 224341 790836 1148820 1294847 1235270 1002406 661759 306421 42856 -25114 188791
10190A88791N49042Q86801J160827J300994J255260J012166O10148J26554l47303
$$ 188791 737833 1624634 2785461 4086455 5341715 6353881 6964029 7090583 6743280
10181F743280p31123r71876j051649r88764q29840o32351m46237l06034k34508
$$ 6743280 6012157 5040281 3988632 2999868 2170028 1537677 1091440 785406 550898
10172E50898k46634l44603n08288o93869q46559r20277q92365p67682n74247l54637
$$ 550898 304264 -40339 -548627 -1242496 -2089055 -3009332 -3901697 -4669379 -5243626 -5598263
10162e598263j55716j8788K7228l0831j87767m17275o73517r02397j059502j123020
$$ -5598263 -5753979 -5772767 -5745539 -5776370 -5964137 -6381412 -7054929 -7957326 -9016828 -10139848
10152a0139848j092743r78784p91940n43394k51081N5468L36901N52345O71182
$$ -10139848 -11232591 -12211375 -13003315 -13546709 -13797790 -13742322 -13405421 -12853076 -12181894
10143a2181894O84346O10628M93429L87162L38775L73515M90847O69065Q73376
$$ -12181894 -11497548 -10886920 -10393491 -10006329 -9667554 -9294039 -8803192 -8134127 -7260751
10134g260751J064249J205208J268972J240975J121836R30747P06557M99401L52037
$$ -7260751 -6196502 -4991294 -3722322 -2481347 -1359511 -428764 277793 777194 1129231
10125A129231K81920K78183L16366L79020M65546N83325P26950Q62850R34030
$$ 1129231 1411151 1689334 2005700 2384720 2850266 3433591 4160541 5023391 5957421
10116E957421Q83944O82170L33719j30611o69915j242109j804905k315566k733483
$$ 5957421 6841365 7523535 7857254 7726643 7056728 5814619 4009714 1694148 -1039335
10107a039335l023469l156918l112506k880827k473568j930564j315648o99370
$$ -1039335 -4062804 -7219722 -10332228 -13213055 -15686623 -17617187 -18932835 -19632205
10099a9632205j38059L37052P15028R92093J163015J223769J181205J060225R02465
$$ -19632205 -19770264 -19433212 -18718184 -17726091 -16563076 -15339307 -14158102 -13097877 -12195412
10090a2195412P57368O69359O64092P37490Q54068R59138J000161R44548P84170
$$ -12195412 -11438044 -10768685 -10104593 -9367103 -8513035 -7553897 -6553736 -5609188 -4825018
10081d825018N27904J91087k09814o53667j105065j508581j798505j924038j873166
$$ -4825018 -4297114 -4106027 -4315841 -4969508 -6074573 -7583154 -9381659 -11305697 -13178863
10072a3178863j676368j388861j067618p57626m87673k69515r9347L6092J51134
$$ -13178863 -14855231 -16244092 -17311710 -18069336 -18557009 -18826524 -18925871 -18889779 -18738645
10063a8738645K57394L66971M96748O65656Q83718J140396J402703J626645J774485
$$ -18738645 -18481251 -18114280 -17617532 -16951876 -16068158 -14927762 -13525059 -11898414 -10123929
10054a0123929J825846J777288J635780J414637J134542Q25427N24109K66519
$$ -10123929 -8298083 -6520795 -4885015 -3470378 -2335836 -1510409 -986300 -719781
10046g19781P8013l2470p0372m7627K3938J32426K60825L83822M70430M90522
$$ -719781 -641768 -674238 -744610 -792237 -768299 -635873 -375048 8774 479204 969726
10036I69726M21322K52291j0728l42102o96524j016503j247745j356964j343244
$$ 969726 1391048 1643339 1632611 1290509 593985 -422518 -1670263 -3027227 -4370471
10027d370471j236288j081997r22397p80262o56625n41282m26868l14732k09762
$$ -4370471 -5606759 -6688756 -7611153 -8391415 -9048040 -9589322 -10016190 -10330922 -10540684
10018a0540684j12619j9277P1892J53455K09288K21587J80122Q9737k6935j34326
$$ -10540684 -10653303 -10672580 -10600688 -10447233 -10237945 -10016358 -9836236 -9746499 -9773434 -9907760
10008i907760j96717j94311j33424m2730M3912J06470J44421J64687J64188J24947
$$ -9907760 -10104477 -10298788 -10432212 -10474942 -10431030 -10324560 -10180139 -10015452 -9851264 -9726317
9998i726317K7263j31536l29414n27863o87223p78272p86886p14926n79752m10801
$$ -9726317 -9699054 -9830590 -10160004 -10687867 -11375090 -12153362 -12940248 -13655174 -14234926 -14645727
9988a4645727k41607r9906j542M9514N8746M0602J8051J6079M8753J08952J70684
$$ -14645727 -14887334 -14987240 -14988782 -14939268 -14880522 -14839920 -14821869 -14805790 -14757037 -14648085 -14477401
9977a4477401K03158J86238J18613J8141q2952j47802j48429p6499N6053K25133
$$ -14477401 -14274243 -14088005 -13969392 -13951251 -14034203 -14182005 -14330434 -14406933 -14350880 -14125747
9967a4125747M01933N53914O44190O37861N16090K89495Q82k86998n14847o49968
$$ -14125747 -13723814 -13169900 -12525710 -11887849 -11371759 -11082264 -11081382 -11368380 -11883227 -12533195
9957a2533195o96136o85301o59703o57497p06400q19839r91618j193872j384754
$$ -12533195 -13229331 -13914632 -14574335 -15231832 -15938232 -16758071 -17749689 -18943561 -20328315
9948b0328315j523956j586868j569424j482586j341195j154466r23971o49665
$$ -20328315 -21852271 -23439139 -25008563 -26491149 -27832344 -28986810 -29910781 -30560446
9940c0560446l38259p604L14569N94569P96517Q86201Q36627O35702K93721j53595
$$ -30560446 -30898705 -30906309 -30591740 -29997171 -29200654 -28314453 -27477826 -26842124 -26548403 -26701998
9930b6701998o49666j128092j525766j794802j912133j884556j744823j538141
$$ -26701998 -27351664 -28479756 -30005522 -31800324 -33712457 -35597013 -37341836 -38879977
9922c8879977j306007j076918q67371o88351n50042m60198m17459m06064l99273
$$ -38879977 -40185984 -41262902 -42130273 -42818624 -43368666 -43828864 -44246323 -44652387 -45051660
9913d5051660l72005l14026k33613j48963p2600L602J16399L29153P23410J392639
$$ -45051660 -45423665 -45737691 -45971304 -46120267 -46192867 -46189265 -46072866 -45743713 -45020303 -43627664
9903d3627664K442204L987412O132655Q915904J2217208J5664835J8618405K0311944
$$ -43627664 -41185460 -37198048 -31065393 -22149489 -9932281 5732554 24350959 44662903
9895D4662903K0149035J8000352J4300726R864657N542451J934019p08978k417335
$$ 44662903 64811938 82812290 97113016 106977673 112520124 114454143 113745165 111327830
9887A11327830l376738l815064l929851l857314l677181l437384l177161k936061
$$ 111327830 107951092 104136028 100206177 96348863 92671682 89234298 86057137 83121076
9879H3121076k749607k639307k605469k629318k683402k741456k780646k779421
$$ 83121076 80371469 77732162 75126693 72497375 69813973 67072517 64291871 61512450
9871F1512450k718527k585919k379580k105526j774952j404440j018343o50193
$$ 61512450 58793923 56208004 53828424 51722898 49947946 48543506 47525163 46874970
9863D6874970l40906j32377n6238j21430l07856n71329q57887j119358j322304
$$ 46874970 46534064 46401687 46345449 46224019 45916163 45344834 44486947 43367589 42045285
9854D2045285j448712j493258j462082j372057j245735j102237r51616p99232
$$ 42045285 40596573 39103315 37641233 36269176 35023441 33921204 32969588 32170356
9846C2170356o56226n45040m93101n18306o16612p60971r13806j045272j143563
$$ 32170356 31514130 30969090 30475989 29957683 29341071 28580100 27666294 26621022 25477459
9837B5477459j208683j236075j206661j094211q84356n88995k44425J04570M22161
$$ 25477459 24268776 23032701 21826040 20731829 19847473 19258478 19014053 19118623 19540784
9828A9540784O89758R04488J074606J215506J342839J459648J544105J550090
$$ 19540784 20230542 21135030 22209636 23425142 24767981 26227629 27771734 29321824
9820B9321824J425536J139764P04589J78552l48139p82838j062664j175543j160180
$$ 29321824 30747360 31887124 32591713 32770265 32422126 31639288 30576624 29401081 28240901
9811B8240901j085568j020565j008140j055823j144980j249782j350445j431519
$$ 28240901 27155333 26134768 25126628 24070805 22925825 21676043 20325598 18894079
9803A8894079j471271j437701j300114j048036p00090k94511J28796N37470R01784
$$ 18894079 17422808 15985107 14684993 13636957 12936867 12642356 12771152 13308622 14210406
9794A4210406J187248J358213J391893J290174J080338Q06783N19615K61721N5118
$$ 14210406 15397654 16755867 18147760 19437934 20518272 21325055 21844670 22106391 22161509
9785B2161509j07883k60991m46526o92133r93498j312196j590100j772527j827248
$$ 22161509 22053626 21792635 21346109 20653976 19660478 18348282 16758182 14985655 13158407
9776A3158407j750941j564940j307384j025240p64997n62019m32558l71855l57585
$$ 13158407 11407466 9842526 8535142 7509902 6744905 6182886 5750328 5378473 5020888
9767E020888l55704l27444k37456o2489K01140N33722Q94628J232978J504431
$$ 5020888 4665184 4337740 4100284 4037795 4238935 4772657 5667285 6900263 8404694
9758H404694J686746J785453J825684J834767J826385J796307J731721J625649
$$ 8404694 10091440 11876893 13702577 15537344 17363729 19160036 20891757 22517406
9750B2517406J483775J317710J131063R12013O40782L07557p3126m62974q15241
$$ 22517406 24001181 25318891 26449954 27361967 28002749 28310306 28237180 27774206 26958965
9741B6958965j094162j287055j405070j475996j534563j613031j732126j892892
$$ 26958965 25864803 24577748 23172678 21696682 20162119 18549088 16816962 14924070
9733A4924070k072761k230816k323493k323858k232465k072821j875953j665157
$$ 14924070 12851309 10620493 8297000 5973142 3740677 1667856 -208097 -1873254
9725a873254j448369j218691r60957o62976l27737K0608L42571N98948P67862
$$ -1873254 -3321623 -4540314 -5501271 -6164247 -6491984 -6471376 -6128805 -5529857 -4761995
9716d761995Q54907Q92373R27699J005187J148623J352933J587773J808707J968487
$$ -4761995 -3907088 -3014715 -2087016 -1081829 66794 1419727 3007500 4816207 6784694
9707F784694K024838J946410J719859J356809Q95197L90779r8163n24130q55071
$$ 6784694 8809532 10755942 12475801 13832610 14727807 15118586 15020423 14496293 13641222
9698A3641222j072076j166672j140870j007157p85612n00321j78659J48008M47245
$$ 13641222 12569146 11402474 10261604 9254447 8468835 7968514 7789855 7937863 8385108
9689H385108O92869Q70809R78219J018020R95120R16752P94284O44531M91219
$$ 8385108 9077977 9948786 10927005 11945025 12940145 13856897 14651181 15295712 15786931
9680A5786931L65620L01797L23815M30608N89400P44545Q38889Q37158P39989
$$ 15786931 16152551 16454348 16778163 17208771 17798171 18542716 19381605 20218763 20958752
9671B0958752N81987M15441K88331K26777K28088K65457L02072L09085K78006
$$ 20958752 21540739 21956180 22244511 22471288 22699376 22964833 23266905 23575990 23853996
9662B3853996K19329J48422P0863j9635j28751k45815l39284l69810l14479j87393
$$ 23853996 24073325 24221747 24292610 24272975 24144224 23898409 23559125 23189315 22874836 22687443
9652B2687443m2165M7983K2392j41796m26124p87747j180649j564472j898891
$$ 22687443 22645278 22693261 22715653 22573857 22147733 21359986 20179337 18614865 16715974
9643A6715974k136706k228889k140279j862828j417812q51579k32576L53390Q20141
$$ 16715974 14579268 12350379 10210100 8347272 6929460 6077881 5845305 6198695 7018836
9634G018836J110489J220216J196516J109544J016278R39155Q67886P77219O46965
$$ 7018836 8129325 9349541 10546057 11655601 12671879 13611034 14478920 15256139 15903104
9625A5903104M73795K72225O8837j05471k24621k78428k81141k69418k87722l69429
$$ 15903104 16376899 16649124 16717961 16612490 16387869 16109441 15828300 15558882 15271160 14901731
9615A4901731n23438p29158r39362j093380j141399j069118r05062p03964n18812
$$ 14901731 14378293 13649135 12709773 11616393 10474994 9405876 8500814 7796850 7278038
9606G278038l80508k93708k45007k15937j94173j77581j69403j69697j71221j62780
$$ 7278038 6897530 6603822 6358815 6142878 5948705 5771124 5601721 5432024 5260803 5098023
9596E098023j36333r2489m1037M468L6035N8051Q5142J31936K03548K94036L91461
$$ 5098023 4961690 4869201 4828164 4832632 4868667 4926718 5011860 5143796 5347344 5641380 6032841
9585F032841M83042N57304O04909O19455N96849N33095M24477K73928R9930o2251
$$ 6032841 6515883 7073187 7678096 8297551 8894400 9427495 9851972 10125900 10225830 10163579
9575A0163579j73312k09950j76498r8148j111J04593K27500L82090N71722P79160
$$ 10163579 9990267 9780317 9603819 9505671 9504560 9609153 9836653 10218743 10790465 11569625
9565A1569625R70106J105024J149627J078841Q77685N44863R9006m18822r51318
$$ 11569625 12539731 13644755 14794382 15873223 16750908 17295771 17394777 16975955 16024637
9556A6024637j438108j829105k091652k209084k174199j984983j648190j188986
$$ 16024637 14586529 12757424 10665772 8456688 6282489 4297506 2649316 1460330
9548A460330o58166j28350L22924O36685P90694Q02070P13419N71956M13443K56042
$$ 1460330 802164 673814 996738 1633423 2424117 3226187 3939606 4511562 4925005 5181047
9538E181047J02279n4220k19667l92692n63236p18168q49076r57035j052268j148417
$$ 5181047 5283326 5229106 5009439 4616747 4053511 3335343 2486267 1529232 476964 -671453
9528f71453j252802j357496j438415j464654j412466j274989j063214p99324n06831
$$ -671453 -1924255 -3281751 -4720166 -6184820 -7597286 -8872275 -9935489 -10734813 -11241644
9519a1241644k02857J03501M07502P04432R88131J251686J488234J691874J859582
$$ -11241644 -11444501 -11341000 -10933498 -10229066 -9240935 -7989249 -6501015 -4809141 -2949559
9510b949559J993245K100295K192033K279055K364071K435642K468148K428886
$$ -2949559 -956314 1143981 3336014 5615069 7979140 10414782 12882930 15311816
9502A5311816K287764K025777J643521J169560O61095J89451j85311m35123n67089
$$ 15311816 17599580 19625357 21268878 22438438 23099533 23288984 23103673 22668550 22101461
9493B2101461o08883n87136n13183l86167k11561j9883J31684J78472P6113j79393
$$ 22101461 21492578 20905442 20392259 20006092 19794531 19774648 19906332 20084804 20160917 19981524
9483A9981524n47992r58662j333836j614433j773023j810521j743853j595975
$$ 19981524 19433532 18474870 17141034 15526601 13753578 11943057 10199204 8603229
9475H603229j392674j162909r38641p52546o33117n97733o47226p66260r29354
$$ 8603229 7210555 6047646 5109005 4356459 3723342 3125609 2478383 1712123 782769
9466G82769j106725j264829j363731j359574j218147r34706n45439j17470K80631
$$ 782769 -323956 -1588785 -2952516 -4312090 -5530237 -6464943 -7010382 -7127852 -6847221
9457f847221O09529Q70371J090284J294416J484533J636707J716381J698588J580784
$$ -6847221 -6237692 -5367321 -4277037 -2982621 -1498088 138619 1855000 3553588 5134372
9448E134372J383198J139867Q86364O48977M38214K48896O6943j20476l16430
$$ 5134372 6517570 7657437 8543801 9192778 9630992 9879888 9946831 9826355 9509925
9439I509925n10913o83527q11176q77896q81977q35991p59493o69266n73143m70674
$$ 9509925 8999012 8315485 7504309 6626413 5744436 4908445 4148952 3479686 2906543 2435869
9429B435869l59248k41073j26140k9397L5368O0896M9220J2343k9543n3988m5904
$$ 2435869 2076621 1835548 1709408 1680011 1715379 1776275 1825495 1837838 1808295 1754307 1708403
9418A708403n882M8472Q9326Q9548L3700p2941j99869k95967l06155j95580L0321
$$ 1708403 1702521 1750993 1840319 1929867 1963567 1890626 1690757 1394790 1088635 893055 923376
9407I23376L21303N97143P75820Q02570O67435M04994P8797k40404m93676o45516
$$ 923376 1244679 1841822 2617642 3420212 4087647 4492641 4571438 4331034 3837358 3191842
9397C191842o87614o35659n20274l74855k24955q4061M2307J47081K14148K20896
$$ 3191842 2504228 1868569 1348295 973440 748485 664424 706731 853812 1067960 1288856
9387A288856J53055K3188j22579k19476k14132q9928J28482L89621O33362Q01907
$$ 1288856 1441911 1465099 1342520 1123044 908912 818984 947466 1337087 1970449 2772356
9377B772356Q47174P42540M95849J49962k36058o13905r61162j275061j553567
$$ 2772356 3619530 4362070 4857919 5007881 4771823 4157918 3196756 1921695 368128
9368C68128j780926j928413j967900j887067j695581j419942j092901p45470m05009
$$ 368128 -1412798 -3341211 -5309111 -7196178 -8891759 -10311701 -11404602 -12150072 -12555081
9359a2555081r7283J51868L18236L84913L49508K28817N7685j18067k52362l10415
$$ -12555081 -12652364 -12500496 -12182260 -11797347 -11447839 -11219022 -11161337 -11279404 -11531766 -11842181
9349a1842181k78440j68568j6590J28162K19331K32100J75395Q8359J9079l000
$$ -11842181 -12120621 -12289189 -12305779 -12177617 -11958286 -11726186 -11550791 -11462432 -11443353 -11446353
9339a1446353J7700N0652O3804M6716J6539M414L4462J12110K28951L75124N44065
$$ -11446353 -11428653 -11378001 -11314197 -11267481 -11250942 -11246528 -11212066 -11099956 -10871005 -10495881 -9951816
9328i951816P24981Q94567J021778J085389J089594J064061J049091J077928J166407
$$ -9951816 -9226835 -8332268 -7310490 -6225101 -5135507 -4071446 -3022355 -1944427 -778020
9319g78020J310226J484470J644440J732973J697996J514217J196022P93000L70714
$$ -778020 532206 2016676 3661116 5394089 7092085 8606302 9802324 10595324 10966038
9310A0966038j2755l24101n60428p42783r01513j060256j225223j382860j504923
$$ 10966038 10953283 10629182 10068754 9325971 8424458 7364202 6138979 4756119 3251196
9301C251196j557738j512454j353772j085065p28129l17887J05137N00721Q32642
$$ 3251196 1693458 181004 -1172768 -2257833 -2985962 -3303849 -3198712 -2697991 -1865349
9292a865349J073259J210071J249564J212333J121671R95329Q46657O89832N39406
$$ -1865349 -792090 417981 1667545 2879878 4001549 4996878 5843535 6533367 7072773
9283G072773M02352K71210J26783n0330k67031n10671p49982r43525j053491j059847
$$ 7072773 7475125 7746335 7873118 7822788 7555757 7045086 6295104 5351579 4298088 3238241
9273C238241r67849q04905o09846m21009k67038j60749r7764o3172m4438m0879
$$ 3238241 2270392 1465487 855641 434632 167594 6845 -90919 -154091 -198529 -239408
9263b39408o1071j11614j89059k81675l75854m59092n18965n43778n27995m78637
$$ -239408 -300479 -412093 -601152 -882827 -1258681 -1717773 -2236738 -2780516 -3308511 -3787148
9253c787148m15710l63607l38342l40592l60316l87655m18578m50467m74490m74517
$$ -3787148 -4202858 -4566465 -4904807 -5245399 -5605715 -5993370 -6411948 -6862415 -7336905 -7811422
9243g811422m34637l50001k34212j17967l6792j2998m4393j08964j80595k41539
$$ -7811422 -8246059 -8596060 -8830272 -8948239 -8985031 -8998029 -9042422 -9151386 -9331981 -9573520
9233i573520k83496l02032k92640k51175j76564p3971M3170J54994K41707K91077
$$ -9573520 -9857016 -10159048 -10451688 -10702863 -10879427 -10953398 -10910228 -10755234 -10513527 -10222450
9223a0222450L01934K83217K51465K27795K32121K74141L45959M23361M77486
$$ -10222450 -9920516 -9637299 -9385834 -9158039 -8925918 -8651777 -8305818 -7882457 -7404971
9214g404971M90414M64036M15882L65353L21226K79903K34673J87012J49861J40550
$$ -7404971 -6914557 -6450521 -6034639 -5669286 -5348060 -5068157 -4833484 -4646472 -4496611 -4356061
9204d356061J69843K35068L19875L98622M44052M37809L79701K87893J87625R7202
$$ -4356061 -4186218 -3951150 -3631275 -3232653 -2788601 -2350792 -1971091 -1683198 -1495573 -1398371
9194a398371K3496l0737n7397m2063K7409J50378L09713M78237O30684P51678
$$ -1398371 -1374875 -1405612 -1463009 -1505072 -1477663 -1327285 -1017572 -539335 91349 843027
9184H43027Q33758Q70144Q52693P78868O59704N19430L87199K88653K41541K53126
$$ 843027 1676785 2546929 3399622 4178490 4838194 5357624 5744823 6033476 6275017 6528143
9174F528143L17933M18282N29252O24717O80724O77435O02790M56663K51177O653
$$ 6528143 6846076 7264358 7793610 8418327 9099051 9776486 10379276 10835939 11087116 11093769
9164A1093769k51807m94308o87355q02330q28617p80645o91511n97155n21833
$$ 11093769 10841962 10347654 9660299 8857969 8029352 7248707 6557196 5960041 5438208
9155E438208m72744m44872m32159m37818m75648n59376o87125q33379r54789j005597
$$ 5438208 4965464 4520592 4088433 3650615 3174967 2615591 1928466 1095087 140298 -865299
9145h65299r54144p94846n52291k74250j3879J91109L30731M20602M89161N62708
$$ -865299 -1819443 -2614289 -3166580 -3440830 -3454709 -3263600 -2932869 -2512267 -2023106 -1460398
9135a460398O54664P61484Q65315R42003R71524R46645Q75877P78745O74711N70284
$$ -1460398 -805734 -44250 821065 1763068 2734592 3681237 4557114 5335859 6010570 6580854
9125F580854M51170K85689M1233k92872o89880j089877j423696j642374j734024
$$ 6580854 7032024 7317713 7358946 7066074 6376194 5286317 3862621 2220247 486223
9116D86223j719501j632445j497796j322123j099832q28192n18046j92139J25909
$$ 486223 -1233278 -2865723 -4363519 -5685642 -6785474 -7613666 -8131712 -8323851 -8197942
9107h197942M22497O98176R63820J230163J494071J729699J893723J944424J861599
$$ -8197942 -7775445 -7077269 -6113449 -4883286 -3389215 -1659516 234207 2178631 4040230
9098D040230J652688J343085R61822N34754Q8432l41027p03202r40448j007813
$$ 4040230 5692918 7036003 7997825 8532579 8621011 8279984 7576782 6636334 5628521
9089E628521q96289o43593l22647j3304K26048L72706M36057M41762M13170L59339
$$ 5628521 4732232 4088639 3765992 3752688 3978736 4351442 4787499 5229261 5642431 6001770
9079F001770K75514J54106l264j82449l63797n32819o86120q29126r68119j102320
$$ 6001770 6277284 6431390 6428126 6245677 5881880 5349061 4662941 3833815 2865696 1763376
9069A763376j220962j306462j340293j307873j202126j027159q00373n48829k99906
$$ 1763376 542414 -764048 -2104341 -3412214 -4614340 -5641499 -6441872 -6990701 -7290607
9060g290607p2956J21836K78816L92781M58585M73217M39573L71893K98935K57619
$$ -7290607 -7363563 -7241727 -6962911 -6570130 -6111545 -5638328 -5198755 -4826862 -4527927 -4270308
9050d270308K76459L59320M82411O06420O93928P21571O83894N91483M65504L29572
$$ -4270308 -3993849 -3634529 -3152118 -2545698 -1851770 -1130199 -446305 145178 610682 940254
9040I40254K01575R0298m36o3892q7221n7949K4556J42994K66399L59498L90103
$$ 940254 1141829 1232127 1231691 1167799 1080578 1022629 1047185 1190179 1456578 1816076 2206179
9029B206179L34709J86543l5863k89063n18932o81537p58114p58345p14794o73004
$$ 2206179 2540888 2727431 2691568 2402505 1883573 1202036 443922 -314423 -1029217 -1702221
9019a702221o78893p64301r34147j160683j389770j560005j627979j586719j465455
$$ -1702221 -2381114 -3145415 -4079562 -5240245 -6630015 -8190020 -9817999 -11404718 -12870173
9010a2870173j309854j154338j003349q33591o17053l50205o7268J75358L33309
$$ -12870173 -14180027 -15334365 -16337714 -17171305 -17788358 -18138563 -18205831 -18030473 -17697164
9001a7697164M00606M09568M09937M46740N48240P20877R46464J185083J388256
$$ -17697164 -17296558 -16886990 -16477053 -16030313 -15482073 -14761196 -13814732 -12629649 -11241393
8992a1241393J517516J557108J515458J419570J307828J220895J188970J218980
$$ -11241393 -9723877 -8166769 -6651311 -5231741 -3923913 -2703018 -1514048 -295068
8984b95068J289262J356276J371340J301593J147351R46441P59188O39174O07287
$$ -295068 994194 2350470 3721810 5023403 6170754 7117195 7876383 8515557 9122844
8975I122844O45750P12998P64580P65563O92894N36079L01715J8162k67536n03791
$$ 9122844 9768594 10481592 11246172 12011735 12704629 13240708 13542423 13560585 13293049 12789258
8965A2789258o54557p15615p18741p20708p79938r29092j156496j408921j617490
$$ 12789258 12134701 11419086 10700345 9979637 9199699 8270607 7114111 5705190 4087700
8956D087700j731459j736929j649569j492458j280125j019022p17451l92354o7589
$$ 4087700 2356241 619312 -1030257 -2522715 -3802840 -4821862 -5539313 -5931667 -5999256
8947e999256K33592M96773P20709R13606J081696J218318J304602J323709J277008
$$ -5999256 -5765664 -5268891 -4548182 -3634576 -2552880 -1334562 -29960 1293749 2570757
8938B570757J188030J092013J021039R94532J015760J070593J128695J149916
$$ 2570757 3758787 4850800 5871839 6866371 7882131 8952724 10081419 11231335
8930A1231335J094797R33999O53926K60525k17290p27308j200012j560540j743836
$$ 11231335 12326132 13260131 13914057 14174582 13957292 13229984 12029972 10469432 8725596
8921H725596j710179j456860j019748m61636J47365P46847J293340J757971K119260
$$ 8725596 7015417 5558557 4538809 4077173 4224538 4971385 6264725 8022696 10141956
8912A0141956K356447K447802K375892K137327J751015J259217P19252J88211
$$ 10141956 12498403 14946205 17322097 19459424 21210439 22469656 23188908 23377119
8904B3377119k92379p03555j044322j321021j539825j705141j818826j876215
$$ 23377119 23084740 22381185 21336863 20015842 18476017 16770876 14952050 13075835
8896A3075835j862595j756929j543862j227198q36217m21122l9899K57606M42884
$$ 13075835 11213240 9456311 7912449 6685251 5849034 5427912 5388013 5645619 6088503
8887F088503N15807N04023M54506M18492M33769N10828O29851P52397Q43613Q91604
$$ 6088503 6604310 7108333 7562839 7981331 8415100 8925928 9555779 10308176 11151789 12043393
8877A2043393R08525R10645Q93854Q27235O71767M09041N8267l27990o83693r52642
$$ 12043393 12951918 13862563 14756417 15583652 16255419 16664460 16722727 16394737 15711044 14758402
8867A4758402j104332j136082j062839r04324o79856m11999j31166J25738L21486
$$ 14758402 13654070 12517988 11455149 10550825 9870969 9458970 9327804 9453542 9775028
8858I775028M24533M14076K86859O4825k04425m61470o58590p76812q22776q08723
$$ 9775028 10199561 10613637 10900496 10965321 10760896 10299426 9640836 8864024 8041248 7232525
8848G232525p33884n83465l44676k5651L36340O80753R38883J052085R88407P53288
$$ 7232525 6498641 5915176 5570500 5544849 5881189 6561942 7500825 8552910 9541317 10294605
8838A0294605L89494l5624m51029q00936j053524j198906j242154j196213j076406
$$ 10294605 10684099 10648475 10197446 9396510 8342986 7144080 5901926 4705713 3629307
8829C629307q98153o80163m50559k47392j07742n0993o9126j31783k03027k60806
$$ 3629307 2731154 2050991 1600432 1353040 1245298 1194305 1125179 993396 790369 529563
8819E29563l10010l82090n18980p48345j064732j428132j778643k055287k208086
$$ 529563 219553 -162537 -681517 -1429862 -2494594 -3922726 -5701369 -7756656 -9964742
8810i964742k202539k022843j677702j204011o60804j13795L79653P76770J049505
$$ -9964742 -12167281 -14190124 -15867826 -17071837 -17732641 -17846436 -17466783 -16690013 -15640508
8801a5640508J186337J196743J111429R74400Q30575P13605O35256N80220N14917
$$ -15640508 -14454171 -13257428 -12145999 -11171599 -10341024 -9627419 -8992163 -8411943 -7897026
8792g897026M11452K70653J23068N875o2709q9036q9213p2415l8225J2905O9098
$$ -7897026 -7485574 -7214921 -7091853 -7085978 -7148687 -7237723 -7326936 -7399351 -7437576 -7424671 -7355573
8781g355573J07511J06789O2470o575o7388r3421q2312n7528n2136q7161j60721
$$ -7355573 -7248062 -7141273 -7078803 -7085378 -7152766 -7246187 -7328499 -7386027 -7438163 -7525324 -7686045
8770g686045k53726l43123m09675m36913m09493l19068j75197j0786J25456J87042
$$ -7686045 -7939771 -8282894 -8692569 -9129482 -9538975 -9858043 -10033240 -10044026 -9918570 -9731528
8760i731528J48907J8514j65875l48975m78258n21014m71958l50426j90384k7366
$$ -9731528 -9582621 -9564107 -9729982 -10078957 -10557215 -11078229 -11550187 -11900613 -12090997 -12118363
8750a2118363J14393K30142L33304M43832N72572P11544Q35816R14645R24680
$$ -12118363 -12003970 -11773828 -11440524 -10996692 -10424120 -9712576 -8876760 -7962115 -7037435
8741g037435Q59474P33133N78022M36027L43972L17672L43532L85355M05248L86649
$$ -7037435 -6177961 -5444828 -4866806 -4430779 -4086807 -3769135 -3425603 -3040248 -2635000 -2248351
8731b248351L44836L18789L50793M65230O54300Q73559J050425J108105R99041
$$ -2248351 -1903515 -1584726 -1233933 -768703 -114403 759156 1809581 2917686 3916727
8722C916727P29786L59052l1482l72569o24932p73575q14095p48263n90941l76518
$$ 3916727 4646513 5005565 4974083 4601514 3976582 3203007 2388912 1640649 1049708 673190
8712F73190j53710L0908J50477K05239K15258K03459J80769J44169Q8942K4758
$$ 673190 519480 550388 700865 906104 1121362 1324821 1505590 1649759 1738701 1763459
8702A763459j8656k725R8856K83622N18767P53408R35047J021472R86286Q22131
$$ 1763459 1744803 1742078 1840934 2124556 2643323 3396731 4331778 5353250 6339536 7161667
8692G161667N44648J94201j70727m90328p22739q53717q91250q51859p50850o02443
$$ 7161667 7706315 7900516 7729789 7239461 6516722 5663005 4771755 3919896 3169046 2566603
8682B566603m25798k48579j03151j6182K502l5722j04639j75999k29018k51248
$$ 2566603 2140805 1892226 1789075 1772893 1775395 1739673 1635034 1459035 1230017 978769
8672I78769k34726j74533p0644P2224K49780M64095P22772J028921J367553J697754
$$ 978769 744043 569510 498866 571090 820870 1284965 2007737 3036658 4404211 6101965
8662F101965J956805K075354J998177J703911J216838O03658m6544o49742j145962
$$ 6101965 8058770 10134124 12132301 13836212 15053050 15656708 15610164 14960422 13814460
8653A3814460j501902j703910j752271j659076j445359j137096p64123l61996
$$ 13814460 12312558 10608648 8856377 7197301 5751942 4614846 3850723 3488727
8645C488727K8906L69575O29192P88154Q38985P87981O56009M75770K86653J29891
$$ 3488727 3517633 3887208 4516400 5304554 6143539 6931520 7587529 8063299 8349952 8479843
8635H479843M2854M9705J50767L18198N03675O56026P39727P44797O84626N86671
$$ 8479843 8522697 8572402 8723169 9041367 9545042 10201068 10940795 11685592 12370218 12956889
8625A2956889M83688M07278L79971M05583M65366N26076N55255N33083M56193
$$ 12956889 13440577 13847855 14227826 14633409 15098775 15624851 16180106 16713189 17169382
8616A7169382L36741J99033P2115k0379o6418o4201j8914N5096J29558J66019
$$ 17169382 17506123 17705156 17777271 17756892 17690474 17626273 17607359 17662455 17792013 17958032
8606A7958032J32876K5609j26835k77112l86896m48722m89759n57585o97038r28835
$$ 17958032 18090908 18116517 17989682 17712570 17325674 16876952 16387193 15829608 15132570 14203735
8596A4203735j237802j574351j867760k045301k050626j857420j476279r53072
$$ 14203735 12965933 11391582 9523822 7478521 5427895 3570475 2094196 1141124
8588A141124l59210K21486P04685J017307J113305R90826O98997L24830l5888
$$ 1141124 781914 1003400 1708085 2725392 3838697 4829523 5528520 5853350 5817462
8579E817462l08845m59489m95215m53926l83781l20553k71511k14277j12873N6771
$$ 5817462 5508617 5049128 4553913 4099987 3716206 3395653 3124142 2909865 2796992 2853763
8569B853763K87223N38762P57608Q99659R44733Q97342P80934O31679M90567L91458
$$ 2853763 3140986 3679748 4437356 5337015 6281748 7179090 7960024 8591703 9082270 9473728
8559I473728L49701L59865M03966M61859N15749N49297N46792M93841L77600J87834
$$ 9473728 9823429 10183294 10587260 11049119 11564868 12114165 12660957 13154798 13532398 13720232
8549A3720232p6132l93535p16583r81828j135444j156598j065022r10746p53544
$$ 13720232 13644100 13250565 12533982 11552154 10416710 9260112 8195090 7284344 6530800
8540F530800o41703n98537o21792o94453p98449r21967j057695j196836j325804
$$ 6530800 5889097 5290560 4668768 3974315 3175866 2253899 1196204 -632 -1326436
8531a326436j429513j500227j545812j589282j655925j754011j862265j934354
$$ -1326436 -2755949 -4256176 -5801988 -7391270 -9047195 -10801206 -12663471 -14597825
8523a4597825j919301j786093j538667j214317q67777n49487k87574q1263R0541
$$ -14597825 -16517126 -18303219 -19841886 -21056203 -21923980 -22473467 -22761041 -22842304 -22751763
8514b2751763K49502L99274N22265N94701O07148N72473N15541M56214M01624
$$ -22751763 -22502261 -22102987 -21580722 -20986021 -20378873 -19806400 -19290859 -18834645 -18433021
8505a8433021L51639L07628K73980K52708K39854K29129K18992K15703K29427
$$ -18433021 -18081382 -17773754 -17499774 -17247066 -17007212 -16778083 -16559091 -16343388 -16113961
8496a6113961K66472L22769L83105M28494M48786M51076M55919M84346N48045
$$ -16113961 -15847489 -15524720 -15141615 -14713121 -14264335 -13813259 -13357340 -12872994 -12324949
8487a2324949O49675P87365R54174J133477J299125J423971J490563J496012J448426
$$ -12324949 -11675274 -10887909 -9933735 -8800258 -7501133 -6077162 -4586599 -3090587 -1642161
8478a642161J356580J217449J010594P08478K99691j92872p15910j208892j626903
$$ -1642161 -285581 931868 1942462 2650940 2950631 2757759 2041849 832957 -793946
8469g93946j947632k165344k284675k320609k299710k254720k211709k177046
$$ -793946 -2741578 -4906922 -7191597 -9512206 -11811916 -14066636 -16278345 -18455391
8461a8455391k133420k048748j892977j652416j333610r56650n44780j17544L10262
$$ -18455391 -20588811 -22637559 -24530536 -26182952 -27516562 -28473212 -29017992 -29135536 -28825274
8452b8825274P26571J120524J481695J797244K046051K195274K207844K062614
$$ -28825274 -28098703 -26978179 -25496484 -23699240 -21653189 -19457915 -17250071 -15187457
8444a5187457J775378J402657J020796O92995M47335K79178J71179J12571J04574
$$ -15187457 -13412079 -12009422 -10988626 -10295631 -9848296 -9569118 -9397939 -9285368 -9180794
8435i180794J52426K53431L90272N33162O48277P07042O92084N99653M40772K41428
$$ -9180794 -9028368 -8774937 -8384665 -7851503 -7203226 -6496184 -5804100 -5204447 -4763675 -4522247
8425d522247L9615j22321k07667j93658p6032J29838L90879O62471Q99509J070478
$$ -4522247 -4482632 -4604953 -4812620 -5006278 -5082310 -4952472 -4561593 -3899122 -2999613 -1929135
8415a929135J168503J211556J228719J240263J246860J236381J199767J138400
$$ -1929135 -760632 450924 1679643 2919906 4166766 5403147 6602914 7741314
8407G741314J056211R47809P98336N96863L50365Q5755j60375l54924m75662n11033
$$ 7741314 8797525 9745334 10543670 11140533 11490898 11576653 11416278 11061354 10585692 10074659
8397A0074659m56790l15003r7203J71527M52743P01536Q77981R58551R42790Q51674
$$ 10074659 9617869 9302866 9205663 9377190 9829933 10531469 11409450 12368001 13310791 14162465
8387A4162465P16834N64762M04266K24639N689k66219n84855r19917j223179j441717
$$ 14162465 14879299 15444061 15848327 16072966 16078655 15812436 15227581 14307664 13084485 11642768
8377A1642768j532894j476325j279439r75352o14612k54948M7564K45824L08873
$$ 11642768 10109874 8633549 7354110 6378758 5764146 5509198 5556762 5802586 6111459
8368F111459K27207J2212l10676p08960j144177j569027j928650k170812k260523
$$ 6111459 6338666 6350878 6040202 5331242 4187065 2618038 689388 -1481424 -3741947
8359c741947k190261j980132j669010j302553r24508n73891k84589q1203K9714
$$ -3741947 -5932208 -7912340 -9581350 -10883903 -11808411 -12382302 -12666891 -12748094 -12718380
8350a2718380O5951O4755O5986R2383J38102J71149J47976L4131j77078m56165
$$ -12718380 -12652429 -12587674 -12521688 -12429305 -12291203 -12120054 -11972078 -11937947 -12115025 -12571190
8340a2571190p44404r74131j092415j076353r34546o98802m14163j31450R9127
$$ -12571190 -13315594 -14289725 -15382140 -16458493 -17393039 -18091841 -18506004 -18637454 -18538327
8331a8538327K35579K51723J41716p9424l78156p07047j012277j243627j364457
$$ -18538327 -18302748 -18051025 -17909309 -17988733 -18366889 -19073936 -20086213 -21329840 -22694297
8322b2694297j358544j231166j003305p01850l52946J5538L66239O51162Q24660
$$ -22694297 -24052841 -25284007 -26287312 -26989162 -27342108 -27326570 -26960331 -26309169 -25484509
8313b5484509Q63627P79593O14409M24418K63300J69840J61678K35168L70949
$$ -25484509 -24620882 -23841289 -23226880 -22802462 -22539162 -22369322 -22207644 -21972476 -21601527
8304b1601527N42867P26476R04450J067737J212299J332932J418401J452302J420221
$$ -21601527 -21058660 -20332184 -19427734 -18359997 -17147698 -15814766 -14396365 -12944063 -11523842
8295a1523842J318684J159870R68609P72827N92685M34804K94386J62351L2292
$$ -11523842 -10205158 -9045288 -8076679 -7303852 -6711167 -6276363 -5981977 -5819626 -5787334
8286e787334r5416k12206l03302l54322l60165l29975k83892k44292k27611k40302
$$ -5787334 -5882750 -6094956 -6398258 -6752580 -7112745 -7442720 -7726612 -7970904 -8198515 -8438817
8276h438817k78627l30908l80344m05837l80235k70668m7675K96974P33989J195318
$$ -8438817 -8717444 -9048352 -9428696 -9834533 -10214768 -10485436 -10533111 -10236137 -9502148 -8306830
8266h306830J593184J851066J928992J828614J578160J212812P67272K82392j88019
$$ -8306830 -6713646 -4862580 -2933588 -1104974 473186 1685998 2453270 2735662 2547643
8257B547643n83083q51226r63739r16436p22122m02173J7851N08948J037965J566379
$$ 2547643 1964560 1113334 149595 -766841 -1488963 -1891136 -1873285 -1364337 -326372 1240007
8247A240007K049278K436283K676923K730817K578669K227813J709594J072292
$$ 1240007 3289285 5725568 8402491 11133308 13711977 15939790 17649384 18721676
8239A8721676L75685l11091r12489j355593j585601j582113j367492j001566n64278
$$ 18721676 19097361 18786270 17873781 16518188 14932587 13350474 11982982 10981416 10417138
8230A0417138j34499K26383M81535O16148O27546N14065K71263j00175n81480
$$ 10417138 10282639 10509022 10990557 11606705 12234251 12748316 13019579 12919404 12337924
8221A2337924j129655j683264k174602k540839k733119k726439k529965k192466
$$ 12337924 11208269 9525005 7350403 4809564 2076445 -649994 -3179959 -5372425
8213e372425j796061j434286j178851j051162j018459j019770j003072r46697
$$ -5372425 -7168486 -8602772 -9781623 -10832785 -11851244 -12871014 -13874086 -14820783
8205a4820783q55183p42729o21945n02281l91219k93339k09004j35364o8365k853
$$ -14820783 -15675966 -16418695 -17040640 -17542921 -17934140 -18227479 -18436483 -18571847 -18640212 -18643065
8195a8643065O8915J56329K63910L82113M84029N35029N11671M16393K75984J24851
$$ -18643065 -18574150 -18417821 -18153911 -17771798 -17287769 -16752740 -16241069 -15824676 -15548692 -15423841
8185a5423841j3598j33582k38561l26976l85411l95346l47377k49885j24426O836
$$ -15423841 -15437439 -15571021 -15809582 -16136558 -16521969 -16917315 -17264692 -17514577 -17639003 -17632167
8175a7632167J28952K30873K98075L13880K72699J92913J13008O8956O9938R3432
$$ -17632167 -17503215 -17272342 -16974267 -16660387 -16387688 -16194775 -16081767 -16012811 -15942873 -15849441
8165a5849441J04355Q2836L9987J2304M0095J43736L11811N08444O94864Q49340
$$ -15849441 -15745086 -15662250 -15622263 -15609959 -15569864 -15426128 -15114317 -14605873 -13911009 -13061669
8155a3061669R70623J063744J121663J118745J022142Q13751N07959J52653j87579
$$ -13061669 -12091046 -11027302 -9905639 -8786894 -7764752 -6951001 -6443042 -6290389 -6477968
8146f477968m54751o12752o49098n68516l85868j20889K05194N68950R38622J268223
$$ -6477968 -6932719 -7545471 -8194569 -8763085 -9148953 -9269842 -9064648 -8495698 -7557076 -6288853
8136f288853J501395J587875J503518J261157R07015N06474J25206j89563m21881
$$ -6288853 -4787458 -3199583 -1696065 -434908 472107 978581 1103787 914224 492343
8127D92343n86377p12181q20733r12256r67478r58825q61369o60504l58618J9548
$$ 492343 -94034 -806215 -1626948 -2539204 -3506682 -4465507 -5326876 -5987380 -6345998 -6326450
8117f326450M27945Q10018J114622J307743J374167J312558J132974Q61727N47772
$$ -6326450 -5898505 -5088487 -3973865 -2666122 -1291955 20603 1153577 2015304 2563076
8108B563076K58405N9251j1376M3876J89493L80770N87182Q01493J030693J276391
$$ 2563076 2821481 2880732 2869356 2913232 3102725 3483495 4070677 4872170 5902863 7179254
8098G179254J518735J714511J809149J754415J524650J128556O12590N0134m82929
$$ 7179254 8697989 10412500 12221649 13976064 15500714 16629270 17241860 17291994 16809065
8089A6809065r33254j280259j528289j691453j783050j812747j788097j717047
$$ 16809065 15875811 14595552 13067263 11375810 9592760 7780013 5991916 4274869
8081D274869j609729j478195j333906j185036j035774q87453p40345n96042m60761
$$ 4274869 2665140 1186945 -146961 -1331997 -2367771 -3255224 -3995569 -4591611 -5052372
8072e052372l47022k70061k39156k49830k83339l13582l14926k64770j42099P0425
$$ -5052372 -5399394 -5669455 -5908611 -6158441 -6441780 -6755362 -7070288 -7335058 -7477157 -7406732
8062g406732L75841P49106J132999J452028J638893J658034J513681J241282Q90395
$$ -7406732 -7030891 -6281785 -5148786 -3696758 -2057865 -399831 1113850 2355132 3245527
8053C245527N08535J31882k15922n20104p72022r70116j120457j230879j300214
$$ 3245527 3754062 3885944 3670022 3149918 2377896 1407780 287323 -943556 -2243770
8044b243770j313081j248164j094954q65121n89684l05593m2038J85776L74417
$$ -2243770 -3556851 -4805015 -5899969 -6765090 -7354774 -7660367 -7702405 -7516629 -7142212
8035g142212N25968O44134P36116Q16955R08843J031929J191405J369374J526368
$$ -7142212 -6616244 -5972110 -5235994 -4419039 -3510196 -2478267 -1286862 82512 1608880
8026A608880J612176J582956J419673J139736P94052M48589J59561m4558j66480
$$ 1608880 3221056 4804012 6223685 7363421 8157473 8606062 8765623 8721065 8554585
8017H554585k31462k75405l35537m42291o08947q22458j044758j228525j338572
$$ 8554585 8323123 8047718 7712181 7269890 6660943 5838485 4793727 3565202 2226630
8008B226630j364689j319996j230382j123439j020947r35318q69460q18428p70670
$$ 2226630 861941 -458055 -1688437 -2811876 -3832823 -4768141 -5637601 -6456029 -7226699
7999g226699p09091o14944m75241k89025o7529J70754M04133O07628P51915Q06630
$$ -7226699 -7935790 -8550734 -9025975 -9315000 -9382529 -9211775 -8807642 -8200014 -7448099 -6641469
7989f641469P48344N67725K70516j26124n94177j088597j542051j873508k013098
$$ -6641469 -5893125 -5325400 -5054884 -5181008 -5775185 -6863782 -8405833 -10279341 -12292439
7980a2292439j929210j639762j202322o92681j84206K66262O25506Q84193J051746
$$ -12292439 -14221649 -15861411 -17063733 -17756414 -17940620 -17674358 -17048852 -16164659 -15112913
7971a5112913J149798J207688J258444J330909J438067J568656J690091J762718
$$ -15112913 -13963115 -12755427 -11496983 -10166074 -8728007 -7159351 -5469260 -3706542
7963c706542J756570J660343J479642J229727R29619N99950K62297o2375l56506
$$ -3706542 -1949972 -289629 1190013 2419740 3349359 3949309 4211606 4149231 3792725
7954C792725o08669q14120r71388j075794j115183j073854r44318p38447m88720
$$ 3792725 3184056 2369936 1398548 322754 -792429 -1866283 -2810601 -3549048 -4037768
7945d037768k37976k4336J30406K24222K70526K89913L02953L26277L70093M34994
$$ -4037768 -4275744 -4300080 -4169674 -3945452 -3674926 -3385013 -3082060 -2755783 -2385690 -1950696
7935a950696N10145N76911O16518O15084N62642M51665K81475O5138j71438m02248
$$ -1950696 -1440551 -863640 -247122 367962 930604 1382269 1663744 1728882 1557444 1155196
7925A155196o16405q22135j034917j258465j472884j639374j719030j692927j569686
$$ 1155196 538791 -283344 -1318261 -2576726 -4049610 -5688984 -7408014 -9100941 -10670627
7916a0670627j376797j144297q93153o34059l73354j19119J17301L24380M94406
$$ -10670627 -12047424 -13191721 -14084874 -14718933 -15092287 -15211406 -15094105 -14769725 -14275319
7907a4275319O24903P17823P79599Q22303Q61422R07476R56705R89837R81798
$$ -14275319 -13650416 -12932593 -12152994 -11330691 -10469269 -9561793 -8605088 -7615251 -6633453
7898f633453R15414P90112O22377M40344K75618J54329Q9442P6201R1502R7444
$$ -6633453 -5718039 -4927927 -4305550 -3865206 -3589588 -3435259 -3345817 -3269616 -3178114 -3080670
7888c080670N0241q4874l16736o18483r33171j193953j347703j369084j260617
$$ -3080670 -3030429 -3115303 -3432039 -4050522 -4983693 -6177646 -7525349 -8894433 -10155050
7879a0155050j044490p54252m28790j05937J85902M34985O47229Q38810J023905
$$ -10155050 -11199540 -11953792 -12382582 -12488519 -12302617 -11867632 -11220403 -10381593 -9357688
7870i357688J205011J371913J508559J600825J638564J612610J512944J332859
$$ -9357688 -8152677 -6780764 -5272205 -3671380 -2032816 -420206 1092738 2425597
7862B425597J078171P76172M77798K48332J47211K04710M07156O98059R94354
$$ 2425597 3503768 4279940 4757738 5006070 5153281 5357991 5765147 6463206 7457560
7853G457560J210523J281982J180226R15344N26302O4127m24215r04006j349820
$$ 7457560 8668083 9950065 11130291 12045635 12571937 12636064 12211849 11307843 9958023
$$ [...]
##END NTUPLES=NMR SPECTRUM
##END=
