##TITLE=31Pdec_LR-748-CR3-20
 CDCl3, 124 sc
 5.5.2022
##JCAMPDX= 6.0         $$ Bruker NMR JCAMP-DX V2.0
##DATA TYPE= NMR SPECTRUM
##DATA CLASS= NTUPLES
##ORIGIN= UXNMR, Bruker Analytische Messtechnik GmbH
##OWNER= root
$$ XWIN-NMR		Version 3.5
$$ Thu May  5 13:50:11 2022 Russian Standard Time (UT+4h)  she@DPX200
##.OBSERVE FREQUENCY= 81.013821
##.OBSERVE NUCLEUS= ^31P
##.ACQUISITION MODE= SIMULTANEOUS
##.ACQUISITION SCHEME= undefined
##.AVERAGES= 24
##.DIGITISER RES= 16
##SPECTROMETER/DATA SYSTEM= spect
##.PULSE SEQUENCE= zgpg30
##.SOLVENT NAME= CDCl3
##.SHIFT REFERENCE= (INTERNAL, CDCl3, 0, 248.564)
##AUDIT TRAIL= $$ (NUMBER, WHEN, WHO, WHERE, WHAT)
$$ ##TITLE= Audit trail, XWIN-NMR		Version 3.5
$$ ##JCAMPDX= 5.01
$$ ##ORIGIN= Bruker BioSpin GmbH
$$ ##OWNER= she
$$ F:/spectra/data/she/nmr/P31/1/pdata/1/auditp.txt
$$ ##AUDIT TRAIL=  $$ (NUMBER, WHEN, WHO, WHERE, WHAT)
(   1,<2022-05-05 13:48:48.10 +0400>,<she>,<DPX200>,
      <created by zg, POWCHK disabled, PULCHK disabled
       configuration hash MD5:
       00 E9 B6 7A A2 85 ED C7 34 08 36 98 17 FE 4E 26
       data hash MD5: 32K
       87 4A 15 BB 66 1F A2 75 CE ED 60 47 6F DE 8D DA>)
(   2,<2022-05-05 13:48:50.32 +0400>,<she>,<DPX200>,
      <Start of raw data processing
       efp BC_mod = 2 LB = 1 FT_mod = 6 PKNL = 1 PHC0 = -11680.1 PHC1 = 4427.648 SI = 64K 
       data hash MD5: 64K
       82 37 0A D7 4A 69 AE 68 1D D4 8F 50 4A A1 29 CF>)
(   3,<2022-05-05 13:49:18.32 +0400>,<she>,<DPX200>,
      <pk PHC0 = 1892.215 PHC1 = -4573.594 
       data hash MD5: 64K
       76 4E 84 50 70 6D 69 25 D4 0B EB C9 C7 D7 37 B7>)
(   4,<2022-05-05 13:49:30.14 +0400>,<she>,<DPX200>,
      <abs ABSG = 5 
       data hash MD5: 64K
       92 81 3D A6 38 1E 57 9C BF D8 1B B4 BB CB 9D 41>)
$$ ##END=
$$ 
$$ hash MD5
$$ 13 4F 79 00 7A 75 8A D9 84 8F 01 E0 79 F7 D3 D4
##$RELAX= 
##$RELAX= 
##$RELAX= 
##$RELAX= 
##$RELAX= 
##$RELAX= 
##$RELAX= 
##$RELAX= 
$$ Bruker specific parameters
$$ --------------------------
##$DU= <F:/spectra>
##$EXPNO= 1
##$NAME= <P31>
##$PROCNO= 1
##$TYPE= <nmr>
##$USER= <she>
##$AMP= (0..31)
100 100 100 100 100 100 100 100 100 100 100 100 100 100 100 100 100 100 
100 100 100 100 100 100 100 100 100 100 100 100 100 100 
##$AQSEQ= 0
##$AQ_mod= 1
##$AUNM= <au_zg>
##$AUTOPOS= <>
##$BF1= 81.014009
##$BF2= 200.13
##$BF3= 200.13
##$BF4= 200.13
##$BF5= 200.13
##$BF6= 200.13
##$BF7= 200.13
##$BF8= 200.13
##$BYTORDA= 1
##$CFDGTYP= 0
##$CFRGTYP= 5
##$CHEMSTR= <none>
##$CNST= (0..31)
1 1 145 1 1 1 1 1 1 1 1 1 1 1 1 1 1 1 1 1 1 1 1 1 1 1 1 1 1 1 1 1 
##$CPDPRG= <waltz16>
##$CPDPRG1= <>
##$CPDPRG2= <waltz16>
##$CPDPRG3= <>
##$CPDPRG4= <mlev>
##$CPDPRG5= <mlev>
##$CPDPRG6= <mlev>
##$CPDPRG7= <mlev>
##$CPDPRG8= <mlev>
##$CPDPRGB= <>
##$CPDPRGT= <>
##$D= (0..31)
0 1 0 0 0 0 0 0 0 0 0 0.03 2e-05 3e-06 0 0 0 0 0 0 0 0 0 0 0 0 0 0 0 0 
0 0 
##$DATE= 1651744127
##$DBL= (0..7)
120 120 120 11 120 120 24 19 
##$DBP= (0..7)
150 150 150 150 150 150 150 150 
##$DBP07= 0
##$DBPNAM0= <>
##$DBPNAM1= <>
$$ [...]
##$SUBNAM3= <"">
##$SUBNAM4= <"">
##$SUBNAM5= <"">
##$SUBNAM6= <"">
##$SUBNAM7= <"">
##$SUBNAM8= <"">
##$SUBNAM9= <"">
##$SW= 501.771253377433
##$SWIBOX= (0..15)
0 1 3 0 0 0 0 0 0 0 0 0 0 0 0 0 
##$SW_h= 40650.406504065
##$TD= 32768
##$TD0= 1
##$TE= 0
##$TE2= 300
##$TE3= 300
##$TEG= 300
##$TL= (0..7)
0 120 53 12 22 120 120 120 
##$TP= (0..7)
150 150 150 150 150 150 150 150 
##$TP07= 0
##$TPNAME0= <>
##$TPNAME1= <>
##$TPNAME2= <>
##$TPNAME3= <>
##$TPNAME4= <>
##$TPNAME5= <>
##$TPNAME6= <>
##$TPNAME7= <>
##$TPOAL= (0..7)
0.5 0.5 0.5 0.5 0.5 0.5 0.5 0.5 
##$TPOFFS= (0..7)
0 0 0 0 0 0 0 0 
##$TUNHIN= 0
##$TUNHOUT= 0
##$TUNXOUT= 0
##$USERA1= <user>
##$USERA2= <user>
##$USERA3= <user>
##$USERA4= <user>
##$USERA5= <user>
##$V9= 5
##$VALIST= <valist>
##$VCLIST= <CCCCCCCCCCCCCCC>
##$VD= 0
##$VDLIST= <DDDDDDDDDDDDDDD>
##$VPLIST= <PPPPPPPPPPPPPPP>
##$VTLIST= <TTTTTTTTTTTTTTT>
##$WBST= 1024
##$WBSW= 4
##$XGAIN= (0..3)
0 0 0 0 
##$XL= 0
##$YL= 0
##$YMAX_a= 3171
##$YMIN_a= -3773
##$ZGOPTNS= <>
##$ZL1= 120
##$ZL2= 120
##$ZL3= 120
##$ZL4= 120
##$ABSF1= 248.5645
##$ABSF2= -253.2056
##$ABSG= 5
##$ABSL= 3
##$ALPHA= 0
##$AQORDER= 0
##$ASSFAC= 0
##$ASSFACI= 0
##$ASSFACX= 0
##$ASSWID= 0
##$AUNMP= <proc_1d>
##$AZFE= 0.1
##$AZFW= 0.5
##$BCFW= 0
##$BC_mod= 2
##$BYTORDP= 0
##$COROFFS= 0
##$CY= -3
##$DATMOD= 1
##$DC= 0
##$DFILT= <>
##$DTYPP= 0
##$F1P= 0
##$F2P= 0
##$FCOR= 1
##$FTSIZE= 65536
##$FT_mod= 6
##$GAMMA= 0
##$GB= 0
##$INTBC= 1
##$INTSCL= 5.30512e-09
##$ISEN= 30
##$LB= 1
##$LEV0= 0
##$LPBIN= 0
##$MAXI= 10000
##$MC2= 0
##$MEAN= 0
##$ME_mod= 0
##$MI= 50
##$NCOEF= 0
##$NC_proc= -7
##$NLEV= 6
##$NOISF1= 182.463
##$NOISF2= 159.3651
##$NSP= 0
##$NTH_PI= 0
##$NZP= 0
##$OFFSET= 248.5645
##$PC= 4
##$PHC0= -9787.885
##$PHC1= -145.9463
##$PH_mod= 1
##$PKNL= yes
##$PPARMOD= 0
##$PSCAL= 0
##$PSIGN= 0
##$REVERSE= no
##$SF= 81.014009
##$SI= 65536
##$SIGF1= 159.3651
##$SIGF2= -187.1042
##$SINO= 113.3802
##$SIOLD= 16384
##$SREGLST= <1H.CDCl3>
##$SSB= 0
##$STSI= 65536
##$STSR= 0
##$SW_p= 40650.406504065
##$SYMM= 0
##$S_DEV= 0
##$TDeff= 32768
##$TDoff= 0
##$TI= <>
##$TILT= no
##$TM1= 0
##$TM2= 0
##$TOPLEV= 0
##$USERP1= <user>
##$USERP2= <user>
##$USERP3= <user>
##$USERP4= <user>
##$USERP5= <user>
##$WDW= 1
##$XDIM= 65536
##$YMAX_p= 296524130
##$YMIN_p= -27938502
$$ End of Bruker specific parameters
$$ ---------------------------------
##NTUPLES= NMR SPECTRUM
##VAR_NAME=  FREQUENCY,     SPECTRUM/REAL,   SPECTRUM/IMAG
##SYMBOL=    X,             R,               I
##VAR_TYPE=  INDEPENDENT,   DEPENDENT,       DEPENDENT
##VAR_FORM=  AFFN,          ASDF,            ASDF
##VAR_DIM=   65536,         65536,           65536
##UNITS=     HZ,            ARBITRARY UNITS, ARBITRARY UNITS
##FACTOR=    0.620285442955139, 1,           1
##FIRST=     20137.2065510759, 0,            0
##LAST=      -20513.1999529892, 0,           0
##MIN=       -20513.1999529892, -27938502,   0
##MAX=       20137.2065510759, 296524130,    0
$$ Real data points
##PAGE= N=1
##DATA TABLE= (X++(R..R)), XYDATA
$$ [...]
39324B226109p52984m62010k95824j04752J32516N69732J181892J246404J92538
$$ 2226109 1473125 1011115 715291 610539 743055 1312787 2494679 3741083 3933621
39315C933621j252754j908667j755949j452671q08546O36872J984878J843499
$$ 3933621 2680867 772200 -983749 -2436420 -3244966 -2608094 -623216 1220283
39307A220283O79243L80439J377885K028701J111356p22733k182910k441705j013855
$$ 1220283 1899526 2279965 3657850 5686551 6797907 6075174 3892264 1450559 436704
39298D36704J608270L118330J339339k528977m693947l469697j115712j28065
$$ 436704 2044974 5163304 6502643 3973666 -720281 -4189978 -5305690 -5433755
39290e433755N9658J179215K807210K944033R71479j614519k943450k179726J76055
$$ -5433755 -5374097 -4194882 -1387672 1556361 2527840 913321 -2030129 -4209855 -4033800
39281d033800K431974K734187Q24695j566940k462079j268952J204367L280093
$$ -4033800 -1601826 1132361 1957056 390116 -2071963 -3340915 -2136548 1143545
39273A143545L094320L85731k295641k123543K78M10842j739757k928964q35724
$$ 1143545 4237865 4623596 2327955 204412 204690 615532 -1124225 -4053189 -4888913
39264d888913J768323J395017o84561r42696M57879M65498j136627j333022O98298
$$ -4888913 -3120590 -1725573 -2410134 -3352830 -2894951 -2429453 -3566080 -4899102 -4200804
39255d200804K079332J144777k4136L89159Q40134m14854j875555j207938Q85232
$$ -4200804 -2121472 -976695 -1000831 -611672 228462 -186392 -2061947 -3269885 -2384653
39246b384653J913596J368600O68707K83861n32366j585218j681612p12194J99355
$$ -2384653 -471057 897543 1566250 1850111 1317745 -267473 -1949085 -2661279 -2461924
39237b461924O83500J373556K001733J238107r33641k459942j865215k68177M30739
$$ -2461924 -1778424 -404868 1596865 2834972 1901331 -558611 -2423826 -2692003 -2261264
39228b261264K15951L36768Q35501N32925o41759j178659m10904K59644k80348
$$ -2261264 -2045313 -1708545 -873044 -340119 -981878 -2160537 -2571441 -2311797 -2592145
39219b592145o72277Q86350L217520L178673K94864k119467j617446j35604q03276
$$ -2592145 -3264422 -2378072 839448 4018121 4312985 2193518 576072 440468 -362808
39210c62808k942063l096499l94792K163971K144670O72079l9357J42846Q0879
$$ -362808 -3304871 -6401370 -6796162 -4632191 -2487521 -1815442 -1854799 -1711953 -1631074
39201a631074l44448m17399J9653O88717J438330J659837M17104j650816k068534
$$ -1631074 -1975522 -2392921 -2373268 -1684551 -246221 1413616 1830720 179904 -1888630
39192a888630J87284K588093K310910L00076m66036K59040J23616j249213j401510
$$ -1888630 -1701346 886747 3197657 3497733 3031697 3290737 3414353 2165140 763630
39183G63630N14226J847643O33099j283690j495493q66545j317485j823074j52468
$$ 763630 1277856 3125499 3758598 2474908 979415 112870 -1204615 -3027689 -3180157
39174c180157K480501K457731m13397j961131J75510K830673K058638j036883
$$ -3180157 -699656 1758075 1344678 -616453 -440943 2389730 4448368 3411485
39166C411485k294438p43629O13698j07977j232445r04034L5804J11308j12560
$$ 3411485 1117047 373418 987116 879139 -353306 -1257340 -1221536 -1110228 -1222788
39157a222788N58284J430298J040013j81845o17785k97924p05822j834094j803626
$$ -1222788 -664504 765794 1805807 1623962 1006177 708253 2431 -1831663 -3635289
39148c635289N9151J867913J810271M32539o78623r54903n39679N73193J811528
$$ -3635289 -3576138 -1708225 102046 534585 -144038 -1098941 -1638620 -1065427 746101
39139G46101J745871k5643j750733j650373k15903R06741J224694J144410O13021
$$ 746101 2491972 2466329 715596 -934777 -1150680 -243939 980755 2125165 2738186
39130B738186k40724k68409Q68594J160034j031296l676153l422358o55562J076658
$$ 2738186 2497462 2229053 3097647 4257681 3226385 -449768 -3872126 -4527688 -3451030
39121c451030N89510L08321J391165J608454k24669j477296l8189J719231O57989
$$ -3451030 -2861520 -2553199 -1162034 446420 221751 -1255545 -1293734 425497 1083486
39112A083486j802335j873719N82410K156892J363838J77581M9143K5551m64941
$$ 1083486 -718849 -2592568 -2010158 146734 1510572 1688153 1737296 1762847 1297906
39103A297906k75518P91393Q88562p04818j814320o77840J056177Q11493j025936
$$ 1297906 1022388 1813781 2702343 1997525 183205 -494635 561542 1373035 347099
39094C47099k028469j427275m82286J99556J210068K238729J834352r0330j467048
$$ 347099 -1681370 -3108645 -3590931 -3391375 -2181307 57422 1891774 1801444 334396
39085C34396q05621P04247R20605m95608k147540k825449k179331k52061K191681
$$ 334396 -471225 233022 1153627 658019 -1489521 -4314970 -6494301 -6746362 -4554681
39076d554681L309366J841172p77759j591372R2115J636675P05360j510768k181145
$$ -4554681 -1245315 595857 -181902 -1773274 -1681159 -44484 660876 -849892 -3031037
39067c031037r01876J14895l75604r67952o5501J642690K249630J209640k30249
$$ -3031037 -3932913 -3818018 -4193622 -5161574 -5227075 -3584385 -1334755 -125115 -355364
39058c55364p15832p3862Q47757J046669K23733q76360j154261l50355P07982
$$ -355364 -1071196 -1145058 -297301 749368 973101 96741 -1057520 -1407875 -699893
39049f99893J082260N74828k98181o43742K91969K118934L006344J538903j134567
$$ -699893 382367 957195 659014 15272 307241 2426175 5432519 6971422 5836855
39040E836855k366894j413417j93827k21811o38037k92928Q5076n70493j429210
$$ 5836855 3469961 2056544 1862717 1640906 1002869 709941 795017 224524 -1204686
39031a204686j021043K60705Q90936P46427Q93652J294209Q24709m69769j154093
$$ -1204686 -2225729 -1965024 -1074088 -327661 565991 1860200 2684909 2215140 1061047
39022A061047p31604m10659r82025j423636m48551J499652K583648J592344o52434
$$ 1061047 329443 -81216 -1063241 -2486877 -2935428 -1435776 1147872 2740216 2087782
39013B087782j896121q25689J148577J510749K23327j68906J097324J112311j960932
$$ 2087782 191661 -634028 514549 2025298 2248625 2079719 3177043 4289354 2328422
39004B328422m722515k839966J962581L730364Q23428k106316j512318M16503
$$ 2328422 -2394093 -5234059 -3271478 458886 1282314 -824002 -2336320 -1919817
38996a919817N29799k05820M90764J680566J104608o32175j292401q27967o77549
$$ -1919817 -1390018 -1595838 -1105074 575492 1680100 1047925 -244476 -1072443 -1749992
38987a749992n35658Q46210K491566K146388M7440j309766j095992r41177j597838
$$ -1749992 -2285650 -1439440 1052126 3198514 3245954 1936188 840196 -100981 -1698819
38978a698819j614380n1758J770950K152417R84251p15514j797511j290953O79802
$$ -1698819 -3313199 -3364957 -1594007 558410 1542661 827147 -970364 -2261317 -1581515
38969a581515K126107J099171j376368k134770j02868K176278K024132o2729j594737
$$ -1581515 544592 1643763 267395 -1867375 -1970243 206035 2230167 2167438 572701
38960E72701j244270K30409J263546Q43012o78531j637335p21225J145914J623219
$$ 572701 -671569 -441160 822386 1665398 986867 -650468 -1371693 -225779 1397440
38951A397440j4843j855815j889443m23937P58698P32467J10752n1367N22050
$$ 1397440 1382597 -473218 -2362661 -2786598 -2027900 -1295433 -1184681 -1236048 -713998
38942g13998R60716J64750j452203j733129N45800L334961L445916Q86516j047349
$$ -713998 246718 411468 -1040735 -2773864 -2228064 1106897 4552813 5439329 4391980
38933D391980l68661J133367R34861p74970k087322k201943j681673r92965k46117
$$ 4391980 4023319 5156686 6091547 5316577 3229255 1027312 -654361 -1647326 -1893443
38924a893443L23341O41393Q88822P82878j13365r68584k82674J390624J442003
$$ -1893443 -1570102 -928709 -39887 742991 629626 -338958 -621632 768992 2210995
38915B210995q46115k648644j722747J07851Q4406r54199l90855J328306J445759
$$ 2210995 1364880 -1283764 -3006511 -2898660 -2814254 -3768453 -4159308 -2831002 -1385243
38906a385243j43092n75460J096524K380531J564495J36871k94602m72228j206449
$$ -1385243 -1528335 -2103795 -1007271 1373260 2937755 3074626 2780024 2307796 1101347
38897A101347j333341j2115J163015N85283o39760o98774k30607q93506j919519
$$ 1101347 -231994 -244109 918906 1504189 864429 165655 -64952 -958458 -2877977
38888b877977j030434J523575K702843J021715j158610q47661J569552K939762
$$ -2877977 -3908411 -2384836 318007 1339722 181112 -666549 903003 3842765
38880C842765J361580j552300k601446o95527J869442K121463K6498j572000p76612
$$ 3842765 5204345 3652045 1050599 355072 2224514 4345977 4372475 2800475 2023863
38871B023863R19631R36868p69895j938874j340664j86047m4417p68523j046159
$$ 2023863 2943494 3880362 3110467 1171593 -169071 -355118 -399535 -1168058 -2214217
38862b214217j41156J390811K181606J122215j353489k990357j666946J944138
$$ -2214217 -2355373 -964562 1217044 2339259 985770 -2004587 -3671533 -1727395
38854a727395M467479L260991o34748l573378l154776n17785J233813N17915j166849
$$ -1727395 2740084 6001075 5366327 1792949 -1361827 -1879612 -645799 -127884 -1294733
38845a294733j258672O79514K478536K158186L16325r33881p17870m3557K0664
$$ -1294733 -2553405 -1873891 604645 2762831 3079156 2145275 1427405 1383848 1404512
38836A404512l48897m44695j56565L7943k34938q01370r81583k36138R09092J067884
$$ 1404512 1055615 610920 454355 492298 257360 -544010 -1525593 -1761731 -852639 215245
38826B15245j68223j147114j17337J993227K334049j4918k509192k364842j23995
$$ 215245 47022 -1100092 -1217429 775798 3109847 3094929 585737 -1779105 -1903100
38817a903100J283802M23432j076472r14660R44773K344037J680819o2976n68203
$$ -1903100 -619298 -195866 -1272338 -2186998 -1242225 1101812 2782631 2719655 2151452
38808B151452P28211J800814Q37151j217818k150972j618926r73900n08074P02326
$$ 2151452 2879663 4680477 5517628 4299810 2148838 529912 -443988 -952062 -249736
38799b49736K082970J498958j034984k294982l90803J977357J365059j160476
$$ -249736 1833234 3332192 2297208 2226 -388577 1588780 2953839 1793363
38791A793363j786452J07889J359510K84783j033465o39822K53126j84826j232182
$$ 1793363 6911 114800 1474310 1759093 725628 85806 338932 154106 -1078076
38782a078076j099909N2787P00225M69068Q9776l80860j258378j614987j51657
$$ -1078076 -2177985 -2125198 -1424973 -955905 -866129 -1246989 -2505367 -4120354 -4272011
38773d272011K191269K633113L74475j764084r30556J733684K510811J64839k429611
$$ -4272011 -2080742 552371 926846 -837238 -1767794 -34110 2476701 2641540 211929
38764B11929k305735l12706M96554o15482j255859K88410K442080K643301Q92543
$$ 211929 -2093806 -2406512 -1909958 -2525440 -3781299 -3492889 -1050809 1592492 2485035
38755B485035n35431k89296O86962R03298J52227p04219r25833n36943j74455
$$ 2485035 1949604 1660308 2347270 3250568 3402795 2698576 1772743 1235800 1061345
38746A061345l15817n00852J24493J131466P74753j323994k674122r78573K100474
$$ 1061345 745528 244676 369169 1500635 2275388 951394 -1722728 -2701301 -600827
38737f00827K716983K66258j748893r56819O19493J50142j614118j973781o44524
$$ -600827 2116156 2382414 633521 -323298 296195 446337 -1167781 -3141562 -3786086
38728c786086L26439K45614N44727J793663K473909J481506j16136q73387j020457
$$ -3786086 -3459647 -3214033 -2669306 -875643 1598266 3079772 2963636 2090249 1069792
38719A069792j492357j979602j394065J69890J303095J202411O39159N65918O15506
$$ 1069792 -422565 -2402167 -3796232 -3626342 -2323247 -1120836 -481677 84241 699747
38710F99747j24408j243727j148355N90943K151700J674770j90764j231740p18104
$$ 699747 575339 -668388 -1816743 -1225800 925900 2600670 2409906 1178166 460062
38701D60062L6999O4079j11171p3471l76316r26307l94173J369452K074236Q7494
$$ 460062 497061 561140 449969 376498 182 -926125 -1320298 49154 2123390 2210884
38691B210884k589967k799534p40642O58846M23125N13701J777879K106082J12858
$$ 2210884 -379083 -3178617 -3919259 -3260413 -2837288 -2323587 -545708 1560374 1673232
38682A673232j984593j432313Q57492J703073L30184r14431l74168P88108Q49294
$$ 1673232 -311361 -1743674 -886182 816891 1147075 232644 -141524 646584 1495878
38673A495878k4224o49306p65857p91002n03682N47588J633181J338183k61007
$$ 1495878 1471654 822348 56491 -734511 -1238193 -690605 942576 2280759 2019752
38664B019752j241001l94654R33669P50867o29765j200255n71911n75458j910507
$$ 2019752 778751 384097 1317766 2068633 1438868 238613 -333298 -908756 -2819263
38655b819263k361587p9163K958316L226574O87580j180908m85420P37736K07631
$$ -2819263 -5180850 -5260013 -2301697 924877 1612457 431549 -53871 683865 891496
38646H91496j184948j428819p92683p97415j123581k24161J513433J897693M20741
$$ 891496 -293452 -1722271 -2514954 -3312369 -4435950 -4660111 -3146678 -1248985 -828244
38637h28244p71764r0225J319373J562511N13252p16003j406221j229985M5852
$$ -828244 -1600008 -1690233 -370860 1191651 1704903 988900 -417321 -1647306 -1601454
38628a601454J593984J516169o70612k563463j653270J104791K369126P60061
$$ -1601454 -7470 1508699 838087 -1725376 -3378646 -2273855 95271 855332
38620H55332j680405k369717q62111J499829L064163K755315Q85068p14895o70715
$$ 855332 -825073 -3194790 -4056901 -2557072 507091 3262406 4147474 3432579 2761864
38611B761864o0060p51060j995126j171171J684620L044463R66354j774318j799725
$$ 2761864 2701804 1950744 -44382 -1215553 469067 3513530 4479884 2705566 905841
38602I05841k125M92952n69419q02367M48607J316875Q15423l193m58474j035573
$$ 905841 903716 1396668 827249 24882 473489 1790364 2605787 2602594 2144120 1108547
38592A108547j446072o29607P72523O91996q08853j055301R15482K319106Q10997
$$ 1108547 -337525 -967132 -194609 497387 -311466 -1366767 -451285 1867821 2678818
38583B678818j649397j559672J077162K978994K034579o52948k753485k926768
$$ 2678818 1029421 -530251 546911 3525905 5560484 4907536 2154051 -772717
38575g72717j271087R30801J947848J138260l81741j249902j425385j491716j295944
$$ -772717 -2043804 -1113003 834845 1973105 1591364 341462 -1083923 -2575639 -3871583
38566c871583m42415N45627Q16982N21078M59926P91331J031083R38337N43361
$$ -3871583 -4313998 -3768371 -2951389 -2430311 -1970385 -1179054 -147971 790366 1333727
38557A333727k12453j051882j190213m34870K44711J46347l232N82763J107278
$$ 1333727 1121274 69392 -1120821 -1555691 -1310980 -1164633 -1167865 -585102 522176
38548E22176L82574r29232r39214O77164J985463J241546r24645k226774j247508
$$ 522176 904750 -24482 -963696 -286532 1698931 2940477 2015832 -210942 -1458450
38539a458450R85113K050842R65272n25428l62084P26128L61998j416258j830002
$$ -1458450 -473337 1577505 2542777 2017349 1655265 2381393 2743391 1327133 -502869
38530e02869J55843J831084Q98539r35042q83613N49772R45155P5004l94612j76490
$$ -502869 -347026 1484058 2382597 1447555 563942 1113714 2058869 2133873 1739261 1562771
38520A562771k89170n01305J52750Q78392J33151j271392j098814N19661J281609
$$ 1562771 1273601 772296 925046 1803438 1936589 665197 -433617 86044 1367653
38511A367653O17877K49127P05111N13716p09485j535197j659459k342687l159618
$$ 1367653 1985530 2234657 2939768 3453484 2743999 1208802 -450657 -2793344 -5952962
38502e952962j762810J803506L896143K248133o96794j458975p3606J103674R81586
$$ -5952962 -7715772 -5912266 -2016123 232010 -464784 -1923759 -1997365 -893691 87895
38493H7895K9901j206807j981752j301193M37918J398227J085493J072018J737673
$$ 87895 117796 -1089011 -3070763 -4371956 -3934038 -2535811 -1450318 -378300 1359373
38484A359373J082881j340466k399149j07681K392905J210285k084043k798443
$$ 1359373 2442254 1101788 -1297361 -1405042 987863 2198148 114105 -2684338
38476b684338l77793J208684R3818r69409L45021K269394K184648O58576N38N94536
$$ -2684338 -3062131 -1853447 -1759629 -2729038 -2384017 -114623 2070025 2728601 2729139 3323675
38466C323675Q73373O7669q62602q90785l02369j73008r59787j836924j498057
$$ 3323675 4197048 4264717 3402115 2511330 2208961 2035953 1076166 -760758 -2258815
38457b258815L09934K269386K737331J321330q81771k235911j742701L7291J142744
$$ -2258815 -1948881 320505 3057836 4379166 3497395 1261484 -481217 -443926 698818
38448F98818J85344j710438k102535n22435J025157J255563J209119J659198J270964
$$ 698818 884162 -826276 -2928811 -3451246 -2426089 -1170526 38593 1697791 2968755
38439B968755p65458k356709j329957Q95895J325962N27m93889N20655J167440
$$ 2968755 2203297 -153412 -1483369 -587474 738488 739015 245126 765781 1933221
38430A933221P49962P23264J371594Q37391j332049k689753j638612n3528j24688
$$ 1933221 2683183 3406447 4778041 5615432 4283383 1593630 -44982 -98510 -223198
38421b23198q89461l62180P65600M70403p50217n41336J150100J730239K18046
$$ -223198 -1112659 -1474839 -709239 -238836 -989053 -1530389 -380289 1349950 1567996
38412A567996j105350n30988K13445r85474k641857j586125J862977L667622J562076
$$ 1567996 462646 -68342 145103 -840371 -3482228 -5068353 -3205376 462246 2024322
38403B024322j768686k408100k56945J548421J175811q9696l24850O57038J741844
$$ 2024322 255636 -2152464 -2409409 -860988 314823 225127 -99723 557315 2299159
38394B299159J914164Q11831j013015k095740j395512J31189M59163p09656j409961
$$ 2299159 4213323 5025154 4012139 1916399 520887 652076 1111239 401583 -1008378
38385a008378k50538J530086J791089K79354j376235j846039j302354p23883o84236
$$ -1008378 -1258916 271170 2062259 2341613 965378 -880661 -2183015 -2906898 -3591134
38376c591134p83192j61415J150144J712001L87980j646885j939988L9767K143689
$$ -3591134 -4374326 -4535741 -3385597 -1673596 -1285616 -2932501 -4872489 -4832722 -2689033
38367b689033K394424J192852P9578l11526j98763K71453Q97332J136437O86265
$$ -2689033 -294609 898243 977821 666295 467532 738985 1636317 2772754 3459019
38358C459019j75985j042133j461889q28166O56002J337605J33166j312433p44954
$$ 3459019 3283034 2240901 779012 -49154 606848 1944453 2077619 765186 20232
38349B0232R14712R26301l49785J82618K509261K655143n50837k702049q70177
$$ 20232 934944 1861245 1511460 1694078 4203339 6858482 6307645 3605596 2735419
38340B735419J209160o20454l539068k236578K024234L282550N47289j061758
$$ 2735419 3944579 3324125 -214943 -2451521 -427287 2855263 3402552 2340794
38332B340794Q65234K421666M33075k300696j820740Q33424J668619m02708k753133
$$ 2340794 3206028 5627694 6060769 3760073 1939333 2772757 4441376 4038668 1285535
38323A285535k911685j039153R55679J483861O87296R4380N05656Q48813J62277
$$ 1285535 -1626150 -2665303 -1709624 -225763 461533 555913 1061569 1910382 2072659
38314B072659m33414L22665J071939k08042k215781j671777J340957K949435J184147
$$ 2072659 1639245 1961910 3033849 2825807 610026 -1061751 279206 3228641 4412788
38305D412788j288206j540605m81961n73443j719184j749159J25450K139845J953049
$$ 4412788 3124582 1583977 1102016 528573 -1190611 -2939770 -2814320 -674475 1278574
38296A278574q64019l955783m057716o75415K784134L001842Q78343m02860k59994
$$ 1278574 414555 -3541228 -7598944 -8274359 -5490225 -2488383 -1610040 -2012900 -2272894
38287b272894o07429j594453j205374O94494J653132P91234K10871J138497J904225
$$ -2272894 -2880323 -4474776 -5680150 -4985656 -3332524 -2541290 -2330419 -1191922 712303
38278G12303J103223j75216o21679n17594j75236P07434J274054R3132j733294
$$ 712303 1815526 1640310 1018631 501037 325801 1033235 2307289 2400421 667127
38269F67127j466875M58074N20352j826390k723291m11212J654912Q81890j60100
$$ 667127 -799748 -341674 178678 -1647712 -4371003 -4782215 -3127303 -2245413 -2405513
38260b405513R23184J498333r83195l273817j315774K361046K392796n10705r23963
$$ -2405513 -1482329 16004 -967191 -4241008 -5556782 -3195736 -802940 -1313645 -2237608
38251b237608K070420L580355J176054j547876j189127O72607J062702J43571
$$ -2237608 -167188 3413167 4589221 3041345 1852218 2524825 3587527 3731098
38243C731098k26257K11263M02808j03046r77584j681762j548407m29821N82174
$$ 3731098 3504841 3716104 4118912 4015866 3038282 1356520 -191887 -621708 -39534
38234c9534L00661q63118j580762j412810n86326J006409K832346L001088P79225
$$ -39534 261127 -601991 -2182753 -3595563 -4181889 -3175480 -343134 2657954 3437179
38225C437179j399757j048867M33263m1119k141087k708772r25046P82021R67858
$$ 3437179 2037422 988555 1421818 1380699 -760388 -3469160 -4394206 -3612185 -2644327
38216b644327P61110R49190Q58927N64676R73316J334436j0680k040444j828367
$$ -2644327 -1883217 -934027 -75100 489576 1462892 2797328 2786648 746204 -1082163
38207a082163N27271J635500L89129l49369Q93103J491760l36949k026379j156257
$$ -1082163 -554892 1080608 1469737 1120368 2013471 3505231 3168282 1141903 -14354
38198a4354K02701o82970k110546r10586J723959J971683k58486j271704L09162
$$ -14354 188347 -494623 -2605169 -3515755 -1791796 179887 -78599 -1350303 -1041141
38189a041141J625435M72013j501292j822856o44222M56604J031539J388387J096484
$$ -1041141 584294 1056307 -444985 -2267841 -2912063 -2455459 -1423920 -35533 1060951
38180A060951l34423j960097k145072p17697P45407R75663M56464K94647L60747
$$ 1060951 726528 -1233569 -3378641 -4096338 -3350931 -2375268 -1918804 -1624157 -1263410
38171a263410l28065j458248j187643J030817K783590J665410r20823j355906
$$ -1263410 -1591475 -3049723 -4237366 -3206549 -422959 1242451 321628 -1034278
38163a034278Q97685K375850Q04949j584599j685675l4561P95014N10108P66433
$$ -1034278 -136593 2239257 3044206 1459607 -226068 -260629 534385 1044493 1810926
38154A810926J517841R98850p40247j448068m18533K78654n94226j324195l90180
$$ 1810926 3328767 4327617 3587370 2139302 1720769 1999423 1405197 81002 -309178
38145c09178P38268K26542p23462J7721J397138O26071j756193k044417P65488
$$ -309178 429090 655632 -67830 -50109 1347029 1973100 216907 -1827510 -1062022
38136a062022K948779J595702j076481j531509l21071k85062j253892o26275J485515
$$ -1062022 1886757 3482459 2405978 874469 553398 268336 -985556 -1611831 -126316
38127a26316J905555l57559k289253j467385P04307J763094J340612P9868j777741
$$ -126316 1779239 1421680 -867573 -2334958 -1630651 132443 1473055 1552923 -224818
38118b24818l006408j438345K441399M559547K386484j349791k646186j515497
$$ -224818 -3231226 -4669571 -2228172 2331375 4717859 3368068 721882 -793615
38110g93615l68343M39300J768164K369650N72538j890668j864399K06888J271816
$$ -793615 -1161958 -722658 1045506 3415156 3987694 2097026 232627 439515 1711331
38101A711331R54652J441316K486980J432947j387204k233961j52691J182179
$$ 1711331 2665983 4107299 6594279 8027226 6640022 4406061 4253370 5435549
38093E435549l91015k083298j267550K03481j60383j011603q0127J391855R16776
$$ 5435549 5044534 2961236 1693686 1897167 1736784 725181 645054 2036909 2953685
38084B953685p21303r55233J15160L21121n90738r13893k98285r0150o54498r79993
$$ 2953685 2232382 1277149 1392309 1713430 1122692 208799 -89486 -179636 -834134 -1814127
38074a814127p89976p47767o87606K56680J765621K385702J538500J11792q34124
$$ -1814127 -2604103 -3351870 -4039476 -3782796 -2017175 368527 1907027 2018819 1184695
38065A184695q89020k55474K08367l22277j125804m15628J700423K589320R48178
$$ 1184695 295675 40201 248568 -73709 -1199513 -1615141 85282 2674602 3622780
38056C622780q10865k82636Q60409m22738l243836l773759r48056K236155L087044
$$ 3622780 2811915 2529279 3389688 2966950 -276886 -4050645 -4998701 -2762546 324498
38047C24498J810924l10125k281702k684902o44069J957775K109575R4855o81223
$$ 324498 2135422 1825297 -456405 -3141307 -3785376 -1827601 281974 376829 -304394
38038c04394R94869K262626R23818j147864j313949j52863K01360m71861j040529
$$ -304394 690475 2953101 3876919 2729055 1415106 1262243 1463603 991742 -48787
38029d8787j270366j260524k79429J594615K324985Q24703o40649K79380J922657
$$ -48787 -1319153 -2579677 -2859106 -1264491 1060494 1885197 1244548 1523928 3446585
38020C446585J116460j403024j981252k3801J237880L76589k15328O56653L32688
$$ 3446585 4563045 3160021 1178769 1154968 2392848 2769437 2554109 3210762 3543450
38011C543450k645496m604501j771707L265255M556086J091765k243075j909413
$$ 3543450 897954 -3706547 -5478254 -2212999 2343087 3434852 1191777 -717636
38003g17636K40803J046156M96633K92800O06930M22031m71655j510224k265105
$$ -717636 -476833 569323 1065956 1358756 1965686 2387717 1916062 405838 -1859267
37994a859267k197376p58250J312368K194619J417017N28930M83758K91740n82958
$$ -1859267 -4056643 -4814893 -3502525 -1307906 109111 638041 1121799 1413539 830581
37985H30581p88855K19382M26123j419212k902692j373406J500341K063588K97710
$$ 830581 41726 261108 687231 -731981 -3634673 -5008079 -3507738 -1444150 -1146440
37976a146440o78650L216J74217p75238o90519J104197K180177J041595n08800
$$ -1146440 -1825090 -1821874 -1647657 -2422895 -3113414 -2009217 170960 1212555 703755
37967G03755o67859l60199q96852j516883j141236l73269m4667K23106O03334
$$ 703755 35896 -324303 -1221155 -2738038 -3879274 -4252543 -4297210 -4074104 -3470770
37958c470770L71014j29503O59735K343591K214689j82505j424581M00520K078707
$$ -3470770 -3099756 -3229259 -2569524 -225933 1988756 1806251 381670 782190 2860897
37949B860897L91027k298728j855213P00727J099750q06989j056667J261541K329621
$$ 2860897 3251924 953196 -902017 -201290 898460 91471 -965196 296345 2625966
37940B625966K16538j762120n50673J762083J561656n99121j277440L87148J683012
$$ 2625966 2842504 1080384 529711 2291794 3853450 3254329 1976889 2364037 4047049
37931D047049N61220j661832k444776j286997J40937M69423J34789J78472M37328
$$ 4047049 4608269 2946437 501661 -785336 -644399 -174976 -40187 138285 575613
37922E75613k7610j028122j238980l74156J70255m34308j077137o02512L93697
$$ 575613 548003 -480119 -1719099 -2093255 -1923000 -2357308 -3434445 -4036957 -3643260
37913c643260Q64807R53001J004617M85451o38487j075840l72720k1691o04304
$$ -3643260 -2778453 -1825452 -820835 -335384 -973871 -2049711 -2422431 -2444122 -3048426
37904c048426j97992J894832K558519l88621l362020j687789K617294L370877
$$ -3048426 -3246418 -1351586 1206933 818312 -2543708 -4231497 -1614203 1756674
37896A756674j35076k243459l46049J291286n87224k598823q82034K022297J409970
$$ 1756674 1621598 -621861 -967910 323376 -263848 -2862671 -3744705 -1722408 -312438
37887c12438j783656k674967j40812K117571J662941J72882j44848M23154N51410
$$ -312438 -2096094 -4771061 -4911873 -2794302 -1131361 -958479 -1103327 -680173 -128763
37878a28763K6887m70281l98118K62968Q73122N95336l37990n44070N56633J761398
$$ -128763 -101876 -572157 -970275 -707307 165815 761151 423161 -120909 435724 2197122
37868B197122J962380J646886J393279N10345j252453k316003j571816m97410
$$ 2197122 4159502 5806388 7199667 7710012 6457559 4141556 2569740 2072330
37860B072330p03030r51451N46563K212434J011875k257405l404939j007205J476504
$$ 2072330 1369300 417849 964412 3176846 4188721 1931316 -1473623 -2480828 -1004324
37851a004324R70691j017408j358056Q2917J169246J175339J230957J800268J897911
$$ -1004324 -33633 -1051041 -2409097 -2326180 -1156934 18405 1249362 3049630 4947541
37842D947541Q40409p02059j611406j390949l12193Q01405R96574L9256j145199
$$ 4947541 5787950 5085891 3474485 2083536 1771343 2572748 3569322 3608578 2463379
37833B463379j348438l87597P91433J217526P71908N7846k74979p4464K44187
$$ 2463379 1114941 727344 1518777 2736303 3508211 3566057 3291078 3216614 3460801
37824C460801J94607j18994j8445Q25383J642706J198164o64311k520924k870179
$$ 3460801 3655408 3536414 3517969 4343352 5986058 7184222 6519911 3998987 1128808
37815A128808j920498j189872j276931r95806O49154K532153K670109R83060o46534
$$ 1128808 -791690 -1981562 -3258493 -4254299 -3605145 -1072992 1597117 2580177 1933643
37806A933643j042957r19882j050497r05619k8265O58291K50987m30952k8970
$$ 1933643 890686 -29196 -1079693 -1985312 -2013577 -1355286 -1104299 -1535251 -1564221
37797a564221J115017J430863N13317m45517n72004k59593k3069K74779N98612
$$ -1564221 -449204 981659 1494976 1049459 477455 217862 194793 469572 1068184
37788A068184K86816q44617j727903j213226L53515J443253J138277M0848p06877
$$ 1068184 1355000 510383 -1217520 -2430746 -2077231 -633978 504299 545147 -161730
37779a61730q15289q27695r23592n03631O40881J473719J020607J37902N26251
$$ -161730 -977019 -1804714 -2728306 -3231937 -2591056 -1117337 -96730 41172 567423
37770E67423J836260J534307j352768l999846l150684K30871K019388N84721j071648
$$ 567423 2403683 3937990 2585222 -1414624 -4565308 -4334437 -2315049 -1730328 -2801976
37761b801976J47099K816914K975453j75129k963044k140940Q40014J960188M6769
$$ -2801976 -2654877 162037 3137490 2962361 -683 -2141623 -1301609 658579 705348
37752G05348j980435j438695N62942J195910J25153m28757N77192J476352O78556
$$ 705348 -1275087 -2713782 -2150840 -954930 -829777 -1258534 -681342 795010 1473566
37743A473566q85388j316998m99055J27930j24193m71109j17706N99846P78862
$$ 1473566 588178 -728820 -1227875 -1099945 -1224138 -1695247 -1812953 -1213107 -434245
37734d34245K08941j95344N57410J883847J730423o65581k820989j736193J551453
$$ -434245 -225304 -420648 136762 2020609 3751032 3085451 264462 -1471731 79722
37725G9722K693130P6728k604428j612075J519230K630682J042718l47307j32772
$$ 79722 2772852 2849580 245152 -1366923 152307 2782989 3825707 3478400 3345628
37716C345628O5044p34909j039369K17950J548163J130590o05250j903330j890689
$$ 3345628 3410672 2675763 1636394 1854344 3402507 4533097 3927847 2024517 133828
37707A33828q78438M01333J014238K85304j214374j928991j037858P51151K158709
$$ 133828 -744610 -343277 670961 956265 -258109 -2187100 -3224958 -2473807 -315098
37698c15098K232231O21311j730949k560919o93815J796818J906804l8039r95483
$$ -315098 1917133 2538444 807495 -1753424 -2447239 -650421 1256383 1218344 222861
37689B22861r4280L07791q02075j046643J009179K839415J926429p5568l28889
$$ 222861 128581 436372 -365703 -1412346 -403167 2436248 4362677 4287109 3958220
37680C958220L59418o15434k621781k632957l52614J408179J351240J002610J126320
$$ 3958220 4317638 3702204 1080423 -1552534 -1905148 -496969 854271 1856881 2983201
37671B983201M17994j409573k495178j905615r56002l60245R50481K756249K428572
$$ 2983201 3401195 1991622 -503556 -2409171 -3365173 -3725418 -2774937 -18688 2409884
37662B409884r23236l850323k841693P02420K555640J334521o87390j448779r61339
$$ 2409884 1486648 -2363675 -5205368 -4502948 -1947308 -612787 -1300177 -2748956 -3710295
37653c710295K45851J850217K821852K060422K70557n99985J7068Q96716J225890
$$ -3710295 -3464444 -1614227 1207625 3268047 3538604 2938619 2955687 3852403 5078293
37644E078293J378614J360999M94947q50757j135631l9963P39669K7211j096938
$$ 5078293 6456907 7817906 8312853 7462096 6326465 6286502 7026171 7053382 5956444
37635E956444j218431p57585p92948r31997p3522J382444J791486N82696j038293
$$ 5956444 4738013 3980428 3187480 2255483 2181961 3564405 5355891 5938587 4900294
37626D900294j755960j468098q69144n64249o80069p35963k6382J253802J641735
$$ 4900294 3144334 1676236 807092 242843 -437226 -1173189 -1199571 54231 1695966
37617A695966J23126k042890k449645n77580J558074K127215J518416R54913M49957
$$ 1695966 1819092 -223798 -2673443 -3251023 -1692949 434266 1952682 2907595 3357552
37608C357552n23817j304886p93649L74768L21897j125014j845919n85623J107978
$$ 3357552 2833735 1528849 735200 1109968 1431865 306851 -1539068 -2124691 -1016713
37599a016713J435798J110687J529084J640209m01362l094404k717429Q15467
$$ -1016713 419085 1529772 3058856 4699065 4297703 1203299 -1514130 -698663
37591f98663K918630Q98684j890119j252810J450025J941208l9322j037445j65515
$$ -698663 2219967 3118651 1228532 -24278 1425747 3366955 3327633 2290188 2124673
37582B124673j19732j649384j924273J54354J504523J6840j722890p33387J575445
$$ 2124673 2004941 355557 -1568716 -1414362 90161 107001 -1615889 -2349276 -773831
37573g73831K115915R57681P1127n38246j856706k748758j489015P64545J462747
$$ -773831 1342084 2299765 2370892 1832646 -24060 -2772818 -4261833 -3497288 -2034541
37564b034541O34412R8390j33601j081830j515540M43978L014328K425068j034374
$$ -2034541 -1400129 -1301739 -1435340 -2517170 -4032710 -3588732 -574404 1850664 816290
37555H16290k972527j446521O70628Q02667K3841l5323K37529N00204J447105
$$ 816290 -2156237 -3602758 -2932130 -2129463 -2105622 -2140945 -1903416 -1403212 43893
37546D3893K220472N85745k664288l493289q18708J303735K23752j031982N63903
$$ 43893 2264365 2850110 185822 -3307467 -4126175 -2822440 -2598688 -3630670 -3066767
37537c066767K458350J100488j553562j328550J084991J806138O06351M52081
$$ -3066767 -608417 492071 -1061491 -2390041 -1305050 501088 1107439 1559520
37529A559520J383466O03442j620014j787301N41068J565099l87045k107851r69247
$$ 1559520 2942986 3546428 1926414 139113 680181 2245280 1858235 -249616 -1218863
37520a218863J051595J109280j40338m11376M78346J082379Q40734L29002J57356
$$ -1218863 -167268 942012 801674 390298 868644 1951023 2791757 3120759 3278115
37511C278115N93324J183812O15890j511145l170690k362308m63861k01049r17700
$$ 3278115 3871439 5055251 5671141 4159996 989306 -1373002 -1836863 -2037912 -2955612
37502b955612K30791K563039K201867j008768k206383O86533L024701P48154k940318
$$ -2955612 -2724821 -161782 2040085 1031317 -1175066 -488533 2536168 3284322 344004
37493C44004k714429N97228K019353M19353p90521J40151J310060J239068P02425
$$ 344004 -2370425 -1773197 246156 665509 -125012 15139 1325199 2564267 3266692
37484C266692J83468r01855j938601j209860J093851K564264J828812m4615j586552
$$ 3266692 3450160 2548305 609704 -600156 493695 3057959 4886771 4842156 3255604
37475C255604k254357j739736j50149J144471R59989L24950Q17857J481609K68316
$$ 3255604 1001247 -738489 -888638 255833 1215822 1540772 2358629 3840238 4108554
37466D108554j877129j891515K67755J182419l88346j327749N50810K670210J877118
$$ 4108554 2231425 339910 607665 1790084 1401738 73989 624799 3295009 5172127
37457E172127m71355r57237L83767O52113q16200j587413m39386O77219l0055
$$ 5172127 4700772 3743535 4127302 4779415 3963215 2375802 1936416 2613635 2583580
37448B583580j316006r03287J038785K098979Q95979j211953j984888j006225
$$ 2583580 1267574 364287 1403072 3502051 4398030 3186077 1201189 194964
37440A94964K17492N22251L55091M37171L73646k69141m60477Q95249K431620
$$ 194964 412456 934707 1289798 1726969 2100615 1831474 1370997 2266246 4697866
37431D697866J452448j945752m121548k507850Q49204K125505P60544m89007Q8609
$$ 4697866 6150314 4204562 83014 -2424836 -1575632 549873 1310417 821410 910019
37422I10019J094028P00944n15028o66777M48282R16973n13019k277958j711882
$$ 910019 2004047 2704991 2189963 1523186 1971468 2888441 2375422 97464 -1614418
37413a614418J202632L178402J627805j744266k964706r00986J645630K047957
$$ -1614418 -411786 2766616 4394421 2650155 -314551 -1215537 430093 2478050
37405B478050Q76453J5716k15064o13477j221375j493343j404428j088017k73639
$$ 2478050 3354503 3370219 3155155 2541678 1320303 -173040 -1577468 -2665485 -2939124
37396b939124P57859P76408n05065j355690m75204O91633J36050j216697p01506
$$ -2939124 -2181265 -1404857 -1909922 -3265612 -3740816 -3049183 -2913133 -4129830 -4831336
37387d831336J799542L400358K320573J05653r67553p54798n40215q92407j234210
$$ -4831336 -3031794 368564 2689137 2794790 1827237 1072439 532224 -360183 -1594393
37378a594393p95999M94572J586993J047015r25516j962464n22918J406335Q47475
$$ -1594393 -2390392 -1895820 -308827 738188 -187328 -2149792 -2672710 -1266375 -418900
37369d18900j479552j914410N60392K710038J977285r0681r63580q50935j136115
$$ -418900 -1898452 -3812862 -3252470 -542432 1434853 1344172 380592 -470343 -1606458
37360a606458j420423o18269O77143J229960J167459R65410M9228j507796j731734
$$ -1606458 -3026881 -3645150 -2968007 -1738047 -570588 394822 444050 -1063746 -2795480
37351b795480L21676K199777J473318k54057j01385J022823K49511j524262o61758
$$ -2795480 -2473804 -274027 1199291 945234 843849 1866672 2116183 591921 -69837
37342f9837K540116L411666L05725k525168j643951M60354J10503j479165q78020
$$ -69837 2470279 5881945 6187670 3662502 2018551 2478905 2589408 1110243 232223
37333B32223J379642J721861m82000k007015q98163Q77405P38186r79854j994721
$$ 232223 1611865 3333726 2851726 844711 -53452 823953 1562139 582285 -1412436
37324a412436j193507L31031Q98373K48775k98888J93057P37096j05890j577201
$$ -1412436 -2605943 -2274912 -1376539 -1127764 -1426652 -1233595 -496499 -602389 -2179590
37315b179590j379912P44106K230326J388117k34206n74315j55553n83207j542167
$$ -2179590 -3559502 -2815396 -585070 803047 568841 -5474 -161027 -744234 -2286401
37306b286401j454585j48729J054770J277960O63052k39726n69989K85970J337737
$$ -2286401 -3740986 -3889715 -2834945 -1556985 -893933 -1133659 -1703648 -1417678 -79941
37297g9941P65372j014626j270589P00890J883790K97903j491404n97243J249011
$$ -79941 685431 -329195 -1599784 -898894 984896 1282799 -208605 -805848 443163
37288D43163Q03026r74593p79995J086662J437848o7874p46088r766J28450m45843
$$ 443163 1246189 271596 -508399 578263 2016111 1948237 1202149 1192383 1320833 874990
37278H74990J77051J398283M97104j932244k169373O4237O95666j524125k594045
$$ 874990 1052041 2450324 2947428 1015184 -1154189 -1089952 -394286 -1918411 -4512456
37269d512456l11740J860279J088394k8513J154404K066613k53523l188927k550703
$$ -4512456 -4824196 -2963917 -1875523 -1904036 -749632 1316981 1063458 -2125469 -4676172
37260d676172N95203K185389J687171J401196J411705K44987j088166n63667O44622
$$ -4676172 -4080969 -1895580 -208409 1192787 2604492 2849479 1761313 1197646 1842268
37251A842268L5737j365561o61215J493477J867960K84451m82041J08985L8449
$$ 1842268 1878005 512444 -148771 1344706 3212666 3497117 3015076 3124061 3162510
37242C162510p60269m31382L67352q80657l147435k344650J784970M316895K331030
$$ 3162510 2402241 1970859 2338211 1457554 -1689881 -4034531 -2249561 2067334 4398364
37233D398364j122094k201655j281717n92959n37007o38657j059392j184986L54905
$$ 4398364 3276270 1074615 -207102 -800061 -1337068 -1975725 -3035117 -4220103 -3865198
37224c865198K633875K591879j07664j843180n73471J012348K68130j089218m48976
$$ -3865198 -1231323 1360556 1252892 -590288 -1163759 -151411 116719 -972499 -1421475
37215a421475J080947R81478k58931n08336J80179L80811K70018O81542P11629
$$ -1421475 -340528 640950 382019 -126317 53862 434673 704691 1386233 2097862
37206B097862o62955j931710j080520Q68803J362937L85305j488N70001N10124
$$ 2097862 1434907 -496803 -1577323 -708520 654417 1039722 1038234 1608235 2118359
37197B118359n59836j221335q34100k77902q0488J09200K35167p0342k57106M72061
$$ 2118359 1558523 337188 -496912 -774814 -855302 -746102 -510935 -581277 -838383 -366322
37187c66322J471502J361112J87848p19207p12711j38913P77292J769570J858086
$$ -366322 1105180 2466292 2654140 1934933 1222222 1083309 1860601 3630171 5488257
37178E488257N09571j102833j565351j185211r12003m36445O37081R65730n99049
$$ 5488257 5997828 4894995 3329644 2144433 1232430 795985 1433066 2398796 1799747
37169A799747k198358j069478J973436L254194J458865r01475j634650j421116
$$ 1799747 -398611 -1468089 505347 3759541 5218406 4316931 2682281 1261165
37161A261165j354602q62874L85068Q65376n49002k223071j565431J414039L745172
$$ 1261165 -93437 -956311 -571243 294133 -254869 -2477940 -4043371 -2629332 1115840
37152A115840K709367j077117l896432k661843J344902L605076K057629j39896
$$ 1115840 3825207 2748090 -1148342 -3810185 -2465283 1139793 3197422 3057526
37144C057526N26590K326737J036048k876485m367686j462837J888394K171512
$$ 3057526 3584116 5910853 6946901 4070416 -297270 -1760107 128287 2299799
37136B299799J078869J265324J400913o44588k762917j535542J497107J540667
$$ 2299799 3378668 4643992 6044905 5400317 2637400 1101858 2598965 4139632
37128D139632j845938l783107j556490J510973J668755K48502M62326J674100
$$ 4139632 2293694 -1489413 -3045903 -1534930 133825 382327 844653 2518753
37120B518753Q79810j616622k307672k11328J505275O94836n29390K99470J872222
$$ 2518753 3398563 1781941 -525731 -737059 768216 1463052 933662 1233132 3105354
37111C105354J678043L79768J79064M11939j193756l574050l132849J11694J771603
$$ 3105354 4783397 5163165 5342229 5754168 4560412 986362 -2146487 -2034793 -263190
37102b63190o7400j729200j33461K145082J544001m21957k44113J217540N82502
$$ -263190 -330590 -2059790 -2193251 -48169 1495832 1073875 829762 2047302 2629804
37093B629804j609189j758585K39482P99241q50493j346566O45313K054424Q70498
$$ 2629804 1020615 -737970 -498488 300753 -549740 -1896306 -1250993 803431 1673929
37084A673929p11348p56887q02460j954183j873923J037486L847801L107268M1669
$$ 1673929 962581 205694 -596766 -2550949 -4424872 -3387386 460415 3567683 3609352
37075C609352j753847j572430j081553n34103Q36402K035110J477627M9178j68086
$$ 3609352 1855505 283075 -798478 -1332581 -496179 1538931 3016558 3065736 2897650
37066B897650N61121L22978r29527j446142o84033M19276J496941K470420K103369
$$ 2897650 3458771 3781749 2852222 1406080 722047 1141323 2638264 5108684 7212053
37057G212053k88196k514361k012235M0579M65819o58019l25601J857160K632358
$$ 7212053 6923857 4409496 2397261 2437840 2903659 2245640 1920039 3777199 6409557
37048F409557M58202j943755j912508m10975M48837N09224L44368m07542j501547
$$ 6409557 6867759 4924004 3011496 2600521 3049358 3558582 3902950 3495408 1993861
37039A993861j287615M29997R79292j347334l991069l353793P8150K632786K615608
$$ 1993861 706246 1136243 2115535 768201 -3222868 -6576661 -6498511 -3865725 -1250117
37030a250117J758612J705369J702531M70354j467336k378963j488780J34498
$$ -1250117 508495 2213864 3916395 4386749 2919413 540450 -948330 -813832
37022h13832P41210j31227j022666l97731J117463J546636O29534K73454J314960
$$ -813832 -72622 -203849 -1226515 -1624246 -506783 1039853 1669387 1942841 3257801
37013C257801J958285Q74493k37337N47521J715574M61412k434738l333389j398254
$$ 3257801 5216086 6090579 5853242 6400763 8116337 8577749 6143011 2809622 1411368
37004A411368j8132j474289l364539k396500O64033K449470J902122R64550J013462
$$ 1411368 1393236 -81053 -3445592 -5842092 -5178059 -2728589 -826467 138083 1151545
36995A151545J268534Q51645J52337l72473q89371j080819j30567J385773J394441
$$ 1151545 2420079 3271724 3424061 3051588 2162217 1081398 950831 2336604 3731045
36986C731045o78943k454016j768326J10184N19712m25738l27567J217267J783193
$$ 3731045 3052102 598086 -1170240 -1060056 -540344 -966082 -1293649 -76382 1706811
36977A706811J65318j513620j183927k5864k47674j323533r18310J207206K674497
$$ 1706811 1872129 358509 -825418 -851282 -1098956 -2422489 -3340799 -2133593 540904
36968E40904J938477K63518l13829L85076Q22191j98961k127890l102924j821877
$$ 540904 2479381 2742899 2429070 2814146 3636337 3437376 1309486 -1793438 -3615315
36959c615315Q46881K557619K084738N16701n43572q61032q46372k61430R60061
$$ -3615315 -2768434 -210815 1873923 2390624 1847052 986020 139648 -121782 838279
36950H38279J665683R15252l61134p88473p11729j041539r86338N68921K178307
$$ 838279 2503962 3419214 3058080 2269607 1557878 516339 -469999 98922 2277229
36941B277229J315000j441074k787394j510222K23025Q64036J334023J866121
$$ 2277229 3592229 2151155 -636239 -2146461 -1923436 -1059400 274623 2140744
36933B140744P06879k119615l243439q41388J860862J160985j479280j954347
$$ 2140744 2847623 728008 -2515431 -3356819 -1495957 -334972 -1814252 -3768599
36925c768599J54192J688017J298207P03151P73295J92247j332185j752736K10163
$$ -3768599 -3614407 -1926390 -628183 74968 848263 1040510 -291675 -2044411 -1834248
36916a834248K906297L791833K123420q32444k874056k214821N60647K180307
$$ -1834248 1072049 4863882 6987302 6154858 3280802 1065981 1626628 3806935
36908C806935L30340k783855k993531O156K379082J814306O8562q88257j620543
$$ 3806935 4137275 1353420 -1640111 -1633955 745127 2559433 2627995 1739738 119195
36899A19195k542438k008086N02632K277191J302234k26837N04054K071121J307277
$$ 119195 -2423243 -4431329 -3928697 -1651506 -349272 -576109 -72055 1999066 3306343
36890C306343r74772j080862J314329K438952M83277j693876j376406k5540l07295
$$ 3306343 2331571 1250709 2565038 5003990 5487267 3793391 2416985 2391445 2084150
36881B084150j713152j786844j71259J104359P38282m33820r55190l00291R55792
$$ 2084150 370998 -1415846 -1587105 -482746 255536 -178284 -1133474 -1433765 -477973
36872d77973J615950Q33393p36769j394541o66954j49356j084156k200473j500502
$$ -477973 1137977 1971370 1234601 -159940 -826894 -976250 -2060406 -4260879 -5761381
36863e761381O05287J833338J374862P08031Q70703Q88414k65200j695982j763004
$$ -5761381 -5156094 -3322756 -1947894 -1239863 -369160 519254 254054 -1441928 -3204932
36854c204932l05972J365520K125336J793920P23633n15199j264811j274870r72735
$$ -3204932 -3510904 -2145384 -20048 1773872 2497505 1982306 717495 -557375 -1530110
36845a530110q43019p42296j63274J015457K216595K379020O93486k134412l545442
$$ -1530110 -2373129 -3115425 -3278699 -2263242 -46647 2332373 3025859 891447 -2653995
36836b653995j442703K721094M687825K249366j952578l800441k601865q17629
$$ -2653995 -4096698 -1375604 3312221 5561587 3609009 -191432 -2793297 -3610926
36828c610926K4170O46374J529798J757996R73428K68143J45595m65823j896407
$$ -3610926 -3586756 -2940382 -1410584 347412 1320840 1588983 1734578 1268755 -627652
36819f27652k201697K21960L572293M223035J196203k511007l366796j120447
$$ -627652 -2829349 -2607389 964904 5187939 6384142 3873135 506339 -614108
36811f14108J242623R92111j258742k278411k20460K815983L291853P90203j645714
$$ -614108 628515 1620626 361884 -1916527 -2136987 678996 3970849 4761052 3115338
36802C115338j736310m32174M40109P21635Q08938J47048j237609j463875O24512
$$ 3115338 1379028 946854 1386963 2108598 2917536 3064584 1826975 363100 987612
36793I87612K923676K603084K02415j393482j309748j149891j501011j108433
$$ 987612 3911288 6514372 6716787 5323305 4013557 2863666 1362655 254222
36785B54222J87417P33938R3903J7572J254162J958402P63878q21700q52837J08875
$$ 254222 441639 1175577 1269480 1287052 2541214 4499616 5263494 4441794 3588957 3697832
36775C697832L64567j68523n35127q25529j632905k247966j374274O83639K111930
$$ 3697832 4062399 3893876 3358749 2533220 900315 -1347651 -2721925 -2038286 73644
36766G3644J737610O8808j448891j473906K03477J965702J776265M7996m77294
$$ 73644 1811254 1880062 431171 -1042735 -839258 1126444 2902709 2950705 2473411
36757B473411J122314K018206j7027k413153j308411K042902K634397m56332k187121
$$ 2473411 3595725 5613931 5596904 3183751 1875340 3918242 6552639 6096307 3909186
36748C909186P70775M605004L888935l53619k378273k90283J683221O9198k822408
$$ 3909186 4679961 9284965 13173900 12820281 10442008 10151725 11834946 11904144 9081736
36739I081736k952350o86716L72849p27552j197811N67618K308830J608892k93550
$$ 9081736 6129386 5442670 5815519 5087967 3890156 4457774 6766604 8375496 8081946
36730H081946o85822L15748L83062r08283j475586k72844J283277J975075K275496
$$ 8081946 7396124 7711872 8094934 7186651 5711065 5438221 6721498 8696573 10972069
36721A0972069K255958O81235k186565l338272r16763K440684K801652K85522
$$ 10972069 13228027 13909262 11722697 8384425 7467662 9908346 12709998 12995520
36713A2995520j501597o75777J020183J375227K71549j148455j786114q12033
$$ 12995520 11493923 10818146 11838329 13213556 13485105 12336650 10550536 9738503
36705I738503J530563L211871K415921L56969M480J761265K780107J316324o03520
$$ 9738503 11269066 14480937 16896858 17253827 17258307 19019572 21799679 23116003 22512483
36696B2512483k43683J954164L271784K440094R01610P45145K390796M286235
$$ 22512483 22268800 24222964 27494748 29934842 30836452 31581597 33972393 38258628
36688C8258628M665435L757780L755412N892314Q481526R337024R220394J0643603
$$ 38258628 42924063 46681843 50437255 56329569 64811095 74148119 83368513 94012116
36680I4012116J3813378J6519397J7985906J9797633K2553543K4692015K5348471
$$ 94012116 107825494 124344891 142330797 162128430 184681973 209373988 234722459
36673B34722459K5027286K2362201J4073058L39126j3184187k1398488k4935726
$$ 234722459 259749745 282111946 296185004 296524130 283339943 261941455 237005729
36666B37005729k6767224k6998446k4575941k1247054j9488732j8388611j5689510
$$ 237005729 210238505 183240059 158664118 137417064 117928332 99539721 83850211
36659H3850211j2253444j0321099q966853n915655k600838k363501m370453m648836
$$ 83850211 71596767 61275668 52308815 46393160 43792322 41428821 37058368 32409532
36651C2409532k918444k728166m428901m114258r69656M98308j846278l667597
$$ 32409532 29491088 26762922 22334021 18219763 17250107 17748415 15902137 12234540
36643A2234540j399631J581922O45804k401712k589789J26820J471121o2125j763369
$$ 12234540 10834909 12416831 13062635 10660923 8071134 8197954 9669075 9606950 7843581
36634G843581j740013j020111o52547k87135J76459L45315O65972J591254J907530
$$ 7843581 6103568 5083457 4430910 4143775 4320234 4665549 5331521 6922775 8830305
36625H830305L55191j726799j962121n27595M06981J71103j46348k56542o75042
$$ 8830305 9185496 7458697 5496576 4968981 5375962 5547065 5400717 5144175 4469133
36616D469133p59040L72611J519749R66469k84143q0369P75504k22031k356166
$$ 4469133 3710093 4082704 5602453 6568922 6284779 6204410 6979914 6757883 4401717
36607D401717k352986j63566N85965j124243j773064N20973K522999J317937r12458
$$ 4401717 2048731 1885165 2471130 1346887 -426177 94796 2617795 3935732 3023274
36598C023274r52865J26908l45787j459174o05075J319102J136962j047507j845859
$$ 3023274 2070409 2197317 1851530 392356 -212719 1106383 2243345 1195838 -650021
36589f50021j24317J366138N89732q70034p38765O62115J510152J119438J51277
$$ -650021 -774338 591800 1181532 311498 -427267 234848 1745000 2864438 3015715
36580C015715o71681r85254o21994J96283Q55161Q93112L69961k31895k85512
$$ 3015715 2344034 1358780 736786 933069 1788230 2681342 3051303 2819408 2533896
36571B533896L71582Q51740L2398j589225j976557l36207J424942J300789L1189
$$ 2533896 2905478 3757218 3789616 2200391 223834 -112373 1312569 2613358 2644547
36562B644547l73736N8803l66239j765421k144131m46022J729979K126031L45676
$$ 2644547 2270811 2329614 1963375 197954 -1946177 -2392199 -662220 1463811 1809487
36553A809487k024946k919607j394103J338412K670419J397631o95723j238185
$$ 1809487 -215459 -3135066 -4529169 -3190757 -520338 877293 181570 -1056615
36545a056615m84769l41037q83184l77867J246455J737366J32650j489507j208735
$$ -1056615 -1541384 -1882421 -2765605 -3143472 -1897017 -159651 -27001 -1516508 -2725243
36536b725243n8250N0900n80692m06789N76958J111734J021640J254534J811989
$$ -2725243 -2783493 -2732593 -3313285 -3720074 -3143116 -2031382 -1009742 244792 2056781
36527B056781J485338p5800j448881j179372L46079J290822L81812j660541k745067
$$ 2056781 3542119 3466319 2017438 838066 1184145 2474967 2856779 1196238 -1548829
36518a548829j681683K94931R22293j92915j137016m61589R19011J399502R44299
$$ -1548829 -3230512 -2935581 -2013288 -2206203 -3343219 -3804808 -2885797 -1486295 -541996
36509e41996M33909q5200q43282r39011M64450J979211J318139j111922k290246
$$ -541996 -108087 -193287 -1036569 -1975580 -1511130 468081 1786220 674298 -1615948
36500a615948q84640Q81436Q74199K47012R67937K062991J200055r56999j269237
$$ -1615948 -2500588 -1619152 -744953 -497941 469996 2532987 3733042 2776043 1506806
36491A506806Q56498K166614M33940k124770k224117j85298J171936Q75148L25772
$$ 1506806 2363304 4529918 4963858 2839088 614971 429673 1601609 2476757 2802529
36482B802529J90405m14541j545545j787627o08354P19642J231868J378003J311197
$$ 2802529 2992934 2578393 1032848 -754779 -1363133 -643491 588377 1966380 3277577
36473C277577J70824j826537k635839j272775L26829J39057q45903m81241Q79426
$$ 3277577 3448401 1621864 -1013975 -2286750 -1959921 -1820864 -2666767 -3148008 -2268582
36464b268582J084093j80391j005068l40049Q69201J716502K316436K452287J355302
$$ -2268582 -1184489 -1364880 -2369948 -2709997 -1840796 -124294 2192142 4644429 5999731
36455E999731n76435j717876j561415j368269j753315j502588O1296J296700M98433
$$ 5999731 5423296 3705420 2144005 775736 -977579 -2480167 -2418871 -1122171 -623738
36446f23738j270504j483573K76344J830555J447844j77878j359012j533719j170763
$$ -623738 -1894242 -3377815 -3101471 -1270916 176928 -950 -1359962 -2893681 -4064444
36437d064444m56029P22523J701937J298064l28312j193659q356J653405J329980
$$ -4064444 -4520473 -3797950 -2096013 -797949 -1126261 -2319920 -2328276 -674871 655109
36428F55109o25845j449546k01460Q98391K54887o10999m9225P20734J7271j010862
$$ 655109 29264 -1420282 -1621742 -723351 -468464 -1079463 -1128688 -407954 -390683 -1401545
36418a401545m31032Q60332Q63114L29245J103967J807764k85664l529969l234479
$$ -1401545 -1832577 -972245 -109131 220114 1324081 3131845 2846181 -683788 -3918267
36409c918267O25233K387080o81686l854964k199502J991148L141231O10893j536982
$$ -3918267 -3293034 -905954 -1587640 -5442604 -7642106 -5650958 -2509727 -1898834 -3435816
36400c435816j061399N00535J457080J703692J133584n01706k083247j924562
$$ -3435816 -4497215 -3996680 -2539600 -835908 297676 -204030 -2287277 -4211839
36392d211839j10866J711850K422621J819317O306j921670j989754q6695J045386
$$ -4211839 -4322705 -2610855 -188234 1631083 1637389 -284281 -2274035 -2360730 -1315344
36383a315344k17562j436392k295K171993J642658o53583j049827L84294K16983
$$ -1315344 -1532906 -2969298 -2971593 -799600 843058 189475 -860352 -476058 -259075
36374b59075j660720j319680K111450M049210J481334k302109k998386j278201
$$ -259075 -1919795 -3239475 -1128025 2921185 4402519 2100410 -897976 -2176177
36366b176177l0800P99422K451921L184799O71527k922752l102050N9144J757891
$$ -2176177 -2206977 -1407555 1044366 4229165 4900692 1977940 -1124110 -1064966 692925
36357F92925j79247k119002n91678K242447K094899q15996k282092n85387J138250
$$ 692925 513678 -1605324 -2197002 45445 2140344 1324348 -957744 -1543131 -404881
36348d04881m3047k334313j986568J057811L160951K315857N55218K13648M63515
$$ -404881 -447928 -2782241 -4768809 -3710998 -550047 1765810 2321028 2534676 2998191
36339B998191n54631k171689k293802r14978J05793K01661M07531P24623p2923
$$ 2998191 2443560 271871 -2021931 -2936909 -2831116 -2629455 -2221924 -1497301 -1570224
36330a570224j669241j905256p2670J810229K014348J268347Q21718M54590j82272
$$ -1570224 -3239465 -5144721 -5217391 -3407162 -1392814 -124467 697251 1151841 969569
36321I69569j98095Q29562J355673l1997k152560k700375j376087J03462N24431
$$ 969569 771474 1601036 2956709 2924712 772152 -1928223 -3304310 -3200848 -2676417
36312b676417J93783j51535j34403L34541R48836J078096N73932K4096k12901
$$ -2676417 -2482634 -2634169 -2768572 -2434031 -1485195 -407099 166833 190929 -21972
36303b1972m01006m75076R2334R21218P28926m69428r01440M2484L93661j105370
$$ -21972 -422978 -898054 -805720 115498 844424 374996 -526444 -483960 -90299 -1195669
36293a195669k255037n24123K525115L064612O04402j489418j166330j62631m29324
$$ -1195669 -3450706 -3974829 -1449714 1614898 2219300 729882 -436448 -599079 -1028403
36284a028403j004935j59977J403825J547809j29463j802125j723302K7749J839969
$$ -1028403 -2033338 -2193315 -789490 758319 628856 -1173269 -2896571 -2868822 -1028853
36275a028853K049232N07492j097301j120062j27980m7989j092599j294238K20410
$$ -1028853 1020379 1527871 430570 -689492 -817472 -865461 -1958060 -3252298 -3031888
36266c031888J506683Q72045j52092P40921K458375J843363j060242k451420m55406
$$ -3031888 -1525205 -653160 -805252 -64331 2394044 4237407 3177165 725745 270339
36257B70339J793931Q61382j741963k080029k765Q74607q37994k135213n61355
$$ 270339 2064270 2925652 1183689 -896340 -899105 -24498 -862492 -2997705 -3559060
36248c559060J905624K014697l38j288559n94132P83031J385196Q23729p41515
$$ -3559060 -1653436 361261 360923 -927636 -1521768 -738737 646459 1470188 728673
36239G28673k361625k165555M81720L237546L328382J303362r0038k11792q01875
$$ 728673 -1632952 -3798507 -3316787 -79241 3249141 4552503 4462465 4250673 3448798
36230C448798k087646k027714k24179P00157q36648k749660k570805r16787L26363
$$ 3448798 1361152 -666562 -890741 -190584 -1027232 -3776892 -6347697 -7264484 -6938121
36221f938121J005534J594289J159516q50576k365357j156314J481166K378165
$$ -6938121 -5932587 -4338298 -3178782 -4029358 -6394715 -7551029 -6069863 -3691698
36213c691698J164549M05004J308394K197180J625303M47915n5813j00257m44283
$$ -3691698 -2527149 -2122145 -813751 1383429 3008732 3456647 3400834 3300577 2856294
36204B856294j012564j354872j388801j054511j86552Q32262J231287J001002
$$ 2856294 1843730 488858 -899943 -1954454 -2141006 -1308744 -77457 923545
36196I23545R11589J096725P24974m27564j164902m59524Q70906J036040m01594
$$ 923545 1835134 2931859 3656833 3229269 2064367 1604843 2475749 3511789 3110195
36187C110195j881474j723259j70771R31145M54722o62314q50355o5936M86189
$$ 3110195 1228721 -494538 -665309 265836 720558 58244 -792111 -858047 -371858
36178c71858M04133L93039M68829l40380j799720j789870P68803L659270L758831
$$ -371858 32275 425314 894143 553763 -1245957 -3035827 -2267024 1392246 5151077
36169E151077R30199k055072k970852k036691p01838K5199q259l30776l53497
$$ 5151077 6081276 4026204 1055352 -981339 -1683177 -1657978 -1666237 -1997013 -2350510
36160b350510n9327J03625J56962N31969Q37240Q7295j269251j311054L34967
$$ -2350510 -2409837 -2306212 -2149250 -1617281 -780041 -692746 -1961997 -3273051 -2938084
36151b938084J383956L57859q49832m8910J439156Q68243j311408k071920m57304
$$ -2938084 -1554128 -1196269 -2046101 -2095011 -655855 212388 -1099020 -3170940 -3628244
36142c628244J466662K159632K127343J702606K32999j796878k379692p96852
$$ -3628244 -2161582 -1950 2125393 3827999 4060998 2264120 -115572 -912424
36134i12424J087992J302233N0602j140449j256601l20675P67545P51938n59160
$$ -912424 175568 1477801 1528403 387954 -868647 -1189322 -421777 330161 -228999
36125b28999j628449j115482J65282O95557P18030J226339J471198R5142j889471
$$ -228999 -1857448 -2972930 -2807648 -2112091 -1394061 -167722 1303476 1398618 -490853
36116d90853k157455p71799J47525J77147P26867J527997P12537j198075j312112
$$ -490853 -2648308 -3420107 -3272582 -3095435 -2368568 -840571 -128034 -1326109 -2638221
36107b638221O82728J555340l9060j141378M32628K359066J822618q544n48033
$$ -2638221 -1955493 -400153 -439213 -1580591 -1147963 1211103 3033721 3025177 2477144
36098B477144r5423m04654j174402j113631p08439r63227j015770J15561R96738
$$ 2477144 2381721 1977067 802665 -310966 -1019405 -1982632 -2998402 -2882841 -1886103
36089a886103J09j349761m60336J904376K542562O70305j200820j193978j77733
$$ -1886103 -1885994 -3235755 -3696091 -1791715 750847 1421152 220332 -973646 -1151379
36080a151379L27852J45536j18753p7482L02665O26476L37976k92973k67313M23369
$$ -1151379 -823527 -677991 -796744 -874226 -571561 54915 392891 99918 -167395 255974
36070B55974N64239K9653L72464J803710J945463l59383k373956j363636R30035
$$ 255974 820213 849866 1222330 3026040 4971503 4612120 2238164 874528 1804563
36061A804563J023277p77748j348685j73314K71243p14581q96488P39983K166830
$$ 1804563 2827840 2050092 701407 528093 799336 84755 -811733 -71750 2095080
36052B095080J649670J12569q45096r94487o93976p6116K89219l21223j395336
$$ 2095080 3744750 3857319 3012223 2017736 1323760 1247644 1536863 1215640 -179696
36043a79696j667103j037047l63515L12388J311439J600886P0175j782964j296717
$$ -179696 -1846799 -2883846 -3247361 -2934973 -1623534 -22648 47527 -1735437 -3032154
36034c032154J192848K570508J562666R8990l67996o36963j026766k36128J693872
$$ -3032154 -1839306 731202 2293868 2392858 2024862 1387899 361133 125005 1818877
36025A818877K425846J058209q8313O48727J413988K10458j397013q10453J235452
$$ 1818877 4244723 5302932 5214619 5863346 7277334 7487792 6090779 5280326 6515778
36016F515778J857068M58418q24638n71067M53465J082611J048003N22841j49701
$$ 6515778 8372846 8831264 8006626 7435559 7889024 8971635 10019638 10542479 10392778
36007A0392778l78642r2346j88541j155256j866862j031868O88263J406289N92942
$$ 10392778 10014136 9921790 9733249 8577993 6711131 5679263 6367526 7773815 8366757
35998H366757l82203k84630N13772Q01481L0401j194162j795328j298256k55782
$$ 8366757 7984554 7699924 8213696 9015177 9045578 7851416 6056088 4757832 4502050
35989D502050M91372P25626O19287O2062q88758j285704l00085J176796J344211
$$ 4502050 4993422 5719048 6338335 6400397 5511639 4225935 3925850 5102646 6446857
35980F446857n5614j508447j947065j589740n84047J179189K637419K190377L71871
$$ 6446857 6391243 4882796 2935731 1345991 761944 1941133 4578552 6768929 7140800
35971G140800m50605J27906k87895k559325l719547j394819J867035J836900j237310
$$ 7140800 6690195 6818101 6530206 3970881 251334 -1143485 723550 2560450 1323140
35962A323140l026787j224384J789729K691179J143079p97814j458067p98883
$$ 1323140 -1703647 -2928031 -1138302 1552877 2695956 1898142 440075 -358808
35954c58808J52958M57955J82942J95105Q15778J228375P48879j9771o6711N97111
$$ -358808 -205850 252105 435047 630152 1445930 2674305 3423184 3403413 3336702 3933813
35944C933813J116621Q37675l33340j827416k294894p98152J353788J526004o45177
$$ 3933813 5050434 5888109 5554769 3727353 1432459 634307 1988095 3514099 2868922
35935B868922k351578j512275L60170Q66767L29855M19378Q70119L62360m79276
$$ 2868922 517344 -994931 -634761 232006 561861 981239 1851358 2213718 1734442
35926A734442J6536J283347J164635k81812o00286J038260K319272J170346j433590
$$ 1734442 1750978 3034325 4198960 3917148 3316862 4355122 6674394 7844740 6411150
35917F411150l027383k519744p72154N64531M34098n19156m35159J186213K196191
$$ 6411150 3383767 864023 91869 656400 1090498 571342 136183 1322396 3518587
35908C518587O65792j881982k306075k63968J694093K031812J523551Q54532j22142
$$ 3518587 4184379 2302397 -3678 -267646 1426447 3458259 4981810 5836342 5714200
35899E714200o24360M64770J841749Q51477j990395k969582q32933J059402M4996
$$ 5714200 5089840 5554610 7396359 8247836 6257441 3287859 2454926 3514328 3559324
35890C559324j769576j223237J004785K093364J442397M47376l54856j188099
$$ 3559324 1789748 566511 1571296 3664660 5107057 5554433 5199577 4011478
35882D011478j477288p83745K5632N02262J663255L286865K718025p33580k887606
$$ 4011478 2534190 1750445 1776077 2278339 3941594 7228459 9946484 9212904 6325298
35873F325298j29672M434818M975120J604779k46628J459047L058459K225215
$$ 6325298 6195626 10630444 15605564 17210343 16963715 18422762 21481221 23706436
35865B3706436J549886L128472M734817M275980L752960N424143P546120P435206
$$ 23706436 25256322 28384794 33119611 37395591 41148551 46572694 54118814 61554020
35857F1554020N781453M379198K376491j280785m149717l522567j586758k628075
$$ 61554020 67335473 71714671 74091162 72810377 68660660 65138093 63551335 60923260
35849F0923260o208488q056988p201131o851531p784713o541036k113362Q69269
$$ 60923260 54714772 46657784 39456653 32605122 24820409 18279373 16166011 17035280
35841A7035280j034008m283378l565567K12820J806142k30119k139446j366884
$$ 17035280 16001272 11717894 8152327 8365147 10171289 9941170 7801724 6434840
35833F434840J90107K36980m34827l07311p9696r45891j862223j063908O93038
$$ 6434840 6624947 6861927 6427100 6119789 6040093 5094202 3231979 2168071 2861109
35824B861109R15210p53670j754840l72441J636546J557505l88914j567054q87288
$$ 2861109 3776319 3022649 1267809 895368 2531914 4089419 3700505 2133451 1246163
35815A246163p1698n11928j037284j96879J066906J139028P41252J449665K027076
$$ 1246163 1174465 662537 -374747 -571626 495280 1634308 2375560 3825225 5852301
35806E852301k35705m271641n216767j238349L131227L076055k8709j543824o19079
$$ 5852301 5616596 1344955 -3871812 -5110161 -1978934 1097121 1068412 -475412 -1094491
35797a094491j96617j258065j586529k79665P04492M07018N88665K144672K989569
$$ -1094491 -1291108 -2549173 -4135702 -4415367 -3710875 -3303857 -2715192 -570520 2419049
35788B419049J432043q74185j411589l04056N71813L97184m09877j418582j970864
$$ 2419049 3851092 2976907 1565318 1261262 1833075 2230259 1820382 401800 -1569064
35779a569064j056853J060393K357364J633912K66864n0177J80722k95674j027005
$$ -1569064 -2625917 -1565524 791840 2425752 2692616 2642439 2823161 2527487 1500482
35770A500482q70071k39648j65932r4457J092177K561926K344254K82465j877759
$$ 1500482 630411 390763 224831 130374 1222551 3784477 6128731 6411196 4533437
35761D533437k980723l077161k067660L2352J792608J686243N96103O22283J465640
$$ 4533437 1552714 -1524447 -3592107 -3559755 -1767147 -80904 515199 1137482 2603122
35752B603122P68079j585842k597320q00534J094728K39067j936927j929097O18364
$$ 2603122 3371201 1785359 -811961 -1612495 -517767 -278700 -2215627 -4144724 -3526360
35743c526360K715084K578445J648654J576393J542550J6663k212985k698558
$$ -3526360 -811276 1767169 3415823 4992216 6534766 6551429 4338444 1639886
35735A639886q38674R84786M82159j527880k391023j200287M61694J148644J078564
$$ 1639886 801212 1785998 2268157 740277 -1650746 -2851033 -2389339 -1240695 -162131
35726a62131O92142l26857j605154j554841J69505J372470M52473o41995Q70526
$$ -162131 530011 203154 -1402000 -2956841 -2787336 -1414866 -962393 -1604388 -733862
35717g33862L905108M520265J527727j803034k286725o16249M71873l8120q34685
$$ -733862 3171246 7691511 9219238 7416204 5129479 4513230 4985103 4946983 4112298
35708D112298m37834R76024J602588m1801k762666l332840p39705J707922P88661
$$ 4112298 3674464 4650488 6253076 6211275 3448609 115769 -623936 1083986 1872647
35699A872647j596120j180295J812189K934132P71638r22289K39401J441613N197
$$ 1872647 276527 -903768 908421 3842553 4614191 3691902 3931303 5372916 5378113
35690E378113j789319q62164J205286J091226n65799q68966o1209n06016j594432
$$ 5378113 3588794 2726630 3931916 5023142 4457343 3588377 3527168 3021152 1426720
35681A426720n91962J919603K331412L9540j429816k45893J092416M32306o43344
$$ 1426720 834758 2754361 5085773 5125313 3695497 3449604 4542020 4974326 4330982
35672D330982q8432J274668J860179J912971J911991J129941j4246R84111M563384
$$ 4330982 4242550 5517218 7377397 9290368 11202359 12332300 12318054 13302165 17865549
35663A7865549O702838M178616J36171L17590M860216Q238985P307963M964337
$$ 17865549 24568387 28747003 28883174 29200764 34060980 42299965 49607928 54572265
35655E4572265M609436M988632L122817l61870k078131r48025M38054m87289l345666
$$ 54572265 59181701 64170333 67293150 66931280 64853149 63905124 64343178 63855889 60510223
35646F0510223o013231p177000o973805o115625n260226m820379m696317m270853
$$ 60510223 54496992 47319992 40346187 34230562 28970336 24149957 19453640 15182787
35638A5182787l074697j431650j65265K86672J45509l17430j167110k237545k619648
$$ 15182787 12108090 10676440 10511175 10797847 10943356 10625926 9458816 7221271 4601623
35629D601623j497856M89808J567353Q80462m88949j124103j087673j195140j234109
$$ 4601623 3103767 3593575 5160928 6041390 5552441 4428338 3340665 2145525 911416
35620I11416m30777O13298L45150j053735j405883Q2547J159837q9958j940536
$$ 911416 480639 1093937 1439087 385352 -1020531 -937984 221853 131895 -1808641
35611a808641j494670P04686J463020p0604j371416q57980L402O216L78270J725805
$$ -1808641 -3303311 -2598625 -1135605 -1206209 -2577625 -3435605 -3432203 -3425987 -3047717 -1321912
35601a321912J831766o65721k851273j332040K172500K967230K94771k010430
$$ -1321912 509854 -155867 -3007140 -4339180 -2166680 800550 1095321 -915109
35593i15109j750782r67362j370764j319737O17567K546604K325308J074154P87906
$$ -915109 -2665891 -3633253 -5004017 -6323754 -5706187 -3159583 -834275 239879 1027785
35584A027785O86349q77878k580338j786688P70902J611296j43218j424658p0802
$$ 1027785 1714134 836256 -1744082 -3530770 -2759868 -1148572 -1291790 -2716448 -2787250
35575b787250J949065J749019k27311j207196j19158J385902J598491P66240J09272
$$ -2787250 -838185 910834 683523 -523673 -642831 743071 2341562 3107802 3217074
35566C217074o9494m74637j324881j645912n88595R56410J044680p53714k395592
$$ 3217074 3147580 2672943 1348062 -297850 -886445 69965 1114645 360931 -2034661
35557b034661j735209P33415K443872J820736j51957j459524j303948m31961K60616
$$ -2034661 -3769870 -3036455 -592583 1228153 1076196 -383328 -1687276 -2119237 -1858621
35548a858621P62428J391079J689348P65392j004720j701747l60126J132437L45848
$$ -1858621 -1096193 294886 1984234 2749626 1744906 43159 -316967 815470 1161318
35539A161318j936470k496357l83657J658386J361963L1168j14009N80148N65230
$$ 1161318 -775152 -3271509 -3655166 -1996780 -634817 -603649 -717658 -137510 427720
35530D27720J20021M41448R77887L57236q58315j018605m01626o29582j399038
$$ 427720 547741 989189 1967076 2324312 1465997 447392 45766 -583816 -1982854
35521a982854p47490J253079K054161O28955q37572m88455L71403l21012j928100
$$ -1982854 -2730344 -1477265 576896 1205851 368279 -120176 251227 -69785 -1997885
35512a997885k035429Q553K131686K022161k74726k319360j769026R34158K857938
$$ -1997885 -4033314 -4024761 -1893075 129086 -145640 -2465000 -4234026 -3299868 -441930
35503d41930K108761J10921q03654q27516j568986k472985j357540J507895L020367
$$ -441930 1666831 1777752 974098 146582 -1422404 -3895389 -5252929 -3745034 -724667
35494g24667J693324l97047j186682j298817j668190j301585M79819J909313J307088
$$ -724667 968657 571610 -615072 -1913889 -3582079 -4883664 -4403845 -2494532 -1187444
35485a187444r2728k66664K75530j12683q67616j68369J549951J956730N23983
$$ -1187444 -1280172 -1546836 -1271306 -1383989 -2251605 -2419974 -870023 1086707 1610690
35476A610690p89081p89413o32210j492062k493626j908152N65463L264368L862378
$$ 1610690 821609 32196 -600014 -2092076 -4585702 -6493854 -5928391 -2664023 1198355
35467A198355J471807j904330k773318j52000K671361J984534j451532l432594
$$ 1198355 2670162 765832 -2007486 -2159486 511875 2496409 1044877 -2387717
35459b387717j939447O71307J499841P45107L27751P46097J050678R30089R99091
$$ -2387717 -4327164 -3655857 -2156016 -1410909 -1083158 -337061 713617 1643706 2642797
35450B642797J219021N91642j122045k438011j792582K64048J536991R67603j42942
$$ 2642797 3861818 4453460 3331415 893404 -899178 -635130 901861 1869464 1726522
35441A726522l17509j08754p26644j470141p55685O89910M72599j247888j360267
$$ 1726522 1409013 1300259 573615 -896526 -1652211 -962301 -489702 -1737590 -3097857
35432c097857J043598K432080K21175k601451j795936J410508K259181o1941j609710
$$ -3097857 -2054259 377821 598996 -2002455 -3798391 -2387883 -128702 -190643 -1800353
35423a800353l52496J065121L64370q14082m29534L94869j22433j045172n64190
$$ -1800353 -2152849 -1087728 -723358 -1537440 -1966974 -1572105 -1694538 -2739710 -3303900
35414c303900P54714J190332Q48808R44089J258260P51301j07605J6901P79776
$$ -3303900 -2549186 -1358854 -510046 434043 1692303 2443604 2335999 2352900 3132676
35405C132676M69686j123808k055099q57813J434536K424501R72791j501461k343078
$$ 3132676 3602362 2478554 423455 -434358 1000178 3424679 4397470 2896009 552931
35396E52931o75823J214684O90176j354195j555591P03903K079740N87026j083063
$$ 552931 -122892 1091792 1781968 427773 -1127818 -423915 1655825 2242851 1159788
35387A159788j57530J295758j10143k821748k447627P97636K052515k91268j902054
$$ 1159788 1002258 2298016 2187873 -633875 -3081502 -2283866 -231351 -522619 -2424673
35378b424673L77211L406410K798032n52359k603872k186306j086644o2297J235669
$$ -2424673 -2047462 1358948 4156980 3604621 1000749 -1185557 -2272201 -2334498 -1098829
35369a098829J569190m97863k908548j957716J745660L192197J70347l152584
$$ -1098829 470361 -27502 -2936050 -4893766 -3148106 44091 214438 -2938146
35361b938146k135007J817995L680258J867085m90374o41618O03101J166568O18159
$$ -2938146 -5073153 -3255158 425100 2292185 1801811 1160193 1763294 2929862 3548021
35352C548021k48956j016751j588431j560970p47353K19586N92804M40195L33696
$$ 3548021 3299065 2282314 693883 -867087 -1614440 -1394854 -802050 -361855 -28159
35343b8159N30952R23339J323063J345060N52179p48342j465514j138572o89366
$$ -28159 502793 1426132 2749195 4094255 4646434 3898092 2432578 1294006 604640
35334F04640q76867q24818M94529J950721J449867n92114j306368L66979J837161
$$ 604640 -272227 -1097045 -602516 1348205 2798072 2205958 899590 1266569 3103730
35325C103730P87289j235587j439831k72490l00992j614002j798784m21361R7419
$$ 3103730 3891019 2655432 1215601 943111 642119 -971883 -2770667 -3192028 -3094609
35316c094609j071937j363549P93231K890021K122520k21325j019358l7224P04958
$$ -3094609 -4166546 -5530095 -4736864 -1846843 275677 54352 -965006 -1002230 -297272
35307b97272P82620J177729J235282n00231k718289k352398N03728K275569J284675
$$ -297272 485348 1663077 2898359 2398128 -320161 -2672559 -2168831 106738 1391413
35298A391413p6132K08331O64849l80566j594999j296940p15432j644268k812663
$$ 1391413 1315281 1523612 2188461 1807895 212896 -1084044 -1799476 -3443744 -6256407
35289f256407j736373J068918K707434J986161K69415j089350j678060r90491
$$ -6256407 -7992780 -6923862 -4216428 -2230267 -1960852 -3050202 -4728262 -5718753
35281e718753R73561K409929J493631o66682j179040N72053K240103J924990J66001
$$ -5718753 -4745192 -2335263 -841632 -1508314 -2687354 -2115301 124802 2049792 2215793
35272B215793j521900k139353j284893L80681J066977J59843k40369J438327K670730
$$ 2215793 693893 -1445460 -2730353 -2349672 -1282695 -1122852 -1363221 75106 2745836
35263B745836J81281l895998l988142L41934L064430P68517k171202q24100K570017
$$ 2745836 2927117 -968881 -4957023 -4615089 -1550659 -782142 -2953344 -3777444 -1207427
35254a207427K773897J6906j172701L39594J360991N52010K28310J379997J585832
$$ -1207427 1566470 1583376 410675 750269 2111260 2663270 2891580 4271577 5857409
35245E857409n49191k620186k103470n7238R01630L33867k35862L4304N17243
$$ 5857409 5308218 2688032 584562 527324 1428954 1762821 1526959 1561263 2078506
35236B078506L37439o03049j461076j161480J24324O77191l97166j261446J92835
$$ 2078506 2415945 1812896 351820 -809660 -685336 -8145 -405311 -1666757 -1473922
35227a473922K601278K634399K47083q84815Q94203K428006O62056k594705l581934
$$ -1473922 1127356 3761755 4008838 3124023 4018226 6446232 7108288 4513583 931649
35218I31649k079526p87775n87046J15716J647265J984125J22748j960710j905605
$$ 931649 -1147877 -1935652 -2522698 -2406982 -759717 1224408 1347156 -613554 -2519159
35209b519159L7746J660485J460390j10330j385550r96776Q22764K239650J659282
$$ -2519159 -2481413 -820928 639462 529132 -856418 -1853194 -1030430 1209220 2868502
35200B868502m20785j991677j842916n65074N70459Q19575J42539q32571r98282
$$ 2868502 2447717 456040 -1386876 -1951950 -1381491 -561916 -419377 -1251948 -2250230
35191b250230J03957J320237J102420k80608j008541l91803J70719m81756j424221
$$ -2250230 -2146273 -826036 276384 -4224 -1012765 -1404568 -1233849 -1715605 -3139826
35182c139826j174170N6915R18602R64066P97350O32265N8395q36582j273467
$$ -3139826 -4313996 -4257081 -3338479 -2374413 -1577063 -944798 -886403 -1722985 -2996452
35173b996452q69000q7635M97443P22246O24633M06645N68427J343100J968801
$$ -2996452 -3865452 -3953087 -3455644 -2733398 -2108765 -1702120 -1133693 209407 2178208
35164B178208J289394p07807k533071k634098r31360J072023J532621l1816j965691
$$ 2178208 3467602 2759795 226724 -2407374 -3338734 -2266711 -734090 -765906 -2731597
35155b731597j987727L1141J678841J223646N1401L49199J470142R99142j020414
$$ -2731597 -4719324 -4688183 -3009342 -1785696 -1734295 -1385096 85046 1084188 63774
35146F3774j778688l3479J994610K056546O95801o45615j858067k800476k094421
$$ 63774 -1714914 -1748393 246217 2302763 2998564 2352949 494882 -2305594 -4400015
35137d400015M94787K460936J763520q2872o10081l14534j031975j994211j061153
$$ -4400015 -3905228 -1444292 319228 236356 -373725 -688259 -1720234 -3714445 -4775598
35128d775598J067607J633157M42792m1194P11137M68454j382093k368635j040114
$$ -4775598 -3707991 -2074834 -1632042 -1673236 -962099 -493645 -1875738 -4244373 -5284487
35119e284487Q01960J373178J329508J452239R54300j96077k29521J167149J413424
$$ -5284487 -4482527 -3109349 -1779841 -327602 626698 430621 201100 1368249 2781673
35110B781673q42800k876930j879934N59910J044048l92417r09253L91716J542386
$$ 2781673 1938873 -938057 -2817991 -2258081 -1214033 -1606450 -2515703 -2123987 -581601
35101e81601J129383n7777q15111r14591o06326j62580J10740K34225M67899M80775
$$ -581601 547782 490005 -325106 -1239697 -1846023 -2008603 -1897863 -1663638 -1195739 -714964
35091g14964k36925q48833K7763J485189Q89553j676602k628963l19120K035615
$$ -714964 -951889 -1800722 -1772959 -287770 601783 -1074819 -3703782 -4022902 -1987287
35082a987287J415636k77643Q5051J417036P38140j389602k115127j242547o17267
$$ -1987287 -571651 -849294 -764243 652793 1390933 1331 -2113796 -3356343 -3973610
35073c973610j61034J045158J315146j071762l207249j001341L481683M150034
$$ -3973610 -4134644 -3089486 -1774340 -2846102 -6053351 -7054692 -3573009 577025
35065E77025L50826k106650l16751J778352Q58275n60932L71786J514711K2535
$$ 577025 927851 -1178799 -1495550 282802 1141077 580145 951931 2466642 2489177
35056B489177k222280j833506M60007J531233R37190N43677P60102M89662l44827
$$ 2489177 266897 -1566609 -1106602 424631 1361821 1905498 2665600 3155262 2810435
35047B810435r26738j183807j291887q08298P8448O5505j012621j400231l19207
$$ 2810435 1883697 699890 -591997 -1400295 -1321847 -1256342 -2268963 -3669194 -3988401
35038c988401O70692P10258J232650K618292K444982k56013k119333k67605K626113
$$ -3988401 -3317709 -2607451 -1374801 1243491 3688473 3432460 1313127 1045522 3671635
35029C671635K099522j201633k691636q75542J043919N20555j104318j439804
$$ 3671635 5771157 4569524 1877888 1002346 2046265 2566820 1462502 22698
35021B2698l80417L79079l72352k085961k805434j210779J317146K058355R01763
$$ 22698 -357719 21360 -350992 -2436953 -5242387 -6453166 -5136020 -3077665 -2175902
35012b175902O44148K238515K722935O3861k920893k619720j46995Q27164j31596
$$ -2175902 -1531754 706761 3429696 3493557 572664 -2047056 -2194051 -1366887 -1498483
35003a498483m83600N40270J318683J169733P83427L9771j316287j735146k1694
$$ -1498483 -1982083 -1441813 -123130 1046603 1830030 1869801 553514 -1181632 -1203326
34994a203326J596900L35361k159744j890647J007272K408029Q00613q99331p13869
$$ -1203326 393574 728935 -1430809 -3321456 -2314184 93845 894458 -4873 -718742
34985g18742k03351n55089l92377Q41048J145412m58985j912310j512394l31159
$$ -718742 -922093 -1477182 -1869559 -1028511 116901 -342084 -2254394 -3766788 -4097947
34976d097947M13144J330429K461214K048177j94807j523784k38050J331678M30794
$$ -4097947 -3684803 -2354374 106840 2155017 1960210 436426 198376 1530054 1960848
34967A960848j882650k758558j744591k15584J543870L683519M579783K479144
$$ 1960848 78198 -2680360 -4424951 -4640535 -3096665 586854 5166637 7645781
34959G645781j199142l021515j940689k36312j2487q62085j373866j158629o39491
$$ 7645781 6446639 3425124 1484435 1248123 1235636 373551 -1000315 -2158944 -2798435
34950b798435k9466O43962J050217P40720k26755j121452j174971m11879M11455
$$ -2798435 -2827901 -2183939 -1133722 -393002 -619757 -1741209 -2916180 -3328059 -2916604
34941b916604Q16724J040698J167433O82915l67477p66493J18083Q87927L0373
$$ -2916604 -2099880 -1059182 108251 791166 423689 -342804 -224721 663206 693579
34932F93579j471903j361821N23951K111084K050131Q66214n55798j580765j287276
$$ 693579 -778324 -2140145 -1616194 494890 2545021 3411235 2855437 1274672 -12604
34923a2604L98793J422422j309k130552j819338M63815J342663K57626K07251
$$ -12604 386189 1808611 1807302 -323250 -2142588 -1678773 -336110 -78484 128767
34914A28767J973026K288057l21914k432926j345504L37359n44232k015631n98924
$$ 128767 2101793 4389850 4067936 1635010 289506 626865 82633 -1932998 -2531922
34905b531922K069505J500506k081455l684153j106430K105076K270438L17437
$$ -2531922 -462417 1038089 -1043366 -4727519 -5833949 -3728873 -1458435 -1140998
34897a140998p47529k46587L00752M640n32056m85124K03384Q93849Q69411N3720
$$ -1140998 -1888527 -2135114 -1834362 -1829722 -2361778 -2846902 -2643518 -1749669 -880258 -826538
34887h26538q72155j194829p03591N16507K047341K767029J680533m98270j876115
$$ -826538 -1698693 -2893522 -3597113 -3080606 -1033265 1733764 3414297 2916027 1039912
34878A039912j856121j475856r42110Q05157L129646L151249R6560k500666j628026
$$ 1039912 -816209 -2292065 -3234175 -2429018 700628 3851877 3948437 1447771 -180255
34869a80255N66369K88270j729993j642937R89651K492586R40857j329131j868680
$$ -180255 386114 674384 -1055609 -2698546 -1708895 783691 1724548 395417 -1473263
34860a473263j208260n85641K61994J429019J575708J47873j123301o39313P33542
$$ -1473263 -2681523 -3267164 -3005170 -1576151 -443 147430 -975871 -1615184 -881642
34851h81642J248549P80707L15826J85041K11575N74033J177624J027474m74737
$$ -881642 366907 1147614 1463440 1648481 1860056 2434089 3611713 4639187 4164450
34842D164450k247944k701214j720521n36204l6576o5220m0565M61853J440205
$$ 4164450 1916506 -784708 -2505229 -3041433 -3078009 -3143229 -3183794 -2721941 -1281736
34833a281736K198174J749382J12841j204866q05044P08106J262575p8110j768587
$$ -1281736 916438 2665820 2778661 1573795 768751 1476857 2739432 2661322 892735
34824H92735j655434J27090J118526k04032k103392j751965P88615K561987J874115
$$ 892735 -762699 -635609 482917 278885 -1824507 -3576472 -2787857 -225870 1648245
34815A648245L47957j62726n16248k133657l642821k535196N56737K288196J453913
$$ 1648245 1996202 1833476 1317228 -816429 -4459250 -6994446 -6437709 -4149513 -2695600
34806b695600N15590J460220K787955K155579l0646j553570j557423r04398k29083
$$ -2695600 -2180010 -719790 2068165 4223744 4193098 2639528 1082105 177707 -51376
34797e1376N50418J177830J088764M08915k72217r69799j989048k691838j902193
$$ -51376 499042 1676872 2765636 3174551 2902334 1932535 -56513 -2748351 -4650544
34788d650544K46819K047219K219974J223236J44872o53257j105285p55305L10606
$$ -4650544 -4403725 -2356506 -136532 1086704 1231576 578319 -526966 -1282271 -971665
34779i71665O44239q55536k708403k149983J020041L664682L193515N91700j566773
$$ -971665 -327426 -1182962 -3891365 -6041348 -5021307 -1356625 1836890 2428590 861817
34770H61817k468769k699061k008725Q6031K209014K296417P95612J59042R23899
$$ 861817 -1606952 -4306013 -6314738 -6228707 -4019693 -1723276 -927664 -768622 155277
34761A55277R36517q32799k352625j686124J86029J253800J312378J309063J448195
$$ 155277 1091794 258995 -2093630 -3779754 -3593725 -2339925 -1027547 281516 1729711
34752A729711J467618J394690P72919j233294l724525m037215j400581J434653
$$ 1729711 3197329 4592019 5364938 4131644 407119 -3630096 -5030677 -3596024
34744c596024K023155J426293J403592R50485j243768l074115j667125J580553
$$ -3596024 -1572869 -146576 1257016 2207501 963733 -2110382 -3777507 -2196954
34736b196954K679609J059823j82449K39251L77307n13544m52903J136475J752140
$$ -2196954 482655 1542478 1360029 1599280 1976587 1463043 1010140 2146615 3898755
34727C898755J02063j382345n59966Q16385N5670k191308l238631k316711p66535
$$ 3898755 4000818 2618473 2058507 2874892 2930562 739254 -2499377 -4816088 -5582623
34718e582623M97855J436105J632113O66457p03696j302129j029467m19825N29995
$$ -5582623 -5084768 -3648663 -2016550 -1350093 -2053789 -3355918 -4385385 -4805210 -4275215
34709d275215J769295K231295J045568p24784j088001K40087J507099J307446
$$ -4275215 -2505920 -274625 770943 46159 -1041842 -801755 705344 2012790
34701B012790J69099n57608n30513n10826r48499j186431m75281O00960O45012
$$ 2012790 2181889 1624281 1093768 582942 -365557 -1551988 -2027269 -1426309 -781297
34692g81297m29066r69966n7978Q36110N2718j437115j336635M46134J717237
$$ -781297 -1210363 -2180329 -2238307 -1402197 -1349479 -2786594 -4123229 -3677095 -1959858
34683a959858J282903J96569l39887k44824L79334J274215J015390j500265m223439
$$ -1959858 -676955 -480386 -820273 -1065097 -685763 588452 1603842 103577 -4119862
34674d119862l535240M39286L153251J774870j007143j412126R5274P64106M25956
$$ -4119862 -7655102 -7215816 -4062565 -2287695 -3294838 -4706964 -4611690 -3847584 -3421628
34665c421628Q16908J557490P07623j162364j229367Q63796J934999M3484k441920
$$ -3421628 -2604720 -1047230 -339607 -1501971 -2731338 -1867542 67457 110941 -2330979
34656b330979k252205K71787K005597J282556m85131j083878l9749J260526J258661
$$ -2330979 -4583184 -4311397 -2305800 -1023244 -1508375 -2592253 -2632002 -1371476 -112815
34647a12815j71662j599034j566049k68783O57236J56521r80407j266576l94697
$$ -112815 -284477 -1883511 -3449560 -3718343 -3061107 -2904586 -3884993 -5151569 -5546266
34638e546266P71983J701452K506375K665870J006373k013289l432499j179285
$$ -5546266 -4774283 -3072831 -566456 2099414 3105787 1092498 -2340001 -3519286
34630c519286K457784L271439R00498q68542j54391L16473j475178k566363K28005
$$ -3519286 -1061502 2209937 3110435 2241893 2087502 2403975 928797 -1637566 -1409561
34621a409561M046821L402458j335863m091730j899372J407256J590706l99872
$$ -1409561 2637260 6039718 4703855 612125 -1287247 120009 1710715 1310843
34613A310843j383661q03475k4018M63730O57214J8122j083552r16273Q23806
$$ 1310843 -72818 -876293 -900311 -436581 220633 238755 -844797 -1761070 -937264
34604i37264J892158Q82458n66784p54770o00134j222118j381089J34973J835850
$$ -937264 954894 1837352 1270568 515798 -84336 -1306454 -2687543 -2552570 -716720
34595g16720J900633J154360J035776P20027q91392k415696k276198j660977j938706
$$ -716720 1183913 2338273 3374049 4094076 3202684 786988 -1489210 -3150187 -5088893
34586e088893j369323J708274M478206L112789p19184j863020L83055J583951
$$ -5088893 -6458216 -4749942 -271736 2841053 2121869 258849 641904 2225855
34578B225855l05612k006994q67439J013339Q42424m67357n23618O84787J518724
$$ 2225855 1920243 -86751 -954190 59149 901573 434216 -89402 595385 2114109
34569B114109J286545L01096r78706j642052r43856m6983r76093l056671l037821
$$ 2114109 3400654 3701750 2723044 1080992 137136 90153 -885940 -3942611 -6980432
34560f980432L6847K858339K481317L49751m55955K40024M72711j75893l63907
$$ -6980432 -6943585 -4085246 -1603929 -1254178 -1710133 -1470109 -997398 -1173291 -1537198
34551a537198L18643P90727M12631k25102m21917j65923J10135m4274o37815r89615
$$ -1537198 -1218555 -427828 -15197 -240299 -662216 -828139 -718004 -762278 -1400093 -2389708
34541b389708n31112K30567N41229Q64468J917687K540525Q35764k347025l704584
$$ -2389708 -2920820 -2690253 -2149024 -1284556 633131 3173656 4009420 1662395 -2042189
34532b042189k034954J37428N72903J68070K94698K28764n79264m43376J527324
$$ -2042189 -4077143 -3939715 -3366812 -3198742 -2904044 -2675280 -3254544 -3697920 -2170596
34523b170596K730162P44310k169516k017074O88026J706675k65259j880854p44710
$$ -2170596 559566 1303876 -865640 -2882714 -2194688 -488013 -753272 -2634126 -3378836
34514c378836J090424Q58773o95536j066848j6503N21758k74650r57897l8230
$$ -3378836 -2288412 -1429639 -2125175 -3192023 -3208526 -2686768 -2961418 -3919315 -3957545
34505c957545J834109K492062Q87946j320685j480048O40107K251830J212281
$$ -3957545 -2123436 368626 1256572 -64113 -1544161 -904054 1347776 2560057
34497B560057r44524j261035K85361R83345k41698j251605k61728J323165J206792
$$ 2560057 1615533 354498 639859 1623204 1381506 129901 -131827 1191338 2398130
34488B398130k49497p37022M24042J323309K63906j845782k616212j065384J378255
$$ 2398130 2148633 1411611 1835653 3158962 3422868 1577086 -1039126 -2104510 -726255
34479g26255K673826K244231Q59956q58343k680829l656705k394979P27036L001988
$$ -726255 1947571 4191802 5051758 4193415 1512586 -2144119 -4539098 -3812062 -810074
34470h10074K375060L0776j409105j289697p39816k8909J401414K586139J578003
$$ -810074 1564986 1595762 186657 -1103040 -1842856 -1871765 -470351 2115788 3693791
34461C693791j139905k504798j200601M33068L08197j69558R79123K369103J321121
$$ 3693791 2553886 49088 -1151513 -718445 -410248 -579806 399317 2768420 4089541
34452D089541j422148k441401p96484Q09342M55762m08109O7024J130377J091994
$$ 4089541 2667393 225992 -570492 238850 694612 286503 353527 1483904 2575898
34443B575898J21964m74923n15692o60805p71440l15642J67662k43010r90429
$$ 2575898 2697862 2222939 1707247 1046442 275002 -40640 127022 -115988 -1106417
34434a106417n93413Q91375J606940N13922j125307j538973o05441N54649J219244
$$ -1106417 -1699830 -808455 798485 1312407 187100 -1351873 -1957314 -1402665 -183421
34425a83421J334822P85593m63459j635149j586860k83348Q72041O69926l20354
$$ -183421 1151401 1936994 1473535 -161614 -1748474 -2031822 -1159781 -489855 -810209
34416h10209m18118R16810K136666J409556r08638k340650j075186J803012L314510
$$ -810209 -1228327 -311517 1825149 3234705 2326067 -14583 -1089769 713243 4027753
34407D027753J674662j859483m137944l090638K04027K493387J765909n83724
$$ 4027753 5702415 3842932 -295012 -3385650 -3181623 -688236 1077673 493949
34399D93949j731473j092273m76417o82868k68753J368179K203789Q61700n66752
$$ 493949 -1237524 -2329797 -2806214 -3489082 -3757835 -2389656 -185867 675833 109081
34390A09081K18356J493339J65199k566294k625776P1794J087677j181837k622120
$$ 109081 327437 1820776 1985975 -580319 -3206095 -3134301 -2046624 -3228461 -5850581
34381e850581k38008K736449K119546n99072j252996J91861N90851m41933m70436
$$ -5850581 -6088589 -3352140 -1232594 -1831666 -3084662 -2892801 -2301950 -2743883 -3214319
34372c214319P61673J001247j7292j57955Q23009P96159m18305m31763J110593
$$ -3214319 -2452646 -1451399 -1468691 -1626646 -803637 -7478 -425783 -857546 253047
34363B53047J453487l55843j469812n7969J545274Q30536r76658j543347j136708
$$ 253047 1706534 1350691 -119121 -177090 1368184 2198720 1222062 -321285 -1457993
34354a457993j022446o42384P99863J990707J461341J43079m42137o65695j095823
$$ -1457993 -2480439 -3122823 -2322960 -332253 1129088 1272167 830030 164335 -931488
34345i31488n19702J536301K543422N76883j810918j150078J180636J112925j290545
$$ -931488 -1451190 85111 2628533 3205416 1394498 244420 1425056 2537981 1247436
34336A247436k058591j67783R17123n31327j623611j63885J460632N33254j251063
$$ 1247436 -811155 -978938 -61815 -593142 -2216753 -2380638 -920006 -386752 -1637815
34327a637815o72842J693049K525614Q94088p98487o08482P31316J449142P80931
$$ -1637815 -2310657 -617608 1908006 2802094 2003607 1395125 2126441 3575583 4356514
34318D356514p55592j922352j679809m15261J77155p21768j715182j083656P47748
$$ 4356514 3600922 1678570 -1239 -416500 -239345 -961113 -2676295 -3759951 -3012203
34309c012203J927537J732154R73127L12566k66414m80295J90151J292053J619335
$$ -3012203 -1084666 647488 1620615 1933181 1666767 1186472 1376623 2668676 4288011
34300D288011R17265J48059k07536p46688j513564j254972N52735K079422J185903
$$ 4288011 5205276 5353335 5145799 4399111 2885547 1630575 2183310 4262732 5448635
34291E448635j391124k684453j475278J66727J38837o01356Q4821J664403J459969
$$ 5448635 4057511 1373058 -102220 64507 203344 -398012 -313191 1351212 2811181
34282B811181r53579k520651j028321J588127K204738J021373M99518R05025J75544
$$ 2811181 1857602 -663049 -1691370 -103243 2101495 3122868 3622386 4527411 4702955
34273D702955j829579k423665n38166J063196J1618j809332j303909Q51956J468395
$$ 4702955 2873376 449711 -88455 974741 986359 -822973 -2126882 -1274926 193469
34264A93469J7638r25796k82526l653j163046j714045M5008K202067J811822p09029
$$ 193469 211107 -714689 -997215 -1000868 -2163914 -3877959 -3832951 -1630884 180938 -528091
34254e28091k206461j185661O15360J039549R4185p17365m33187N54714J145428
$$ -528091 -2734552 -3920213 -3304853 -2265304 -2171119 -2888484 -3321671 -2766957 -1621529
34245a621529P30656n6783j01857M82008L03219r93647j625986k99339J242712
$$ -1621529 -890873 -947656 -1049513 -567505 -264286 -1257933 -2883919 -3183258 -1940546
34236a940546M91404j666023j823679P49070K756593J766535l58088p54132J30925
$$ -1940546 -1449142 -3115165 -4938844 -4189774 -1433181 333354 -24734 -778866 -647941
34227f47941M9302r74376j019091K00091J065634R89140R20670R74990K00406
$$ -647941 -598639 -1573015 -2592106 -2392015 -1326381 -337241 583429 1558419 1758825
34218A758825j013633r36418M51077R30909m42426j687608j041645M35725R63976
$$ 1758825 745192 -191226 259851 1190760 748334 -939274 -1980919 -1545194 -581218
34209e81218P57052Q20314P77379n7095q50928o14240j76598o23942r05121M78445
$$ -581218 175834 996148 1773527 1716432 865504 251264 74666 -549276 -1454397 -975952
34199i75952K226835J575175j283066k966238j585353Q68583J689386Q39900R780
$$ -975952 1250883 2826058 1542992 -1423246 -3008599 -2140016 -450630 389270 399050
34190C99050J8772M76194Q54249P62500m6791j174638j781554j699367j484355
$$ 399050 417822 894016 1748265 2510765 2463974 1289336 -492218 -2191585 -3675940
34181c675940j220836m81740L75326M36660Q9719Q08307K427133K677713N86283
$$ -3675940 -4896776 -5378516 -5003190 -4566530 -4476811 -3668504 -1241371 1436342 2022625
34172B022625j666663j817789n60101L44022J089179K491624L194766J308836
$$ 2022625 355962 -1461827 -2021928 -1677906 -588727 1902897 5097663 6406499
34164F406499j914766l202693j888614m09144j03269K40483J042584N89904j463448
$$ 6406499 4491733 1289040 -599574 -1008718 -1111987 -871504 171080 760984 -702464
34155g02464k404049n33399J614555Q55912j745545k555905p10798J282815J650923
$$ -702464 -3106513 -3639912 -2025357 -1169445 -2914990 -5470895 -6181693 -4898878 -3247955
34146c247955J061129L41398o49590j496321j122302J40177O13644O1647J59136
$$ -3247955 -2186826 -1845428 -2495018 -3991339 -5113641 -4973464 -4359820 -4298173 -4139037
34137d139037J369374J771838L47503q67668J30400J871159J413553j232397l001137
$$ -4139037 -2769663 -997825 -650322 -1517990 -1387590 483569 1897122 664725 -2336412
34128b336412j788747J200720L053706J910026j505636m131711l108929Q14892
$$ -2336412 -4125159 -2924439 129267 2039293 533657 -3598054 -6706983 -5892091
34120e892091L473326K263974m34236q59083N86637M88490j618967k335289q2230
$$ -5892091 -2418765 -154791 -589027 -1448110 -861473 -372983 -1991950 -4327239 -4409469
34111d409469K093610J333184n06993M8154K505335L179325Q03215j722185j587494
$$ -4409469 -2315859 -982675 -1489668 -1441514 1063821 4243146 5046361 3324176 1736682
34102A736682K73126R16499n71012k137193j618839N07705J861334J334214M04092
$$ 1736682 2009808 2926307 2355295 218102 -1400737 -893032 968302 2302516 2706608
34093B706608O18933R75125m39070k792030l017803m25258J783775R82658j140338
$$ 2706608 3325541 4300666 3861596 1069566 -1948237 -2373495 -589720 392938 -747400
34084g47400j367823K50093R73074j75583j243957n91205J024237K049307K051706
$$ -747400 -2115223 -1865130 -892056 -1067639 -2311596 -2902801 -1878564 170743 2222449
34075B222449J429255N46664k23591n38725o03921r56190j546210j712219j149735
$$ 2222449 3651704 4198368 3974777 3436052 2832131 1875941 329731 -1382488 -2532223
34066b532223k74900L77636N53908J96409m87372j009197j021501m54191Q46304
$$ -2532223 -2807123 -2429487 -1875579 -1679170 -2166542 -3175739 -4197240 -4651431 -3805127
34057c805127K729070L813592K484223m52634j917442o75128O57068l52537j989027
$$ -3805127 -1076057 2737535 5221758 4769124 2851682 2176554 2833622 2481085 492058
34048D92058j320932P00263Q75689n28510j95946K064812K388966n70807k800595
$$ 492058 -828874 -128611 747078 218568 22622 2087434 4476400 3905593 1104998
34039A104998j196472J399977R66586j159072q80813J596823K193279j61817j840949
$$ 1104998 -91474 1308503 2275089 1116017 235204 1832027 4025306 3863489 2022540
34030B022540n42254J135596J27938k186647k288403K8411J531097N22951q16999
$$ 2022540 1480286 2615882 2743820 557173 -1731230 -1702819 -171722 351229 -465770
34021d65770j261J847485J580115j202939l238949k065164N76717J375263J13903
$$ -465770 -467031 1380454 2960569 1757630 -1481319 -3546483 -2969766 -1594503 -1480600
34012a480600n45124O38217J928304J630780L38650n93429q26196m34920N62261
$$ -1480600 -2025724 -1387507 540797 2171577 2510227 1916798 1090602 655682 1217943
34003A217943J181026m773k254087k752402o58781J267813Q15580l79271K2482
$$ 1217943 2398969 2394196 140109 -2612293 -3271074 -2003261 -1187681 -1566952 -1544470
$$ [...]
##END NTUPLES=NMR SPECTRUM
##END=
