##TITLE=31Pdec_6C1211
 D2O, 24 sc
 15.11.2021
##JCAMPDX= 6.0         $$ Bruker NMR JCAMP-DX V2.0
##DATA TYPE= NMR SPECTRUM
##DATA CLASS= NTUPLES
##ORIGIN= UXNMR, Bruker Analytische Messtechnik GmbH
##OWNER= root
$$ XWIN-NMR		Version 3.5
$$ Mon Nov 15 10:43:38 2021 Russian Standard Time (UT+4h)  she@DPX200
##.OBSERVE FREQUENCY= 81.013821
##.OBSERVE NUCLEUS= ^31P
##.ACQUISITION MODE= SIMULTANEOUS
##.ACQUISITION SCHEME= undefined
##.AVERAGES= 24
##.DIGITISER RES= 16
##SPECTROMETER/DATA SYSTEM= spect
##.PULSE SEQUENCE= zgpg30
##.SOLVENT NAME= CDCl3
##.SHIFT REFERENCE= (INTERNAL, CDCl3, 0, 248.564)
##AUDIT TRAIL= $$ (NUMBER, WHEN, WHO, WHERE, WHAT)
$$ ##TITLE= Audit trail, XWIN-NMR		Version 3.5
$$ ##JCAMPDX= 5.01
$$ ##ORIGIN= Bruker BioSpin GmbH
$$ ##OWNER= she
$$ F:/spectra/data/she/nmr/P31/1/pdata/1/auditp.txt
$$ ##AUDIT TRAIL=  $$ (NUMBER, WHEN, WHO, WHERE, WHAT)
(   1,<2021-11-15 10:42:32.67 +0400>,<she>,<DPX200>,
      <created by zg, POWCHK disabled, PULCHK disabled
       configuration hash MD5:
       00 E9 B6 7A A2 85 ED C7 34 08 36 98 17 FE 4E 26
       data hash MD5: 32K
       BC 18 A4 04 9D 7C F7 3B E5 B2 B9 A8 F6 AC 65 27>)
(   2,<2021-11-15 10:42:34.87 +0400>,<she>,<DPX200>,
      <Start of raw data processing
       efp BC_mod = 2 LB = 1 FT_mod = 6 PKNL = 1 PHC0 = -9208.808 PHC1 = 130.2694 SI = 64K 
       data hash MD5: 64K
       93 CA 16 42 00 1C F3 FF 14 91 06 95 67 ED 30 79>)
(   3,<2021-11-15 10:42:55.81 +0400>,<she>,<DPX200>,
      <pk PHC0 = 134.0889 PHC1 = -324.9999 
       data hash MD5: 64K
       0E 93 00 F3 CF F6 B3 0E E0 E9 E8 0A 66 D6 9C 82>)
(   4,<2021-11-15 10:42:58.40 +0400>,<she>,<DPX200>,
      <abs ABSG = 5 
       data hash MD5: 64K
       95 98 96 64 AD 5C 41 C2 37 13 EF 56 32 6D 0F 0E>)
$$ ##END=
$$ 
$$ hash MD5
$$ D4 3F 84 C9 4C BF B2 5C 22 79 38 79 AC 41 56 3F
##$RELAX= 
##$RELAX= 
##$RELAX= 
##$RELAX= 
##$RELAX= 
##$RELAX= 
##$RELAX= 
##$RELAX= 
$$ Bruker specific parameters
$$ --------------------------
##$DU= <F:/spectra>
##$EXPNO= 1
##$NAME= <P31>
##$PROCNO= 1
##$TYPE= <nmr>
##$USER= <she>
##$AMP= (0..31)
100 100 100 100 100 100 100 100 100 100 100 100 100 100 100 100 100 100 
100 100 100 100 100 100 100 100 100 100 100 100 100 100 
##$AQSEQ= 0
##$AQ_mod= 1
##$AUNM= <au_zg>
##$AUTOPOS= <>
##$BF1= 81.014009
##$BF2= 200.13
##$BF3= 200.13
##$BF4= 200.13
##$BF5= 200.13
##$BF6= 200.13
##$BF7= 200.13
##$BF8= 200.13
##$BYTORDA= 1
##$CFDGTYP= 0
##$CFRGTYP= 5
##$CHEMSTR= <none>
##$CNST= (0..31)
1 1 145 1 1 1 1 1 1 1 1 1 1 1 1 1 1 1 1 1 1 1 1 1 1 1 1 1 1 1 1 1 
##$CPDPRG= <waltz16>
##$CPDPRG1= <>
##$CPDPRG2= <waltz16>
##$CPDPRG3= <>
##$CPDPRG4= <mlev>
##$CPDPRG5= <mlev>
##$CPDPRG6= <mlev>
##$CPDPRG7= <mlev>
##$CPDPRG8= <mlev>
##$CPDPRGB= <>
##$CPDPRGT= <>
##$D= (0..31)
0 1 0 0 0 0 0 0 0 0 0 0.03 2e-05 3e-06 0 0 0 0 0 0 0 0 0 0 0 0 0 0 0 0 
0 0 
##$DATE= 1636958551
##$DBL= (0..7)
120 120 120 11 120 120 24 19 
##$DBP= (0..7)
150 150 150 150 150 150 150 150 
##$DBP07= 0
##$DBPNAM0= <>
##$DBPNAM1= <>
##$DBPNAM2= <>
$$ [...]
##$SUBNAM3= <"">
##$SUBNAM4= <"">
##$SUBNAM5= <"">
##$SUBNAM6= <"">
##$SUBNAM7= <"">
##$SUBNAM8= <"">
##$SUBNAM9= <"">
##$SW= 501.771253377433
##$SWIBOX= (0..15)
0 1 3 0 0 0 0 0 0 0 0 0 0 0 0 0 
##$SW_h= 40650.406504065
##$TD= 32768
##$TD0= 1
##$TE= 0
##$TE2= 300
##$TE3= 300
##$TEG= 300
##$TL= (0..7)
0 120 53 12 22 120 120 120 
##$TP= (0..7)
150 150 150 150 150 150 150 150 
##$TP07= 0
##$TPNAME0= <>
##$TPNAME1= <>
##$TPNAME2= <>
##$TPNAME3= <>
##$TPNAME4= <>
##$TPNAME5= <>
##$TPNAME6= <>
##$TPNAME7= <>
##$TPOAL= (0..7)
0.5 0.5 0.5 0.5 0.5 0.5 0.5 0.5 
##$TPOFFS= (0..7)
0 0 0 0 0 0 0 0 
##$TUNHIN= 0
##$TUNHOUT= 0
##$TUNXOUT= 0
##$USERA1= <user>
##$USERA2= <user>
##$USERA3= <user>
##$USERA4= <user>
##$USERA5= <user>
##$V9= 5
##$VALIST= <valist>
##$VCLIST= <CCCCCCCCCCCCCCC>
##$VD= 0
##$VDLIST= <DDDDDDDDDDDDDDD>
##$VPLIST= <PPPPPPPPPPPPPPP>
##$VTLIST= <TTTTTTTTTTTTTTT>
##$WBST= 1024
##$WBSW= 4
##$XGAIN= (0..3)
0 0 0 0 
##$XL= 0
##$YL= 0
##$YMAX_a= 16499
##$YMIN_a= -17307
##$ZGOPTNS= <>
##$ZL1= 120
##$ZL2= 120
##$ZL3= 120
##$ZL4= 120
##$ABSF1= 248.5645
##$ABSF2= -253.2056
##$ABSG= 5
##$ABSL= 3
##$ALPHA= 0
##$AQORDER= 0
##$ASSFAC= 0
##$ASSFACI= 0
##$ASSFACX= 0
##$ASSWID= 0
##$AUNMP= <proc_1d>
##$AZFE= 0.1
##$AZFW= 0.5
##$BCFW= 0
##$BC_mod= 2
##$BYTORDP= 0
##$COROFFS= 0
##$CY= -3
##$DATMOD= 1
##$DC= 0
##$DFILT= <>
##$DTYPP= 0
##$F1P= 0
##$F2P= 0
##$FCOR= 1
##$FTSIZE= 65536
##$FT_mod= 6
##$GAMMA= 0
##$GB= 0
##$INTBC= 1
##$INTSCL= 5.30512e-09
##$ISEN= 30
##$LB= 1
##$LEV0= 0
##$LPBIN= 0
##$MAXI= 10000
##$MC2= 0
##$MEAN= 0
##$ME_mod= 0
##$MI= 50
##$NCOEF= 0
##$NC_proc= -5
##$NLEV= 6
##$NOISF1= 182.463
##$NOISF2= 159.3651
##$NSP= 0
##$NTH_PI= 0
##$NZP= 0
##$OFFSET= 248.5645
##$PC= 4
##$PHC0= -9074.719
##$PHC1= -194.7305
##$PH_mod= 1
##$PKNL= yes
##$PPARMOD= 0
##$PSCAL= 0
##$PSIGN= 0
##$REVERSE= no
##$SF= 81.014009
##$SI= 65536
##$SIGF1= 159.3651
##$SIGF2= -187.1042
##$SINO= 113.3802
##$SIOLD= 16384
##$SREGLST= <1H.CDCl3>
##$SSB= 0
##$STSI= 65536
##$STSR= 0
##$SW_p= 40650.406504065
##$SYMM= 0
##$S_DEV= 0
##$TDeff= 32768
##$TDoff= 0
##$TI= <>
##$TILT= no
##$TM1= 0
##$TM2= 0
##$TOPLEV= 0
##$USERP1= <user>
##$USERP2= <user>
##$USERP3= <user>
##$USERP4= <user>
##$USERP5= <user>
##$WDW= 1
##$XDIM= 65536
##$YMAX_p= 426919799
##$YMIN_p= -43087056
$$ End of Bruker specific parameters
$$ ---------------------------------
##NTUPLES= NMR SPECTRUM
##VAR_NAME=  FREQUENCY,     SPECTRUM/REAL,   SPECTRUM/IMAG
##SYMBOL=    X,             R,               I
##VAR_TYPE=  INDEPENDENT,   DEPENDENT,       DEPENDENT
##VAR_FORM=  AFFN,          ASDF,            ASDF
##VAR_DIM=   65536,         65536,           65536
##UNITS=     HZ,            ARBITRARY UNITS, ARBITRARY UNITS
##FACTOR=    0.620285442955139, 1,           1
##FIRST=     20137.2065510759, 0,            0
##LAST=      -20513.1999529892, 0,           0
##MIN=       -20513.1999529892, -43087056,   0
##MAX=       20137.2065510759, 426919799,    0
$$ Real data points
##PAGE= N=1
##DATA TABLE= (X++(R..R)), XYDATA
$$ [...]
$$ plain form
39138 311541 72120 -53521 -63492 -171822 -504798 -878666 -934621 -570675 -179450 -267243
39128 -267243 -805497 -1188553 -971988 -441174 -212241 -416824 -593516 -357716 132233 453913
39118 453913 419757 173275 -35604 -33556 199648 501315 619600 426335 39572 -261154
39108 -261154 -225654 170581 618418 667195 200736 -361430 -550693 -439828 -445257 -608037
39098 -608037 -499033 76263 714712 974945 925751 845269 700805 315889 -154215 -330968
39088 -330968 -126299 190523 407441 556276 691519 749608 670993 471613 156961 -294363
39078 -294363 -825280 -1245253 -1298105 -851538 -164231 128883 -347243 -1051593 -980031 15475
39068 15475 870075 659732 -171663 -508391 -93214 366029 389837 200932 17678 -309226
$$ packed form
39138C11541k39421j25641r971j08330l32976l73868n5955L63946L91225q7793
39128b67243n38254l83056K16565N30814K28933k04583j76692K35800M89949L21680
39118D53913l4156k46482k08879K048K33204L01667J18285j93265l86763l00726
39108b61154L5500L96235M47837M8777m66459n62166j89263J10865n429j62780
39098f08037J09004N75296O38449K60233m9194q0482j44464l84916m70104j76753
39088c30968K04669L16822K16918J48835J35243N8089p8615j99380l14652m51324
39078b94363n30917m19973n2852M46567O87307K93114m76126p04350P1562R95506
39068A5475Q54600k10343q31395l36728M15177M59243K3808j88905j83254l26904
$$ plain form
39058 -309226 -758833 -928774 -651423 -281653 -128955 -130313 -306423 -921243 -1825785 -2244733
39048 -2244733 -1735096 -891062 -531643 -571487 -339299 238798 489283 6124 -794425 -1267928
39038 -1267928 -1250750 -1014276 -843759 -855559 -1030149 -1243495 -1327992 -1195697 -918765 -708022
39028 -708022 -772774 -1077220 -1260301 -1014747 -564875 -469778 -855092 -1189553 -1020045 -561271
39018 -561271 -247065 -46024 326982 753171 798378 415433 83654 161133 446313 507521
39008 507521 212235 -193136 -409233 -416695 -484065 -773145 -983345 -662482 76134 548884
38998 548884 420408 174183 295686 452973 79519 -581124 -771488 -421734 -260923 -657743
38988 -657743 -1083126 -957592 -428779 -9964 72419 -124846 -512306 -925483 -1145809 -1175199
$$ packed form
39058c09226m49607j69941K77351L69770J52698j358j76110o14820r04542m18948
39048b244733N09637Q44034L59419l9844K32188N78097K50485m83159q00549m73503
39038a267928J7178K36474J70517j1800j74590k13346q4497J32295K76932K10743
39028g08022o4752l04446j83081K45554M49872R5097l85314l34461J69508M58774
39018e61271L14206K01041L73006M26189M5207l82945l31779P7479K85180O1208
39008E07521k95286m05371k16097p462o7370k89080k10200L20863P38616M72750
38998E48884j28476k46225J21503J57287l73454o60643j90364L49754J60811l96820
38988f57743m25383J25534N28813M18815Q2383j97265l87460m13177k20326k9390
$$ plain form
38978 -1175199 -1193788 -1131865 -692595 41197 491247 334501 -52557 -181109 -69647 26493
38968 26493 75881 87308 -129514 -573302 -760861 -314179 415467 774558 633692 332195
38958 332195 32881 -339267 -664205 -675294 -404444 -143797 -30119 -64369 -383536 -1000224
38948 -1000224 -1401607 -1028959 -156131 331031 113537 -217177 -137094 134181 208305 172788
38938 172788 265384 410264 521062 818217 1341686 1544687 978267 106114 -223296 27977
38928 27977 116938 -260307 -525475 -233053 151518 -13295 -488986 -494525 42388 245365
38918 245365 -497630 -1573541 -1827713 -1004898 -21712 252678 21266 50728 474503 654191
38908 654191 198613 -464461 -774980 -822594 -1027359 -1365800 -1434373 -1135002 -771560 -492924
$$ packed form
38978a175199j8589O1923M39270P33792M50050j56746l87058j28552J11462R6140
38968B6493M9388J1427k16822m43788j87559M46682P29646L59091j40866l01497
38958C32195k99314l72148l24938j1089K70850K60647J13678l4250l19167o16688
38948a000224m01383L72648Q72828M87162k17494l30714Q0083K71275P4124l5517
38938A72788R2596J44880J10798K97155N23469K03001n66420q72153l29410K51273
38928B7977Q8961l77245k65168K92422L84571j64813m75691n539N36913K02977
38918B45365p42995j075911k54172Q22815R83186K74390k31412K9462M23775J79688
38908F54191m55578o63074l10519m7614k04765l38441o8573K99371L63442K78636
$$ plain form
38898 -492924 -159950 170448 163891 -193934 -409410 -196365 38354 -185583 -644794 -706185
38888 -706185 -190452 499109 969147 1121396 943162 477600 7394 -143962 -39857 -12560
38878 -12560 -117542 -90677 140211 337258 406164 506260 602421 414805 7883 -100526
38868 -100526 280450 641272 579629 477271 817229 1242893 1010847 182357 -365023 -121853
38858 -121853 476918 755740 557640 164068 -108851 -85395 160736 289760 88256 -156421
38848 -156421 -66323 129517 -121323 -701159 -817336 -214811 312995 61660 -534148 -571224
38838 -571224 37909 605759 728223 631573 553114 396255 73446 -287780 -606945 -969549
38828 -969549 -1375553 -1637174 -1606116 -1297667 -780908 -170503 276814 309875 -21238 -393788
$$ packed form
38898d92924L32974L30398o557l57825k15476K13045K34719k23937m59211o1391
38888g06185N15733O89561M70038J52249j78234m65562m70206j51356J04105K7297
38878a2560j04982K6865K30888J97047O8906J00096R6161j87616m06922j08409
38868a00526L80976L60822o1643j02358L39958M25664k32046q28490n47380K43170
38858a21853N98771K78822j98100l93572k72919K3456K46131J29024k01504k44677
38848a56421R0098J95840k50840n79836j16177O02525N27806k51335n95808l7076
38838e71224O09133N67850J22464r6650p8459j56859l22809l61226l19165l62604
38828i69549m06004k61621L1058L08449N16759O10405M47317L3061l31113l72550
$$ plain form
38818 -393788 -551082 -472816 -265981 -69915 -11999 -72056 -64482 71070 109501 -89858 -248845
38807 -248845 -73102 170260 -28294 -559866 -711442 -170048 512065 711991 530398 422251
38797 422251 418623 227230 -79515 -39506 461251 866120 621465 -51191 -371672 13928
38787 13928 544520 440811 -267660 -782758 -669483 -508063 -1053892 -2060627 -2515520 -1987406
38777 -1987406 -1141531 -773725 -884314 -1004304 -972856 -960733 -1013440 -1003751 -890189 -698281
38767 -698281 -400771 -96120 -87277 -453086 -784861 -759378 -723801 -1159447 -1732540 -1579454
38757 -1579454 -586266 320789 403140 -3387 -196059 -117860 -118465 -140151 166602 695595
38747 695595 927608 741949 610150 841385 1105858 921028 262382 -515954 -1087699 -1298866
$$ packed form
38818c93788j57294P8266K06835J96066N7916o0057P574J35552L8431j99359j58987
38807b48845J75743K43362j98554n31572j51576N41394O82113J99926j81593j08147
38797D22251l628j91393l06745M0009N00757M04869k44655o72656l20481L85600
38787A3928N30592j03709p08471n15098J13275J61420n45829j006735m54893N28114
38777a987406Q45875L67806j10589j19990L1448J2123n2707R689J13562J91908
38767f98281K97510L04651Q843l65809l31775K5483L5577m35646n73093J53086
38757a579454R93188R07055Q2351m06527j92672P8199o05k1686L06753N28993
38747F95595K32013j85659j31799K31235K64473j84830o58646p78336n71745k11167
$$ plain form
38737 -1298866 -1161538 -879704 -667639 -444064 4326 480366 455059 -83191 -388270 -9435
38727 -9435 413535 66966 -717419 -935897 -525623 -462114 -1103863 -1516813 -952831 -63948
38717 -63948 124256 -284772 -524166 -592841 -1082646 -1787691 -1695368 -562014 538316 671270
38707 671270 229193 129379 494379 777793 742059 619423 530577 356458 109620 -53194
38697 -53194 -164422 -406022 -749673 -947755 -864177 -572553 -202129 77334 46191 -299792
38687 -299792 -588185 -483426 -159750 -33159 -124207 -79010 214217 449040 391892 167979
38677 167979 -40352 -236178 -423287 -492231 -443738 -455970 -574579 -584316 -356327 -100990
38667 -100990 -89249 -284263 -402314 -214972 281381 817422 922809 311509 -683171 -1318919
$$ packed form
38737a298866J37328K81834K12065K23575M48390M76040k5307n38250l05079L78835
38727i435M22970l46569p84385k18478M10274O3509o41749m12950N63982Q88883
38717f3948J88204m09028k39394o8675m89805p05045R2323J133354J100330J32954
38707F71270m42077r9814L65000K83414l5734j22636q8846j74119k46838j62814
38697e3194j11228k41600l43651j98082Q3578K91624L70424K79463l1143l45983
38687b99792k88393J04759L23676J26591r1048M5197K93227K34823n7148k23913
38677A67979k08331j95826j87109o8944M8493j2232j18609r737K27989K55337
38667a00990J1741j95014j18051J87342M96353N36041J05387o11300r94680o35748
$$ plain form
38657 -1318919 -1239359 -803213 -483384 -287493 -35156 148647 42191 -200483 -256402 -197465
38647 -197465 -373702 -759479 -888520 -521049 34280 381278 436801 226999 -308986 -1041502
38637 -1041502 -1501214 -1359420 -878560 -572785 -552777 -519685 -324978 -196567 -372182 -767710
38627 -767710 -1093559 -1139111 -900333 -572190 -439933 -629503 -940215 -1068719 -1002218 -995214
38617 -995214 -1118873 -1081428 -650423 -57962 243087 131839 -94487 -152756 -80690 -85291
38607 -85291 -248166 -425481 -335780 225228 1085977 1641806 1374573 525394 -36183 177640
38597 177640 647313 545894 -132263 -598903 -401573 -10554 -71192 -500774 -716085 -510155
38587 -510155 -246661 -232042 -313279 -213840 29339 155873 52770 -146989 -293301 -415505
$$ packed form
38657a318919P9560M36146L19829J95891K52337J83803j06456k42674n5919N8937
38647a97465j76237l85777j29041L67471N55329L46998N5523k09802n35985p32516
38637a041502m59712J41794M80860L05775K0008L3092J94707J28411j75615l95528
38627g67710l25849m5552K38778L28143J32257j89570l10712j28504O6501P004
38617i95214j23659L7445M31005N92461L01049j11248k26326n8269P2066m601
38607h5291j62875j77315Q9701N61008Q60749N55829k67233q49179n61577K13823
38597A77640M69673j01419o78157m66640J97330L91019o0638m29582k15311K05930
38587e10155K63494J4619q1237R9439K43179J26534j03103j99759j46312j22204
$$ plain form
38577 -415505 -639775 -929595 -993890 -592384 59428 404224 194378 -180136 -233229 -37641
38567 -37641 3514 -121798 -16617 426002 798278 775415 485009 105506 -422583 -995449
38557 -995449 -1128843 -586823 118576 341086 149316 61216 168759 122170 -141241 -295096
38547 -295096 -259520 -322160 -526506 -535824 -286844 -198320 -450277 -594788 -263221 196358
38537 196358 234061 -109453 -396620 -495075 -585241 -662556 -550082 -317534 -200099 -124880
38527 -124880 205696 707351 856769 412252 -186929 -390228 -231697 -156919 -312750 -369257
38517 -369257 -102701 146970 -126447 -829695 -1255638 -978693 -435485 -270634 -373966 -136633
38507 -136633 427953 560548 -47160 -677063 -665573 -400471 -569292 -947324 -806681 -227467
$$ packed form
38577d15505k24270k89820o4295M01506O51812L44796k09846l74514n3093J95588
38567c7641M1155j25312J05181M42619L72276k2863k90406l79503n28089n72866
38557i95449j33394N42020P05399K22510j91770q8100J07543m6589k63411j53855
38547b95096L5576o2640k04346r318K48980Q8524k51957j44511L31567M59579
38537A96358L7703l43514k87167r8455r0166p7315J12474K32548J17435P5219
38527a24880L30576N01655J49418m44517n99181k03299J58531P4778j55831n6507
38517c69257K66556K49671k73417p03248m25943K76945N43208J64851j03332K37333
38507a36633N64586J32595o07708o29903J1490K65102j68821l78032J40643N79214
$$ plain form
38497 -227467 -31697 -456970 -834592 -723981 -476050 -383863 -130245 441630 744670 274187
38487 274187 -505325 -769409 -478978 -267910 -411672 -542331 -322342 130543 510425 626580
38477 626580 448746 165790 135623 466173 745735 531829 1610 -276792 -144952 16146
38467 16146 -53132 -182018 -226568 -365699 -692009 -877611 -596904 -69562 181657 42290
38457 42290 -66770 162170 437246 254256 -361887 -812640 -695759 -332286 -271580 -472547
38447 -472547 -393793 121204 530396 366041 -76122 -159347 233997 624336 580044 131886
38437 131886 -361147 -506070 -152046 387329 535948 132583 -284528 -178133 226679 300540
38427 300540 -53836 -344753 -289948 -100736 61926 320272 605072 518626 -21474 -464535
$$ packed form
38497b27467J95770m25273l77622J10611K47931R2187K53618N71875L03040m70483
38487B74187p79512k64084K90431K11068j43762j30659K19989M52885L79882J16155
38477F26580j77834k82956l0167L30550K79562k13906n30219k78402J31840J61098
38467A6146o9278j28886m4550j39131l26310j85602K80707N27342K51219j39367
38457D2290j09060K28940K75076j82990o16143m50753J16881L63473O0706k00967
38447d72547P8754N14997M09192j64355m42163q3225L93344L90339m4292m48158
38437A31886m93033j44923L54024N39375J48619m03365m17111J06395M04812P3861
38427C00540l54376k90917N4805J89212J62662K58346K84800q6446n40100m43061
$$ plain form
38417 -464535 -328852 122417 284571 13791 -356166 -568347 -594471 -386618 71050 492041
38407 492041 488748 120520 -105533 86749 364551 299154 25469 68323 568732 1014464
38397 1014464 867100 224681 -356076 -552556 -513929 -472743 -461660 -473139 -557386 -615974
38387 -615974 -426047 -64153 46628 -219875 -390258 -119987 171547 -50741 -478404 -356195
38377 -356195 337588 885368 959396 924803 933329 625922 41513 -71117 611753 1280679
38367 1280679 1077364 311842 -95352 81704 359868 479088 578971 644785 493360 219976
38357 219976 57488 -101907 -476709 -837183 -795624 -534448 -576091 -879499 -862975 -373541
38347 -373541 37853 -61666 -480805 -847907 -999907 -813650 -234203 371985 462714 87865
$$ packed form
38417d64535J35683M51269J62154k70780l69957k12181k6124K07853M57668M20991
38407D92041l293l68228k26053J92282K77802o5397k73685M2854N00409M45732
38397A014464j47364o42419n80757j96480L8627M1186J1083j1479q4247n8588
38387f15974J89927L61894J10781k66503j70383K70271K91534k22288m27663J22209
38377c56195O93783N47780P4028l4593Q526l07407n84409j12630O82870O68926
38367A280679k03315p65522m07194J77056K78164J19220R9883O5814j51425k73384
38357B19976j62488j59395l74802l60474M1559K61176m1643l03408J6524M89434
38347c73541M11394r9519m19139l67102j52000J86257N79447O06188R0729l74849
$$ plain form
38337 87865 -156081 -84092 -165481 -572291 -737615 -313961 105819 -154123 -778693 -927753
38327 -927753 -452918 12776 5986 -312442 -569134 -542828 -149610 512365 1085801 1228000
38317 1228000 970594 627975 442381 460649 569716 506447 107603 -286585 -65258 765992
38307 765992 1388338 1229803 736815 593334 675150 463473 75177 35061 276804 276742 70298
38296 70298 193040 586019 535383 -101974 -563332 -419282 -250068 -581340 -956809 -742432
38286 -742432 -227928 -181063 -708702 -1237551 -1343987 -1032007 -465476 37987 35514 -473344
38276 -473344 -800646 -457220 41353 -73606 -574073 -576871 13190 343495 -9622 -421764
38266 -421764 -297747 33198 -5000 -281094 -274386 51329 273206 189916 -18375 -184836
$$ packed form
38337H7865k43946P1989q1389m06810j65324M23654M19780k59942o24570j49060
38327i27753M74835M65694o790l18428k56692K6306L93218O61975N73436J42199
38317A228000k57406l42619j85594J8268J09067o3269l98844l94188K21327Q31250
38307G65992O22346j58535m92988j43481Q1816k11677l88296m0116K41743o2k06444
38296G0298J22742L92979n0636o37357m61358J44050J69214l31272l75469K14377
38286g42432N14504M6865n27639n28849j06436L11980N66531N03463k473n08858
38276d73344l27302L43426M98573j14959n00467k798N90061L30305l53117m12142
38266d21764J24017L30945l8198k76094O708L25715K21877q3290k08291j66461
$$ plain form
38256 -184836 -294056 -299043 -155501 -5779 -39504 -189403 -196117 53540 440974 801518
38246 801518 1004457 934209 614957 292178 162987 74632 -262428 -781073 -1051209 -828489
38236 -828489 -370271 -80428 -17978 69817 309692 478085 260484 -343637 -961131 -1213310
38226 -1213310 -1077711 -804654 -549574 -286708 -91288 -203392 -616253 -868867 -610582
38217 -610582 -236910 -501399 -1437386 -2126519 -1793054 -779057 -68839 -77602 -361748 -436316
38207 -436316 -345349 -278448 -109572 308920 697150 674472 430178 554885 1110484 1356574
38197 1356574 709309 -368593 -851748 -358366 546043 1175693 1384943 1322192 998371
38188 998371 407996 -198572 -517905 -570617 -612382 -731128 -767917 -609146 -339683 -92027
$$ packed form
38256a84836j09220m987J43542J49722l3725j49899o714K49657L87434L60544
38246H01518K02939p0248l19252l22779j29191q8355l37060n18645k70136K22720
38236h28489M58218K89843O2450Q7795K39875J68393k17601o04121o17494k52179
38226a213310J35599K73057K55080K62866J95420j12104m12861k52614K58285
38217f10582L73672k64489r35987o89133L33465J013997P10218q763k84146p4568
38207d36316R0967O6901J68876M18492L88230k2678k44294J24707N55599K46090
38197A356574o47265j077902m83155M93382R04409O29650K09250o2751l23821
38188I98371n90375o06568l19333n2712m1765j18746l6789J58771K69463K47656
$$ plain form
38178 -92027 84116 181063 202990 191414 163714 39946 -231499 -489192 -471385 -149601 200619
38167 200619 313419 177599 -88458 -439801 -845739 -1141016 -1133173 -873497 -683021 -835062
38157 -835062 -1266556 -1658081 -1757135 -1553230 -1167558 -702260 -258890 15251 47822 -31480
38147 -31480 -29167 62347 101765 65259 74259 135153 89865 -88321 -196984 -144441 -138800 -336010
38135 -336010 -541642 -535663 -477734 -637970 -876949 -806497 -416805 -122363 -140747 -217855 -86341
38124 -86341 145225 225713 118083 -29941 -50731 213311 784085 1315144 1257991 470261
38114 470261 -537279 -1141886 -1209148 -988287 -653135 -240864 81575 25363 -473585 -1076658
38104 -1076658 -1309070 -1007250 -492060 -238610 -338434 -434409 -310111 -290761 -724540 -1285537
$$ packed form
38178i2027J76143R6947K1927j1576k7700j23768k71445k57693J7807L21784L50220
38167B00619J12800j35820k66057l51343m05938k95277P843K59676J90476j52041
38157h35062m31494l91525r9054K03905L85672M65298M43370K74141L2571p9302
38147c1480K313R1514L9418l6506R000O0894m5288j78186j08663N2543N641j97210
38135c36010k05632N979N7929j60236k38979P0452L89692K94442j8384p7108J31514
38124h6341K31566Q0488j07630j48024k0790K64042N70774N31059n7153p87730
38114D70261j007540o04607o7262K20861L35152M12271L22439n6212m98948o03073
38104a076658k32412L01820N15190K53450r9824r5975J24298J9350m33779n60997
$$ plain form
38094 -1285537 -1327889 -859925 -532227 -593588 -573271 -220780 26207 -49201 140076 954356
38084 954356 1586122 1085188 -111089 -700863 -347332 80351 53485 49194 441759 777645
38074 777645 629384 326445 283621 302596 117402 769 189993 281184 -72317 -340867
38064 -340867 148233 976601 1076108 317861 -281579 -86028 311855 149907 -335421 -403846
38054 -403846 -5692 211781 -69933 -433345 -402914 -43496 294464 454934 444046 199977
38044 199977 -244317 -505423 -182845 488706 695672 -33168 -1208848 -1918294 -1792746
38035 -1792746 -1212571 -737985 -626528 -774720 -832709 -487910 85552 252071 -237432 -670215
38025 -670215 -226146 746255 1071157 414302 -241931 -97842 333684 184979 -363227 -428506
$$ packed form
38094a285537m2352M67964L27698o1361K0317L52491K46987p5408J89277Q14280
38084I54356O31766n00934j196277n89774L53531M27683k6866m291L92565L35886
38074G77645j48261l02939m2824J8975j85194j16633J89224R1191l53501k68550
38064c40867M89100Q28368R9507p58247n99440J95551L97883j61948m85328o8425
38054d03846L98154K17473k81714l63412L0431L59418L37960J60470j0888k44069
38044A99977m44294k61106L22578O71551K06966p28840j175680p09446J25548
38035a792746N80175M74586J11457j48192n7989L44799N73462J66519m89503m32783
38025f70215M44069R72401L24902o56855o56233J44089M31526j48705n48206o5279
$$ plain form
38015 -428506 231488 1023325 1450235 1496892 1187260 479960 -353111 -847110 -929931 -903826
38005 -903826 -837081 -513008 -26811 153274 -117303 -421328 -445029 -410621 -600035 -872354
37995 -872354 -948508 -833543 -664061 -424282 -108203 63890 -120593 -556644 -950884 -1129165
37985 -1129165 -1071611 -808439 -438956 -128916 17343 -19824 -265001 -651694 -881216 -712544
37975 -712544 -404042 -454331 -829415 -943142 -594351 -363961 -695562 -1088368 -777172 117052
37965 117052 754877 739773 489966 473341 650147 765586 694190 351242 -285445 -880092
37955 -880092 -893989 -300820 213559 81427 -416563 -613258 -390814 -188904 -210718 -171597
37945 -171597 84060 243693 76935 -102160 59116 286147 58510 -477942 -610317 -147213
$$ packed form
38015d28506O59994P91837M26910M6657l09632p07300q33071m93999q2821K6105
38005i03826O6745L24073M86197J80085k70577l04025k3701L4408j89414k72319
37995h72354p6154J14965J69482K39779L16079J72093j84483m36051l94240j78281
37985a129165N7554K63172L69483L10040J46259l7167k45177l86693k29522J68672
37975g12544L08502n0289l75084j13727L48791K30390l31601l92806L11196Q94224
37965A17052O37825j5104k49807j6625J76806J15439p1396l42948o36687n94647
37955h80092j3897N93169N14379j32132m97990j96695K22444K01910k1814L9121
37945a71597K55657J59633j66758j79095J61276K27031k27637n36452j32375M63104
$$ plain form
37935 -147213 236130 36589 -289131 -92188 372715 317520 -340666 -858658 -770322 -402018
37925 -402018 -157264 42941 332772 496941 369409 188293 174329 136622 -131842 -435914
37915 -435914 -557589 -694063 -1043905 -1268334 -928065 -270219 2377 -306417 -677742 -644394
37905 -644394 -288183 95730 388044 547220 468988 145992 -218247 -379407 -242587 102349
37895 102349 411417 440614 241528 179493 449120 743888 694619 456501 481485 834388
37885 834388 1154019 1212256 1074448 767946 278984 -130852 -124937 133406 117617 -261684
37875 -261684 -518946 -370494 -71556 198962 637004 1168707 1173349 392782 -409035 -357096
37865 -357096 310081 608981 200850 -271692 -191727 310072 721808 741610 385087 -101108
$$ packed form
37935a47213L83343j99541l25720J96943M64903n5195o58186n17992Q8336L68304
37925d02018K44754K00205K89831J64169j27532j81116j3964l7707k68464l04072
37915d35914j21675j36474l49842k24429L40269O57846K72596l08794l71325L3348
37905f44394L56211L83913K92314J59176p8232l22996l64239j61160J36820L44936
37895A02349L09068K9197j99086o2035K69627K94768m9269k38118K4984L52903
37885H34388L19631N8237j37808l06502m88962m09836N915K58343j5789l79301
37875b61684k57262J48452K98938K70518M38042N31703M642p80567q01817N1939
37865c57096O67177K98900m08131m72542P9965N01799M11736J9802l56523m86195
$$ plain form
37855 -101108 -319996 -43115 465170 711191 569185 310035 62009 -339002 -876670 -1153785
37845 -1153785 -880722 -272747 243119 492326 566605 607216 749213 1078234 1466516 1617536
37835 1617536 1416278 1068295 778753 507418 184951 -65000 -124067 -98507 -123509 -133083
37825 -133083 -52296 -26753 -180569 -301330 -82406 412449 820899 938093 818571 538531
37815 538531 206688 109373 400869 673591 348959 -413194 -747939 -273352 282886 55731
37805 55731 -779979 -1322745 -1144953 -603703 -115501 248935 429695 244798 -203912 -449578
37795 -449578 -245642 95383 180793 60366 17113 93572 129388 102765 123566 156055 28769
37784 28769 -250418 -388575 -126670 380368 603457 187872 -509646 -661205 26470 756724
$$ packed form
37855a01108k18888K76881N08285K46021j42006k59150k48026m01011n37668k77115
37845a153785K73063O07975N15866K49207P4279M0611J41997L29021L88282J51020
37835A617536k01258l47983k89542k71335l22467k49951n9067K5560k5002r574
37825a33083Q0787K5543j53816j20761K18924M94855M08450J17194j19522k80040
37815E38531l31843r7315K91496K72722l24632p62153l34745M74587N56238k27155
37805E5731q35710n42766J77792N41250M88202L64436J80760j84897m48710k45666
37795d49578K03936L41025Q5410j20427m3253P6459L5816k6623K0801L2489j27286
37784B8769k79187j38157K61905N07038K23089m15585o97518j51559O87675P30254
$$ plain form
37774 756724 512038 -605133 -1425100 -1172790 -311747 280828 387283 302816 157998 -29852
37764 -29852 4656 446828 917320 906101 538180 331572 342886 203612 -74837 -65339 235349
37753 235349 260733 -204490 -601318 -411755 141289 542195 639688 499776 76964 -527750
37743 -527750 -864694 -665197 -297073 -259411 -475981 -532897 -393041 -376078 -540023 -558622
37733 -558622 -218621 315397 735612 823794 519551 39624 -156566 168116 657942 758235
37723 758235 413253 53991 -45922 -32411 -78477 -89373 101508 489616 902476 1040169
37713 1040169 569545 -495559 -1514619 -1716494 -1086372 -403560 -253650 -385475 -292630
37704 -292630 -44066 -88641 -436733 -575420 -266081 22021 -254490 -892303 -1099414 -451585
$$ packed form
37774G56724k44686j117171q19967K52310Q61043N92575J06455q4467j44818j87850
37764b9852L4508M42172M70492j1219l67921k06608J1314j39274k78449R498L00688
37753B35349K5384m65223l96828J89563N53044M00906R7493j39912m22812o04714
37743e27750l36944J99497L68124L7662k16570n6916J39856J6963j63945j8599
37733e58622L40001N34018M20215Q8182l04243m79927j96190L24682M89826J00293
37723G58235l44982l59262r9913J3511m6066j0896J90881L88108M12860J37693
37713A040169m70624j065104j019060k01875O30122O82812J49910j31825R2845
37704b92630K48564m4575l48092j38687L09339K88102k76511o37813k07111O47829
$$ plain form
37694 -451585 587256 1201311 1080925 578861 165971 11556 86476 357876 707742 865453
37684 865453 656629 240527 -76287 -192550 -213847 -186140 -50051 146315 195743 -42356
37674 -42356 -475517 -859819 -961923 -671280 -81749 543296 997107 1290899 1472218 1367988
37664 1367988 747857 -235161 -1009536 -1114855 -624376 47874 588384 876649 788536 203757
37654 203757 -702698 -1362807 -1239647 -411269 391925 478043 -90722 -603893 -527562 -37664
37644 -37664 343758 403646 298146 135667 -135101 -424889 -458560 -176388 97799 86794
37634 86794 -72850 -138286 -219044 -558895 -963403 -921950 -415875 -145559 -615562 -1320522
37624 -1320522 -1333439 -571228 90436 44832 -269072 -126079 413176 688687 436867 32989
$$ packed form
37694d51585J038841O14055j20386n02064m12890j54415P4920K71400L49866J57711
37684H65453k08824m16102l16814j16263k1297K7707J36089J96366M9428k38099
37674d2356m33161l84302j02104K90643N89531O25045M53811K93792J81319j04230
37664A367988o20131r83018p74375j05319M90479O72250N40510K88265q8113n84779
37654B03757r06455o60109J23160Q28378Q03194Q6118n68765n13171P6331M89898
37644c7664L81422N9888j05500j62479k70768k89788l3671K82172K74187j1005
37634H6794j59644o5436q0758l39851m04508M1453N06075K70316m70003p04960
37624a320522j2917P62211O61664m5604l13904J42993N39255K75511k51820m03878
$$ plain form
37614 32989 -199882 -381162 -666148 -887650 -799006 -394311 134375 504581 377406 -345174
37604 -345174 -1165973 -1366774 -928662 -641825 -1016837 -1536500 -1423302 -775850 -369751 -535319
37594 -535319 -855438 -954583 -975549 -1084020 -988290 -326283 668378 1228200 832339 -198927
37584 -198927 -983337 -980185 -541483 -425841 -824171 -1159203 -920797 -336204 33216 44751
37574 44751 -34336 -58695 -101984 -126818 28658 332901 553990 585447 526863 464467 401607
37563 401607 344672 238819 -53298 -450456 -520359 -14491 629393 767211 424773 197466
37553 197466 322324 407465 156952 -187782 -323046 -332745 -424439 -592107 -763967 -947880
37543 -947880 -1024713 -733077 -86099 495904 682395 582705 424579 217347 -39032 -152299
$$ packed form
37614C2989k32871j81280k84986k21502Q8644M04695N28686L70206j27175p22580
37604c45174q20799k00801M38112K86837l75012n19663J13198O47452M06099j65568
37594e35319l20119r9145k0966j08471R5730O62007R94661N59822l95861j031266
37584a98927p84410L152M38702J15642l98330l35032K38406N84593L69420J1535
37574D4751p9087k4359m3289k4834J55476L04243K21089L1457n8584o2396o2860
37563D01607n6935j05853k92117l97158o9903N05868O43884J37818l42438k27307
37553A97466J24858Q5141k50513l44734j35264r699r1694j67668j71860j83913
37543i47880p6833K91636O46978N82003J86491r9690j58126k07232k56379j13267
$$ plain form
37533 -152299 -43115 36763 -92909 -177292 94211 566915 849152 887298 909769 903788 595241
37522 595241 -10844 -465092 -415206 -55764 152713 55237 -109727 -129434 -107741 -253690
37512 -253690 -507299 -545773 -172416 433335 902827 1005497 757646 372264 186602 448182
37502 448182 1013151 1404456 1317608 915130 508647 204757 36082 106561 316985 289296
37492 289296 -64611 -260796 11010 267403 -17372 -436108 -263690 233491 142024 -495692
37482 -495692 -566483 382828 1388742 1506051 1022354 641604 352054 -118357 -445529 -201353
37472 -201353 271713 316512 -24395 -180539 26774 300819 459040 487760 261369 -183509
37462 -183509 -355718 74717 614979 563318 59947 -180419 -13184 21409 -316151 -598968
$$ packed form
37533a52299J09184P9878j29672q4383K71503M72704K82237L8146K2471n981l08547
37522E95241o06085m54248M9886L59442K08477r7476j64964j9707K1693j45949
37512b53690k53609l8474L73357O05751M69492J02670k47851l85382j85662K61580
37502D48182N64969L91305q6848m02478m06483l03890j68675P0479K10424k7689
37492B89296l53907j96185K71806K56393k84775m18736J72418M97181r1467o37716
37482d95692p0791R49311J005914J17309m83697l80750k89550m70411l27172K44176
37472b01353M73066M4799l40907j56144K07313K74045J58221K8720k26391m44878
37462a83509j72209M30435N40262n1661n03371k40366J67235L4593l37560k82817
$$ plain form
37452 -598968 -439228 39847 529179 833077 812332 510207 343201 694550 1318995 1593783
37442 1593783 1312937 789452 290442 -104031 -209034 79680 371252 191164 -219914
37433 -219914 -190989 286074 484789 88654 -319578 -149928 449014 989995 1212323 1011447
37423 1011447 391674 -245886 -340982 23575 130840 -283220 -593780 -306791 160670 242948
37413 242948 146208 329024 553291 251416 -433141 -777151 -577757 -392188 -604536 -893813
37403 -893813 -840753 -556721 -406404 -445145 -456301 -355164 -247363 -158646 7660 198167
37393 198167 140284 -281568 -738233 -811873 -591153 -584585 -984598 -1395626 -1466239 -1366116
37383 -1366116 -1310337 -1056879 -412365 125738 -49747 -623691 -714171 -237635 -52917 -563284
$$ packed form
37452e98968J59740M79075M89332L03898k0745l02125j67006L51349O24445K74788
37442A593783k80846n23485m99010l94473j05003K88714K91572j80088m11078
37433b19914K8925M77063J98715l96135m08232J69650N98942N40981K22328k00876
37423A011447o19773o37560r5096L64557J07265m14060l10560K86989M67461Q2278
37413B42948r6740J82816K24267l01875o84557l44010J99394J85569k12348k89277
37403h93813N3060K84032J50317l8741j1156J01137J07801Q8717J66306J90507
37393A98167n7883m21852m56665p3640K20720O568m00013m11028p0613J00123
37383a366116N5779K53458O44514N38103j75485n73944r0480M76536J84718n10367
$$ plain form
37373 -563284 -1045156 -788695 -159006 66324 -143066 -230490 -4340 221523 253953 222994
37363 222994 223457 192284 129051 126886 202906 295158 345937 255808 -75644 -529302 -796152
37352 -796152 -747241 -530212 -236161 149584 371659 20562 -707616 -938736 -257400 580175
37342 580175 630249 55045 -203465 249148 929948 1300598 1258855 893815 389850 180260
37332 180260 612733 1391182 1838139 1749728 1518398 1411041 1282490 1081623 1048250 1192734
37322 1192734 1107461 598981 77144 -21883 158741 234071 215735 369998 617421 566526
37312 566526 158529 -162045 -94176 41203 -226006 -770037 -1019988 -842127 -777667 -1157395
37302 -1157395 -1441864 -959926 -18254 414874 77878 -282988 -132534 107855 -84096
$$ packed form
37373e63284m81872K56461O29689K25330k09390q7424K26150K25863L2430l0959
37363B22994M63l1173o3233k165P6020R2252N0779r0129l31452m53658k66850
37352g96152M8911K17029K94051L85745K22075l51097p28178k31120O81336Q37575
37342E80175N0074n75204k58510M52613O80800L70650m1743l65040n03965k09590
37332A80260M32473P78449M46957q8411k31330j07357j28551k00867l3373J44484
37322A192734q5273n08480n21837r9027J80624P5330j8336J54263K47423n0895
37312E66526m07997l20574O7869J35379k67209n44031k49951J77861O4460l79728
37302a157395k84469M81938R41672M33128l36996l60866J50454K40389j91951
$$ plain form
37293 -84096 -437966 -428133 -139429 66946 283467 707431 951178 566112 14817 169980
37283 169980 895708 1111484 428767 -237327 -84020 396818 275141 -366475 -576584 107632
37273 107632 1073603 1416205 912109 117046 -318034 -306252 -265901 -453646 -622839 -535627
37263 -535627 -472001 -759861 -1053316 -757626 -94946 52856 -496181 -851545 -396805 274261
37253 274261 336824 -13761 -42306 250151 189262 -402387 -890418 -740483 -148589 339003
37243 339003 378413 -52926 -655780 -876061 -410936 263398 310430 -365600 -867774 -418526
37233 -418526 636367 1304846 1200230 860791 829637 867168 371687 -614117 -1227654 -757493
37223 -757493 461739 1395242 1444766 932481 465421 201267 -73840 -445667 -759438 -872950
$$ packed form
37293h4096l53870R833K88704K06375K16521M23964K43747l85066n51295J55163
37283A69980P25728K15776o82717o66094J53307M80838j21677o41616k10109O84216
37273A07632R65971L42602n04096p95063m35080J1782M0351j87745j69193Q7212
37263e35627O3626k87860k93455K95690O62680J47802n49037l55364M54740O71066
37253B74261O2563l50585k8545K92457o0889n91649m88031J49935N91894M87592
37243C39003L9410m31339o02854k20281M65125O74334M7032o76030n02174M49248
37233d18526J054893O68479j04616l39439l1154L7531m95481r85804o13537M70161
37223g57493J219232R33503M9524n12285m67060k64154k75107l71827l13771j13512
$$ plain form
37213 -872950 -764629 -458771 -39075 331142 564249 742978 931716 1032431 978086 880686
37203 880686 784461 501672 -8965 -340924 -156473 154397 -110029 -892055 -1327935 -950457
37193 -950457 -345912 -244918 -474276 -378677 49338 168918 -228870 -531120 -217941 360991
37183 360991 500897 98619 -328015 -403391 -252015 -133781 -122259 -225323 -478529 -744594
37173 -744594 -692272 -213853 315467 448437 225496 73920 216820 445494 465903 210521
37163 210521 -226462 -701649 -977493 -811234 -259595 264855 408794 240898 67935 23678
37153 23678 29067 64096 221146 443530 422256 -69990 -782439 -1097147 -657363 174958
37143 174958 667486 548077 249695 193026 151088 -275712 -786274 -635109 167452 609139
$$ packed form
37213h72950J08321L05858M19696L70217K33107J78729J88738J00715n4345r7400
37203H80686r6225k82789n10637l31959J84451L10870k64426p82026m35880L77478
37193i50457O04545J00994k29358R5599M28015J19580l97788l02250L13179N78932
37183C60991J39906m02278m26634p5376J51376J18234J1522j03064k53206k66065
37173g44594N2322M78419N29320J32970k22941j51576J42900K28674K0409k55382
37163B10521m36983m75187k75844J66259N51639N24450J43939j67896j72963m4257
37153B3678N389L5029J57050K22384k1274m92246p12449l14708M39784Q32321
37143A74958M92528j19409k98382n6669m1938m26800n10562J51165Q02561M41687
$$ plain form
37133 609139 7257 -987969 -1293125 -865730 -538638 -602150 -428666 362495 1163383 1211679
37123 1211679 624425 120247 58124 215092 290150 184847 -86886 -373182 -356058 80323
37113 80323 513453 396991 -184720 -547288 -262682 348895 705337 647101 459333 429111
37103 429111 580393 735941 702014 449625 147636 -74133 -335664 -766265 -1118172 -995516
37093 -995516 -535031 -412159 -925272 -1477549 -1339035 -598897 86341 434096 690829 987094
37083 987094 1114816 965395 690245 362611 -78959 -515433 -741969 -896576 -1243985 -1480175
37073 -1480175 -942282 262917 1062467 765063 -34807 -395132 -238242 -12302 224254
37064 224254 554638 558854 -75048 -621084 -123141 972516 1193565 205633 -608144 -174214
$$ packed form
37133F09139o01882r95226l05156M27395L27092o3512J73484P91161Q00888M8296
37123A211679n87254n04178o2123J56968P5058j05303k71733k86296J7124M36381
37113H0323M33130j16462n81711l62568K84606O11577L56442n8236j87768l0222
37103D29111J51282J55548l3927k52389l01989k21769k61531m30601l51907J22656
37093i95516M60485J22872n13113n52277J38514P40138O85238L47755K56733K96265
37083I87094J27722j49421k75150l27634m41570m36474k26536j54607l47409k36190
37073a480175N37893J205199P99550k97404p99870l60325J56890K25940K36556
37064B24254L30384M216o33902n46036M97943J095657K21049r87932q13777M33930
$$ plain form
37054 -174214 784853 1007179 496544 126852 109721 -52248 -393935 -350548 168207 461757
37044 461757 64060 -546802 -610315 -66117 448056 383348 -179040 -710596 -813838 -571957
37034 -571957 -328495 -230460 -170017 -107470 -124512 -131436 69564 320645 198282 -220682 -265085
37023 -265085 264373 547843 -102965 -1065508 -1206142 -520189 -36617 -232998 -543441 -511518
37013 -511518 -432735 -554279 -539340 -191672 49797 -103325 -146145 445410 1286140 1579511
37003 1579511 1194219 630959 208109 -89802 -167143 118055 521133 641335 577331 797870
36993 797870 1318263 1560808 1193116 626530 435627 643589 855840 840357 685959 528200
36983 528200 379240 206899 28608 -87803 -72425 63679 173471 65262 -310839 -794577
$$ packed form
37054a74214R59067K22326n10635l69692j7131j61969l41687M3387N18755K93550
37044D61757l97697o10862o3513N44198N14173o4708n62388n31556j03242K41881
37034e71957K43462R8035O0443O2547j7042o924K01000K51081j22363m18964m4403
37023b65085N29458K83470o50808r62543j40634O85953M83572j96381l10443L1923
37013e11518P8783j21544J4939L47668K41469j53122m2820N91555Q40730K93371
37003A579511l85292n63260m22850k97911p7341K85198M03078J20202o4004K20539
36993G97870N20393K42545l67692n66586j90903K07962K12251j5483j54398j57759
36983E28200j48960j72341j78291j16411J5378J36104J09792j08209l76101m83738
$$ plain form
36973 -794577 -1140482 -1201027 -1029399 -833403 -767552 -736564 -501065 -31984 379414 480807
36963 480807 393924 420374 608591 715141 562178 248503 -5175 -87824 -64646 -95488
36953 -95488 -259665 -408252 -293490 60477 264640 22597 -434177 -595206 -299079 115429
36943 115429 279202 207290 206575 511942 1044708 1452331 1414749 976086 492958 201913
36933 201913 10981 -180470 -225867 -42239 72982 -197439 -669036 -893241 -823625 -828148
36923 -828148 -1079656 -1374723 -1581160 -1811853 -2039583 -1951581 -1384388 -619986 -99225 -46839
36913 -46839 -399400 -828004 -860201 -349931 186926 140165 -300784 -363366 138214 501864
36903 501864 227038 -260083 -356782 -169317 -156801 -367808 -552398 -645839 -640097 -336306
$$ packed form
36973g94577l45905o0545J71628J95996O5851L0988K35499M69081M11398J01393
36963D80807q6883K6450J88217J06550j52963l13675k53678q2649K3178l0842
36953i5488j64177j48587J14762L53967K04163k42043m56774j61029K96127M14508
36943A15429J63773p1912p15L05367N32766M07623l7582m38663m83128k91045
36933B01913j90932j91451m5397J83628J15221k70421m71597k24205O9616m523
36923h28148k51508k95067k06437k30693k27730Q8002N67193P64402N20761N2386
36913d6839l52561m28604l2197N10270N36857m6761m40949o2582N01580L63650
36903E01864k74826m87121r6699J87465J2516k11007j84590r3441N742L03791
$$ plain form
36893 -336306 276927 755752 817308 847707 1242831 1635320 1435619 817514 454963 526733
36883 526733 693151 829542 1024606 1043180 600238 45466 -33457 229947 271884 206536
36873 206536 626938 1324238 1356938 601622 93899 438412 950980 879965 457050 137867
36863 137867 -207645 -627612 -549242 243702 911095 733047 242237 239610 419128 68676
36853 68676 -505084 -508447 -158251 -314216 -874627 -907208 -330680 -107295 -584573 -912280
36843 -912280 -471112 227513 517306 486524 431736 267537 -3589 12186 424879 748517
36833 748517 713232 713802 999313 1135415 814893 502165 622535 742218 304986 -326441
36823 -326441 -383766 90055 336956 19346 -445016 -594705 -373408 73408 540903 764356
$$ packed form
36893c36306O13233M78825O1556L0399L95124L92489j99701o18105l62551P1770
36883E26733J66418J36391J95064J8574m42942n54772p8923K63404M1937o5348
36873B06536M20402O97300L2700p55316n07723L44513N12568p1015m22915l19183
36863A37867l45512m19967P8370P92944O67393j78048m90810k627J79518l50452
36853F8676n73760l363L50196j55965n60411l2581N76528K23385m77278l27707
36843i12280M41168O98625K89793l0782n4788j64199k71126J5775M12693L23638
36833G48517l5285N70K85511J36102l20522l12728J20370J19683m37232o31427
36823c26441n7325M73821K46901l17610m64362j49689K21297M46816M67495K23453
$$ plain form
36813 764356 705727 725202 1058029 1312434 989116 348308 188389 779705 1527091 1738929
36803 1738929 1313544 625469 114339 41017 328754 595952 580851 488233 669482 1070770
36793 1070770 1313138 1235197 1037707 956294 1077561 1385765 1718312 1811824 1665135 1653601
36783 1653601 1980856 2306427 2310005 2262337 2476382 2554180 1948687 1043751 770155 1198286
36773 1198286 1477696 1293859 1363670 2126420 2919895 3050966 2859475 2974286 3175591 2876217
36763 2876217 2305994 2288548 2989248 3709073 3954564 4025746 4382579 4945122 5261013 5087247
36753 5087247 4636177 4342534 4388876 4447275 4106039 3602509 3682258 4458314 4949896 4326784
36743 4326784 3192722 2861380 3569474 4261050 4138907 3555590 3154556 2955876 2731487
$$ packed form
36813G64356n8629J9475L32827K54405l23318o40808j59919N91316P47386K11838
36803A738929m25385o88075n11130p3322K87737K67198j5101r2618J81249M01288
36793A070770K42368p7941j97490q1413J21267L08204L32547R3512j46689j1534
36783A653601L27255L25571L578m7668K14045P7798o05493r04936k73596M28131
36773A198286K79410j83837O9811P62750P93475J31071j91491J14811K01305k99374
36763B876217n70223j7446P00700P19825K45491P1182L56833N62543L15891j73766
36753E087247m51070k93643M6342N8399l41236n03530P9749P76056M91582o23112
36743D326784j134062l31342P08094O91576j22143n83317m01034j98680k24389
$$ plain form
36734 2731487 2622885 2806565 2985448 2801938 2489439 2559106 2967434 3087602 2506936 1497092
36724 1497092 674473 451537 808319 1363822 1653202 1504368 1162939 986945 1108133
36715 1108133 1444578 1843386 2070089 1878843 1307528 719896 351962 48162 -301466
36706 -301466 -364706 168076 936246 1249167 998900 712517 707192 763039 732955 866209
36696 866209 1239614 1394501 964772 302629 41526 289103 661007 898634 1023670 1035769
36686 1035769 904540 795993 900771 1063926 955402 584552 271778 127574 -19002
36677 -19002 -131356 128704 817357 1416153 1407600 919575 555579 718779 1263954 1706395
36667 1706395 1685659 1333796 1173196 1459141 1714584 1293334 376100 -134775 137545 505614
$$ packed form
36734B731487j08602J83680J78883j83510l12499O9667M08328J20168n80666j009844
36724A497092q22619k22936L56782N55503K89380j48834l41429j75994J21188
36715A108133L36445L98808K26703j91246n71315n87632l67934l03800l49628
36706c01466o3240N32782P68170L12921k50267k86383n325N5847l0084J33254
36696H66209L73405J54887m29729o62143k61103K47577L71904K37627J25036J2099
36686A035769j31229j08547J04778J63155j08524l70850l12774j44204j46576
36677a9002j12354K60060O88653N98796q553m88025l63996J63200N45175M42441
36667A706395k0736l51863j60600K85945K55443m21250r17234n10875K72320L68069
$$ plain form
36657 505614 282069 -198182 -195973 247779 499810 465640 691715 1311242 1682534 1343329
36647 1343329 708009 453192 658591 928526 1027421 1015471 962923 849563 640375 296284
36637 296284 -121687 -271216 232657 1212865 1905023 1807776 1244515 781325 463460 85989
36627 85989 -121441 245305 924786 1117495 585758 19524 49202 423697 544734 378859
36617 378859 330623 482252 539708 463817 581697 948181 1098904 725328 213028 103384
36607 103384 268717 136884 -325283 -434485 204786 1026949 1252192 956578 840414 1094149
36597 1094149 1157553 711366 275497 453769 1023963 1255583 898589 396209 215991 381575
36587 381575 655774 837517 829114 667508 529781 525699 519477 343202 83884 -90536 -256807
$$ packed form
36657E05614k23545m80251K209M43752K52031l4170K26075O19527L71292l39205
36647A343329o35320k54817K05399K69935R8895j1950n2548j13360k09188l44091
36637B96284m17971j49529N03873R80208O92158r7247n63261m63190l17865l77471
36627H5989k07430L66746O79481J92709n31737n66234K9678L74495J21037j65875
36617C78859m8236J51629N7456p5891J17880L66484J50723l73576n12300j09644
36607A03384J65333j31833m62167j09202O39271Q22163K25243k95614j16164K53735
36597A094149O3404m46187m35869J78272N70194K31620l56994n02380j80218J65584
36587C81575K74199J81743q403j61606j37727m082o222j76275k59318j74420j66271
$$ plain form
36576 -256807 -542571 -716267 -421546 183112 507293 355282 192811 403859 750942 856468
36566 856468 787359 782933 760918 547725 351663 528594 1000564 1324188 1253248 874814
36556 874814 321161 -222799 -329286 319404 1319554 1771984 1302085 485221 71956
36547 71956 134070 213194 14844 -355675 -666696 -762427 -564498 -120215 354407 647306
36537 647306 775518 926401 1171695 1339258 1222478 893500 728179 1008096 1501095 1642417
36527 1642417 1261724 889577 1041642 1390754 1138060 209765 -468795 -137578 813014
36518 813014 1408376 1319576 1046563 1029652 1106233 930739 524117 185768 80874 138716
36508 138716 274056 515810 877214 1201324 1251122 986300 662569 558327 671824 832921
$$ packed form
36576b56807k85764j73696K94721O04658L24181j52011j62471K11048L47083J05526
36566H56468o9109m426k2015k13193j96062J76931M71970L23624p0940l78434
36556H74814n53653n43960j06487O48690J000150M52430m69899q16864m13265
36547G1956O2114P9124j98350l70519l11021r5731J97929M44283M74622K92899
36537F47306J28212J50883K45294J67563j16780l28978j65321K79917M92999J41322
36527A642417l80693l72147J52065L49112k52694r28295o78560L31217R50592
36518H13014N95362q8800k73013j6911P6581j75494m06622l38349j04894N7842
36508A38716J35340K41754L61404L24110M9798k64822l23731j04242J13497J61097
$$ plain form
36498 832921 1028737 1352098 1631544 1465500 779327 44455 -281484 -267685 -205429 -74491
36488 -74491 296881 724757 785266 413174 -6347 -156776 -44779 264268 743944 1147780
36478 1147780 1090413 618748 350924 738356 1429883 1694998 1328300 807802 622727 761026
36468 761026 893951 801035 496682 113969 -175674 -199984 92523 510515 724392 592666
36458 592666 354984 395762 810781 1319694 1616032 1632541 1405833 930260 345760 43012
36448 43012 247887 613636 590953 165503 -158731 -125081 -29334 -129622 -204693 22841
36438 22841 397844 627451 775383 1051190 1317929 1276442 1039729 1038966 1336222 1486474
36428 1486474 1208567 801188 700127 940939 1272875 1517139 1561885 1275559 764643 520645
$$ packed form
36498H32921J95816L23361K79446j66044o86173p34872l25939J3799O2256J30938
36488g4491L71372M27876O0509l72092m19521j50429J11997L09047M79676M03836
36478A147780n7367m71665k67824L87432O91527K65115l66698n20498j85075J38299
36468G61026J32925r2916l04353l82713k89643k4310K92507M17992K13877j31726
36458E92666k37682M0778M15019N08913K96338J6509k26708m75573n84500l02748
36448D3012K04875L65749k2683m25450l24234L3650R5747j00288p5071K27534
36438B2841L75003K29607J47932K75807K66739m1487k36713p63K97256J50252
36428A486474k77907m07379j01061K40812L31936K44264M4746k86326n10916k43998
$$ plain form
36418 520645 902451 1550735 1737138 1311580 865819 836169 920461 709699 487806 840290
36408 840290 1616149 1912763 1256011 303234 41215 584299 1140504 1028328 375166 -176841
36398 -176841 -175559 295029 799536 1004819 991104 1075857 1316962 1383547 1062369 667048
36388 667048 655839 997459 1282137 1381233 1555897 1872011 1986092 1721633 1445329 1535982
36378 1535982 1775966 1672637 1220041 920475 1074085 1420134 1558070 1427363 1240121
36369 1240121 1159973 1205907 1328587 1433490 1433488 1416271 1656013 2271157 2919262 3059934 2571575
36358 2571575 1898425 1471101 1199643 781790 347439 391910 1018265 1645170 1710539 1387049
36348 1387049 1278176 1582176 1934877 2021323 1946061 1922474 1952087 2003190 2234005 2747040
$$ packed form
36418E20645L81806O48284J86403m25558m45761k9650Q4292k10762k21893L52484
36408H40290P75859K96614o56752r52777k62019N43084N56205j12176o53162n52007
36398a76841J282M70588N04507K05283j3715Q4753K41105O6585l21178l95321
36388F67048j1209L41620K84678R9096J74664L16114J14081k64459k76304R0653
36378A535982K39984j03329m52596k99566J53610L46049J37936j30707j87242
36369A240121q0148M5934J22680J04903kj7217K39742O15144O48105J40672m88359
36358B571575o73150m27324k71458m17853m34351M4471O26355O26905O5369l23490
36348A387049j08873L04000L52701Q6446p5262k3587K9613N1103K30815N13035
$$ plain form
36338 2747040 3242050 3225630 2624496 1973848 1845320 2203153 2532872 2574985 2628686 2972507
36328 2972507 3296214 3105119 2536276 2262060 2566439 3066144 3488573 4102984 5027125
36319 5027125 5699721 5601557 5057496 4705014 4548859 4249427 4018737 4361728 5065769 5351196
36309 5351196 5063132 4853989 5052549 5200309 4940976 4550766 4274132 3926511 3538190
36300 3538190 3603029 4196606 4589935 4327363 4016124 4378807 5111694 5418201 5198123 4956821
36290 4956821 4917142 4959522 5126260 5468401 5668481 5501386 5378060 5721580 6122321 5935160
36280 5935160 5460182 5596748 6424939 7089002 7147681 7109960 7418159 7746868 7665477 7326438
36270 7326438 7121081 7162016 7400316 7797712 8146572 8163957 7968021 8026917 8474838 8942681
$$ packed form
36338B747040M95010j6420o01134o50648j28528L57833L29719M2113N3701L43821
36328B972507L23707j91095n68843k74216L04379M99705M22429O14411R24141
36319E027125O72596r8164n44061l52482j56155k99432k30690L42991P04041K85427
36309E351196k88064k09143J98560J47760k59333l90210k76634l47621l88321
36300C538190O4839N93577L93329k62572l11239L62683P32887L06507k20078k41302
36290D956821l9679M2380J66738L42141K00080j67095j23326L43520M00741j87161
36280E935160m74978J36566Q28191O64063N8679l7721L08199L28709q1391l39039
36270G326438k05357M0935K38300L97396L48860J7385j95936N8896M47921M67843
$$ plain form
36260 8942681 9209190 9496156 9934682 10296946 10507822 10862382 11416234 11709635 11513362
36251 11513362 11373629 11933061 13056635 14076326 14608943 14721975 14591727 14465960 14749877
36242 14749877 15653165 16840228 17786588 18384418 18908032 19555124 20372944 21483530 22960971
36233 22960971 24520655 25712749 26478392 27232195 28345010 29794350 31390153 33104657
36225 33104657 35030811 37160853 39400796 41805698 44650571 48151602 52173861 56384805
36217 56384805 60716250 65464633 70857523 76813179 83338073 90832620 99618541 109447779
36209 109447779 120025095 131841260 145816677 162127387 180095016 199371094 220486835
36202 220486835 243925926 269352681 296154135 323966635 351931034 377961219 399614713
$$ packed form
36260H942681K66509K86966M38526L62264K10876L54560N53852K93401j96273
36251A1513362j39733N59432J123574J019691N32617J13032j30248j25767K83917
36242A4749877R03288J187063R46360N97830N23614O47092Q17820J110586J477441
36233B2960971J559684J192094P65643P53803J112815J449340J595803J714504
36225C3104657J926154K130042K239943K404902K844873L501031M022259M210944
36217E6384805M331445M748383N392890N955656O524894P494547Q785921R829238
36209A09447779J0577316J1816165J3975417J6310710J7967629J9276078K1115741
36202B20486835K3439091K5426755K6801454K7812500K7964399K6030185K1653494
$$ plain form
36195 399614713 415456016 424868335 426919799 420576493 406247565 386203114 362988785
36188 362988785 337991027 311906726 285896817 261455601 239339173 219318966 201042976
36181 201042976 184606904 170139401 157337575 145799610 135562917 126901590 119674019
36174 119674019 113288907 107418619 102413937 98803972 96612317 95407125 94851675 94912289
36166 94912289 95622404 96977886 99086599 102117553 105966574 110119488 113898960 116708611
36158 116708611 118049474 117552063 115134224 111015906 105506288 98877040 91472273 83788688
36150 83788688 76334139 69435396 63189957 57547839 52455373 47977598 44245477 41244402
36142 41244402 38740982 36464313 34242206 31955429 29613809 27560201 26253967 25637746
$$ packed form
36195C99614713J5841303R412319K051464o343306j4328928k0044451k3214329
36188C62988785k4997758k6084301k6009909k4441216k2116428k0020207j8275990
36181B01042976j6436072j4467503j2801826j1537965j0236693q661327p227571
36174A19674019o385112n870288n004682l609965k191655j205192n55450O0614
36166I4912289P10115J355482K108713L030954L849021M152914L779472K809651
36158A16708611J340863m97411k417839m118318n509618o629248p404767p683585
36150H3788688p454549o898743o245439n642118n092466m477775l732121l001075
36142D1244402k503420k276669k222107k286777k341620k053608j306234o16221
$$ plain form
36134 25637746 25053946 24051882 22890636 21896514 20812765 19378871 18132588 17813168
36126 17813168 18151887 18109743 17296685 16317325 15638177 15004513 14239863 13769130 13883128
36117 13883128 14148085 14053834 13737900 13594749 13613219 13583278 13613099 13981899 14693204 15482648
36107 15482648 16061733 16195070 15866378 15513223 15688266 16331923 16840667 16986345 17161537
36098 17161537 17480367 17344370 16352666 15034614 14139718 13698406 13324306 12982610 12873152
36089 12873152 12922938 12954008 13043808 13234460 13235309 12903146 12640258 12790144 13021052 12891402
36079 12891402 12667546 12920984 13570513 13993034 13949958 13808483 13899889 14130473 14191095 13839794
36069 13839794 13102508 12382315 12064872 11858768 11053254 9673352 8647209 8375073 7987026
$$ packed form
36134B5637746n83800j002064j161246r94122j083749j433894j246283l19420
36126A7813168L38719m2144q13058r79360o79148o33664p64650m70733J13998
36117A3883128K64957r4251l15934j43151J8470k9941K9821L68800P11305P89444
36107A5482648N79085J33337l28692l53155J75043O43657N08744J45678J75192
36098A7161537L18830j35997r91704j318052q94896m41312l74100l41696j09458
36089A2873152M9786L1070Q9800J90652Q49l32163k62888J49886K30908j29650
36079A2891402k23856K53438O49529M22521m3076j41475R1406K30584O0622l51301
36069A3839794p37286p20193l17443k06104q05514j379902j026143k72136l88047
$$ plain form
36060 7987026 6774899 5532829 5406799 6032073 6074253 5291879 4763126 5114070 5729110
36051 5729110 5874771 5579775 5177652 4846302 4798361 5137320 5371385 4857419 3889551 3558715
36041 3558715 4307686 5342748 5714239 5338113 4745144 4427056 4619017 5185131 5591012
36032 5591012 5460004 5108648 5002813 4926197 4464347 4036672 4364035 5010480 4733396 3457583
36022 3457583 2572092 2832539 3276868 2911358 2243490 2175268 2399718 2091663 1504177 1606414
36012 1606414 2440701 3001937 2742369 2248737 2248015 2649696 2872157 2698069 2486858 2637715
36002 2637715 3023053 3105932 2693080 2306467 2448742 2747031 2442526 1610303 1097461 1188606
35992 1188606 1222676 786391 367276 387763 497932 430763 686002 1558059 2237337 1864930
$$ packed form
36060G987026j212127j242070j26030O25274M2180p82374n28753L50944O15040
36051E729110J45661k94996m02123l31350m7941L38959K34065n13966r67868l30836
36041C558715P48971J035062L71491l76126n92969l18088J91961N66114M05881
36032E591012j31008l51356j05835p6616m61850m27675L27363O46445k77084j275813
36022C457583q85491K60447M44329l65510o67868o8222K24450l08055n87486J02237
36012A606414Q34287N61236k59568m93632p22M01681K22461j74088k11211J50857
36002B637715L85338Q2879m12852l86613J42275K98289l04505q32223n12842R1145
35992A188606L4070m36285m19115K0487J10169o7169K55239Q72057O79278l72407
$$ plain form
35982 1864930 955279 733093 1381876 1984933 2044058 2012369 2253951 2436984 2254722 2000345
35972 2000345 2024714 2145447 2011522 1730515 1744500 2211403 2788158 3019173 2785497 2329070
35962 2329070 1924592 1665114 1591184 1799268 2201223 2371685 1997586 1377989 1082590 1208918
35952 1208918 1439402 1714819 2221011 2730698 2711220 2230496 1994805 2231526 2294680 1732923
35942 1732923 1004329 690514 707442 784397 1032004 1484968 1740998 1630463 1595994 1831128
35932 1831128 1770775 1122280 636206 993690 1620794 1582001 1045319 797115 827095 571799
35922 571799 189022 356815 1002004 1420727 1559674 1996148 2662141 2789697 2257308 1852579
35912 1852579 1964502 2083902 1903730 1881089 2276872 2544571 2177630 1448389 878008 608286
$$ packed form
35982A864930r09651k22186O48783O03057N9125l1689K41582J83033j82262k54377
35972B000345K4369J20733j33925k81007J3985M66903N76755K31015k33676m56427
35962B329070m04478k59478p3930K08084M01955J70462l74099o19597k95399J26328
35952A208918K30484K75417N06192N09687j9478m80724k35691K36721O3154n61757
35942A732923p28594l13815J6928P6955K47607M52964K56030j10535l4469K35134
35932A831128o0353o48495m86074L57484O27104l8793n36682k48204K9980k55296
35922E71799l82777J67793O45189M18723J38947M36474O65993J27556n32389m04729
35912A852579J11923J19400j80172k2641L95783K67699l66941p29241n70381k69722
$$ plain form
35902 608286 635965 1016306 1502782 1620057 1398833 1396460 1716433 1727687 1108317 450140
35892 450140 401107 863860 1459826 2100593 2617165 2523173 1771772 1173084 1397005 2017678
35882 2017678 2180230 1798067 1427961 1304864 1205661 1074192 1127863 1398733 1660265 1761673
35872 1761673 1677600 1366880 930071 717507 902566 1134613 1012177 724612 787518 1247454
35862 1247454 1585683 1414881 937046 664936 887033 1405903 1708842 1492958 1059267
35853 1059267 965111 1256141 1419197 1209536 1020075 1143074 1203289 819074 384322 553542
35843 553542 1221040 1683756 1687842 1645896 1815433 1899668 1616437 1162232 908717 994047
35833 994047 1355170 1841559 2180244 2145281 1897447 1884531 2285114 2794897 3052202 3017836
$$ packed form
35902F08286K7679L80341M86476J17275k21224k373L19973J1254o19370o58177
35892D50140m9033M62753N95966O40767N16572r3992p51401n98688K23921O20673
35882B017678J62552l82163l70106j23097r9203j31469N3671K70870K61532J01408
35872A761673q4073l10720m36809k12564J85059K32047j22436k87565O2906M59936
35862A247454L38229j70802m77835k72110K22097N18870L02939k15884m33691
35853A059267r4156K91030J63056k09661j89461J22999O0215l84215m34752J69220
35843E53542O67498M62716M086m1946J69537Q4235k83231m54205k53515Q5330
35833I94047L61123M86389L38685l4963k47834j2916M00583N09783K57305l4366
$$ plain form
35823 3017836 2849093 2682973 2667329 2917851 3263493 3288860 2855041 2382253 2369483 2769472
35813 2769472 3091516 3047568 2845922 2845636 3136182 3527624 3817747 3975588 4106198 4283480
35803 4283480 4428799 4403302 4254162 4266276 4634957 5162342 5500438 5694824 6185556 7119616
35793 7119616 7980014 8259240 8326022 9135815 11025985 13232504 14773156 15438697 15697108
35784 15697108 16018381 16662773 17820966 19462673 21139666 22333983 22952144 23182196 23024085
35775 23024085 22357254 21342868 20308557 19308184 18232234 17230554 16478222 15625842
35767 15625842 14187458 12511718 11568458 11534817 11396896 10380994 9026883 8240559 7952032
35758 7952032 7502934 6873986 6603897 6717763 6641765 6164659 5680583 5394276 5030086 4509486
$$ packed form
35823C017836j68743j66120j5644K50522L45642K5367m33819m72788j2770L99989
35813B769472L22044m3948k01646k86K90546L91442K90123J57841J30610J77282
35803D283480J45319k5497j49140J2114L68681N27385L38096J94386M90732R34060
35793G119616Q60398K79226O6782Q09793J890170K206519J540652O65541K58411
35784A5697108L21273O44392J158193J641707J676993J194317O18161K30052j58111
35775B3024085o66831j014386j034311j000373j075950j001680p52332q52380
35767A5625842j438384j675740r43260l3641j37921j015902j354111p86324k88527
35758G952032m49098o28948k70089J13866p5998m77106m84076k86307l64190n20600
$$ plain form
35748 4509486 4225824 4351769 4459477 4186402 3795670 3685840 3744249 3608639 3260276 2921333
35738 2921333 2596537 2180416 1895530 2155646 2966245 3825853 4306120 4457072 4561004
35729 4561004 4748916 4997378 5289796 5580416 5719748 5634084 5546266 5791062 6325362 6598709
35719 6598709 6107189 5029390 4103184 3816863 3911914 3820165 3422940 3124879 3222814 3488353
35709 3488353 3479119 3058187 2447819 1912877 1588758 1540386 1742189 1955418 1840150 1336643
35699 1336643 822305 730711 1067885 1453934 1589968 1475916 1176678 679081 141775 6741
35689 6741 528506 1310568 1668096 1446526 1137404 1128155 1210940 1015912 605166 351102
35679 351102 429666 710645 1001653 1144255 1012130 693261 553047 816260 1182916 1182909 841638
$$ packed form
35748D509486k83662J25945J07708k73075l90732j09830N8409j35610l48363l38943
35738B921333l24796m16121k84886K60116Q10599Q59608M80267J50952J03932
35729D561004J87912K48462K92418K90620J39332q5664q7818K44796N34300K73347
35719F598709m91520j077799r26206k86321R5051r1749l97225k98061R7935K65539
35709C488353r234m20932o10368n34942l24119m8372K01803K13229j15268n03507
35699A336643n14338r1594L37174L86049J36034j14052k99238m97597n37306j35034
35689F741N21765P82062L57528k21570l09122r249Q2785j95028m10746k54064
35679C51102P8564K80979K91008J42602j32125l18869j40214K63213L66656pl41271
$$ plain form
35668 841638 640325 851220 1293879 1744367 2137327 2277005 1840537 915648 132714 -43178
35658 -43178 166757 317470 362003 454362 497321 373684 340879 627532 859494 567760
35648 567760 156687 545261 1704359 2384190 1719314 422115 -205297 78674 497110
35639 497110 587288 648766 905129 1025438 757621 478696 697195 1270734 1496979 963267
35629 963267 98127 -224782 351721 1185285 1313051 625911 12425 146951 588359 547627
35619 547627 154764 214413 847264 1255263 1013983 764893 1168324 1821341 1843777 1142925
35609 1142925 448747 270171 393083 397953 218079 80703 149384 317622 305415 38137
35599 38137 -85309 396116 1220994 1453379 632158 -487194 -776483 -63534 859657 1358580
$$ packed form
35668H41638k01313K10895M42659M50488L92960J39678m36468r24889p82934j75892
35658d3178K09935J50713M4533R2359M2959j23637l2805K86653K31962k91734
35648E67760m11073L88574J159098O79831o64876j297199o27412K83971M18436
35639D97110R0178O1478K56363J20309k67817k78925K18499N73539K26245n33712
35629I63267q65140l22909N76503Q33564J27766o87140o13486J34526M41408m0732
35619E47627l92863N9649O32851M07999k41280k49090M03431O53017K2436p00852
35609A142925o94178j78576J22912M870j79874j37376O8681J68238j2207k67278
35599C8137j23446M81425Q24878K32385q21221j119352k89289P12949R23191M98923
$$ plain form
35589 1358580 1516208 1605901 1578580 1267517 742649 251284 -10668 22160 260105 447417
35579 447417 320730 -148574 -699705 -929111 -515713 470560 1400959 1546324 933258 440283
35569 440283 722971 1334387 1339794 581857 -176247 -272628 190461 706520 929094 788992
35559 788992 408147 24491 -195177 -284796 -293098 -124296 222904 485887 510607 544844
35549 544844 808023 1080285 1171860 1418870 2050998 2405189 1672702 315764 -258962 414458
35539 414458 1250860 1205433 581840 247809 321625 331777 164510 122039 280037 380539
35529 380539 283477 140124 181376 538255 1122372 1574381 1592016 1383898 1416522 1626728
35519 1626728 1421683 685004 185931 563639 1391908 1757015 1401691 802734 416003
$$ packed form
35589A358580J57628Q9693k7321l11063n24868m91365k61952L2828K37945J87312
35579D47417j26687m69304n51131k29406M13398R86273R30399J45365o13066m92975
35569D40283K82688O11416N407p57937p58104r6381M63089N16059K22574j40102
35559G88992l80845l83656k19668q9619q302J68802L47200K62983K4720L4237
35549E44844K63179K72262R1575K47010O32128L54191p32487j356938n74726O73420
35539D14458Q36402m5427o23593l34031P3816J0152j67267m2471J57998J00502
35529C80539r7062j43353M1252L56879N84117M52009J7635k08118L2624K10206
35519A626728k05045p36679m99073L77708Q28269L65107l55324n98957l86731
$$ plain form
35510 416003 340562 505222 726657 741817 539064 450105 604983 613967 184194 -291761
35500 -291761 -264854 142511 403826 457293 664720 1003226 980712 458093 -21878 47110
35490 47110 498559 812929 774219 555665 333286 80904 -246227 -487876 -382468 79349
35480 79349 554258 755056 819203 1001295 1139182 866383 323154 108579 408574 735766
35470 735766 746649 715563 860980 816403 285239 -279741 -248181 290328 749653 853994
35460 853994 702494 350687 -128067 -445648 -464610 -447092 -490224 -197495 505272 826979
35450 826979 229801 -459016 -144310 724739 743510 -183683 -603937 240922 1322182 1497986
35440 1497986 1026474 648255 247594 -557896 -1268047 -1068705 -156304 511567 606355 683027
$$ packed form
35510D16003p5441J64660K21435J5160k02753q8959J54878Q984m29773m75955
35500b91761K6907M07365K61315N3467K07427L38506k2514n22619m79971O8988
35490D7110M51449L14370l8710k18554k22379k52382l27131k41649J05408M61817
35480G9349M74909K00798O4147J82092J37887k72799n43229k14575K99995L27192
35470G35766J0883l1086J45417m4577n31164n64980L1560N38509M59325J04341
35460H53994j51500l51807m78754l17581j8962J7518m3132K92729P02767L21707
35450H26979n97178o88817L14706Q69049J8771r27193m20254Q44859J081260J75804
35440A497986m71512l78219m00661q05490p10151J99342R12401O67871R4788P6672
$$ plain form
35430 683027 1085195 1398015 1151151 482451 -126802 -417517 -469283 -455089 -391513 -78991
35420 -78991 640673 1514333 1975560 1764699 1232358 855156 716412 681787 757661 925072
35410 925072 897530 479422 -8685 -86779 228384 525005 620191 644357 627868 521331
35400 521331 573052 1099402 1811237 1975522 1451379 987565 1173681 1648106 1797980 1734220
35390 1734220 1927552 2235180 2091383 1561643 1373477 1755778 2026222 1677516 1184566
35381 1184566 1209822 1573839 1699412 1683604 2117085 2991800 3616988 3692641 3713122 4097589
35371 4097589 4616602 5008754 5508326 6264298 6773564 6533480 5927793 5788815 6215871
35362 6215871 6471938 6082527 5462316 5256727 5482768 5617718 5334602 4873453 4686695
$$ packed form
35430F83027M02168L12820k46864o68700o09253k90715n1766J4194O3576L12522
35420g8991P19664Q73660M61227k10861n32341l77202j38744l4625P5874J67411
35410I25072k7542m18108m88107p8094L15163K96621R5186K4166j6489j06537
35400E21331N1721N26350P11835J64285n24143m63814J86116M74425J49874o3760
35390A734220J93332L07628j43797n29740j88166L82301K70444l48706m92950
35381A184566K5256L64017J25573j5808M33481Q74715O25188P5653K0481L84467
35371D097589N19013L92152M99572P55972N09266k40084o05687j38978M27056
35362F215871K56067l89411o20211k05589K26041J34950k83116m61149j86758
$$ plain form
35353 4686695 4862303 5013410 4778759 4309213 4053513 4118540 4165247 3986596 3789491 3719773
35343 3719773 3522856 3004330 2474190 2314678 2374416 2246966 1948804 1838406 1998444 2192770
35333 2192770 2364309 2680143 3085519 3280582 3183762 2992490 2736607 2209203 1438547 799872
35323 799872 487849 248961 -144042 -449601 -247215 493985 1335253 1777848 1656688 1205980
35313 1205980 793477 559246 356515 75336 -153793 -217667 -264966 -444224 -587973 -477660
35303 -477660 -270539 -285424 -454102 -394662 -25228 280870 213783 -113901 -395276 -455298
35293 -455298 -290036 2803 275215 439966 518697 529738 493763 607150 1060500 1508031
35283 1508031 1208678 99986 -762185 -452142 529629 946408 504933 -24781 -189983
$$ packed form
35353D686695J75608J51107k34651m69546k55700O5027M6707j78651j97105o9718
35343C719773j96917n18526n30140j59512N9738j27450k98162j10398J60038J94326
35333B192770J71539L15834M05376J95063r6820j91272k55883n27404p70656o38675
35323G99872l12023k38888l93003l05559K02386P41200Q41268M42595j21160m50708
35313A205980m12503k34231k02731k81179k29129o3874m7299j79258j43749J10313
35303d77660K07121j4885j68678N9440L69434L06098o7087l27684k81375o0022
35293d55298J65262K92839K72412J64751P8731J1041l5975J13387M53350M47531
35283A508031k99353j108692q62171L10043R81771M16779m41475n29714j65202
$$ plain form
35274 -189983 -341456 -662548 -728475 -380236 -179553 -503017 -850383 -585448 128238 623427
35264 623427 584133 184447 -305896 -670638 -744971 -573163 -391828 -293482 -132125 160743
35254 160743 475387 786875 1142930 1352612 1133425 628302 299205 257853 235174 237008
35244 237008 552753 1000538 937212 288303 -185040 -738 398389 522660 591910 867296
35234 867296 948661 428268 -313885 -651283 -584430 -458980 -303056 -89489 -153038 -622996
35224 -622996 -901749 -480799 154502 269116 115142 458103 1164963 1355750 886626 578070
35214 578070 819129 979061 549647 -34136 -208062 -174731 -383584 -651086 -471934 65281
35204 65281 302261 -66940 -541398 -392574 521197 1599687 2047885 1543180 463087
$$ packed form
35274a89983j51473l21092o5927L48239K00683l23464l47366K64935P13686M95189
35264F23427l9294l99686m90343l64742p4333J71808J81335R8346J61357K92868
35254A60743L14644L11488L56055K09682k19187n05123l29097m1352k2679J834
35244B37008L15745M47785o3326o48909m73343J84302L99127J24271O9250K75386
35234H67296Q1365n20393p42153l37398O6853J25450J55924K13567o3549m69958
35224f22996k78753M20950O35301J14614j53974L42961P06860J90787m69124l08556
35214E78070K41059J59932m29414n83783j73926L3331k08853k67502J79152N37215
35204F5281K36980l69201m74458J48824R13771J078490M48198n04705j080093
$$ plain form
35195 463087 -448034 -652666 -199959 352446 478273 277523 401292 1155384 1872414 1643840
35185 1643840 618749 -44796 315701 1046344 1211064 857034 707115 1020669 1386051
35176 1386051 1414090 1076956 500008 -100244 -389499 -254156 -47841 -128854 -325857 -249943
35166 -249943 71880 317842 434888 597313 739372 619497 281200 10105 -121170 -286149
35156 -286149 -551663 -827120 -1053626 -1136657 -883307 -353696 -38883 -281097 -742205 -863170
35146 -863170 -597249 -254560 60080 336511 338662 18605 -89726 380142 800985 341792
35136 341792 -645794 -1026711 -586625 -246368 -453903 -504806 126431 821941 848212 538965
35126 538965 662825 1151111 1267150 772810 208442 72187 269860 436416 428793 373191
$$ packed form
35195D63087r11121k04632M52707N52405J25827k00750J23769P54092P17030k28574
35185A643840j025091o63545L60497P30643J64720l54030j49919L13554L65382
35176A386051K8039l37134n76948o00252k89255J35343K06315q1013j97003P5914
35166b49943L21823K45962J17046J62425J42059j19875l38297k71095j31275j64979
35156b86149k65514k75457k26506q3031K53350N29611L14813k42214m61108j20965
35146h63170K65921L42689L14640K76431K151l20057j08331M69868M20843m59193
35136C41792r87586l80917M40086L40257k07535n0903O31237O95510K6271l09247
35126E38965J23860M88286J16039m94340n64368j36255J97673J66556p623n5602
$$ plain form
35116 373191 390953 388732 160682 -275380 -576643 -478137 -160188 34803 101969 256907
35106 256907 466639 527401 518597 693049 935113 827243 303597 -220335 -422880 -359284
35096 -359284 -168226 54757 117843 -42276 -58608 375035 804193 527348 -214352 -428739
35086 -428739 108327 471542 73176 -404598 -145412 533424 783004 491395 174541 28611
35076 28611 -140430 -309654 -262328 -69343 26950 75143 263106 465079 429550 260591
35066 260591 212795 147124 -266043 -851110 -980106 -420978 286352 470868 93178 -273950
35056 -273950 -102875 521005 962059 708828 -28553 -559316 -542262 -286067 -153736 -51285
35046 -51285 259467 669208 869220 791454 621518 523641 560912 709968 767000 452732
$$ packed form
35116C73191J7762k221k28050m36062l01263R8506L17949J94991O7166J54938
35106B56907K09732O0762q804J74452K42064j07870n23646n23932k02545O3596
35096c59284J91058K22983O3086j60119j6332M33643M29158k76845p41700k14387
35086d28739N37066L63215l98366m77774K59186O78836K49580k91609l16854j45930
35076B8611j69041j69224M7326J92985R6293M8193J87963K01973l5529j68959
35066B60591m7796o5671m13167n85067j28996N59128P07330J84516l77690l67128
35056b73950J71075O23880M41054k53231p37381n30763J7054K56195J32331J02451
35046e1285L10752M09741K00012p7766j69936r7877L7271J49056N7032l14268
$$ plain form
35036 452732 -179037 -639448 -518687 65536 666717 936584 759373 280523 -50058 182055
35026 182055 780328 1064106 766260 380218 362881 481337 329154 15802 -164015 -358846
35016 -358846 -865953 -1446114 -1506556 -870740 64771 821417 1137900 996790 738920 900149
35006 900149 1509699 1842598 1379112 697108 736887 1384663 1590515 907158 100492 -22407
34996 -22407 300076 317085 -77552 -271200 122468 698746 774584 271775 -137678 145413
34986 145413 843894 1127753 739794 377369 733285 1548902 2005158 1781208 1282337 973381
34976 973381 918296 927538 819993 566760 389907 578201 1011612 1150572 789308 469908
34966 469908 714105 1176387 1124145 515898 -27437 -176700 -167108 -180715 -109445 43013
$$ packed form
35036D52732o31769m60411J20761N84223O01181K69867j77211m78850l30581K32113
35026A82055N98273K83778k97846l86042j7337J18456j52183l13352j79817j94831
35016c58846n07107n80161o0442O35816R35511P56646L16483j41110k57870J61229
35006I00149O09550L32899m63486o82004L9779O47776K05852o83357q06666j22899
34996b2407L22483J7009l94637j93648L93668N76278P5838n02809m09453K83091
34986A45413O98481K83859l87959l62425L55916Q15617M56256k23950m98871l08956
34976I73381n5085R242j07545k53233j76853J88294M33411J38960l61264l19400
34966D69908K44197M62282n2242o08247n43335j49263R592j3607P1270J52458
$$ plain form
34956 43013 131374 286190 762163 1310871 1344631 861868 563042 813679 1109012 902375
34946 902375 423421 250758 470371 682366 582622 197213 -258418 -499505 -347401 30938
34936 30938 273721 323753 461931 711789 629772 -28397 -796549 -1026687 -687981 -285954
34926 -285954 -171645 -280195 -426629 -508885 -443828 -177295 211773 566701 785530 795430
34916 795430 508352 -19478 -460960 -470060 -88260 258927 254908 96226 272507 913714
34906 913714 1498884 1398680 657487 -31642 -174372 31625 188510 271008 376851 296682
34896 296682 -129890 -461453 -83714 850055 1478787 1280714 570009 -71251 -335712 -137358
34886 -137358 391746 732476 399018 -297815 -506102 -56420 248081 -97869 -464616 -95978
$$ packed form
34956D3013Q8361J54816M75973N48708L3760m82763k98826K50637K95333k06637
34946I02375m78954j72663K19613K11995r9744l85409m55631k41087J52104L78339
34936C0938K42783N0032J38178K49858q2017o58169p68152k30138L38706M02027
34926b85954J14309j08550j46434q2256O5057K66533L89068L54928K18829R900
34916G95430k87078n27830m41482r100L81800L47187m019j58682J76281O41207
34906I13714N85170j00204p41193o89129j42730K05997J56885Q2498J05843q0169
34896B96682m26572l31563L77739R33769O28732j98073p10705o41260k64461J98354
34886a37358N29104L40730l33458o96833k08287M49682L04501l45950l66747L68638
$$ plain form
34876 -95978 645842 803992 245459 -225214 -47117 494505 862339 876295 619709 213355
34866 213355 -125860 -111683 326543 895200 1122832 664640 -422045 -1558171 -2004952
34857 -2004952 -1601798 -981367 -788318 -893075 -747890 -333679 -224987 -699371 -1296982
34848 -1296982 -1468887 -1285766 -1211326 -1389195 -1464490 -1072922 -285885 487595 923828 1003384
34838 1003384 834110 425067 -201276 -755107 -820375 -347668 212192 414188 289507 176120
34828 176120 272126 527881 784009 806136 389772 -291477 -634309 -270232 331689 348325
34818 348325 -325523 -936661 -900085 -496054 -276153 -195892 178978 819566 1183533 1073002
34808 1073002 968517 1201287 1273282 560038 -570220 -1058777 -611216 -109284 -267594
$$ packed form
34876i5978P41820J58150n58533m70673J78097N41622L67834J3956k56586m06354
34866B13355l39215J4177M38226N68657K27632m58192j086685j136126m46781
34857b004952M03154O20431J93049j04757J45185M14211J08692m74384n97611
34848a296982j71905J83121P4440j77869p5295L91568P87037P73480M36233P9556
34838A003384j69274m09043o26343n53831o5268M72707N59860K01996j24681j13387
34828A76120R6006K55755K56128K2127m16364o81249l42832L64077O01921J6636
34818C48325o73848o11138L6576M04031K19901Q0261L74870O40588L63967j10531
34808A073002j04485K32770P1995p13244j130258m88557M47561N01932j58310
$$ plain form
34799 -267594 -582267 -209407 643323 1009279 587406 30869 -140209 -91053 -29736 187510
34789 187510 532367 581751 184879 -218243 -286948 -235123 -265060 -160609 131391 143988
34779 143988 -337967 -733771 -538976 -208101 -417661 -903327 -891772 -373852 -30578 -62460
34769 -62460 -26542 188932 147729 -259480 -564071 -543704 -532996 -678006 -632352 -308775 -207868
34758 -207868 -577873 -897482 -703718 -383258 -559069 -1108659 -1397124 -1195303 -773807 -280004
34748 -280004 370179 1022170 1261425 984777 612341 583029 887176 1194818 1216231 822359
34738 822359 38634 -846566 -1264572 -764653 417538 1357421 1271063 351491 -447754 -482274
34728 -482274 19556 518187 836686 976126 702149 -113980 -953736 -1075712 -473796 123519
$$ packed form
34799b67594l14673L72860Q52730L65956m21873n56537j71078M9156O1317K17246
34789A87510L44857M9384l96872m03122o8705N1825k9937J04451K92000J2597
34779A43988m81955l95804J94795L30875k09560m85666J1555N17920L43274l1882
34769f2460L5918K15474m1203m07209l04591K0367J0708j45010M5654L23577J00907
34758b07868l70005l19609J93764L20460j75811n49590k88465K01821M21496M93803
34748b80004O50183O51991K39255k76648l72436k9312L04147L07642K1413l93872
34738H22359p83725q85200m18006M99919J182191R39883q6358r19572p99245l4520
34728d82274N01830M98631L18499J39440k73977q16129q39756j21976O01916N97315
$$ plain form
34718 123519 245565 147992 205368 372712 452722 452550 440932 398250 383073 510017 636960
34707 636960 460210 51061 -134610 51342 210703 71859 -81713 44100 240863 201111
34697 201111 37600 -2216 886 -130594 -273670 -243273 -159894 -183482 -142036 156467 475005
34686 475005 451934 183148 80516 277038 551164 729128 819128 854946 905362 1103637
34676 1103637 1400050 1473031 1158835 736118 496508 328188 68365 -84715 31118 80878
34666 80878 -252670 -570197 -248299 522724 911776 649806 364643 582133 1002991 1026524
34656 1026524 556958 21577 -171811 -47793 -52224 -560865 -1268036 -1360707 -610028 115839
34646 115839 -34069 -665906 -784270 -349701 -220980 -651512 -939497 -726547 -543627 -685199
$$ packed form
34718A23519J22046r7573N7376J67344Q0010j72j1618m2682j5177J26944J26943
34707F36960j76750m09149j85671J85952J59361j38844j53572J25813J96763l9752
34697B01111j63511l9816L102j31480j43076L0397Q3379k3588M1446K98503L18538
34686D75005k3071k68786j02632J96522K74126J77964R0000L5818N0416J98275
34676A103637K96413P2981l14196m22717k39610j68320k59823j53080J15833M9760
34666H0878l33548l17527L21898P71023L89052k61970k85163K17490M20858K3533
34656A026524m69566n35381j93388J24018m431n08641p07171r2671P50679P25867
34646A15839j49908o31837j18364M34569J28721m30532k87985K12950J82920j41572
$$ plain form
34636 -685199 -586241 90531 669752 506068 49156 48490 328196 253179 -75374 -65702 221841
34625 221841 160597 -309554 -548177 -275387 37111 5795 -116748 26790 365569 652911
34615 652911 829541 920048 908096 868136 916314 953132 793758 590007 694792 1024529
34605 1024529 1053519 635422 323395 554892 985427 1070079 901749 887224 864934 289940
34595 289940 -697065 -1145903 -567826 250236 220349 -606155 -1168165 -833942 -107780 177725
34585 177725 -156537 -686869 -1002314 -972851 -697955 -464463 -512878 -633925 -322192 418721
34575 418721 850332 477148 -191104 -409633 -298121 -411344 -565492 -114145 687021 741164
34565 741164 -187385 -894874 -400137 701986 1220823 964830 579081 365703 130113
$$ packed form
34636f85199R8958O76772N79221j63684m56912o66K79706p5017l28553R672K87543
34625B21841o1244m70151k38623K72790L12498l1316j22543J43538L38779K87342
34615F52911J76630R0507j1952l9960M8178L6818j59374k03751J04785L29737
34605A024529K8990m18097l12027K31497M30535Q4652j68330j4525k2290n74994
34595B89940r87005m48838N78077Q18062k9887q26504n62010L34223P26162K85505
34585A77725l34262n30332l15445K9463K74896K33492m8415j21047L11733P40913
34575D18721M31611l73184o68252k18529J11512j13223j54148M51347Q01166N4143
34565G41164r28549p07489M94737J102123N18837k55993l85749k13378k35590
$$ plain form
34556 130113 -140877 -259108 -314446 -500468 -613537 -330742 157501 362483 218181 74754
34546 74754 125456 324059 665637 1041052 1056715 558133 75338 140165 439956 338395
34536 338395 -55407 -163302 -45509 -258918 -689651 -579608 157642 676012 536944 340939
34526 340939 593855 830503 451471 -266456 -615208 -395519 120329 701888 1127886 1050148
34516 1050148 400695 -347024 -701891 -666629 -482800 -263952 -147486 -350921 -748325 -831825
34506 -831825 -428159 -19982 -45140 -344753 -605635 -811270 -916897 -675401 -185171 23920
34496 23920 -108626 89729 836732 1252347 666936 -210437 -394926 -189875 -480025 -1028610
34486 -1028610 -865341 -90681 172202 -357618 -721685 -426861 -180746 -453879 -564771
$$ packed form
34556A30113k70990j18231n5338j86022j13069K82795M88243K04982j44302j43427
34546G4754N0702J98603L41578L75415J5663m98582m82795O4827K99791j01561
34536C38395l93802j07895J17793k13409m30733J10043P37250N18370j39068j96005
34526C40939K52916K36648l79032p17927l48752K19689N15848N81559M25998p7738
34516A050148o49453p47719l54867L5262J83829K18848J16466k03435l97404q3500
34506h31825M03666M08177k5158k99613k60882k05635j05627K41496M90230K09091
34496B3920j32546J98355P47003M15615n85411q77373j84489K05051k90150n48585
34486a028610J63269P74660K62883n29820l64067K94824K46115k73133j10892
$$ plain form
34477 -564771 96157 961844 1214754 999506 888797 820589 435250 -45574 -150611 -12049
34467 -12049 -64600 -158363 201323 861294 1081324 636769 164607 241143 663708 872635
34457 872635 676537 318869 99277 136064 335134 450947 285532 -95734 -425536 -530813
34447 -530813 -486907 -481191 -603505 -772450 -831070 -731805 -600616 -535872 -424262 -168108 -34840
34436 -34840 -420555 -1187502 -1635696 -1349266 -711420 -296937 -116528 135287 394738 327916
34426 327916 -27673 -255218 -182510 -56126 -73112 -169870 -308584 -520598 -592092 -204900
34416 -204900 428212 559958 -150039 -1094074 -1485042 -1319801 -1136760 -1105065 -924688 -511946
34406 -511946 -164100 46811 474576 1229682 1763945 1516433 690123 -29748 -351786 -528350
$$ packed form
34477e64771O60928Q65687K52910k15248j10709o8208l85339m80824j05037J38562
34467a2049n2551r3763L59686O59971K20030m44555m72162P6536M22565K08927
34457H72635j96098l57668k19592L6787J99070J15813j65415l81266l29802j05277
34447e30813M3906N716j22314j68945n8620R9265J31189O4744J11610K56154J33268
34436c4840l85715p66947m48194K86430O37846M14483J80409K51815K59451o6822
34426C27916l55589k27545P2708J26384j6986r6758j38714k12014p1494L87192
34416b04900O33112J31746p09997r44035l90968J65241J83041L1695J80377M12742
34406e11946L47846K10911M27765P55106N34263k47512q26310p19871l22038j76564
$$ plain form
34396 -528350 -717073 -711923 -435461 -244052 -445232 -795857 -807317 -385783 129659 441857
34386 441857 500240 323194 -30609 -314671 -260359 42313 230719 205917 240544 415386
34376 415386 340871 -245595 -895717 -889533 -149098 678667 1029094 929111 639472 186294
34366 186294 -489109 -1138982 -1311837 -873190 -217121 153343 170697 193394 449453 662551
34356 662551 402844 -272608 -798469 -778870 -416468 -102285 157247 597947 1138734 1343815
34346 1343815 965728 250190 -346748 -540969 -332022 23863 149820 -91452 -371143
34337 -371143 -286925 59501 228115 149466 175004 335192 143436 -565058 -1171936 -1127455
34327 -1127455 -779263 -749421 -884623 -584134 57396 296617 -61070 -344592 -100164 247076
$$ packed form
34396e28350j88723N150K76462J91409k01180l50625j1460M21534N15442L12198
34386D41857N8383j77046l53803k84062N4312L02672J88406k4802L4627J74842
34376D15386p4515n86466o50122O184P40435Q27765L50427r9983k89639m53178
34366A86294o75403o49873j72855M38647O56069L70464J7354K2697K56059K13098
34356F62551k59707o75452n25861J9599L62402L14183K59532M40700N40787K05081
34346A343815l78087p15538n96938j94221K08947L55885J25957k41272k79691
34337c71143Q4218L46426J68614p8649K5538J60188j91756p08494o06878M4481
34327a127455L48192K9842j35202L00489O41530K39221l57687k83522K44428L47240
$$ plain form
34317 247076 142652 -302328 -642057 -704017 -504599 -59889 342313 205401 -396871 -635665
34307 -635665 -56881 635344 586436 71773 -77055 81354 -217001 -961854 -1226642 -677198
34297 -677198 -144446 -273980 -546906 -248886 362039 600461 497003 574993 819866 696083
34287 696083 104284 -381890 -300709 207507 781913 1257115 1553434 1516642 1091798 490320
34277 490320 35709 -102946 302 145309 212842 263071 373439 445748 367544 306589
34267 306589 511891 803849 703347 209853 -53021 233140 507932 147720 -565343 -862928
34257 -862928 -576941 -186220 20263 177845 342318 391199 410635 575352 638759 178392
34247 178392 -583526 -871706 -440935 85094 217435 284088 685335 1049018 743614 -93863
$$ packed form
34317B47076j04424m44980l39729o1960J99418M44710M02202j36912o02272k38794
34307f35665N78784O92225m8908n14663j48828J58409k98355p44853k64788N49444
34297f77198N32752j29534k72926K98020O10925K38422j03458P7990K44873j23783
34287F96083n91799m86174Q1181N08216N74406M75202K96319l6792m24844o01478
34277D90320m54611j38655J03248J45007O7533N0229J10368P2309p8204o0955
34267C06589K05302K91958j00502m93494k62874K86161K74792l60212p13063k97585
34257h62928K85987L90721K06483J57582J64473M8881J9436J64717O3407m60367
34247A78392p61918k88180M30771N26029J32341O6653M01247L63683l05404q37477
$$ plain form
34237 -93863 -665816 -553940 -150312 -26704 -261023 -515424 -555114 -515221 -663631 -977604
34227 -977604 -1088977 -748063 -205158 84009 24309 -133327 -271299 -473810 -639965 -495619
34217 -495619 -87389 182049 158181 128111 226571 132279 -349420 -842302 -906246 -626216
34207 -626216 -325422 -43082 278019 396280 65124 -454295 -629666 -314582 178918 539070
34197 539070 669135 601520 509203 623397 846199 705226 53218 -499168 -340432 212577
34187 212577 321915 -206429 -779164 -938580 -783930 -486136 -46335 364494 445364 308143
34177 308143 418979 824707 998490 666963 221712 31598 -86495 -343806 -462344 -161112
34167 -161112 262095 359683 235800 287331 457146 289027 -334240 -954890 -1070285 -618394
$$ packed form
34237i3863n71953J11876M03628J23608k34319k54401l9690L9893j48410l13973
34227i77604j11373L40914N42905K89167n9700j57636j37972k02511j66155J44346
34217d95619M08230K69438k3868l0070R8460r4292m81699m92882o3944K80030
34207f26216L00794K82340L21101J18261l31156n19419j75371L15084M93500L60152
34197E39070J30065o7615r2317J14194K22802j40973o52008n52386J58736N53009
34187B12577J09338n28344n72735j59416J54650K97794M39801M10829Q0870j37221
34177C08143J10836M05728J73783l31527m45251j90114j18093k57311j18538L01232
34167a61112M23207R7588j23883N1531J69815j68119o23267o20650j15395M51891
$$ plain form
34157 -618394 38470 409689 259038 -122329 -187876 153479 375104 114013 -263076 -274885
34147 -274885 -135856 -373792 -892720 -1102269 -879507 -679197 -654346 -423002 81963 260205
34137 260205 -258148 -948456 -1117900 -844914 -661670 -653074 -475116 -83674 147258 7881
34127 7881 -327609 -668579 -960709 -1049613 -745832 -243370 -59352 -350023 -620202 -370316
34117 -370316 222012 562623 420786 129759 51724 140451 119858 -108736 -394560 -588985
34107 -588985 -708818 -820136 -862828 -678613 -192639 491784 1155945 1557658 1511047 1021565
34097 1021565 366721 -95774 -259808 -304953 -382373 -439752 -406472 -324701 -184775 112775
34087 112775 454968 471057 78517 -209629 64827 571520 626804 230467 52344 378337
$$ packed form
34157f18394O56864L71219j50651l81367o5547L41355K21625k61091l77089j1809
34147b74885J39029k37936n18928k09549K22762K00310K4851K31344N04965J78242
34137B60205n18353o90308j69444K72986J83244Q596J77958L91442K30932j39377
34127G881l35490l40970k92130q8904L03781N02462J84018k90671k70179K49886
34117c70316N92328L40611j41837k91027p8035Q8727k0593k28594k85824j94425
34107e88985j19833j11318m2692J84215M85974O84423O64161M01713m6611m89482
34097A021565o54844m62495j64034m5145p7420n7379L3280Q1771J39926K97550
34087A12775L42193J6089l92540k88146K74456N06693N5284l96337j78123L25993
$$ plain form
34077 378337 743549 789680 802354 1031198 1109617 715493 327598 624627 1392189 1740850
34067 1740850 1337616 760080 571638 651493 630126 489741 444257 541897 644264 618223
34057 618223 421681 180015 198755 616300 1020211 800076 4834 -578776 -440222 -15145
34047 -15145 27970 -202733 -71732 508822 880672 605755 106218 56085 454720 647816
34037 647816 161411 -748001 -1374102 -1241897 -511705 188418 325056 -78065 -527940 -614778
34027 -614778 -406085 -253237 -329244 -497150 -564550 -485842 -321652 -179658 -207846 -434851
34017 -434851 -569742 -229334 483730 893949 497547 -412652 -1159485 -1506505 -1668504 -1672795
34007 -1672795 -1283338 -588744 -73498 94859 305092 726875 832715 180683 -732768
$$ packed form
34077C78337L65212M6131J2674K28844P8419l94124l87895K97029P67562L48661
34067A740850m03234n77536j88442P9855k1367j40385m5484R7640J02367k6041
34057F18223j96542k41666J8740M17545M03911k20135p95242n83610J38554M25077
34047a5145M3115k30703J31001N80554L71850k74917m99537n0133L98635J93096
34037F47816m86405r09412o26101J32205P30192P00123J36638m03121m49875q6838
34027f14778K08693J52848p6007j67906o7400P8708J64190J41994k8188k27005
34017d34851j34891L40408P13064M10219l96402r10199p46833l47020j61999m291
34007a672795L89457O94594N15246J68357K10233M21783J05840o52032r13451
$$ plain form
33998 -732768 -1011675 -548774 -80108 -119576 -403515 -461317 -251468 -52672 -47189 -174889
33988 -174889 -208076 73625 593072 903375 665428 144986 -82751 111594 321050 270347
33978 270347 141857 117017 16439 -348941 -767030 -855273 -546174 -124145 123692 144732
33968 144732 88896 130790 256164 220843 -145794 -612396 -721946 -333326 200537 442863
33958 442863 295884 -8939 -164812 -10142 330268 506280 298530 -111544 -389661 -478050
33948 -478050 -540045 -568968 -374985 51158 468766 700715 762910 720340 687417 870726
33938 870726 1250912 1332510 687370 -287418 -695181 -296357 191784 96719 -417937 -763078
33928 -763078 -648314 -151117 507281 985543 983847 621054 335959 270306 139941 -155823
$$ packed form
33998g32768k78907M62901M68666l9468k83939n7802K09849J98796N483j27700
33988a74889l3187K81701N19447L10303k37947n20442k27737J94345K09456n0703
33978B70347j28490k4840j00578l65380m18089q8243L09099M22029K47837K1040
33968A44732n5836M1894J25374l5321l66637m66602j09550L88620N33863K42326
33958D42863j46979l04823j55873J54670L40410J76012k07750m10074k78117q8389
33948d78050o1995k8923J93983M26143M17608K31949O2195m2570l2923J83309
33938H70726L80186Q1598o45140r74788m07763L98824M88141r5065n14656l45141
33928g63078J14764M97197O58398M78262j696l62793k85095o5653j30365k95764
$$ plain form
33918 -155823 -297981 -147617 -77739 -382376 -772540 -787048 -364639 236364 733116 861551
33908 861551 551729 201152 271730 520999 299484 -266864 -281676 423632 818093 277007
33898 277007 -371717 -245900 118440 -198069 -795571 -622038 182528 529885 220081 121602
33888 121602 529206 693068 198130 -378080 -502483 -345164 -83125 460577 1097126 1124451
33878 1124451 379409 -338387 -339300 152070 627279 987333 1203109 1026272 518361 214170
33868 214170 318028 399694 304204 582095 1439256 2028265 1546732 440299 -275863 -387646
33858 -387646 -366148 -339456 -95802 163477 -7081 -466612 -629340 -400614 -233666 -269810
33848 -269810 -176296 85047 74401 -329877 -605720 -370761 19343 -2937 -461961 -910003
$$ packed form
33918a55823j42158J50364O9878l04637l90164j4508M22409O01003M96752J28435
33908H61551l09822l50577P0578K49269k21515n66348j4812P05308L94461n41086
33898B77007o48724J25817L64340l16509n97502J73533Q04566L47357l09804r8479
33888A21602M07604J63862m94938n76210j24403J57319K62039N43702O36549K7325
33878A124451p45042p17796r13M91370M75209L60054K15776j76837n07911l04191
33868B14170J03858Q1666r5490K77891Q57161N89009m81533j106433p16162j11783
33858c87646K1498K6692K43654K59279j70558m59531j62728K28726J66948l6144
33848b69810R3514K61343j0646m04278k75843K34959L90104k2280m59024m48042
$$ plain form
33838 -910003 -975959 -616494 -72390 249565 108662 -219351 -230070 38615 -60394 -803755
33828 -803755 -1483058 -1259799 -368713 122033 -307272 -1069671 -1404319 -1313759 -1264366 -1376757
33818 -1376757 -1363934 -1066449 -614294 -131735 337983 633731 565562 245259 12193 -22684
33808 -22684 -58696 -194112 -276298 -234712 -191817 -132992 125940 482402 513602 148646 -95923
33797 -95923 100012 303337 10992 -519248 -655497 -274783 286416 826720 1214135 1079484
33787 1079484 339626 -237994 120043 912113 889557 -111518 -898040 -705022 -207689
33778 -207689 -272638 -645414 -597410 -162425 94182 74904 116555 231479 115749 -210464
33768 -210464 -398153 -365276 -379087 -546101 -656438 -569338 -414683 -378228 -527131 -821088
$$ packed form
33838i10003o5956L59465N44104L21955j40903l28013j0719K68685r9009p43361
33828h03755o79303K23259Q91086M90746m29305p62399l34648R0560M9393j12391
33818a376757J2823K97485M52155M82559M69718K95748o8169l20303k33066l4877
33808b2684l6012j35416q2186M1586M2895N8825K58932L56462L1200l64956k44569
33797i5923J95935K03325k92345n30240j36249L80714N61199N40304L87415j34651
33787A079484p39858n77620L58037P92070k2556j001075p86522J93018M97333
33778b07689o4949l72776M8004M34985K56607j9278M1651J14924j15730l26213
33768b10464j87689L2877j3811j67014j10337Q7100J54655L6455j48903k93957
$$ plain form
33758 -821088 -1086503 -1051425 -618209 -27279 427383 725391 978153 1125360 1034450 798940
33748 798940 666128 694918 702928 558025 353013 250512 251707 193189 864 -105051 166233
33737 166233 687159 920558 636379 313735 447459 752093 613153 108907 -122732 57979
33727 57979 160661 21817 38821 283168 275029 -52891 -76716 394744 631136 198213
33717 198213 -236833 -62924 169761 -266037 -925260 -913399 -398736 -235959 -467390 -411311
33707 -411311 -33935 -14497 -468746 -750846 -602416 -424064 -301246 126078 619397 331166
33697 331166 -752229 -1437747 -955489 -1570 478267 621080 956462 1190388 705265
33688 705265 -206011 -638379 -413384 -216323 -432572 -649113 -432489 46379 367750 364326
$$ packed form
33758h21088k65415L5078M33216N90930M54662K98008K52762J47207r0910k35510
33748G98940j32812K8790Q010j44903k05012j02501J195n8518j92325j05915K71284
33737A66233N20926K33399k84179l22644J33724L04634j38940n04246k31639J80711
33727E7979J02682j38844J7004K44347q139l27920k3825M71460K36392m32923
33717A98213m35046J73909K32685m35798o59223J1861N14663J62777k31431N6079
33707d11311L77376J9438m54249k82100J48430J78352J22818M27324M93319k88231
33697C31166j083395o85518M82258R53919M79837J42813L35382K33926m85123
33688G05265r11276m32368K24995J97061k16249k16541K16624M78868L21371l424
$$ plain form
33678 364326 73865 -413872 -842432 -822826 -235622 555618 1071378 1183244 1071521 843941
33668 843941 439565 -69968 -346431 -182159 93461 -49628 -557690 -753682 -320081 90965
33658 90965 -290588 -1163489 -1460551 -791369 94264 420281 304264 248816 299398 206613
33648 206613 30182 24696 128607 65945 -150891 -263183 -252369 -366453 -651079 -823250
33638 -823250 -674552 -309646 62673 306558 298784 -2755 -345350 -338726 22059 258291
33628 258291 33584 -359383 -406497 -79617 210586 269010 294362 352918 146898 -418318
33618 -418318 -825130 -560209 72788 292615 -64263 -373523 -250030 -107609 -347004 -557130
33608 -557130 -123236 707819 1055740 605117 -47411 -277760 -103526 146366 308806 327833
$$ packed form
33678C64326k90461m87737m28560J9606N87204P91240N15760J11866j11723k27580
33668H43941m04376n09533k76463J64272K75620j43089n08062j95992M33601M11046
33658I0965l81553q72901k97062O69182Q85633L26017j16017n5448N0582r2785
33648B06613j76431n486J03911o2662k16836j12292J0814j14084k84626j72171
33638h23250J48698L64906L72319K43885p774l01539l42595O624L60785K36232
33628B58291k24707l92967m7114L26880K90203N8424K5352N8556k06020n65216
33618d18318m06812K64921O32997K19827l56878l09260J23493J42421k39395k10126
33608e57130M33894Q31055L47921m50623o52528k30349J74234K49892J62440J9027
$$ plain form
33598 327833 157600 -41537 14822 243347 184418 -259052 -518172 -178666 308351 269088
33588 269088 -148837 -242096 70395 95587 -473877 -976292 -761857 -192554 -66068 -380274
33578 -380274 -392592 131083 446386 -115274 -1148315 -1672809 -1346145 -715596 -383199 -366317
33568 -366317 -324741 -58954 357064 723779 887441 884131 909049 1002454 874514 312987
33558 312987 -340550 -522687 -230776 9020 17643 222518 798918 1159753 782686 81103
33548 81103 -149694 148279 367063 250233 172757 400526 664636 607315 211978 -326641
33538 -326641 -789816 -917891 -586407 -104943 -2564 -404030 -892833 -1033243 -734790 -122541
33528 -122541 551892 842148 423007 -375204 -774563 -490743 -80248 -132366 -506262 -663621
$$ packed form
33598C27833j70233j99137N6359K28525n8929m43470k59120L39506M87017l9263
33588B69088m17925r3259L12491K5192n69464n02415K14435N69303J26486l14206
33578c80274j2318N23675L15303n61660j033041n24494L26664O30549L32397J6882
33568c66317M1576K65787M16018L66715J63662l310K4918R3405j27940n61527
33558C12987o53537j82137K91911K39796Q623K04875N76400L60835l77067p01583
33548H1103k30797K97973K18784j16830p7476K27769K64110n7321l95337n38619
33538c26641m63175j28075L31484M81464J02379m01466m88803j40410K98453O12249
33528a22541O74433K90256m19141p98211l99359K83820M10495n2118l73896j57359
$$ plain form
33518 -663621 -419796 -12727 326774 511618 464185 181439 -131990 -237027 -118566 64690
33508 64690 158493 16432 -456274 -1046588 -1225583 -686647 224659 876473 1030345 889596
33498 889596 615825 192692 -240895 -352522 -86608 139740 -41834 -440170 -586396 -386657
33488 -386657 -173047 -153973 -191311 -217237 -475743 -1059598 -1509380 -1308596 -635639 -148758
33478 -148758 -66076 3486 239281 245240 -184953 -514170 -202263 393969 484289 831
33468 831 -343916 -113482 324328 423447 137611 -204454 -368275 -372066 -349272 -345287 -200915
33457 -200915 241639 728533 710226 150640 -156319 416482 1310347 1411945 557753 -293380
33447 -293380 -369444 139031 676929 965362 844591 180059 -709572 -1060771 -488881 537775
$$ packed form
33518f63621K43825M07069L39501J84844m7433k82746l13429j05037J18461J83256
33508F4690R3803j42061m72706n90314j78995N38936R11306O51814J53872j40749
33498H89596k73771m23133m33587j11627K65914K26348j81574l98336j46226J99739
33488c86657K13610J9074l7338k5926k58506n83855m49782K00784O72957M86881
33478a48758Q2682O9562K35795N959m30193l29217L11907N96232R0320m83458
33468H31l44747K30434M37810R9119k85836l42065j63821l791K2794L985J44372
33457b00915M42554M86894j8307n59586l06959N72801Q93865J01598q54192q51133
33447b93380p6064N08475N37898K88433j20771o64532q89631l51199N71890J026656
$$ plain form
33437 537775 1271307 1379842 957098 304734 -141399 -144763 -63383 -400636 -887902 -701780
33427 -701780 224537 903696 668864 60591 -151999 -65583 -115459 -161830 94713 334606
33417 334606 126393 -180418 50063 610825 685936 99386 -459709 -437191 40907 607455
33407 607455 1012928 1047062 679134 294214 302070 557087 625959 487199 428631 418030 209621
33396 209621 -36582 76653 440106 541795 303446 127848 106725 -85074 -445221 -565640
33386 -565640 -434336 -525896 -874345 -860859 -250398 346742 469362 500502 846810 1153563
33376 1153563 1003356 766166 966917 1287667 1052006 380137 -12014 18631 -37145 -290832
33366 -290832 -234016 257583 530604 148500 -373373 -320374 192635 469273 218312 -220749
$$ packed form
33437E37775P33532J08535m22744o52364m46133l364Q1380l37253m87266J86122
33427g01780R26317O79159k34832o08273k12590Q6416m9876m6371K56543K39893
33417C34606k08213l06811K30481N60762P5111n86550n59095K2518M78098N66548
33407F07455M05473L4134l67928l84920P856K55017O8872j38760n8568j0601k08409
33396B09621k46203J13235L63453J01689k38349j75598k1123j91799l60147j20419
33386e65640J31304r1560l48449J3486O10461N97140J22620L1140L46308L06753
33376A153563j50207k37190K00751L20750k35661o71869l92151L0645n5776k53687
33366b90832N6816M91599K73021l82104n21873N2999N13009K76638k50961m39061
$$ plain form
33356 -220749 -492163 -584963 -590374 -496517 -312218 -124709 42598 213407 258508 -28872
33346 -28872 -552080 -860603 -673372 -257955 -50724 -53299 78018 400619 520722 183225
33336 183225 -272097 -291573 187108 640410 552795 -40514 -617326 -697989 -302613 96135
33326 96135 82924 -276548 -587107 -620904 -492568 -376658 -292099 -213570 -157606 -70031 142984
33315 142984 382672 419715 294237 321173 515097 407743 -222172 -814283 -734401 -267205
33305 -267205 -272166 -909401 -1382227 -1123783 -639949 -769948 -1481785 -1889637 -1368451 -256347
33295 -256347 620053 859083 748615 715669 756108 570878 138311 -178157 -173299 -104111
33285 -104111 -196262 -152161 421729 1254268 1581947 1119746 423080 145829 294562 405635
$$ packed form
33356b20749k71414r2800n411R3857J84299J87509J67307J70809M5101k87380
33346b8872n23208l08523J87231M15417K07231k575J31317L22601J20103l37497
33336A83225m55322j9476M78681M53302q7615n93309n76812q0663L95376L98748
33326I6135j3211l59472l10559l3797J28336J15910Q4559P8529N5964Q7575K13015
33315A42984K39688L7043j25478K6936J93924j07354o29915n92111P9882M67196
33305b67205m961o37235m72826K58444M83834j29999p11837m07852N21186J112104
33295b56347Q76400K39030j10468l2946M0439j85230m32567l16468M858O9188
33285a04111r2151M4101N73890Q32539L27679m62201o96666k77251J48733J11073
$$ plain form
33275 405635 184028 -245862 -548106 -473274 -82939 229596 90675 -416340 -827025 -848286
33265 -848286 -634182 -465798 -399094 -332823 -208500 -20512 203060 359019 399040 525882
$$ packed form
33275D05635k21607m29890l02244P4832L90335L12535j38921n07015m10685k1261
33265h48286K14104J68384O6704O6271J24323J87988K23572J55959M0021J26842
$$ [...]
##END NTUPLES=NMR SPECTRUM
##END=
