##TITLE=31Pdec_6C1111
 CDCl3, 24 sc
 12.11.2021
##JCAMPDX= 6.0         $$ Bruker NMR JCAMP-DX V2.0
##DATA TYPE= NMR SPECTRUM
##DATA CLASS= NTUPLES
##ORIGIN= UXNMR, Bruker Analytische Messtechnik GmbH
##OWNER= root
$$ XWIN-NMR		Version 3.5
$$ Fri Nov 12 10:48:23 2021 Russian Standard Time (UT+4h)  she@DPX200
##.OBSERVE FREQUENCY= 81.013821
##.OBSERVE NUCLEUS= ^31P
##.ACQUISITION MODE= SIMULTANEOUS
##.ACQUISITION SCHEME= undefined
##.AVERAGES= 24
##.DIGITISER RES= 16
##SPECTROMETER/DATA SYSTEM= spect
##.PULSE SEQUENCE= zgpg30
##.SOLVENT NAME= Acetone
##.SHIFT REFERENCE= (INTERNAL, Acetone, 0, 248.564)
##AUDIT TRAIL= $$ (NUMBER, WHEN, WHO, WHERE, WHAT)
$$ ##TITLE= Audit trail, XWIN-NMR		Version 3.5
$$ ##JCAMPDX= 5.01
$$ ##ORIGIN= Bruker BioSpin GmbH
$$ ##OWNER= she
$$ F:/spectra/data/she/nmr/P31/1/pdata/1/auditp.txt
$$ ##AUDIT TRAIL=  $$ (NUMBER, WHEN, WHO, WHERE, WHAT)
(   1,<2021-11-12 10:45:45.03 +0400>,<she>,<DPX200>,
      <created by zg, POWCHK disabled, PULCHK disabled
       configuration hash MD5:
       00 E9 B6 7A A2 85 ED C7 34 08 36 98 17 FE 4E 26
       data hash MD5: 32K
       78 10 76 7A AB B5 77 7B AD CC E6 7C A3 94 79 48>)
(   2,<2021-11-12 10:46:24.34 +0400>,<she>,<DPX200>,
      <Start of raw data processing
       efp BC_mod = 2 LB = 1 FT_mod = 6 PKNL = 1 PHC0 = -9217.936 PHC1 = 130.2694 SI = 64K 
       data hash MD5: 64K
       4C FD 79 34 5E 04 3C 51 DA 01 FC 2D 8A 6E 94 A5>)
(   3,<2021-11-12 10:46:43.03 +0400>,<she>,<DPX200>,
      <pk PHC0 = 20.51173 PHC1 = 0 
       data hash MD5: 64K
       93 A2 D4 28 56 53 4E 46 25 70 1B B7 8B 6B 16 3B>)
(   4,<2021-11-12 10:46:48.59 +0400>,<she>,<DPX200>,
      <abs ABSG = 5 
       data hash MD5: 64K
       7A 4B E7 DA A7 A9 02 C6 F4 B0 2A 0F 9F 2B 70 84>)
$$ ##END=
$$ 
$$ hash MD5
$$ 97 DA FF 33 4A F0 33 36 37 61 E4 F3 10 19 F7 03
##$RELAX= 
##$RELAX= 
##$RELAX= 
##$RELAX= 
##$RELAX= 
##$RELAX= 
##$RELAX= 
##$RELAX= 
$$ Bruker specific parameters
$$ --------------------------
##$DU= <F:/spectra>
##$EXPNO= 1
##$NAME= <P31>
##$PROCNO= 1
##$TYPE= <nmr>
##$USER= <she>
##$AMP= (0..31)
100 100 100 100 100 100 100 100 100 100 100 100 100 100 100 100 100 100 
100 100 100 100 100 100 100 100 100 100 100 100 100 100 
##$AQSEQ= 0
##$AQ_mod= 1
##$AUNM= <au_zg>
##$AUTOPOS= <>
##$BF1= 81.014009
##$BF2= 200.13
##$BF3= 200.13
##$BF4= 200.13
##$BF5= 200.13
##$BF6= 200.13
##$BF7= 200.13
##$BF8= 200.13
##$BYTORDA= 1
##$CFDGTYP= 0
##$CFRGTYP= 5
##$CHEMSTR= <none>
##$CNST= (0..31)
1 1 145 1 1 1 1 1 1 1 1 1 1 1 1 1 1 1 1 1 1 1 1 1 1 1 1 1 1 1 1 1 
##$CPDPRG= <waltz16>
##$CPDPRG1= <>
##$CPDPRG2= <waltz16>
##$CPDPRG3= <>
##$CPDPRG4= <mlev>
##$CPDPRG5= <mlev>
##$CPDPRG6= <mlev>
##$CPDPRG7= <mlev>
##$CPDPRG8= <mlev>
##$CPDPRGB= <>
##$CPDPRGT= <>
##$D= (0..31)
0 1 0 0 0 0 0 0 0 0 0 0.03 2e-05 3e-06 0 0 0 0 0 0 0 0 0 0 0 0 0 0 0 0 
0 0 
##$DATE= 1636699544
##$DBL= (0..7)
120 120 120 11 120 120 24 19 
##$DBP= (0..7)
150 150 150 150 150 150 150 150 
##$DBP07= 0
##$DBPNAM0= <>
##$DBPNAM1= <>
##$DBPNAM2= <>
$$ [...]
##$SUBNAM3= <"">
##$SUBNAM4= <"">
##$SUBNAM5= <"">
##$SUBNAM6= <"">
##$SUBNAM7= <"">
##$SUBNAM8= <"">
##$SUBNAM9= <"">
##$SW= 501.771253377433
##$SWIBOX= (0..15)
0 1 3 0 0 0 0 0 0 0 0 0 0 0 0 0 
##$SW_h= 40650.406504065
##$TD= 32768
##$TD0= 1
##$TE= 0
##$TE2= 300
##$TE3= 300
##$TEG= 300
##$TL= (0..7)
0 120 53 12 22 120 120 120 
##$TP= (0..7)
150 150 150 150 150 150 150 150 
##$TP07= 0
##$TPNAME0= <>
##$TPNAME1= <>
##$TPNAME2= <>
##$TPNAME3= <>
##$TPNAME4= <>
##$TPNAME5= <>
##$TPNAME6= <>
##$TPNAME7= <>
##$TPOAL= (0..7)
0.5 0.5 0.5 0.5 0.5 0.5 0.5 0.5 
##$TPOFFS= (0..7)
0 0 0 0 0 0 0 0 
##$TUNHIN= 0
##$TUNHOUT= 0
##$TUNXOUT= 0
##$USERA1= <user>
##$USERA2= <user>
##$USERA3= <user>
##$USERA4= <user>
##$USERA5= <user>
##$V9= 5
##$VALIST= <valist>
##$VCLIST= <CCCCCCCCCCCCCCC>
##$VD= 0
##$VDLIST= <DDDDDDDDDDDDDDD>
##$VPLIST= <PPPPPPPPPPPPPPP>
##$VTLIST= <TTTTTTTTTTTTTTT>
##$WBST= 1024
##$WBSW= 4
##$XGAIN= (0..3)
0 0 0 0 
##$XL= 0
##$YL= 0
##$YMAX_a= 10724
##$YMIN_a= -12224
##$ZGOPTNS= <>
##$ZL1= 120
##$ZL2= 120
##$ZL3= 120
##$ZL4= 120
##$ABSF1= 248.5645
##$ABSF2= -253.2056
##$ABSG= 5
##$ABSL= 3
##$ALPHA= 0
##$AQORDER= 0
##$ASSFAC= 0
##$ASSFACI= 0
##$ASSFACX= 0
##$ASSWID= 0
##$AUNMP= <proc_1d>
##$AZFE= 0.1
##$AZFW= 0.5
##$BCFW= 0
##$BC_mod= 2
##$BYTORDP= 0
##$COROFFS= 0
##$CY= -3
##$DATMOD= 1
##$DC= 0
##$DFILT= <>
##$DTYPP= 0
##$F1P= 0
##$F2P= 0
##$FCOR= 1
##$FTSIZE= 65536
##$FT_mod= 6
##$GAMMA= 0
##$GB= 0
##$INTBC= 1
##$INTSCL= 5.30512e-09
##$ISEN= 30
##$LB= 1
##$LEV0= 0
##$LPBIN= 0
##$MAXI= 10000
##$MC2= 0
##$MEAN= 0
##$ME_mod= 0
##$MI= 50
##$NCOEF= 0
##$NC_proc= -8
##$NLEV= 6
##$NOISF1= 182.463
##$NOISF2= 159.3651
##$NSP= 0
##$NTH_PI= 0
##$NZP= 0
##$OFFSET= 248.5645
##$PC= 4
##$PHC0= -9197.424
##$PHC1= 130.2694
##$PH_mod= 1
##$PKNL= yes
##$PPARMOD= 0
##$PSCAL= 0
##$PSIGN= 0
##$REVERSE= no
##$SF= 81.014009
##$SI= 65536
##$SIGF1= 159.3651
##$SIGF2= -187.1042
##$SINO= 113.3802
##$SIOLD= 16384
##$SREGLST= <1H.CDCl3>
##$SSB= 0
##$STSI= 65536
##$STSR= 0
##$SW_p= 40650.406504065
##$SYMM= 0
##$S_DEV= 0
##$TDeff= 32768
##$TDoff= 0
##$TI= <>
##$TILT= no
##$TM1= 0
##$TM2= 0
##$TOPLEV= 0
##$USERP1= <user>
##$USERP2= <user>
##$USERP3= <user>
##$USERP4= <user>
##$USERP5= <user>
##$WDW= 1
##$XDIM= 65536
##$YMAX_p= 262838380
##$YMIN_p= -242048179
$$ End of Bruker specific parameters
$$ ---------------------------------
##NTUPLES= NMR SPECTRUM
##VAR_NAME=  FREQUENCY,     SPECTRUM/REAL,   SPECTRUM/IMAG
##SYMBOL=    X,             R,               I
##VAR_TYPE=  INDEPENDENT,   DEPENDENT,       DEPENDENT
##VAR_FORM=  AFFN,          ASDF,            ASDF
##VAR_DIM=   65536,         65536,           65536
##UNITS=     HZ,            ARBITRARY UNITS, ARBITRARY UNITS
##FACTOR=    0.620285442955139, 1,           1
##FIRST=     20137.2065510759, 0,            0
##LAST=      -20513.1999529892, 0,           0
##MIN=       -20513.1999529892, -242048179,  0
##MAX=       20137.2065510759, 262838380,    0
$$ Real data points
##PAGE= N=1
##DATA TABLE= (X++(R..R)), XYDATA
$$ [...]
38870i135888L681770L879732M60574k895278k717625r01900o09847j58305L322082
$$ -9135888 -5454118 -1574386 -1113812 -4009090 -6726715 -7628615 -8238462 -8396767 -5074685
38861e074685O779613M817135r37158l507270j405065n0026j616968j718677J417789
$$ -5074685 1704928 6522063 5584905 2077635 672570 622544 -994424 -2713101 -1295312
38852a295312K605231j290660n013465k937323K069558L475608O09828k141897
$$ -1295312 1309919 19259 -4994206 -7931529 -5861971 -2386363 -1776535 -3918432
38844c918432k457160j288222M93380K066869J489314j398632l136785j358107
$$ -3918432 -6375592 -7663814 -7170434 -5103565 -3614251 -5012883 -8149668 -9507775
38836i507775J295566J627992J118968K398939L649111J657054j988473l100501
$$ -9507775 -8212209 -6584217 -5465249 -3066310 582801 2239855 251382 -2849119
38828b849119j448414L5950Q23103K200855K750522K04494l219609l192662l19348
$$ -2849119 -4297533 -4261583 -3438480 -1237625 1512897 1717391 -1502218 -4694880 -5014228
38819e014228J038967L57920R35777K448081P48782l745580m812612j33323M457936
$$ -5014228 -3975261 -3617341 -2681564 -233483 515299 -3230281 -8042893 -8176216 -3718280
38810c718280L851855O80979n80816p34227k009012k203344J158654M545027K974395
$$ -3718280 133575 814554 233738 -500489 -2509501 -4712845 -3554191 990836 3965231
38801C965231j486015k550957K00299J133284j373471j982696K096716N201981
$$ 3965231 2479216 -71741 128558 1261842 -111629 -2094325 2391 5204372
38793E204372J483716n345490o460641l57598N103612L729912j091999k238315
$$ 5204372 6688088 1342598 -5118043 -5475641 -372029 3357883 2265884 27569
38785B7569J044674L158185R16904k346688k374919J20810J526069P34057m29130
$$ 27569 1072243 4230428 5147332 2800644 425725 546535 2072604 2806661 2377531
38776B377531o94367l08860O33062J947364K073406N8329j664574k7593L236673
$$ 2377531 1683164 1374304 2007366 3954730 6028136 6086465 4421891 4394298 7630971
38767G630971L160900o83861k848618o12567J212999j730977n070341j835304
$$ 7630971 10791871 10108010 7259392 6646825 7859824 6128847 1058506 -776798
38759g76798N534823P100922r8102p054984n589135K03449Q82249m160521o595649
$$ -776798 4758025 11858947 11760845 4705861 -883274 -679825 202424 -3958097 -10553746
38750a0553746k036327M094673N094868J502225k048473l897166m936168m221751
$$ -10553746 -12590073 -8495400 -3400532 -1898307 -3946780 -7843946 -12780114 -17001865
38742a7001865k24640M657408N762560K563529o97489j212425l43164N91728K556162
$$ -17001865 -17226505 -12569097 -6806537 -4243008 -4940497 -6152922 -6496086 -5904358 -3348196
38733c348196M844532L642490j915330o110401l598960K688158N467260L010713
$$ -3348196 1496336 5138826 3223496 -2886905 -6485865 -3797707 1669553 4680266
38725D680266j03671r47961j066406j301224K6098K147485Q71507m419616p789196
$$ 4680266 4576595 3628634 2562228 1261004 1287102 3434587 4306094 -113522 -7902718
38716g902718m781510O58724K160182N61122J498349N012289M710181j482020
$$ -7902718 -12684228 -12025504 -9865322 -9304200 -7805851 -2793562 1916619 434599
38708D34599o372634l264681L969320O075046J360023k760446j189111K277385
$$ 434599 -5938035 -9202716 -5233396 841650 2201673 -558773 -1747884 529501
38700E29501K445196J076731K434587M306723Q09208o720448r409217l410194
$$ 529501 2974697 4051428 6486015 10792738 11601946 4881498 -4527719 -7937913
38692g937913M078928N091157J305797q02302j86191k07414r86034M29J524534
$$ -7937913 -3858985 1232172 2537969 1735667 1549476 1342062 356028 356457 1880991
38683A880991j2987l408489l604042J08595L201853L490389L099057K373625j057741
$$ 1880991 1868004 -1540485 -5144527 -5035932 -1834079 1656310 4755367 7128992 6071251
38674F071251n703872n943366q01549L784851M172650L525601M031917K282955
$$ 6071251 367379 -5575987 -6377536 -2592685 1579965 5105566 9137483 11420438
38666A1420438l009253o178276l435380J79784o61580k440125J27022L691001
$$ 11420438 8411185 2232909 -1202471 -1022687 -1684267 -4124392 -3997370 -306369
38658c06369K018239k356497k124899K038358K876596p13422k482719l43615P44692
$$ -306369 1711870 -644627 -2769526 -731168 2145428 1432006 -1050713 -1394328 -649636
38649f49636j312222k128424N28759K739689J942934R94086J649583J079406j647846
$$ -649636 -1961858 -4090282 -3561523 -821834 1121100 2115186 3764769 4844175 3196329
38640C196329k390544O38070K508105n62301m352627k990512J972437M235499
$$ 3196329 805785 1443855 3951960 3389659 -962968 -3953480 -1981043 2254456
38632B254456J733491j839409k712762m83767K726402L827937J022964l489361
$$ 2254456 3987947 2148538 -564224 -1047991 1678411 5506348 6529312 3039951
38624C039951n012929k129389J441637K112425N79791p90899j354643j051804
$$ 3039951 -1972978 -4102367 -2660730 -548305 31486 -759413 -2114056 -3165860
38616c165860P58170L174883L555054J373873p86846j591279k563873l816317
$$ -3165860 -2407690 767193 4322247 5696120 4909274 3317995 754122 -3062195
38608c062195k700281R23099K754865N23709j991523r06200J910600K692975J638841
$$ -3062195 -5762476 -4839377 -2084512 -1560803 -3552326 -4458526 -2547926 145049 1783890
38599A783890R12461L11177r92522j545630l42672N40167m89104j650916j655934
$$ 1783890 2696351 3007528 2015006 469376 126704 666871 177767 -1473149 -3129083
38590c129083k309915l729118k002092L679198O873284K977565k411208j530507
$$ -3129083 -5438998 -9168116 -11170208 -7491010 -617726 2359839 -51369 -1581876
38582a581876L182756L137906k557962o122028l259664J822745M039854L083391
$$ -1581876 1600880 4738786 2180824 -3941204 -7200868 -5378123 -1338269 1745122
38574A745122O46761j937246k464084M45944L891982L590969M6816k689972l365220
$$ 1745122 2391883 454637 -2009447 -1563503 2328479 5919448 5966264 3276292 -88928
38565h8928l534973k742731L33374L184481K400821K20655J259821L796113K163872
$$ -88928 -3623901 -6366632 -6033258 -2848777 -447956 -227301 1032520 4828633 6992505
38556F992505k671066l687096L60893K708107N9415k605690j646947n47624k041758
$$ 6992505 4321439 634343 995236 3703343 3762758 1157068 -489879 -1037503 -3079261
38547c079261k469382R15958L830855J699593k907519m653938k659913Q64471
$$ -3079261 -5548643 -4632685 -801830 897763 -2009756 -6663694 -9323607 -8459136
38539h459136M478093O111299K917880l305890n639286j312310L652959L578679
$$ -8459136 -3981043 2130256 5048136 1742246 -3897040 -5209350 -1556391 2022288
38531B022288J376798K159179L932393J613318l401146m985863j765548J581429
$$ 2022288 3399086 5558265 9490658 11103976 7702830 2716967 951419 2532848
38523B532848J793206N34772M40774J534874J967599L20420k550119l613020j375089
$$ 2532848 4326054 4860826 5301600 6836474 8804073 9124493 6574374 2961354 1586265
38514A586265J111443N14900o38198K024579N402043K188557n616195p055130
$$ 1586265 2697708 3212608 2574410 4598989 10001032 12189589 6573394 -481736
38506d81736L45219N042790q9154n574673j452090N215661K184358o809097q133765
$$ -481736 -136517 4906273 4817119 -757554 -2209644 3006017 5190375 -1618722 -9752487
38497i752487o78756L877037J419546Q7226L559306M776634O0737l748732j532745
$$ -9752487 -10431243 -6554206 -5134660 -5047434 -1488128 3288506 3349243 -399489 -1932234
38488a932234J884724J429402m2613Q35612J050474j956685m080084j649339J541388
$$ -1932234 -47510 1381892 1339279 2174891 3225365 1268680 -2811404 -4460743 -2919355
38479b919355N66662k524416k772992m5490K466672L504464L119919Q52103j657793
$$ -2919355 -2352693 -4877109 -7650101 -7695591 -5228919 -1724455 1395464 2247567 589774
38470E89774p29452L026972L597264j197848n074618k833502J346534J299315
$$ 589774 -139678 2887294 6484558 5286710 212092 -2621410 -1274876 24439
38462B4439r63532O5908L032499K542548n48806o20282K095865J264403m459960
$$ 24439 -939093 -873185 2159314 4701862 4153056 3532774 5628639 6893042 2433082
38453B433082q192314m988129J386041M881167M928860M234854L152067M86497
$$ 2433082 -5759232 -10747361 -9361320 -4480153 448707 4683561 7835628 8322125
38445H322125k608656l533907k129658p35203o11005m89368J014723L022356L235829
$$ 8322125 5713469 2179562 49904 -685299 -1296304 -1785672 -770949 2251407 5487236
38436E487236P99796k340818l378565j775382K74894P05616l1813r1004J041295
$$ 5487236 6287032 3946214 567649 -1207733 -932839 -227223 -259036 -350040 691255
38427F91255J953714J221660q66914k631174k789224j746348p82263l7930J576913
$$ 691255 2644969 3866629 2999715 368541 -2420683 -4167031 -4949294 -4987224 -3410311
38418c410311L879011M442564J815779j702009k885973k050149j702233j686937
$$ -3410311 468700 4911264 6727043 5025034 2139061 88912 -1613321 -3300258
38410c300258L18764L439839L341635j127064n120233m067444M60248L724726
$$ -3300258 -2981494 458345 3799980 2672916 -2447317 -6514761 -6054513 -2329787
38402b329787L837411K084030j99384k025873k043046m32379J13015j887140l700177
$$ -2329787 1507624 3591654 3392270 1366397 -676649 -1109028 -996013 -2883153 -6583330
38393f583330k116078J492344L354710L209651L854802N233173L634404j945980
$$ -6583330 -8699408 -7207064 -3852354 -642703 3212099 8445272 12079676 10133696
38385A0133696o654604n628012n42573K638441J310307j297675j284944R72696
$$ 10133696 3479092 -2148920 -2691493 -53052 1257255 -40420 -1325364 -352668
38377c52668K272506J096439j331904l535941m941603m711157k077852J491135
$$ -352668 1919838 3016277 1684373 -1851568 -6793171 -11504328 -13582180 -12091045
38369a2091045L101892K560330K841131M743486M533066j7580m577346l758133
$$ -12091045 -8989153 -6428823 -3587692 1155794 5688860 5671280 1093934 -2664199
38361b664199P78948K990474J500733j4540n14042k651936n599046m192672K253878
$$ -2664199 -1885251 1105223 2605956 2591416 2077374 -574562 -6173608 -10366280 -8112402
38352h112402O876467M602355r11464l480184k457840m94796J772505L802841
$$ -8112402 -1235935 3366420 2454956 -1025228 -3483068 -3977864 -2205359 1597482
38344A597482K359244l452611p607515l909098M570248Q766484N398959o2727
$$ 1597482 3956726 504115 -7103400 -11012498 -6442250 2324234 7723193 7660466
38336G660466j980659r15618n94596k569120n205796n566989j856754M111116
$$ 7660466 5679807 4764189 4169593 1600473 -3605323 -9172312 -11029066 -6917950
38328f917950P322897M586094j414027n099339m203220r85099J543936K142164
$$ -6917950 404947 4991041 3577014 -1522325 -5725545 -6710644 -5166708 -3024544
38320c024544R55294r61618k102019k027517j683775j377178k43795J376269J741631
$$ -3024544 -2069250 -3030868 -5132887 -7160404 -8844179 -10221357 -10465152 -9088883 -7347252
38311g347252J139272K026252L961988K806708k062104m641367r67165L727322
$$ -7347252 -6207980 -4181728 -219740 2586968 524864 -4116503 -5083668 -1356346
38303a356346K524276k305858l134572Q72027L431399K053955J064491K835360
$$ -1356346 1167930 -1137928 -4272500 -3400473 30926 2084881 3149372 5984732
38295E984732L612198N26349l428863m424558k947803j149260P68249K755317
$$ 5984732 9596930 10123279 6694416 2269858 -677945 -1827205 -1058956 1696361
38287A696361L052177Q41512j866309l009251k774126j824804M4377K166675K622586
$$ 1696361 4748538 5590050 3723741 714490 -2059636 -3884440 -3840063 -1673388 949198
38278I49198R73603r49242j832064j990791j355660N08410J906459L05311k847092
$$ 949198 1922801 973559 -858505 -2849296 -4204956 -3696546 -1790087 -1484776 -4331868
38269d331868k665093J956816N620425L641298j367572l478794j515043O16353
$$ -4331868 -6996961 -5040145 580280 4221578 2854006 -624788 -2139831 -1523478
38261a523478K91549q91080n96920P88880J293702L37444p37603o79494K14699
$$ -1523478 -1231929 -2123009 -2719929 -1931049 -637347 -299903 -1037506 -1717000 -1502301
38252a502301R60997J282049J161137j05488k491909l475707o97970L410878L525464
$$ -1502301 -541304 740745 1901882 1796394 -695515 -4171222 -4869192 -1458314 2067150
38243B067150p58066l380692o37627L065305K232942j255413j977656K41553J446519
$$ 2067150 1309084 -2071608 -2709235 356070 2589012 1333599 -644057 -402504 1044015
38234A044015Q19485M14742k72216k664798l753342J76146N537049N154381l57261
$$ 1044015 1863500 2278242 2006026 -658772 -4412114 -4235968 1301081 6455462 6098201
38225F098201l385565j809620j372426l934836l433159K520533O552724K969167
$$ 6098201 2712636 903016 -469410 -4404246 -7837405 -5316872 1235852 4205019
38217D205019k769995k966410N54380J174940j267727j966663k44329N90614J40409
$$ 4205019 1435024 -1531386 -977006 197934 -1069793 -3036456 -3280785 -2690171 -2549762
38208b549762N19394P11503j821428m840093l327665K142055N179012K697076
$$ -2549762 -2030368 -1318865 -3140293 -7980386 -11308051 -9165996 -3986984 -1289908
38200a289908j098897j536938K84715O87363m14386Q9972K996471M741109K105378
$$ -1289908 -2388805 -3925743 -3641028 -2953665 -3368051 -3278079 -281608 4459501 6564879
38191F564879k475162k986066J957387N976077L089676l366331m996971n19815
$$ 6564879 4089717 1103651 3061038 9037115 12126791 8760460 3763489 3243674
38183C243674K669299R3116l390159j969524K200215L220170M12211j962975j298269
$$ 3243674 5912973 6006089 2615930 646406 2846621 6066791 6479002 4516027 3217758
38174C217758J341540L785081L968933P54043l635928m614640j330311J435590
$$ 3217758 4559298 8344379 12313312 13067355 9431427 4816787 3486476 4922066
38166D922066K81788j755494p09427J786448J924235J08613r26583j259449k089923
$$ 4922066 5203854 3448360 2738933 4525381 6449616 6558229 5631646 4372197 2282274
38157B282274j878535O24078K255732j49124l694198l470339m36715P58951j07754
$$ 2282274 403739 1027817 3283549 3134425 -559773 -4030112 -4466827 -3707876 -3815630
38148c815630N87872K884710L115419Q90715k59786M61974r5208k820905m505741
$$ -3815630 -3227758 -343048 2772371 3663086 3403300 3865274 3770066 949161 -3556580
38139c556580l283914r18082J240764L658043N087428K774946k230898m641887
$$ -3556580 -6840494 -7758576 -6517812 -2859769 2227659 5002605 2771707 -1870180
38131a870180j862630K385305L208591J67224l630608n140125l018809J599278
$$ -1870180 -3732810 -1347505 1861086 2028310 -1602298 -6742423 -9761232 -8161954
38123h161954N163719M972692K538454J250696J423664R66192r037L89608J257194
$$ -8161954 -2998235 1974457 4512911 5763607 7187271 8153463 8144426 8534034 9791228
38114I791228l12873l510228l917484m44839K568600J758781j030850k602857
$$ 9791228 9478355 5968127 2050643 1605804 4174404 5933185 4902335 2299478
38106B299478k454057j164871J374815M027795M130473J287285j456081j902000
$$ 2299478 -154579 -1319450 55365 4083160 8213633 9500918 8044837 6142837
38098F142837j207955p29338J92848J469188Q28304k302310m415628k325289K075596
$$ 6142837 4934882 4205544 4398392 5867580 6695884 4393574 -22054 -2347343 -271747
38089b71747M116470K113036j278552k626578j193365O62667J06393k533010l471312
$$ -271747 3844723 5957759 4679207 2052629 859264 1521931 1628324 -904686 -4375998
38080d375998m46072L277761K874716r59865k928646j094283P68066K273n24109
$$ -4375998 -4822070 -1544309 1330407 370542 -2558104 -3652387 -2884321 -2882048 -3406157
38071c406157K316013N941846N205870l03251n533364o092356k698384O14612
$$ -3406157 -1090144 4851702 10057572 9754321 4220957 -1871399 -4569783 -3955171
38063c955171J183146p7060p70341m00689m05867r68530j46689K633307M678476
$$ -3955171 -2772025 -2849085 -3619426 -4020115 -4425982 -5394512 -5541201 -2907894 1770582
38054A770582L679721J024559q29899j814923k441328j495171J049652J955096
$$ 1770582 5450303 6474862 5644963 3830040 1388712 -106459 943193 2898289
38046B898289l29898j959531K16697K539972O25420k165286p9343M209720L320285
$$ 2898289 2568391 608860 825557 3365529 3990949 1825663 1746320 5956040 9276325
38037I276325k061129m231830j850644j413660m324303l933544J518119M323373
$$ 9276325 7215196 2983366 1132722 -280938 -4605241 -8538785 -7020666 -2697293
38029b697293N15478k909730j89359L503089J950081j212479K9472K970778J625260
$$ -2697293 -2181815 -5091545 -5280904 -1777815 172266 -1040213 -1010741 1960037 3585297
38020C585297k417782l462070j517147l26889L33756K333823L081028j9306k584436
$$ 3585297 1167515 -2294555 -3811702 -4138591 -3804835 -1471012 1610016 1590710 -993726
38011i93726O85158N957213N174729j131233m897879l149961p22473p13151p74726
$$ -993726 -308568 5648645 10823374 9692141 4794262 1644301 921828 208677 -566049
38002e66049L70684N02137o47884k56131J804963K004344o11894k559955j597994
$$ -566049 -195365 306772 -341112 -597243 1207720 3212064 2600170 40215 -1557779
37993a557779M36697J420311J310572K56823j582696k302857k97767K414228K830805
$$ -1557779 -1121082 299229 1609801 1866624 283928 -2018929 -2316696 97532 2928337
37984B928337J697475J264881L69185k719517m671112j190380M635436N661582
$$ 2928337 4625812 5890693 6259878 3540361 -1130751 -2321131 2314305 7975887
37976G975887J718496p82247j97616j481921n340574n384607L16333M145591Q63243
$$ 7975887 9694383 8912136 8714520 7232599 1892025 -3492582 -3176249 969342 1832585
37967A832585l523259j696578K946848K476732k153703l081951J175517L546418
$$ 1832585 -1690674 -3387252 -440404 2036328 -117375 -3199326 -2023809 1522609
37959A522609K42147l138234m98080N400427O991146K312491l359923n442077
$$ 1522609 1764756 -1373478 -1871558 3528869 10520015 12832506 9472583 4030506
37951D030506m992351m501808k959963J194365M846308L324516j693845l286181
$$ 4030506 -961845 -5463653 -8423616 -7229251 -2382943 941573 -752272 -4038453
37943d038453M76176L576677J998535q5409J335674K405011r54066l723356N67739
$$ -4038453 -3562277 14400 2012935 1927526 3263200 5668211 4714145 990789 1558528
37934A558528P137798N766241k655994o859701k640146J955693R63316j233735
$$ 1558528 8696326 14462567 11806573 4946872 2306726 4262419 5225735 3992000
37926C992000K0033J644531L45169q63525L53505L50692k446231k235897L936828
$$ 3992000 4012033 5656564 6001733 5138208 5491713 5842405 3396174 1160277 5097105
37917E097105Q152815K774532o386837p929773j648038K738189J099278j185609
$$ 5097105 13249920 16024452 9637615 1707842 59804 2797993 3897271 2711662
37909B711662l04510Q22071L3639K51940L261686N354669K634691l315885p720565
$$ 2711662 2407152 3229223 3262862 3514802 6776488 12131157 14765848 11449963 3729398
37900C729398p887666m696184r95536P55717R36299K354026N557396O439766J855664
$$ 3729398 -4158268 -8854452 -9849988 -9094271 -8157972 -5803946 -246550 6193216 8048880
37891H048880m251331n035030k66046L404863J943901j331966j821469R9964J238780
$$ 8048880 3797549 -1237481 -1503527 1901336 3845237 2513271 691802 791766 2030546
37882B030546O97409J02851M89114J092495O55244q99432j754697K29173M108539
$$ 2030546 2727955 2830806 3319920 4412415 5067659 4168227 2413530 2642703 6751242
37873F751242N386892J352056m198283m859308J0614M370140L489931o19348l123606
$$ 6751242 12138134 13490190 9291907 4432599 4443213 8813353 12303284 11683936 8560330
37864H560330k598419j183903o89940j040978j593349j889110j355013K16682
$$ 8560330 5961911 4778008 4088068 3047090 1453741 -435369 -1790382 -1573700
37856a573700J768012J632022m34025k395241j851115J018197L095977J717617
$$ -1573700 194312 1826334 1392309 -1002932 -2854047 -1835850 1260127 2977744
37848B977744j958126m097068k619844P81656L049139K652233n1873l488061n310973
$$ 2977744 1019618 -3077450 -5697294 -4915638 -1866499 785734 733861 -2754200 -8065173
37839h065173l921270k92170L057877N026473O064177N707424K948131o84862
$$ -8065173 -11986443 -12278613 -9220736 -4194263 1869914 7577338 10525469 9840607
37831I840607j957551q01510o66292k665447l463299j054578J617706J685479
$$ 9840607 7883056 7081546 6415254 3749807 286508 -768070 849636 2535115
37823B535115Q93023J652438K461050J242420l42475k20906o8747j583086k231512
$$ 2535115 3428138 5080576 7541626 8784046 8441571 8220665 8151918 6568832 4337320
37814D337320Q6900J873536l40550k811195m16061L368000J222038m835974n049210
$$ 4337320 4424220 6297756 5957206 3146011 2729950 6097950 7319988 2484014 -2565196
37805b565196K512123P957603M267032k879975m724697j595992L40944q69555
$$ -2565196 -53073 7904530 12171562 9291587 4566890 2970898 3311842 2442287
37797B442287k235357j794121j79521J658156K525038Q73514k404513l462428
$$ 2442287 206930 -1587191 -1766712 -108556 2416482 3289996 885483 -2576945
37789b576945m94300L250093L905747J730158q79101k880968l488664j069351
$$ -2576945 -3071245 178848 4084595 5814753 4935652 2054684 -1433980 -2503331
37781b503331L568515N953215L573528q8496o41271J044095J586416R84559J112299
$$ -2503331 1065184 7018399 10591927 10503431 9862160 10906255 12492671 13477230 14589529
37772A4589529Q84526j706283m349638k937858J162789K027528j970999n426721
$$ 14589529 15474055 13767772 9418134 6480276 7643065 9670593 7699594 2272873
37764B272873l725807P71469K848140J429781m25231m69602O68568J535617J652164
$$ 2272873 -1452934 -681465 2166675 3596456 3171225 2701623 3370191 4905808 6557972
37755F557972J211089M28269m19265j004028j310490j618620j845614j305968
$$ 6557972 7769061 8197330 7778065 6774037 5463547 3844927 1999313 693345
37747F93345J26916Q28139j052282m187355m260030L75332N052563M198786o59245
$$ 693345 820261 1648400 596118 -3591237 -7851267 -7475935 -2423372 1775414 1116169
37738A116169k656061N90082L986552L303711J167551J421039K245291j62737
$$ 1116169 -1539892 -949810 3036742 6340453 7508004 8929043 11174334 11011597
37730A1011597m296223n333407k760106n48686l63769J44425J995102K836463
$$ 11011597 6715374 1381967 -1378139 -1926825 -2290594 -2146169 -151067 2685396
37722B685396J495105K32718N90727N97247j580068m052636l866554j303651Q99713
$$ 2685396 4180501 4413219 5003946 5601193 4021125 -31511 -3898065 -5201716 -4302003
37713d302003J323810O20726o23573k479125m134421l710413n67782L019078L691713
$$ -4302003 -2978193 -2357467 -2981040 -5460165 -9594586 -13304999 -13872781 -10853703 -7161990
37704g161990Q81797j910825q92039L048985M838708J630191k950997k966800
$$ -7161990 -6280193 -8191018 -9083057 -6034072 -1195364 434827 -2516170 -5482970
37696e482970K273668P203355O682907J580099l132981m230507k816055j702747
$$ -5482970 -3209302 3994053 10676960 12257059 9124078 4893571 2077516 374769
37688C74769j590146n55223K692904N934152N296019L47470m413153m667703j574322
$$ 374769 -1215377 -1770600 922304 6856456 12152475 12499945 8086792 3419089 1844767
37679A844767K65777n79361q01257J934074M701729L184209j742506m440536j759492
$$ 1844767 2110544 1531183 729926 2664000 7365729 10549938 8807432 4366896 2607404
37670B607404K885012M136643J344908j785992k940080l317548l932065l326291
$$ 2607404 5492416 9629059 10973967 9187975 6247895 2930347 -1001718 -4328009
37662d328009n67735K389256L507913L287478K278248q50238n257631n430130
$$ -4328009 -4895744 -2506488 1001425 4288903 6567151 5716913 459282 -4970848
37654d970848J600260Q815643O346077m030284r396659k940567O777943Q106051
$$ -4970848 -3370588 5445055 11791132 7760848 -1635811 -4576378 2201565 10307616
37646A0307616J532857l401281k173676O20325k27658l756997n163986j710871
$$ 10307616 11840473 8439192 6265516 6885841 6658183 2901186 -2262800 -3973671
37638c973671M159826O647983K780628l031728l801472K69537J918374j702826
$$ -3973671 186155 6834138 9614766 6583038 2781566 3051103 4969477 3266651
37630C266651m341111j245051K614102J158070k296622j310547J941384P95312
$$ 3266651 -1074460 -2319511 294591 1452661 -843961 -2154508 -213124 582188
37622E82188l389410l288265J334009L329318J047177P42143M291102N086382
$$ 582188 -2807222 -6095487 -4761478 -1432160 -384983 357160 4648262 9734644
37614I734644k1994m275219j865418K762699K682708q63494k215732q70225n96905
$$ 9734644 9712650 5437431 3572013 6334712 9017420 8153926 5938194 5067969 4471064
37605D471064k006520k026777O05160L729817M791635K849119j028189l793484
$$ 4471064 2464544 437767 1042927 4772744 9564379 12413498 11385309 7591825
37597G591825l089933q61856j093115l244505k497735K112369N223499L240720
$$ 7591825 4501892 3640036 2546921 -697584 -3195319 -1082950 4140549 7381269
37589G381269n66719k239835k898926m346409m228659n83679L160003K935907
$$ 7381269 6814550 4574715 1675789 -2670620 -6899279 -7482958 -4322955 -1387048
37581a387048K78641r04954l46107L10050J502132L234916K400818k088387n127728
$$ -1387048 -1108407 -2013361 -2359468 -2049418 -547286 2687630 5088448 3000061 -2127667
37572b127667k126610L310805M355771P66052k290509k541636j465503O72164
$$ -2127667 -4254277 -943472 3412299 4178351 1887842 -653794 -2119297 -1447133
37564a447133L893000M579239m08111o771452o946467q89101L879720L023297
$$ -1447133 2445867 7025106 6616995 -154457 -7100924 -7990025 -4110305 -1087008
37556a087008j26043j243341k03728J338108K456987K134553P9701j474699n28857
$$ -1087008 -1213051 -2456392 -2660120 -1322012 1134975 3269528 3349229 1874530 1345673
37547A345673J025900M68001q88328n81747k04428j902208k573299J180936N004455
$$ 1345673 2371573 2839574 1951246 1369499 1165071 -737137 -3310436 -2129500 2874955
37538B874955K468667l122199k806832K801388L814870k072251n157024l2022
$$ 2874955 5343622 2221423 -585409 2215979 6030849 3958598 -1198426 -1230448
37530a230448N337564L095364k081973j862625K562705M552924L006431J136312
$$ -1230448 4107116 7202480 5120507 3257882 5820587 10373511 13379942 14516254
37522A4516254p79344l728030n078366k444173J021482J397343L03983N47667
$$ 14516254 13736910 10008880 4930514 2486341 3507823 4905166 5209149 5756816
37514E756816Q21l388987n103584o94220M725903K675386n021775p924402k072167
$$ 5756816 5757637 2368650 -2734934 -3429154 1296749 3972135 -1049640 -8974042 -11046209
37505a1046209N066570N880622J679210j502679o96065K386299L901746J309158
$$ -11046209 -5979639 -99017 1580193 77514 -618551 1767748 5669494 6978652
37497F978652l112520l450979J891997O185593L209542k892003l309555J960151
$$ 6978652 3866132 415153 2307150 8492743 11702285 8810282 5500727 7460878
37489G460878M273171m03616o316144p068975k933031K415442O040091N289507
$$ 7460878 11734049 11330433 5014289 -2054686 -4987717 -2572275 3467816 8757323
37481H757323m07896n816133m345517K237368N180189J412956k583386j984660
$$ 8757323 8349427 2533294 -1812223 425145 5605334 7018290 4434904 2450244
37473B450244n51579k214588l554191n35443L668326M071833J981062J310005
$$ 2450244 1898665 -315923 -3870114 -4405557 -737231 3334602 5315664 6625669
37465F625669J337389l18246j623179n721J256001j985168o170273m470558J893752
$$ 6625669 7963058 7644812 6021633 6015912 7271913 5286745 -883528 -5354086 -3460334
37456c460334N079347K843518Q30554J733373P94551m704557q852404n064811
$$ -3460334 1619013 4462531 5293085 7026458 7821009 3116452 -5735952 -10800763
37448a0800763M118372J0216572R008429L431928j743126m349860m758583m341462
$$ -10800763 -6682391 3534181 12542610 15974538 14231412 9881552 5122969 781507
37440G81507m155824l837366k054597J400664M758341N843014L724221q34013
$$ 781507 -3374317 -7211683 -9266280 -7865616 -3107275 2735739 6459960 5625947
37432E625947n205667n933983k163316K403711L458908J470911J94117N86048
$$ 5625947 420280 -5513703 -7677019 -5273308 -1814400 -343489 -149372 436676
37424D36676L17208q21597j15011K392144K752033j00941j700536N57876K536289
$$ 436676 753884 -67713 -182724 2209420 4961453 4860512 3159976 3717852 6254141
37415F254141K91185k853546j812466J560984J879072m48200n75876J593099J325718
$$ 6254141 6545326 3691780 1879314 3440298 5319370 4871170 4295294 5888393 7214111
37406G214111j869505k776437N39551L388211K370881J06216o97680j512929k947234
$$ 7214111 5344606 2568169 3107720 6495931 8866812 8973028 8275348 6762419 3815185
37397C815185j795780K443276M104868j42771m697097l219403J297317J900161
$$ 3815185 2019405 4462681 8567549 8424778 3727681 508278 1805595 3705756
37389C705756q11995r06119J697732J425941k212118l275365J10800K519094Q42137
$$ 3705756 2893761 1987642 3685374 5111315 2899197 -376168 -265368 2253726 3095863
37380C095863q37945O44445J994933L85103q28080J336142L040117l4932m566986
$$ 3095863 2257918 2902363 4897296 5282399 4454319 5790461 8830578 8795646 4228660
37371D228660m536706q55570Q50544l38249n38286R21781O30496j639284j659243
$$ 4228660 -308046 -1163616 -313072 -651321 -1189607 -267826 362670 -1276614 -2935857
37362b935857J764028L985317J682419j941550k084814J020983L368856K702737
$$ -2935857 -1171829 2813488 4495907 2554357 469543 1490526 4859382 7562119
37354G562119K56506j498078j054599J021368K255325Q54608j581670j861400
$$ 7562119 7818625 6320547 5265948 6287316 8542641 9397249 7815579 5954179
37346E954179J88068J518404O47769n22934o44019j125495k568913k545911J73661
$$ 5954179 6142247 7660651 8308420 7785486 7141467 6015972 3447059 901148 1074809
37337A074809K246749L93588k811980k205059K047002M519744K622766j37604
$$ 1074809 3321558 3715146 903166 -1301893 745109 5264853 7887619 7750015
37329G750015m07717n1125k010204m500348l510660N55948L171193K453230J404776
$$ 7750015 7342298 7291173 5280969 780621 -2730039 -2174091 997102 3450332 4855108
37320D855108K333032L077705J260811j033274n00186J585032J143242j994366
$$ 4855108 7188140 10265845 11526656 10493382 9993196 11578228 12721470 10727104
37312A0727104l723944k296210o88658j030284j231125L49514J148725j023276
$$ 10727104 7003160 4706950 4018292 2988008 1756883 2106397 3255122 2231846
37304B231846l206044j675474J522151J672066o40435n48317K484951L324361
$$ 2231846 -974198 -2649672 -1127521 544545 -95890 -644207 1840744 5165105
37296E165105k28794l325711j465135K704881L783299J396357o08338n48909j99862
$$ 5165105 4936311 1610600 145465 2850346 6633645 8030002 7421664 6872755 6672893
37287F672893o04086n14263O96784J516129N74897j313093k206086j266438M38902
$$ 6672893 6068807 5554544 6251328 7767457 8342354 7029261 4823175 3556737 3995639
37278C995639J095227K92167j37500J451623L329049J838733l051767o240196
$$ 3995639 5090866 5383033 5245533 6697156 10026205 11864938 8813171 2572975
37270B572975l709100J835709M518999L045238J240347J338278R89946j746870
$$ 2572975 -1136125 699584 5218583 8263821 9504168 10842446 11832392 10085522
37262A0085522m187463k710696J409874L219343O84702k851975l451548j414082
$$ 10085522 5898059 3187363 4597237 7816580 8501282 5649307 2197759 783677
37254G83677J82421J30999p868P99490J361392O66041m8201O88194J777393R33777
$$ 783677 966098 1097097 1089229 1888719 3250111 3916152 3867951 4556145 6333538 7267315
37244G267315j552922k621551m46449K987819M069370J391279k993918n460712
$$ 7267315 5714393 3092842 2646393 5634212 9703582 11094861 8100943 2640231
37236B640231m016171l98746J496994K68170j039954N91488L230666K775130k71421
$$ 2640231 -1375940 -1774686 -277692 -9522 -1049476 -457988 2772678 5547808 5276387
37227E276387j248607J115263K667764J057297l01709J230975K106172j263935
$$ 5276387 4027780 5143043 7810807 8868104 8566395 9797370 11903542 10639607
37219A0639607n043382l101019K851317N232726J810815k001689k266850r58602
$$ 10639607 5596225 2495206 5346523 10579249 12390064 10388375 8121525 7162923
37211G162923j6825J970612M499048L261543k493576o517336m148056P35237K395103
$$ 7162923 7146098 9116710 13615758 16877301 14383725 7866389 3718333 4453570 6848673
37202F848673J872102K846241L521823L24131l602472k289589K313819K603469
$$ 6848673 8720775 11567016 15088839 15412970 11810498 9520909 11834728 14438197
37194A4438197j928092l781491o32585O57119l200089n084370L58540O287748
$$ 14438197 12510105 8728614 8096029 8753148 5553059 468689 827229 7114977
37186G114977L821207l695985o026887j603446J924250O27698j620007j604099
$$ 7114977 10936184 7240199 1213312 -390134 1534116 2161814 541807 -1062292
37178a062292o84502L40028K528558M154449K208768p47972P98599M887055L426816
$$ -1062292 -1746794 -1406766 1121792 5276241 7485009 6737037 7535636 12422691 15849507
37169A5849507l751579o407669j01503N403657J348417n681367m610450K148980
$$ 15849507 12097928 5690259 5588756 10992413 12340830 6659463 2049013 4197993
37161D197993L602874j237656k773962J964452M314977j096982p273309n775233
$$ 4197993 7800867 6563211 3789249 5753701 10068678 8971696 1698387 -4076846
37153d076846J199600N421278L913680K99342j555939p25085J684214L314939
$$ -4076846 -2877246 2544032 6457712 6757054 5201115 4476030 6160244 9475183
37145I475183K073803j196854l334298l026252j886826r68716M10130J766659
$$ 9475183 11548986 10352132 7017834 3991582 2104756 1136040 1546170 3312829
37137C312829J317576k85441j90606J606107J900168J88032j00965J976353K728844
$$ 3312829 4630405 4344964 4154358 5760465 7660633 7848665 7747700 9724053 12452897
37128A2452897N72544q75832K85693L44089k616748l630016Q51918N215288K755237
$$ 12452897 13025441 12149609 12435302 12779391 10162643 6532627 7384545 12599833 15355070
37119A5355070k933394l318473J121892J872477l265048o381324k008735M744844
$$ 15355070 12421676 9103203 10225095 12097572 8832524 2451200 442465 5187309
37111E187309O257974K399384j627540k913701k227650p78671P74377J635647
$$ 5187309 11445283 13844667 12217127 9303426 7075776 6297105 7071482 8707129
37103H707129J479520P09653o07933k373728l046100j237792J292361J442697
$$ 8707129 10186649 10896302 10288369 7914641 4868541 3630749 4923110 6365807
37095F365807l78662r49720O2863k85999k082568j408323K517133M497683J248545
$$ 6365807 5987145 5037425 5100288 4814289 2731721 1323398 3840531 8338214 9586759
37086I586759k720787j834256J804098J970868j880706m334503k592314K14408
$$ 9586759 6865972 5031716 6835814 8806682 6925976 2591473 -841 213567
37078B13567O44372p36790j645147j087511R09244L621799M910362K938718o10268
$$ 213567 857939 121149 -1523998 -2611509 -1702265 1919534 6829896 9768614 9158346
37069I158346j652630J064254M188377M134998J141171j883510k648342r38518
$$ 9158346 7505716 8569970 12758347 16893345 18034516 16151006 13502664 12564146
37061A2564146J411384J577597j321770m263030l629850m33027R16142o78169
$$ 12564146 13975530 15553127 14231357 9968327 6338477 5905450 6821592 6143423
37053F143423j506162M97434K291455J259793j41959R36763K208218K34242k961258
$$ 6143423 4637261 5134695 7426150 8685943 8543984 9480747 11688965 11923207 8961949
37044H961949k808904K32009J899710J616309K300966L294680Q20812l664635
$$ 8961949 6153045 6385054 8284764 9901073 12202039 15496719 16317531 12652896
37036A2652896l466008K326844N485874P73375n521268n140038j10920J716890
$$ 12652896 9186888 11513732 16999606 17772981 12251713 7111675 7000755 8717645
37028H717645j028459l266044k854818j962249q22607J897615L473544K4578n078771
$$ 8717645 7689186 4423142 1568324 -393925 -1216532 681083 4154627 4179205 -899566
37019h99566m140475K581339O057816K031688l172031l694650k475317l484668
$$ -899566 -5040041 -2458702 3599114 5630802 2458771 -1235879 -3711196 -7195864
37011g195864l462874J612809P639996P630863K202961k093879k305471o79090
$$ -7195864 -10658738 -9045929 -1405933 6224930 8427891 6334012 4028541 3349451
37003C349451R84832K508389K552471K98840j492608k46006J347844o25492m013235
$$ 3349451 4334283 6842672 9395143 9693983 8201375 7955369 9303213 8677721 4664486
36994D664486l410763Q97498L162687J082384j569646j546955K31349K166891
$$ 4664486 1253723 2151221 5313908 6396292 4826646 3279691 3511040 5677931
36986E677931L823870L737128N62278k998175k606413P99064J921373m09123j621188
$$ 5677931 9501801 13238929 13801207 10803032 8196619 8995683 10917056 10507933 8886745
36977H886745M98657K433683J799604J218522K226373J453000k865474n935824
$$ 8886745 9385402 11819085 13618689 14837211 17063584 18516584 15651110 9715286
36969I715286l140258K336688L948026R58703j869645j672191J61781J649715
$$ 9715286 6575028 8911716 12859742 13818445 11948800 10276609 10438390 12088105
36961A2088105K055995R14095j402544k868376k145923o03449O7249K91126M55900
$$ 12088105 14144100 15058195 13655651 10787275 8641352 8037903 8105152 8396278 8852178
36952H852178r39054l885486m467571J0898N673835O441909K340543j220743j535789
$$ 8852178 7913124 4027638 -439933 -429035 5244800 11686709 14027252 12806509 11270720
36943A1270720j017313j636147j955911p97600L90958N40057R90028K644905L708697
$$ 11270720 10253407 8617260 6661349 5863749 6254707 6794764 7784792 10429697 14138394
36934A4138394K242792p65819k616523k175568p77218l76075j365023k129346
$$ 14138394 16381186 15615367 12998844 10823276 10046058 9669983 8304960 6175614
36926F175614j119533O53244P63287m66739L20079L802593N296782J432139l409720
$$ 6175614 5056081 5709325 6472612 6005873 6325952 10128545 15425327 16857466 13447746
36917A3447746k640948K311832L802277k01684l214419r43642K138014P26307
$$ 13447746 10806798 13118630 16920907 16719223 13504804 12561162 14699176 15425483
36909A5425483k858030l370229j120937K45322R88179L630577O170015M014139
$$ 15425483 12567453 9197224 8076287 8321609 9309788 12940365 19110380 23124519
36901B3124519j735961m759173l032242j347533k571192k969466L09776L043285
$$ 23124519 21388558 16629385 13597143 12249610 9678418 6708952 7018728 10062013
36893A0062013M73548m180683l914968J629036O068796N799366L621807K395306
$$ 10062013 10535561 6354878 2439910 4068946 10137742 15937108 19558915 21954221
36885B1954221Q91416j921345l355789j115623K399451L379567J878580M42642
$$ 21954221 22845637 20924292 17568503 16452880 18852331 22231898 24110478 24553120
36877B4553120o24741k834917n404500n578682l097308o79493N62130K529233
$$ 24553120 23928379 21093462 15688962 10110280 7012972 6333479 6895609 9424842
36869I424842N488327N669834N91829n603906o123597l05495N227091M898133
$$ 9424842 14913169 20583003 21174832 15570926 9447329 9141834 14368925 19267058
36861A9267058N40257k225439j481616k22793j193039l358901l872792j633316
$$ 19267058 19807315 17581876 16100260 15877467 14684428 11325527 7452735 5819419
36853E819419J836675L979990L297432P24207j051617n15038R04355J246397J114469
$$ 5819419 7656094 11636084 14933516 15657723 14606106 14091068 14995423 16241820 17356289
36844A7356289J886864J907675j397144n530336m455061J888706N408172J275002
$$ 17356289 19243153 21150828 19753684 14223348 9768287 11656993 17065165 18340167
36836A8340167m021293k184747L984949N331470R27446j727826j54179N667l221988
$$ 18340167 14318874 12134127 16119076 21450546 22377992 20650166 20495987 20501654 17279666
36827A7279666l928175L10868K963984P7116k124887J574732N271479K063233
$$ 17279666 13351491 13662359 16626343 16703459 14578572 16153304 21424783 23488016
36819B3488016l190687j935872L048758K658322k308567k755599K357192M239049
$$ 23488016 20297329 18361457 21410215 24068537 21759970 19004371 21361563 25600612
36811B5600612l17096m065936k423341m4093n74748n54017J671395J090431l915485
$$ 25600612 25283516 21217580 18794239 18750146 18175398 17621381 19292776 20383207 16467722
36802A6467722n980508l74104N976188N089067N06585M79334M344408N255757
$$ 16467722 10487214 10113110 16089298 21178365 21684950 22164284 26508692 31764449
36794C1764449K506179J337698K504117J292454l363336o821321o388358m392866
$$ 31764449 34270628 35608326 38112443 39404897 36041561 29220240 22831882 18439016
36786A8439016k891369j140174Q59055J503741J136737J905082L480267L171414
$$ 18439016 15547647 14407473 15266528 16770269 17907006 19812088 23292355 26463769
36778B6463769P18203j183051j483310j787947k413228j655474L54920J158876
$$ 26463769 27181972 25998921 24515611 22727664 20314436 18658962 19013882 20172758
36770B0172758K45393O50J322340J889878O2948k718200m591266n273886m391428
$$ 20172758 20418151 20418801 21741141 23631019 23693967 20975767 16384501 11110615 6719187
36761F719187j092224L207513M793523K296347j095689j906133o27458K45335
$$ 6719187 5626963 8834476 13627999 15924346 14828657 12922524 12295066 12540401
36753A2540401M08666J481612L612298M815125L752059J504967J7306l02130n79803
$$ 12540401 12949067 14430679 18042977 22858102 26610161 28115128 28132434 27830304 27250501
36744B7250501j344892j573856o20719k106j438047l623584l480504q61574R37379
$$ 27250501 25905609 24331753 23711034 23708928 22270881 18647297 15166793 14305219 15242598
36735A5242598L58995N1211K168114M250174K755681j460067m296100l587878
$$ 15242598 15601593 15652804 17820918 22071092 24826773 23366706 19070606 15482728
36727A5482728m96611K830531M506551L334805L91270j355975r33123n80015j201048
$$ 15482728 14986117 17816648 22323199 25658004 26049274 24693299 23760176 23180161 21979113
36718B1979113j89166L165081M354063M96128l473125j724699K493391J410085
$$ 21979113 21789947 24955028 29309091 29805219 26332094 24607395 27100786 28510871
36710B8510871m507827o886469k695222J497472O54159j379401M43455M000393
$$ 28510871 24003044 17116575 14421353 15918825 16572984 15193583 15637038 19637431
36702A9637431M412358K059739Q52096J467622J171856j176114l749283m569168
$$ 19637431 24049789 26109528 26961624 28429246 29601102 28424988 24675705 20106537
36694B0106537l082469K28238L779107N185607L224609p89463m075109m401804
$$ 20106537 17024068 17252306 21031413 26217020 29441629 28652166 24577057 20175253
36686B0175253j703269J136075M77894l060708l841973J213825O619018N044524
$$ 20175253 18471984 19608059 20085953 17025245 13183272 14397097 21016115 26060639
36678B6060639j510437l924546O64850N002829L037057k050958m497982m230583
$$ 26060639 24550202 20625656 21290506 26293335 29330392 27279434 22781452 18550869
36670A8550869l913745k959360K44498L776462M783639M001467L592820L032158
$$ 18550869 14637124 11677764 11922262 15698724 20482363 24483830 28076650 31108808
36662C1108808R12346j622870k786217l056314l040176j355382J956153L145443
$$ 31108808 32021154 30398284 27612067 24555753 21515577 20160195 22116348 25261791
36654B5261791j10l530337k486046J697259L673766K249345J063892K147879L340197
$$ 25261791 25261681 21731344 19245298 20942557 24616323 26865668 27929560 30077439 33417636
36645C3417636K141097j186488m365326m834567j654139K585349L577036P74657
$$ 33417636 35558733 34372245 30006919 25172352 23518213 26103562 29680598 30455255
36637C0455255j589555r30565o6501j611995k868423p06275K264283J756803r47052
$$ 30455255 28865700 27935135 27868634 26256639 23388216 22681941 24946224 26703027 25755975
36628B5755975j451539M70352J727006J859262K307245J836329j056840l123198
$$ 25755975 24304436 24774788 26501794 28361056 30668301 32504630 31447790 28324592
36620B8324592o19496K979110J151375m532142n670102N3975N450666N007761
$$ 28324592 27705096 30684206 31835581 27303439 21633337 21687312 27137978 32145739
36612C2145739J638763l10623j316290k417873j472076K040177M060887K100340
$$ 32145739 33784502 33473879 32157589 29739716 28267640 30307817 34368704 36469044
36604C6469044n02833m57714P8253j780711l933923k952836J09074K000824K327003
$$ 36469044 35966211 35508497 35586750 33806039 29872116 26919280 27028354 29029178 31356181
36595C1356181K286899J330926r64383k434314j498923j31524k20861m8516J916996
$$ 31356181 33643080 34974006 34009623 31575309 30076386 29944862 29724001 29675485 31592481
36586C1592481L055152P38437k605285l169317j674698q13590K77232L399919
$$ 31592481 34647633 35386070 32780785 29611468 27936770 27123180 27400412 30800331
36578C0800331N642380K796809k848875m647711j231353K215935K570271K311138
$$ 30800331 36442711 39239520 36390645 31742934 30511581 32727516 35297787 37608925
36570C7608925L232801K846774l26696l074846k478584o41720r07066k321084
$$ 37608925 40841726 43688500 43361804 40286958 37808374 37166654 36259588 33938504
36562C3938504j530029J663409M072057L670543J647997J07711j98184L88028
$$ 33938504 32408475 34071884 38143941 41814484 43462481 43570192 43372008 43760036
36554D3760036J386590K126871J544991p58436l023461k308152J484098L726363
$$ 43760036 45146626 47273497 48818488 48060052 45036591 42728439 44212537 47938900
36546D7938900K67746n675893o091735R02719P393791O118260L9076l271097k690643
$$ 47938900 48206646 42530753 36439018 37341737 44735528 50853788 50892864 47621767 44931124
36537D4931124k467996l024203q98761K913355K955657j193031l264570m73496
$$ 44931124 42463128 39438925 38540164 41453519 44409176 43216145 39951575 39478079
36529C9478079K176958J186700P86987M745078Q300010N022033k471008n625564
$$ 39478079 41655037 42841737 43628724 48373802 56673812 61695845 59224837 53599273
36521E3599273j636198L968707N235344J361807m550677p970788n331478J882708
$$ 53599273 51963075 55931782 61167126 62528933 57978256 50007468 44675990 46558698
36513D6558698O608976L820982k557104m461943r7010M970835O037062L650047
$$ 46558698 53167674 56988656 54431552 49969609 49872599 54843434 60880496 64530543
36505F4530543K28082k651396l239154n97751K582128K313143p99797k148091
$$ 64530543 64758625 62107229 58868075 58270324 60852452 63165595 62365798 60217707
36497F0217707l64743O29777j539313l380742r65428L721289N332584K276654
$$ 60217707 59852964 60482741 58943428 55562686 54597258 58318547 63651131 65927785
36489F5927785j669476k176462J137830M774390M996465J628428j810555k283608
$$ 65927785 64258309 62081847 63219677 67994067 72990532 74618960 72808405 70524797
36481G0524797o03608O97960J376373K775750M264829L785088J646563L28512
$$ 70524797 69921189 70619149 71995522 74771272 79036101 82821189 84467752 84796264
36473H4796264M44216L60340m2491R14493K651136K038991j562113m671344m531689
$$ 84796264 85240480 85600820 85558329 86472822 89123958 91162949 89600836 84929492 80397803
36464H0397803k120994R41721M565729P499496O676664K055160j441900q9735
$$ 80397803 78276809 79218530 83784259 91283755 97960419 100015579 98573679 98483944
36456I8483944L294609L412747l29298l855734l998593j233064J924671K990719
$$ 98483944 101778553 105191300 104862002 101006268 97007675 95774611 97699282 100690001
36448A00690001J115364j671048k039560O71387L708315M787405M273121K801038
$$ 100690001 101805365 100134317 98094757 98766144 102474459 107261864 111534985 114336023
36440A14336023J12319k354802j478251K687847N525065L869166J67411j900589
$$ 114336023 114448342 112093540 110615289 113303136 118828201 122697367 122864778 120964189
36432A20964189k395836k715788j884423R53144L371140L002840J607339K078581
$$ 120964189 118568353 115852565 113968142 114921286 118292426 121295266 122902605 124981186
36424A24981186L677742L789113K201444L62495j216881j809915K09928L675993
$$ 124981186 128658928 132448041 134649485 135011980 133795099 131985184 132195112 135871105
36416A35871105L955400j50805k922786Q9473M575550M014686r9958j451224O69277
$$ 135871105 139826505 139675700 136752914 136842387 141417937 145432623 145332665 143881441 144550718
36407A44550718J634281L22545J03513J830735K919164K942685L583762L727347
$$ 144550718 146184999 146507544 146611057 148441792 151360956 154303641 157887403 161614750
36399A61614750J288864j027713R24559M499385L443544j033427j342445L549259
$$ 161614750 162903614 161875901 162800460 167299845 170743389 169709962 168367517 171916776
36391A71916776N767277J536384k664345q78317L570375M864268L263438J922775
$$ 171916776 177684053 179220437 176556092 175677775 179248150 184112418 187375856 189298631
36383A89298631J170689Q13545K740014O551682P554254L489995j450658l208967
$$ 189298631 190469320 191282865 194022879 200574561 208128815 211618810 210168152 206959185
36375B06959185l210301l169814n66384N452401R281268O254018L57721j677889
$$ 206959185 203748884 200579070 200012686 205465087 214746355 221000373 221358094 219680205
36367B19680205N018J023048J173543L143123N611569M963319K243135J477582
$$ 219680205 219685223 220708271 221881814 225024937 230636506 235599825 237842960 239320542
36359B39320542K122830J07531l820548l761790K003381P284544O027061r2754
$$ 239320542 241443372 241550903 237730355 233968565 235971946 243256490 249283551 249190797
36351B49190797m577152l783207M15838L829257M068300K119364N95150N70611
$$ 249190797 244613645 240830438 241246276 245075533 249143833 251263197 251858347 252428958
36343B52428958Q44696M06653o7207R0942L23315M30334J298600K766856K949139
$$ 252428958 253273654 253680307 253613100 253704042 254027357 254457691 255756291 258523147 261472286
36334B61472286J110160r58648j728591j721483j407482k29621J017802K28801
$$ 261472286 262582446 261623798 259895207 258173724 256766242 256536621 257554423 257783224
36326B57783224j981332j959169J269831L772149K501625n08647k124863k199861
$$ 257783224 255801892 253842723 255112554 258884703 261386328 260877681 258752818 256552957
36318B56552957j258254J238193L484075J476838l821870n177754M29839N851939
$$ 256552957 255294703 256532896 260016971 261493809 257671939 252494185 252924024 258775963
36310B58775963M062417j315685k763825q15057q62889k386225r80431J625339
$$ 258775963 262838380 261522695 258758870 257943813 257080924 254694699 253714268 255339607
36302B55339607j82152m681131m159003J828498M424634r31692p618891p944149
$$ 255339607 255157455 250476324 246317321 248145819 252570453 251638761 244019870 236075721
36294B36075721k786458K466388N110563M556608N97817l718880l006880K323303
$$ 236075721 233289263 235755651 240866214 245422822 246020639 242301759 239294879 241618182
36286B41618182M097905k273029r279283o890842K405458O139456o52745q359110
$$ 241618182 245716087 243443058 234163775 227272933 229678391 235817847 235165102 226805992
36278B26805992o476688J881086N364268J012008k661242K3465L043574p25953
$$ 226805992 220329304 222210390 227574658 228586666 225925424 225948889 228992463 228266510
36270B28266510o989014o719586j160459O09203k342892j625423L933647M017603
$$ 228266510 221277496 214557910 213397451 214006654 211663762 210038339 213971986 217989589
36262B17989589n192195j1746722o050078L064017K601210l527189k496488M755233
$$ 217989589 212797394 201050672 195000594 198064611 200665821 197138632 194642144 199397377
36254A99397377N514640k469232p412601l307739J915923J437617q16272m10563
$$ 199397377 204912017 202442785 195030184 191722445 193638368 195075985 194259713 193849150
36246A93849150k96369k666878l248009J25752K155997p08500l779081k640525
$$ 193849150 193552781 190885903 187637894 187763646 189919643 189211143 185432062 182791537
36238A82791537m95076j109015j771157L59433J564170k003777o753794p061153
$$ 182791537 182296461 181187446 179416289 179775722 181339892 179336115 172582321 165521168
36230A65521168l618543n96936J096064K287285J643726j306944l175788j589363
$$ 165521168 161902625 161305689 162401753 164689038 166332764 165025820 161850032 160260669
36222A60260669P13722P33449k83442j041535l496389p414949p483935j455257
$$ 160260669 160974391 161707840 161424398 160382863 156886474 149471525 141987590 140532333
36214A40532333M277614L372678j244831l160242k311079k005596j071577K775856
$$ 140532333 144809947 148182625 146937794 143777552 141466473 139460877 138389300 141165156
36206A41165156N532926J727866n539757p788486l279418J623815K429405O82327
$$ 141165156 146698082 148425948 142886191 135097705 131818287 133442102 135871507 136553834
36198A36553834j358980l280476l712478j331420J116314l59264m042770m206952
$$ 136553834 135194854 131914378 128201900 126870480 127986794 127627530 123584760 119377808
36190A19377808r3273K542038k07587n549153q573945p372909k849722K527095
$$ 119377808 119284535 121826573 121618986 116069833 107495888 100122979 97273257 99800352
36182I9800352N192383L345840l76561k192654k277870k907882l144486n71456
$$ 99800352 104992735 108338575 107962014 105769360 103491490 100583608 97439122 96867666
36174I6867666K638240J509088l511335o081372l059768J356662K412229O67353
$$ 96867666 99505906 101014994 97503659 91422287 88362519 89719181 92131410 92798763
36166I2798763j179279k629734l613072k411164J141960L367967J232518k867735
$$ 92798763 91619484 88989750 85376678 82965514 84107474 87475441 88707959 85840224
36158H5840224m146630j931412J57502r08l96261J075408K651854J179147k546024
$$ 85840224 81693594 79762182 79919684 79918776 79522515 80597923 83249777 84428924 81882900
36149H1882900m045040j582724P53091j101446m886378n595623l445264k695378
$$ 81882900 77837860 76255136 77008227 75906781 71020403 65424780 61979516 59284138
36141E9284138l242352m80565N126404O207944O5594n345044k935283K467127
$$ 59284138 56041786 55561221 60687625 66895569 66961163 61616119 58680836 61147963
36133F1147963K185751k340804k776881K015629M852882K440256n02202k34472
$$ 61147963 63333714 60992910 58216029 60231658 65084540 67524796 67022594 66788122
36125F6788122J035502R28271M34383l57057l327315o772980n408552R17449M675240
$$ 66788122 67823624 68751895 69186278 68829221 65501906 58728926 53320374 54237823 58913063
36116E8913063R14395n119714n358334L3174L964987K346660j969643m163779
$$ 58913063 59827458 54707744 49349410 49382584 53347571 55694231 53724588 49560809
36108D9560809k697220L44136J881654O77721j540515k138469q08367M17927K43894
$$ 49560809 46863589 47207725 49089379 49767100 48226585 46088116 45279749 45697676 45941570
36099D5941570n75257j020936r69446l99022P22097J681970J779250J469061J184774
$$ 45941570 45366313 44345377 43375931 42976909 43699006 45380976 47160226 48629287 49814061
36090D9814061Q8467j991949k970773j538763K0705o54755j722787m41074J443145
$$ 49814061 49902528 47910579 44939806 43401043 43421748 42766993 41044206 40603132 42046277
36081D2046277P62826n86681J397367M592981K884969l312650o387842k860322
$$ 42046277 42809103 42222422 43619789 48212770 51097739 47785089 41397247 38536925
36073C8536925K041142L301711K265081J058106j583628n066492m844231l71922
$$ 38536925 40578067 43879778 46144859 47202965 45619337 40552845 35708614 35336692
36065C5336692J746640j973437n242059k044553L148492L000849n28133o62132
$$ 35336692 37083332 35109895 29867836 27823283 30971775 33972624 33444491 32782359
36057C2782359J955675J529625j166633n3192M057781L393649l215550o919289
$$ 32782359 34738034 36267659 35101026 35047834 39105615 42499264 39283714 32364425
36049C2364425k408810L969013M396793N25058j345063j69351Q45393R54959J486723
$$ 32364425 29955615 33924628 38321421 38846479 37501416 37332065 38177458 39132417 40619140
36040D0619140J380924j325878n027479o110541l938064o93537K194072L901649
$$ 40619140 42000064 40674186 35646707 29536166 25598102 24904565 27098637 31000286
36032C1000286K563510j708571l823871P60654P974263Q591103Q69671o174299
$$ 31000286 33563796 31855225 28031354 28792008 36766271 45357374 46227045 40052746
36024D0052746m934219O46968J731867k442666m502918p52722L398536J792812
$$ 40052746 35118527 35765495 37497362 35054696 30551778 29799056 33197592 34990404
36016C4990404l475498n304507j567863K487370J989342j117138j557051J497698
$$ 34990404 31514906 26210399 24642536 27129906 29119248 28002110 26445059 27942757
36008B7942757L528808J552459j481058j128105K086980L767621K097426l67920
$$ 27942757 31471565 33024024 31542966 30414861 32501841 36269462 38366888 37998968
36000C7998968j334833j459698j483517m65840J271486J098679j367269k215377
$$ 37998968 36664135 35204437 33720920 33255080 34526566 35625245 34257976 32042599
35992C2042599P07767L136556N73581l692751k903783K287907M216118j40090
$$ 32042599 32750366 35886922 36460503 32767752 29863969 32151876 36367994 36227904
35984C6227904m792503m058670m1962K358991K618626K808752K841697J745834
$$ 36227904 31435401 27376731 27334769 29693760 32312386 35121138 37962835 39708669
35976C9708669O64738P11769L24345j778543l430358k269943N7490M39787q10037
$$ 39708669 40373407 41085176 41409521 39630978 36200620 33930677 33988167 34427954 33617917
35967C3617917r10578J042349L520017M848284L771199k21788m861363n877742
$$ 33617917 32707339 33749688 37269705 42117989 45889188 45667400 40806037 34928295
35959C4928295k314825J574561K200207J208427J393332J798795N82151q71242
$$ 34928295 32613470 34188031 36388238 37596665 38989997 40788792 41370943 40499701
35951D0499701q80657j048638k565886k720348j4650J312515k168978n921279
$$ 40499701 39619044 38570406 36004520 33284172 33269522 34582037 32413059 26491780
35943B6491780l810252J703407L531249J407305P90609K212848J165792j895449
$$ 26491780 22681528 24384935 27916184 29323489 30114098 32326946 33492738 31597289
35935C1597289j284579L071594M044758r42691n316521l932920m39559n9642j924942
$$ 31597289 30312710 33384304 37429062 36486371 31169850 27236930 26797371 26737729 24812787
35926B4812787k901177l029124k836544n65964L645704N490839K488724j649709
$$ 24812787 21911610 18882486 16045942 15479978 19125682 24616521 27105245 25455536
35918B5455536k137368Q56160L863444M288094J204123l944744o356200k518825
$$ 25455536 23318168 24174328 28037772 32325866 33529989 29585245 23229045 20710220
35910B0710220L377999L724432j077312k978966N21781K651121j35721j922576
$$ 20710220 24088219 27812651 26735339 23756373 24278154 26929275 26793554 24870978
35902B4870978J187011L339274p3010l065001K48131M089785R22679m260982k012894
$$ 24870978 26057989 29397263 29324253 26259252 26507383 30597168 31519847 27258865 25245971
35893B5245971M413292L769557l847994o621742m57869M765403J623089m053337
$$ 25245971 29659263 33428820 29580826 22959084 22501215 27266618 28889707 24836370
35885B4836370l960949O71913L840993M049348K841480k9259m155968n823752
$$ 24836370 20875421 21547334 25388327 29437675 32279155 32249896 28093928 22270176
35877B2270176l152168j23937o83756k437278j196539J566312J549386m67987
$$ 22270176 19118008 18994071 18310315 15873037 14676498 16242810 17792196 17324209
35869A7324209M4178K839603K306374l160311p097033l842008K746516M424139
$$ 17324209 17368387 20207990 22514364 19354053 12257020 8415012 11161528 15585667
35861A5585667K74671k517912J98309L687160K431753j161655j348850J256420
$$ 15585667 15860338 13342426 13540735 17227895 19659648 18497993 17149143 18405563
35853A8405563J369164j106977o32050L717317N309241M07942n247888m996786
$$ 18405563 19774727 18667750 18035700 21753017 27062258 27470200 22222312 17225526
35845A7225526q45328J003086k03129p01289L50856O70723K25835R92976K404229
$$ 17225526 16380198 17383284 17180155 16478866 16829722 17500445 17726280 18719256 21123485
35836B1123485K136184N55583k49195p87611k857686n016765m246114j382062
$$ 21123485 23259669 23815252 23566057 22778446 19920760 14903995 10657881 9275819
35828I275819m6235o89706m90817J184530K068189J664505J870325K648174J629189
$$ 9275819 9229584 8539878 8049061 9233591 11301780 12966285 14836610 17484784 19113973
35819A9113973j336009l269493k425078k53385J198862R89429r63311k938803
$$ 19113973 17777964 14508471 12083393 11830008 13028870 14018299 13054988 10116185
35811A0116185j891772J748956K580294j727820m475179R03645Q760082P754207
$$ 10116185 8224413 9973369 12553663 10825843 6350664 7254309 16014391 23768598
35803B3768598j633665o943155k496084K977732J586725j804707K1240L541233
$$ 23768598 22134933 15191778 12695694 15673426 17260151 15455444 15476684 19017917
35795A9017917J238817m797474o189948j840485J452061O58126q1931J780834
$$ 19017917 20256734 15459260 9269312 7428827 8880888 9539014 9457083 11237917
35787A1237917K872046M81100k578216k707393r59952n84695j642152j130390
$$ 11237917 14109963 14591063 12012847 9305454 8345502 7760807 6118655 4988265
35779D988265K141465M997964L350068k020334m967924j397750M125856L322782
$$ 4988265 7129730 12127694 15477762 13457428 8489504 7091754 11217610 14540392
35771A4540392m023575q630680m407076L062661N188242K399025R98275J847880
$$ 14540392 10516817 1886137 -2520939 541722 5729964 8128989 9127264 10975144
35763A0975144N61869k430647j155019N071879Q370953L586233l787201n796776
$$ 10975144 11537013 9106366 7951347 13023226 21394179 24980412 21193211 15396435
35755A5396435l014744j686183l468220m286813k030342M20774L10458j186516
$$ 15396435 12381691 10695508 7227288 2940475 910133 1330907 1641365 454849
35747D54849j467816O7100K167881L385119K901864J084436o06589j219605j225263
$$ 454849 -1012967 -945867 1222014 4607133 7508997 8593433 7986844 6767239 5541976
35738E541976q29084R97707L869897M481643J062610k433606j147024K650321
$$ 5541976 4712892 5710599 9580496 14062139 15124749 12691143 11544119 14194440
35730A4194440K012589l736427o892467k606212L862578N206100K119652r013
$$ 14194440 16207029 12470602 5578135 2971923 6834501 12040601 14160253 14151240
35722A4151240j40645r07248j858254m13373J868995R39801k170631k199618J483338
$$ 14151240 14010595 13103347 11245093 10831720 12700715 13640516 11469885 9270267 10753605
35713A0753605L558241J575993m99003K31969Q86395j250901l665793l331865
$$ 10753605 14311846 15887839 15388836 15620805 16507200 15256299 11590506 8258641
35705H258641j746146j257385o04388J618317K798586L31248k954157k048286
$$ 8258641 6512495 5255110 4650722 6269039 9067625 9398873 6444716 4396430
35697D396430L173410P852974P855306K964569l819029p958612o609539k142655
$$ 4396430 7569840 15422814 23278120 26242689 22423660 14465048 7855509 5712854
35689E712854J85391n73111j80318K836014L921105M49595k997717k147113j59146
$$ 5712854 5898245 5325134 5144816 7980830 11901935 12351530 9353813 7206700 7047554
35680G047554j218367k358549Q57100M969825L639161r90075j256071L126041
$$ 7047554 5829187 3470638 4327738 9297563 12936724 11946649 10690578 13816619
35672A3816619M632342N89036k888099j388700J523393J417746m54134j110521
$$ 13816619 18448961 19037997 16149898 14761198 16284591 17702337 17248203 16137682
35664A6137682r01781j227825j296293j9553J853679L239861L735632K616661
$$ 16137682 15235901 14008076 12711783 12692230 14545909 17785770 21521402 24138063
35656B4138063j77098k232263j332925O31329L29791j490157j776556j158715
$$ 24138063 23960965 21728702 20395777 21027106 21356897 19866740 18090184 16931469
35648A6931469k508828m477431k905416J534165L778383K695417K098942K862945
$$ 16931469 14422641 9945210 7039794 8573959 12352342 15047759 17146701 20009646
35640B0009646J331874k948354n098949k707229O83668J915756J871299J220749
$$ 20009646 21341520 18393166 13294217 10586988 11270656 13186412 15057711 16278460
35632A6278460r12007k579977l87759L314763K389952k375083l401459N98194
$$ 16278460 15366453 12786476 12398717 15713480 18103432 15728349 12326890 12925084
35624A2925084J815666k590134m559300P35528N518002K341810l165414k233860
$$ 12925084 14740750 12150616 7591316 8326844 13844846 16186656 13021242 10787382
35616A0787382K457172K908381n973J5236J918157r5198m128797k603728M248317
$$ 10787382 13244554 16152935 16146962 16162198 18080355 17985157 13856360 11252632 15500949
35607A5500949P761661M133870j149605l168470l333446l794391l476485j591740
$$ 15500949 23262610 27396480 26246875 23078405 19744959 15950568 12474083 10882343
35599A0882343N73526K397766L820600L182655J95882q65022K757788N447834
$$ 10882343 11455869 13853635 17674235 20856890 21052772 20187750 22945538 28393372
35591B8393372M87476p666437q131294l83263M481104J213237j957001K106982
$$ 28393372 28880848 21214411 13083117 12699854 17180958 18394195 16437194 18544176
35583A8544176P372599M667556l570317p306395l517938J447568K344334O95522
$$ 18544176 25916775 30584331 27014014 19707619 16189681 17637249 19981583 20677105
35575B0677105q1798L93720P87579P85868R41532J402590J619924P90775j199079
$$ 20677105 20595307 20989027 21776606 22562474 23504006 24906596 26526520 27317295 26118216
35566B6118216k956415k617232k86000J592069J074590q69619j554563K18854
$$ 26118216 23161801 20544569 20258569 21850638 22925228 22055609 20501046 20719900
35558B0719900K604421K457918r87312m385621l599601R42106M249589L080317
$$ 20719900 23324321 25782239 24794927 20409306 16809705 17751811 22001400 25081717
35550B5081717j99625j628282p22578Q02027K401054L496462J700324l547560
$$ 25081717 24882092 23253810 22531232 23333259 25734313 29230775 30931099 27383539
35542B7383539p713455o186243j061864J712250N76992j190312j885546k448048
$$ 27383539 19670084 13483841 12421977 14134227 14711219 13520907 11635361 9187313
35534I187313j824124K258100P325763P410294J920064k621020j870772R48363
$$ 9187313 7363189 9621289 16947052 24357346 26277410 23656390 21785618 22733981
35526B2733981J672396J503957K734588L162896N5529l659794k896265J356736
$$ 22733981 24406377 25910334 28644922 31807818 31863347 28203553 25307288 26664024
35518B6664024K686922j591179o355676n429977M02901M573106K966493j401132
$$ 26664024 29350946 27759767 21404091 15974114 16377015 20950121 23916614 22515482
35510B2515482k740167K48616L704155M555133L887904L480299K480433p1411
$$ 22515482 19775315 20023931 23728086 28283219 32171123 35651422 38131855 38060444
35502C8060444k341844k370339j220105m57056P22010K382952J393055l071995
$$ 38060444 35718600 33348261 32128156 31671100 32393110 34776062 36169117 33097122
35494C3097122n112729K20511P531193P299673J71639l792364l73232L640292
$$ 33097122 27984393 28204904 35736097 43035770 43207409 39415045 39041813 42682105
35486D2682105K556253l05210p43024j038392l549377m382772l29951L712222
$$ 42682105 45238358 44933148 44190124 43151732 39602355 35219583 34889632 38601854
35478C8601854J692870l495589m402511n52930J904754M99527q45273O58877K709421
$$ 38601854 40294724 36799135 32396624 31843694 33748448 34247975 33402702 34061579 36771000
35469C6771000K651414J449939J337086K485865L125162J390429k605343n307099
$$ 36771000 39422414 40872353 42209439 44695304 47820466 49210895 46605552 41298453
35461D1298453k340216N051233Q868337L662603n009858o560126P62380P402010
$$ 41298453 38958237 44009470 52877807 56540410 51530552 44970426 45732806 53134816
35453E3134816N071185l029152p324870l937718K004845L994050J591400q18162
$$ 53134816 58206001 55176849 47851979 43914261 45919106 49913156 51504556 50686394
35445E0686394o21205L03678l08238j038640P05322L724622M247201J851111M1281
$$ 50686394 50065189 50368867 50060629 49021989 49727311 53451933 57699134 59550245 59591526
35436E9591526J35357q41980m071121n476401k116232J975169J425005j850296
$$ 59591526 59726883 58884903 54813782 49337381 47221149 49196318 50621323 48771027
35428D8771027j729279J788692K245911k424490n545115j725135M042691K937947
$$ 48771027 47041748 48830440 51076351 48651861 43106746 41381611 45424302 48362249
35420D8362249m631249q954103m416972K963134M518835Q68349n53488K457424
$$ 48362249 43731000 34776897 30359925 33323059 37841894 38710243 38156755 40614179
35412D0614179M382207K224352P23348L394882N041989O144o876504o348696N48567
$$ 40614179 44996386 47220738 47944086 51338968 56380957 56387101 49510597 43161901 43710468
35403D3710468L610083n16052l641238j58963M019489K156571k106864j794864
$$ 43710468 47320551 46804499 43163261 43004298 47023787 49180358 47073494 45278630
35395D5278630J402864Q21295l315150m473688p16748K867322K663065Q27705
$$ 45278630 46681494 47502789 44187639 39713951 38997203 41864525 44527590 45355295
35387D5355295K13920L70138l4392p30107r39279l27463J220976K592131J303371
$$ 45355295 45569215 45939353 45904961 45174854 44235575 43908112 45129088 47721219 49024590
35378D9024590k940913o132686m659243n10519J762275J530602J469947K141938
$$ 49024590 46083677 39950991 35291748 34781229 36543504 38074106 39544053 41685991
35370D1685991J850332P67878M45417M223k380245m830940l676465J70450J843021
$$ 41685991 43536323 44304201 44749618 44753841 42373596 37542656 33866191 34036641 35879662
35361C5879662j75454k284046j846244k69562P38969J333253J061304j083587
$$ 35879662 35704208 33420162 31573918 31304356 32043325 33376578 34437882 33354295
35353C3354295l026138q08274M858555P719607L934573k776283o175282m590724
$$ 33354295 30328157 29519883 34378438 42098045 46032618 43256335 37081053 32490329
35345C2490329r71946J385698J289682j57877p03776J95824J41739k188237l386328
$$ 32490329 31518383 32904081 34193763 34035886 33332110 33527934 33669673 31481436 28095108
35336B8095108O3553M859621M420989q92826l828487j516779N94153j323448l004218
$$ 28095108 28158661 33018282 37439271 36546445 32717958 31201179 31795332 30471884 27467666
35327B7467666j46157L431867J838960l096971m580922q63621L368204M287796
$$ 27467666 27321509 30753376 32592336 29495365 24914443 24050822 27419026 31706822
35319C1706822K590236L81436j527576l063925m118772m227516k190427K219313
$$ 31706822 34297058 34678494 33150918 30086993 25968221 21740705 19550278 21769591
35311B1769591N576393L297248l524054p748836n206677n341K241256J999355
$$ 21769591 27345984 30643232 27119178 19370342 14163665 14158324 16399580 18398935
35303A8398935K436281K830976Q88729j614459j435822J07081n61937k708432
$$ 18398935 20835216 23666192 24554921 22940462 21504640 21611721 21049784 18341352
35295A8341352k658816l01734J375403J960898L080357L361176K05998m013582
$$ 18341352 15682536 15380802 16756205 18717103 21797460 25158636 25364634 21351052
35287B1351052m178341r82688m32441l773799m940077m16707M832969M892565
$$ 21351052 17172711 16190023 15757582 11983783 7043706 6626999 11459968 16352533
35279A6352533J092208j371973r43300L03286J186322K002521K439781J963006
$$ 16352533 17444741 16072768 15129468 15432754 16619076 18621597 21061378 23024384
35271B3024384R68952l22079k307014l872676k378869K239019N768417M456742
$$ 23024384 23993336 23671257 21364243 17491567 15112698 17351717 23120134 27576876
35263B7576876l35578m127124m274865j446801J901706L009243P09927k782246
$$ 27576876 27241298 23114174 18839309 17392508 19294214 22303457 23013384 20231138
35255B0231138l897710k333035j090147j262163m71645K027682K986735O09267
$$ 20231138 16333428 14000393 12910246 11648083 11176438 13204120 16190855 16800122
35247A6800122j716952p51755J228664P59595m23562J303809M125192K966483
$$ 16800122 15083170 14331415 15560079 16319674 15896112 17199921 21325113 24291596
35239B4291596j804532m130461j443997J619517O43534k290682k709132n13557
$$ 24291596 22487064 18356603 16912606 18532123 19175657 16884975 14175843 13662286
35231A3662286R07108K24002o99131n71645o30570k204004m015300l153245J346103
$$ 13662286 14569394 14793396 14094265 13522620 12892050 10688046 6672746 3519501 4865604
35222D865604O553423Q050333M501232q92401l932046l500432j449675K57898
$$ 4865604 11419027 19469360 23970592 23078191 19146145 15645713 14196038 14453936
35214A4453936Q15288m2839j916066l163900k172402N32365K535884K017820p00123
$$ 14453936 15269224 15226385 13310319 10146419 7974017 8506382 11042266 13060086 12359963
35205A2359963l708861m850710l171130k5853J906717J626618R42582J671464
$$ 12359963 8651102 3800392 629262 603409 2510126 4136744 5079326 6750790
35197F750790K993799K940069J193028j128021l045942l426602r92317L023341
$$ 6750790 9744589 12684658 13877686 12749665 9703723 6277121 5284804 8308145
35189H308145M240560L94422m355103m215704K31109L180761K212954O82601R32914
$$ 8308145 12548705 12943127 8588024 4372320 4603429 7784190 9997144 10679745 11612659
35180A1612659N35236k433673n017799l739614j11606J786563J037366j95893
$$ 11612659 12147895 9714222 4696423 956809 845203 2631766 3669132 3473239
35172C473239q86083j880992l143004l247720j691277M16283K091961L364342
$$ 3473239 2587156 706164 -2436840 -5684560 -7375837 -6959554 -4867593 -1503251
35164a503251M314341M411345L109596P33677j234317j146414O73109J387673
$$ -1503251 2811090 7222435 10332031 11065708 9831391 8684977 9358086 10745759
35156A0745759r85933m086451l701184Q8893K543978J132571q81709o2492J463294
$$ 10745759 9759826 5673375 1972191 2061084 4605062 5737633 4855924 4793432 6256726
35147F256726k70552l885384l935482R97265N823010N638385J653557j307606
$$ 6256726 5986174 2100790 -1834692 -837427 4985583 10623968 12277525 10969919
35139A0969919r89986P71612J622152J443964J117200K25012k218814m963505
$$ 10969919 9979933 10751545 12373697 13817661 14934861 15159873 12941059 7977554
35131G977554m751945r11250K150182L4134m814266n251812Q15222O844214O146698
$$ 7977554 3225609 2314359 4464541 4498675 -315591 -5567403 -4752181 2092033 8238731
35122H238731N84164k779431j508372P7940j791826m995892m864112l69516M901180
$$ 8238731 8822895 6043464 4535092 4613032 2821206 -2174686 -7038798 -7408314 -2507134
35113b507134P006269N321030J880867j694219n150601p479361o224637j028131
$$ -2507134 4499135 9820165 11701032 10006813 4856212 -2623149 -8847786 -9875917
35105i875917L875785M136541J468846J162994L475175K894640k322663n801551
$$ -9875917 -6000132 -1863591 -394745 768249 4243424 7138064 4815401 -986150
35097i86150k317031L472946L417472k032072m736990r36575M073915M407549
$$ -986150 -3303181 169765 3587237 1555165 -3181825 -4118400 -44485 4363064
35089D363064J384315K91993K689304M852634K816549k731816o707920m918940
$$ 4363064 5747379 6039372 8728676 13581310 16397859 13666043 6958123 2039183
35081B039183Q31396M350540K544267r25000j215228J062841J850569K03370j102983
$$ 2039183 2870579 7221119 9765386 8840386 7625158 8687999 10538568 10741938 9638955
35072I638955n74901L02066K94061M8340K53215O85610R93694M41447k077211
$$ 9638955 9064054 9366120 9660181 9708521 9961736 10647346 11641040 12082487 10005276
35063A0005276n399499n247736M46847O809939O921883Q76200m348203l937413
$$ 10005276 4605777 -641959 -195112 6614827 13536710 14412910 10064707 6127294
35055F127294J06061L525248M539497L096790m01941l949542m701295k469491
$$ 6127294 6233355 9758603 14298100 17394890 16992949 13043407 8342112 5872621
35047E872621n9591O84651O56967P92105L87364j047908k624463l414936l089257
$$ 5872621 5813030 6497681 7154648 7946753 8334117 7286209 4661746 1246810 -1842447
35038a842447j307339J462081L107257K269168P25431P55371J406159N29228r97453
$$ -1842447 -3149786 -1687705 1419552 3688720 4414151 5169522 6575681 7104909 6107456
35029F107456q76459K74258M06224K78079J478508J970486p58162l644992j727987
$$ 6107456 5230997 5505255 5911479 6189558 7668066 9638552 8880390 5235398 3507411
35020C507411L082105M160500Q29979r65059Q77098J912483M43200O50922L510600
$$ 3507411 6589516 10750016 11579995 10614936 11492034 13404517 13847717 14498639 18009239
35011A8009239L369059j969984n839810k965671J900930J855776j544490k211301
$$ 18009239 21378298 19408314 13568504 10602833 12503763 14359539 12815049 10603748
35003A0603748M54632K019441M63497k288043m024306l550219r08806J088846
$$ 10603748 11058380 13077821 13541318 11253275 7228969 3678750 2769944 3858790
34995C858790p42665m034440k597819L552136O573585K686038j778125j096413
$$ 3858790 3116125 -918315 -3516134 36002 6609587 9295625 7517500 6421087
34987F421087Q36548j254720m115803k257724J946275K875650J224321O76357
$$ 6421087 7257635 6002915 1887112 -370612 1575663 4451313 5675634 6351991
34979F351991L5394k769430l847037J89738L710770J99514n422292l816440K907987
$$ 6351991 6387385 3617955 -229082 -39344 3671426 3870940 -1551352 -5367792 -2459805
34970b459805M643670M48431r21627K632968L258600j688552m169378N09626N560352
$$ -2459805 2183865 2632296 1710669 4343637 7602237 5913685 1744307 2253933 7814285
34961G814285M280586K37477m00431J097683K49914k258471k628493l88980J961152
$$ 7814285 12094871 12332348 11931917 13029600 13279514 11021043 8392550 8003570 9964722
34952I964722K613946P23252l472578o658476m712544J065541M364804K267719
$$ 9964722 12578668 13301920 9829342 3170866 -1541678 -476137 3888667 6156386
34944F156386j342874k334160j253940J8940J333847J963677K95953k228025j877528
$$ 6156386 4813512 2479352 1225412 1244352 2578199 4541876 4837829 2609804 732276
34935G32276J001908J773142o86181j859672O42574L274110L021135J640740P21841
$$ 732276 1734184 3507326 2821145 961473 1604047 4878157 7899292 9540032 10261873
34926A0261873j278282l975669l411302Q39841L113640L54499k664065j378247
$$ 10261873 8983591 5007922 1596620 2436461 5550101 5904600 3240535 1862288
34918A862288J258772P93145r09895J11548K408780K121905L7353l67337O85394
$$ 1862288 3121060 3914205 3004310 3115858 5524638 7646543 7683896 7316559 8001953
34909H001953L49127j395084k173631j389278K779J876233L554479K522463j771986
$$ 8001953 8351080 6955996 4782365 3393087 3395866 5272099 8826578 11349041 9577055
34900I577055n216523l852801O47463L557475L046913P52577j249433j473172
$$ 9577055 4360532 507731 1155194 4712669 7759582 8512159 7262726 5789554
34892E789554M88591K386333J112456k280056l089587q6991K490386J924950N98941
$$ 5789554 6278145 8664478 9776934 7496878 4407291 4320300 6810686 8735636 9334577
34883I334577K98188r01747l116615k818907j41130m59729m158300l432690M301431
$$ 9334577 9632765 8731018 5614403 2795496 2654366 2194637 -1963663 -5396353 -1094922
34874a094922Q949754K617618o459048o022939J135189L203667o31084p85709
$$ -1094922 7854832 10472450 4013402 -2009537 -874348 2329319 1698235 912526
34866I12526M358491N796417M50648l730586k157015k78462j765353j986770J291005
$$ 912526 5271017 11067434 11518082 7787496 5630481 5352019 3586666 1599896 2890901
34857B890901J822980l638230p632195l785693K077934J614561k128610n25695
$$ 2890901 4713881 1075651 -6556544 -10342237 -8264303 -6649742 -8778352 -9304047
34849i304047N609964P430496K500976k122803j553649Q46836Q86699k26099r7258
$$ -9304047 -3694083 3736413 6237389 4114586 2560937 3407773 4294472 4068373 3971115
34840C971115J43721q80965j067794J397233L461726J084837l680979m386065
$$ 3971115 4114836 3233871 2166077 3563310 7025036 8109873 4428894 42829
34832D2829O08545N162163L703822j182842l061948r28575N81600o90557j527814
$$ 42829 651374 5813537 9517359 8334517 5272569 4343994 4925594 4235037 2707223
34823B707223L94103K370375J390365j002514j818019j459684j966863k852628
$$ 2707223 3101326 5471701 6862066 5859552 4041533 2581849 614986 -2237642
34815b237642k211789j79125J766563L122882L309534P97203l532097m948117
$$ -2237642 -4449431 -4628556 -2861993 260889 3570423 4367626 835529 -4112588
34807d112588p85834M674741N603462K569313L18012m3643q72006j681009L30819
$$ -4112588 -4898422 -223681 5379781 7949094 8267106 8223463 7351457 5670448 6001267
34798F001267L698281L265759j574077n111417l572654n4108Q69037r56443k954648
$$ 6001267 9699548 12965307 11391230 6279813 2707159 2653051 3522088 2565645 -389003
34789c89003l609699k408431O85314L639704L143904j017621m720517m283591
$$ -389003 -3998702 -6407133 -5721819 -2082115 1061789 44168 -4676349 -8959940
34781h959940o27204K405258K167633q29270l358833j981903K985246O663090
$$ -8959940 -9587144 -7181886 -5014253 -5843523 -9202356 -11184259 -8199013 -1535923
34773a535923N056575K10278k852517k771046j781923o98696J265975K665221
$$ -1535923 3520652 3730930 878413 -1892633 -3674556 -4373252 -3107277 -442056
34765d42056J136020j622993j446674J559841L115223J841089P05794Q62226l3905
$$ -442056 693964 -929029 -2375703 -815862 2299361 4140450 4846244 5708470 5674565
34756E674565k203588k422088o2625J213499k73677j767959j654983j628798j453600
$$ 5674565 3470977 1048889 986264 2199763 1926086 158127 -1496856 -3125654 -4579254
34747d579254J776329O481456N862647j626164p810712n825782M23715L319872
$$ -4579254 -2802925 3678531 9541178 7915014 104302 -5721480 -5297765 -1977893
34739a977893K353190J591306J320921o29684k718356j829291P03323J262165
$$ -1977893 375297 1966603 3287524 2657840 -60516 -1889807 -1186484 75681
34731G5681L2769m69971m39401r11961K24346M332516P001093L666544k130212
$$ 75681 108450 -361521 -800922 -1712883 -1488537 2843979 9845072 13511616 11381404
34722A1381404l362936m64159K42493k212899k533750L51844R77541k546026m640116
$$ 11381404 8018468 7554309 7796802 5583903 3050153 3401997 4379538 1833512 -2806604
34713b806604j768515J815864J947943J160646K413408K601687j413261n411713
$$ -2806604 -4575119 -2759255 -811312 349334 2762742 5364429 3951168 -1460545
34705a460545l662411J251448K016997j757409l175557N50745L703072J246834
$$ -1460545 -5122956 -3871508 -1854511 -3611920 -6787477 -6236732 -2533660 -1286826
34697a286826l600329m594822j089302K572122L625360K904934J765550O57250
$$ -1286826 -4887155 -9481977 -10571279 -7999157 -4373797 -1468863 296687 953937
34689I53937K35052P88805P94018j141792l136748k036477J320840K592611O66442
$$ 953937 1188989 1977794 2771812 1630020 -1506728 -3543205 -2222365 370246 1036688
34680A036688k72880K260425M158816R31187m298732m445862J123921N426105
$$ 1036688 763808 3024233 7183049 8114236 3815504 -630358 493563 5919668
34672E919668L445051k120757n869460n908843l302950N08529L340274K841243
$$ 5919668 9364719 7243962 1374502 -4534341 -7837291 -7328762 -3988488 -1147245
34664a147245L0605q32437J556196K718230j097509o585388p518565l111449J919862
$$ -1147245 -1116640 -1949077 -392881 2325349 1227840 -5357548 -12876113 -15987562 -14067700
34655a4067700M291686M781042M388669K384014p58927k060630J71563L161653
$$ -14067700 -9776014 -4994972 -606303 1777711 1018784 -1041846 -870283 2291370
34647B291370K498225k202691o074556m338388J614981N169484K485247k401739
$$ 2291370 4789595 2586904 -3487652 -7826040 -6211059 -1041575 1443672 -958067
34639i58067l103505J54376J560039o52754j502904J890035M814568K516373j812181
$$ -958067 -4061572 -3907196 -2347157 -2999911 -4502815 -2612780 2201788 4718161 2905980
34630B905980k244891M16865Q87352j382708k284692j150988j347507k570192
$$ 2905980 661089 1077954 1965306 582598 -1702094 -2853082 -4200589 -6770781
34622f770781j54376N984093Q831870M276613k241385l549842o06329M72251k095385
$$ -6770781 -6925157 -941064 7890806 12167419 9926034 6376192 5769863 6242114 4146729
34613D146729m511772l812748p86300K566720M498253L193627j289653n233216
$$ 4146729 -365043 -4177791 -4964091 -2397371 2100882 5294509 4004856 -1228360
34605a228360m816013j062953J936313K958172L916461M701115K603293k100476
$$ -1228360 -6044373 -7107326 -5171013 -2212841 1703620 6404735 9008028 6907552
34597F907552m665873k314625J505052K009558o97689l103344l442795k367321
$$ 6907552 2241679 -72946 1432106 3441664 2743975 -359369 -3802164 -6169485
34589f169485n41122J368661J981112J230714J231002K462028J787514k156481
$$ -6169485 -6710607 -5341946 -3360834 -2130120 -899118 1562910 3350424 1193943
34581A193943m693929j323650M360049N232410J361530j047416m23944j100790
$$ 1193943 -3499986 -4823636 -463587 4768823 6130353 5082937 4658993 3558203
34573C558203l509946k654009J452575J900243k497122l184856L272821O993938
$$ 3558203 48257 -2605752 -1153177 747066 -1750056 -4934912 -1662091 5331847
34565E331847N82156o783872l254240N658150N691858k577375n197466J612343
$$ 5331847 5914003 -869869 -4124109 1534041 7225899 4648524 -548942 1063401
34557A063401O216372J952580l187819k214032l0611j644593k215383K430690
$$ 1063401 7279773 9232353 6044534 3830502 3799891 2155298 -60085 2370605
34549B370605O046891K328946l606728l807251l93930k41236k754777k652259
$$ 2370605 8417496 10746442 7139714 3332463 2938533 2697297 -57480 -2709739
34541b709739k04155O30806M83677K216121L660583J185630k492564k291090K30008
$$ -2709739 -2913894 -2283088 -1799411 416710 4077293 5262923 2770359 479269 709277
34532G09277n2369k408495k201582R2615K32454j335316p79794J006012J48662
$$ 709277 656908 -1751587 -3953169 -3860554 -3628100 -4963416 -5743210 -4737198 -4588536
34523d588536j761977P2459L790367K629119l211515n734414j528269L555023
$$ -4588536 -6350513 -6278054 -2487687 141432 -3070083 -8804497 -10332766 -6777743
34515f777743M043700J429678r64845k537827k704030k27234K882876K969583
$$ -6777743 -2734043 -1304365 -2269210 -4807037 -7511067 -7738301 -4855425 -1885842
34507a885842J340275K655665N934463M837254j517314o050901m504030r56971
$$ -1885842 -545567 2110098 8044561 12881815 11364501 5313600 809570 -147401
34499a47401K77224N10086J057778m26865l796434l934412Q30988M603361L023892
$$ -147401 129823 639909 1697687 1270822 -2525612 -6460024 -5629036 -1025675 1998217
34490A998217p0687o1149J046154J34813o75399O06498M16024l563828o089468
$$ 1998217 1927530 1866381 2912535 3047348 2371949 2978447 3394471 -169357 -6258825
34481f258825k455854K502980J944881j209375M46057N289301N020371q48305
$$ -6258825 -8714679 -6211699 -4266818 -5476193 -5030136 259165 5279536 4431231
34473D431231l555283Q09845N412265L708124j647648m759572m935431m695933
$$ 4431231 875948 1685793 7098058 10806182 9158534 4398962 -536469 -5232402
34465e232402m027808j376535K212274L908651K974035J236265K93894l5114o13576
$$ -5232402 -9260210 -10636745 -8424471 -4515820 -1541785 -305520 -11626 -46740 -660316
34456f60316j273135p50521J185098K213944K27179k386000q19863M409953O373650
$$ -660316 -1933451 -2683972 -1498874 715070 942249 -1443751 -2263614 2146339 8519989
34447H519989J633577l475927j781417L513049L650348k120776o044780m302240
$$ 8519989 10153566 6677639 4896222 8409271 12059619 9938843 3894063 -408177
34439d08177j348792o65532K60423K826753L252223L5236j669650J421993M178130
$$ -408177 -1756969 -2422501 -2162078 664675 3916898 3952134 2282484 3704477 7882607
34430G882607J416246k874091k287742P15540p22786n198612m967556L47229K569094
$$ 7882607 9298853 6424762 4137020 4852560 4129774 -1068838 -6036394 -5689165 -3120071
34421c120071r55611k547344K457233P108808M073788k343792l526750j06141
$$ -3120071 -4075682 -6623026 -4165793 2943015 7016803 4673011 1146261 1040120
34413A040120R58862r13326j19686L540631L487527k158810o594029m785921m92624
$$ 1040120 1998982 1085656 965970 4506601 7994128 5835318 -758711 -5544632 -6037256
34404f037256R35486M03814J221010K580341J870974j95761j301029j464211j484081
$$ -6037256 -5101770 -4697956 -3476946 -896605 974369 778608 -522421 -1986632 -3470713
34395c470713m04418J858521K550956N76735l72659K454222N227196K747629l173808
$$ -3470713 -3875131 -2016610 534346 1111081 738422 3192644 8419840 11167469 7993661
34386G993661o000465l584982J34294J503686M97634j460116k713619j329983
$$ 7993661 1993196 -1591786 -1457492 46194 543828 -916288 -3629907 -4959890
34378d959890K243575L878732J067051k474880j963346J062653J806638K99700
$$ -4959890 -2716315 1162417 2229468 -245412 -2208758 -1146105 660533 960233
34370I60233J90664J380184Q04010p31925J01494J782025j32965l883912k988444
$$ 960233 1150897 2531081 3335091 2603166 2704660 4486685 4353720 469808 -2518636
34361b518636K245060L817402r61518m645234j810984K336385J017123l347979
$$ -2518636 -273576 3543826 2582308 -2062926 -3873910 -1537525 -520402 -3868381
34353c868381l744707Q64880N430291O035229K754855j952697m563721l161604
$$ -3868381 -7613088 -6748208 -1317917 4717312 7472167 5519470 955749 -2205855
34345b205855p45027j988267n515066m927471Q52786N113291L930852J709594
$$ -2205855 -2950882 -4939149 -10454215 -15381686 -14528900 -9415609 -5484757 -3775163
34337c775163K205055J943913j805608m089988m79054M169465L083204j468320
$$ -3775163 -1570108 373805 -1431803 -5521791 -6000845 -1831380 1251824 -216496
34329b16496k727894o36392n6615j125395J15248L405391M343456J721505j550825
$$ -216496 -2944390 -3580782 -3637397 -4762792 -4647544 -1242153 3101303 4822808 3271983
34320C271983l506957l748287j370390K442946L025343q97796l092805Q71016
$$ 3271983 -234974 -3983261 -5353651 -2910705 114638 -783158 -3875963 -3004947
34312c004947N143695K661636k319457j094776M050468L429133l002676n338461
$$ -3004947 2138748 4800384 2480927 1386151 5436619 8865752 5863076 524615
34304E24615q29181J969028j212984l408535J46872L309282M48084l294884j031889
$$ 524615 -304566 1664462 451478 -2957057 -2810185 499097 947181 -2347703 -3379592
34295c379592M308740N533747K416109l12391j517007k897100l395639j312752
$$ -3379592 929148 6462895 8879004 8566613 7049606 4152506 756867 -555885
34287e55885Q58211O5942j335596N85752L759157K827847j772494l885149q78742
$$ -555885 302326 368268 -967328 -381576 3377581 6205428 4432934 547785 -330957
34278c30957K870594K832126L0445j786953j286786J9004L55604p56195k305561
$$ -330957 2539637 5371763 5402208 3615255 2328469 2347473 2703077 1946882 -358679
34269c58679k490349n95506J761754K402332J406046P33715J166923J400851N43907
$$ -358679 -2849028 -3444534 -1682780 719552 2125598 2859313 4026236 5427087 5970994
34260E970994l54086l68869o87387k607392m494889l408877Q4228J780586r7110
$$ 5970994 5616908 5248039 4560652 1953260 -2541629 -5950506 -5866278 -4085692 -4182802
34251d182802j882844j89625K492907K132221L36621J284288L288313J078520
$$ -4182802 -6065646 -6255271 -3762364 -1630143 -1293522 -9234 3279079 4357599
34243D357599l692438l262081K956587N732515J036781k476205J812451O105086
$$ 4357599 665161 -2596920 359667 6092182 7128963 4652758 6465209 12570295
34235A2570295R03729p917216p687405N61541M258824l50410m266001k284174
$$ 12570295 13474024 5556808 -2130597 -1569056 2689768 2339358 -1926643 -4210817
34227d210817L92448K66187J100309L610094J999841m075709n666934R95694O784355
$$ -4210817 -3818369 -3552182 -2451873 1158221 3158062 -917647 -6584581 -5588887 1195468
34218A195468L813484k314506k768958M84178L32538k550127k336719R57065K321974
$$ 1195468 5008952 2694446 -74512 409666 742204 -1807923 -4144642 -3187577 -865603
34209h65603N99987j264306k141079k307044k79655L752360N077973J367222j901497
$$ -865603 -265616 -1529922 -3671001 -5978045 -6257700 -2505340 2572633 3939855 2038358
34200B038358J00327K501822j320876p105929n314116L139360P737216M458338
$$ 2038358 2138685 4640507 3319631 -3786298 -9100414 -5961054 1776162 6234500
34192F234500K09929l2107K5228k721317m248310j200233K316648J542334r73369
$$ 6234500 6444429 6412322 6437550 3716233 -532077 -1732310 584338 2126672 1153303
34183A153303k30374K465386J862002k242651m344474j648301J591682N6727m904010
$$ 1153303 922929 3388315 5250317 3007666 -1336808 -2985109 -1393427 -1336700 -6240710
34174f240710o382690q50648O416244P247414J038470m398069l370268N80837
$$ -6240710 -12623400 -13474048 -7057804 189610 1228080 -3169989 -6540257 -5959420
34166e959420J032218j831203k901624p39085J252638J305252J326153K235185
$$ -5959420 -4927202 -6758405 -9660029 -10399114 -9146476 -7841224 -6515071 -4279886
34158d279886K343042J208753N43723K93318j634574m371178l529021J968665
$$ -4279886 -1936844 -728091 -184368 108950 -1525624 -5896802 -9425823 -7457158
34150g457158O636025N254012o1815l092669j755546M85234M88859q00819r84107
$$ -7457158 -821133 4432879 4371064 1278395 -477151 8083 496942 -303877 -1287984
34141a287984J2737M41801n9424J77157J749675K317565m7791k782232j637018
$$ -1287984 -1275247 -833446 -892870 -715713 1033962 3351527 3303736 521504 -1115514
34132a115514K260389K785172j672994m249390J93996N416185J768693q209486
$$ -1115514 1144875 3930047 2257053 -1992337 -1798341 3617844 5386537 -2822949
34124b822949j1147581j383387J0206170J0569961J400286m844381k174719L176421
$$ -2822949 -13970530 -15353917 -5147747 5422214 6822500 1978119 -196600 2979821
34116B979821L805892Q65032k03451J042098M3292m522685p374860l679028L400510
$$ 2979821 6785713 7650745 7447294 8489392 8532684 4009999 -3364861 -7043889 -3643379
34107c643379N966037J656530l341059k835212J468196L413206R68012k458934
$$ -3643379 2322658 3979188 638129 -2197083 -728887 2684319 3652331 1193397
34099A193397l687425k639208j98639K647175L469978L83216l855702l840085
$$ 1193397 -2494028 -5133236 -5331875 -2684700 785278 1168494 -2687208 -6527293
34091f527293Q63114M042688J222293l773598m036127J027344N397614M572256
$$ -6527293 -5664179 -1621491 -399198 -4172796 -8208923 -7181579 -1783965 2788291
34083B788291L49401k704614k591363o10567J280330K259717K339804J425776
$$ 2788291 3137692 433078 -2158285 -2768852 -1488522 771195 3110999 4536775
34075D536775p36668l527966m904468l085183Q41066L308656K364099K94040N34433
$$ 4536775 3800107 272141 -4632327 -7717510 -6876444 -3567788 -1203689 -909649 -375216
34066c75216K675347K921091j66785l054087k127796Q54266J188389j729187l427543
$$ -375216 2300131 5221222 5054437 2000350 -127446 726820 1915209 186022 -3241521
34057c241521j152040J982203J820011q03425k062997j080266o1550K10052Q32858
$$ -3241521 -4393561 -2411358 -591347 -1394772 -3457769 -4538035 -4599585 -4389533 -3556675
34048c556675J299981L8038j482189k3327L202623K918986j638737m094037m13215
$$ -3556675 -2256694 -2218656 -3700845 -3724172 -521549 2397437 758700 -3335337 -3748552
34039c748552M148779K734504k488273l737716O04364M434673L780632J658482
$$ -3748552 400227 3134731 646458 -3091258 -2486894 1947779 5728411 7386893
34031G386893J607971J927276n61290m555755n615882k111534K731308M581737
$$ 7386893 8994864 10922140 10360850 5805095 189213 -1922321 808987 5390724
34023E390724K458486q21278k124799j151202N15139K330258M343235M306001
$$ 5390724 7849210 7027932 4903133 3751931 4267070 6597328 10940563 15246564
34015A5246564o68955q182891j0814192n525673J227422K166213o86463k55659
$$ 15246564 14577609 6394718 -4419474 -9945147 -8717725 -6551512 -7237975 -7493634
34007g493634M010523N871744K624888j532806l016631k907982k097848Q86359
$$ -7493634 -3483111 2388633 5013521 3480715 464084 -2443898 -4541746 -3655387
33999c655387M729297M426250q72006m783851k709498J259454J426105l65287
$$ -3655387 1073910 5500160 4628154 -155697 -2865195 -1605741 -179636 -544923
33991e44923R49635L896772K787756j736473k690181J808334M726483R11625m637567
$$ -544923 404712 4301484 7089240 5352767 2662586 4470920 9197403 10109028 5471461
33982E471461m224398J202129M077241J385279k265668k455551k47462J446928
$$ 5471461 1247063 2449192 6526433 7911712 5646044 3190493 2943031 4389959
33974D389959J849459O79705k838364o505407n269195J081727M716029R019o665477
$$ 4389959 6239418 6919123 4080759 -2424648 -7693843 -6612116 -1896087 -1887068 -8552545
33965h552545n049138L230534O409934M90040m912669k069812L465305L337596
$$ -8552545 -13601683 -10371149 -3961215 -3471175 -8383844 -10453656 -6988351 -3650755
33957c650755k94013n51555J579521N55119k125569m95894L723210K665189l713171
$$ -3650755 -3944768 -4496323 -2916802 -2361683 -4487252 -4983146 -1259936 1405253 -2307918
33948b307918n961636Q6058O493920N330114m47405l294831j850378J07983O88042
$$ -2307918 -8269554 -8183496 -1689576 3640538 3193133 -101698 -1952076 -1844093 -1156051
33939a156051N52739r0049p77347J53751K360973K422466p88009l077236r63270
$$ -1156051 -603312 -693361 -1470708 -1316957 1044016 3466482 2678473 -398763 -1362033
33930a362033K551555K415263r81834l150483k301400m34930R47228J986672K094716
$$ -1362033 1189522 3604785 2622951 -527532 -2828932 -3263862 -2316634 -329962 1764754
33921A764754L30453k009817k418153q03108O31477J080043K012935L946617M691851
$$ 1764754 2095207 85390 -2332763 -3135871 -2504394 -1424351 588584 4535201 9227052
33912I227052K026071k941125o153815m610747J20034L167796J930326p58571
$$ 9227052 11253123 8311998 2158183 -2452564 -2332530 835266 2765592 2007021
33904B007021q76092O90359k33438l718358m580783j91332M869966M942223Q17835
$$ 2007021 1130929 1821288 1587850 -2130508 -6711291 -6902623 -2032657 2909566 3727401
33895C727401k329682k201441q65964m34343q34819j422483j901429j688173m42535
$$ 3727401 1397719 -803722 -1669686 -2104029 -2938848 -4361331 -6262760 -7950933 -8393468
33886h393468R49348J497739J661031K302825K898138K381516J058314J08703
$$ -8393468 -7444120 -5946381 -4285350 -1982525 915613 3297129 4355443 4464146
33878D464146j93257m07414p75028j372907k565829m008853m062869j602130K216242
$$ 4464146 4270889 3863475 3088447 1715540 -850289 -4859142 -8922011 -10524141 -8307899
33869h307899N093413N776364M221609P69217l418021n973467n071008j462462
$$ -8307899 -3214486 2561878 6783487 7552704 4134683 -1838784 -6909792 -8372254
33861h372254K172136L700122K829211O43710j164186r93507J493461M364314
$$ -8372254 -6200118 -2499996 329215 972925 -191261 -1184768 308693 4673007
33853D673007M298431j07753n393558n456585R62522O562303L565340m797081
$$ 4673007 8971438 8863685 3470127 -1986458 -1023936 5538367 9103707 4306626
33845D306626p095506O4981O145117K205343n214239m643920J792764K508237
$$ 4306626 -2788880 -2723899 3421218 5626561 412322 -4231598 -2438834 69403
33837F9403l697775n936358l80748L319070n28095l540408J376480O709419L303555
$$ 69403 -3628372 -9564730 -9945478 -6626408 -7154503 -10694911 -9318431 -2609012 694543
33828F94543l109146j461771N314970M992174l167751p061872j610245L707201
$$ 694543 -2414603 -3876374 1438596 6430770 3263019 -3798853 -5409098 -1701897
33820a701897Q29445m789839l980627K536016O920870N339035N53717l254227
$$ -1701897 -872452 -5662291 -9642918 -7106902 -186032 5153003 5706720 2452493
$$ [...]
##END NTUPLES=NMR SPECTRUM
##END=
