##TITLE=31Pdec_6BnP0706
 CDCl3, 24 sc
 9.6.2022
##JCAMPDX= 6.0         $$ Bruker NMR JCAMP-DX V2.0
##DATA TYPE= NMR SPECTRUM
##DATA CLASS= NTUPLES
##ORIGIN= UXNMR, Bruker Analytische Messtechnik GmbH
##OWNER= root
$$ XWIN-NMR		Version 3.5
$$ Thu Jun  9 13:59:20 2022 Russian Standard Time (UT+4h)  she@DPX200
##.OBSERVE FREQUENCY= 81.013821
##.OBSERVE NUCLEUS= ^31P
##.ACQUISITION MODE= SIMULTANEOUS
##.ACQUISITION SCHEME= undefined
##.AVERAGES= 24
##.DIGITISER RES= 16
##SPECTROMETER/DATA SYSTEM= spect
##.PULSE SEQUENCE= zgpg30
##.SOLVENT NAME= DMSO
##.SHIFT REFERENCE= (INTERNAL, DMSO, 0, 248.564)
##AUDIT TRAIL= $$ (NUMBER, WHEN, WHO, WHERE, WHAT)
$$ ##TITLE= Audit trail, XWIN-NMR		Version 3.5
$$ ##JCAMPDX= 5.01
$$ ##ORIGIN= Bruker BioSpin GmbH
$$ ##OWNER= she
$$ F:/spectra/data/she/nmr/P31/1/pdata/1/auditp.txt
$$ ##AUDIT TRAIL=  $$ (NUMBER, WHEN, WHO, WHERE, WHAT)
(   1,<2022-06-09 13:57:52.45 +0400>,<she>,<DPX200>,
      <created by zg, POWCHK disabled, PULCHK disabled
       configuration hash MD5:
       00 E9 B6 7A A2 85 ED C7 34 08 36 98 17 FE 4E 26
       data hash MD5: 32K
       E4 66 F2 4B 84 CF 6F 68 6B 61 B0 53 1C C7 8A 2C>)
(   2,<2022-06-09 13:58:15.45 +0400>,<she>,<DPX200>,
      <Start of raw data processing
       efp BC_mod = 2 LB = 1 FT_mod = 6 PKNL = 1 PHC0 = -10056.3 PHC1 = -523.5464 SI = 64K 
       data hash MD5: 64K
       36 46 F8 25 90 8C CD F9 D4 90 01 3A 5D 8C 53 2A>)
(   3,<2022-06-09 13:58:48.70 +0400>,<she>,<DPX200>,
      <pk PHC0 = 167.6448 PHC1 = -297.5999 
       data hash MD5: 64K
       CA 62 B0 AB 84 12 8A C6 64 EA AC 83 B5 23 CF 14>)
(   4,<2022-06-09 13:58:52.32 +0400>,<she>,<DPX200>,
      <abs ABSG = 5 
       data hash MD5: 64K
       EE 99 DE E0 B2 20 6C 83 A4 85 92 6A 32 52 0D 5E>)
$$ ##END=
$$ 
$$ hash MD5
$$ 8F D6 57 3A 87 EF 87 25 21 42 6A 11 9A A7 7F 1C
##$RELAX= 
##$RELAX= 
##$RELAX= 
##$RELAX= 
##$RELAX= 
##$RELAX= 
##$RELAX= 
##$RELAX= 
$$ Bruker specific parameters
$$ --------------------------
##$DU= <F:/spectra>
##$EXPNO= 1
##$NAME= <P31>
##$PROCNO= 1
##$TYPE= <nmr>
##$USER= <she>
##$AMP= (0..31)
100 100 100 100 100 100 100 100 100 100 100 100 100 100 100 100 100 100 
100 100 100 100 100 100 100 100 100 100 100 100 100 100 
##$AQSEQ= 0
##$AQ_mod= 1
##$AUNM= <au_zg>
##$AUTOPOS= <>
##$BF1= 81.014009
##$BF2= 200.13
##$BF3= 200.13
##$BF4= 200.13
##$BF5= 200.13
##$BF6= 200.13
##$BF7= 200.13
##$BF8= 200.13
##$BYTORDA= 1
##$CFDGTYP= 0
##$CFRGTYP= 5
##$CHEMSTR= <none>
##$CNST= (0..31)
1 1 145 1 1 1 1 1 1 1 1 1 1 1 1 1 1 1 1 1 1 1 1 1 1 1 1 1 1 1 1 1 
##$CPDPRG= <waltz16>
##$CPDPRG1= <>
##$CPDPRG2= <waltz16>
##$CPDPRG3= <>
##$CPDPRG4= <mlev>
##$CPDPRG5= <mlev>
##$CPDPRG6= <mlev>
##$CPDPRG7= <mlev>
##$CPDPRG8= <mlev>
##$CPDPRGB= <>
##$CPDPRGT= <>
##$D= (0..31)
0 1 0 0 0 0 0 0 0 0 0 0.03 2e-05 3e-06 0 0 0 0 0 0 0 0 0 0 0 0 0 0 0 0 
0 0 
##$DATE= 1654768671
##$DBL= (0..7)
120 120 120 11 120 120 24 19 
##$DBP= (0..7)
150 150 150 150 150 150 150 150 
##$DBP07= 0
##$DBPNAM0= <>
##$DBPNAM1= <>
##$DBPNAM2= <>
$$ [...]
##$SUBNAM3= <"">
##$SUBNAM4= <"">
##$SUBNAM5= <"">
##$SUBNAM6= <"">
##$SUBNAM7= <"">
##$SUBNAM8= <"">
##$SUBNAM9= <"">
##$SW= 501.771253377433
##$SWIBOX= (0..15)
0 1 3 0 0 0 0 0 0 0 0 0 0 0 0 0 
##$SW_h= 40650.406504065
##$TD= 32768
##$TD0= 1
##$TE= 0
##$TE2= 300
##$TE3= 300
##$TEG= 300
##$TL= (0..7)
0 120 53 12 22 120 120 120 
##$TP= (0..7)
150 150 150 150 150 150 150 150 
##$TP07= 0
##$TPNAME0= <>
##$TPNAME1= <>
##$TPNAME2= <>
##$TPNAME3= <>
##$TPNAME4= <>
##$TPNAME5= <>
##$TPNAME6= <>
##$TPNAME7= <>
##$TPOAL= (0..7)
0.5 0.5 0.5 0.5 0.5 0.5 0.5 0.5 
##$TPOFFS= (0..7)
0 0 0 0 0 0 0 0 
##$TUNHIN= 0
##$TUNHOUT= 0
##$TUNXOUT= 0
##$USERA1= <user>
##$USERA2= <user>
##$USERA3= <user>
##$USERA4= <user>
##$USERA5= <user>
##$V9= 5
##$VALIST= <valist>
##$VCLIST= <CCCCCCCCCCCCCCC>
##$VD= 0
##$VDLIST= <DDDDDDDDDDDDDDD>
##$VPLIST= <PPPPPPPPPPPPPPP>
##$VTLIST= <TTTTTTTTTTTTTTT>
##$WBST= 1024
##$WBSW= 4
##$XGAIN= (0..3)
0 0 0 0 
##$XL= 0
##$YL= 0
##$YMAX_a= 2870
##$YMIN_a= -3085
##$ZGOPTNS= <>
##$ZL1= 120
##$ZL2= 120
##$ZL3= 120
##$ZL4= 120
##$ABSF1= 248.5645
##$ABSF2= -253.2056
##$ABSG= 5
##$ABSL= 3
##$ALPHA= 0
##$AQORDER= 0
##$ASSFAC= 0
##$ASSFACI= 0
##$ASSFACX= 0
##$ASSWID= 0
##$AUNMP= <proc_1d>
##$AZFE= 0.1
##$AZFW= 0.5
##$BCFW= 0
##$BC_mod= 2
##$BYTORDP= 0
##$COROFFS= 0
##$CY= -3
##$DATMOD= 1
##$DC= 0
##$DFILT= <>
##$DTYPP= 0
##$F1P= 0
##$F2P= 0
##$FCOR= 1
##$FTSIZE= 65536
##$FT_mod= 6
##$GAMMA= 0
##$GB= 0
##$INTBC= 1
##$INTSCL= 5.30512e-09
##$ISEN= 30
##$LB= 1
##$LEV0= 0
##$LPBIN= 0
##$MAXI= 10000
##$MC2= 0
##$MEAN= 0
##$ME_mod= 0
##$MI= 50
##$NCOEF= 0
##$NC_proc= -7
##$NLEV= 6
##$NOISF1= 182.463
##$NOISF2= 159.3651
##$NSP= 0
##$NTH_PI= 0
##$NZP= 0
##$OFFSET= 248.5645
##$PC= 4
##$PHC0= -9888.655
##$PHC1= -821.1463
##$PH_mod= 1
##$PKNL= yes
##$PPARMOD= 0
##$PSCAL= 0
##$PSIGN= 0
##$REVERSE= no
##$SF= 81.014009
##$SI= 65536
##$SIGF1= 159.3651
##$SIGF2= -187.1042
##$SINO= 113.3802
##$SIOLD= 16384
##$SREGLST= <1H.CDCl3>
##$SSB= 0
##$STSI= 65536
##$STSR= 0
##$SW_p= 40650.406504065
##$SYMM= 0
##$S_DEV= 0
##$TDeff= 32768
##$TDoff= 0
##$TI= <>
##$TILT= no
##$TM1= 0
##$TM2= 0
##$TOPLEV= 0
##$USERP1= <user>
##$USERP2= <user>
##$USERP3= <user>
##$USERP4= <user>
##$USERP5= <user>
##$WDW= 1
##$XDIM= 65536
##$YMAX_p= 410938799
##$YMIN_p= -9760430
$$ End of Bruker specific parameters
$$ ---------------------------------
##NTUPLES= NMR SPECTRUM
##VAR_NAME=  FREQUENCY,     SPECTRUM/REAL,   SPECTRUM/IMAG
##SYMBOL=    X,             R,               I
##VAR_TYPE=  INDEPENDENT,   DEPENDENT,       DEPENDENT
##VAR_FORM=  AFFN,          ASDF,            ASDF
##VAR_DIM=   65536,         65536,           65536
##UNITS=     HZ,            ARBITRARY UNITS, ARBITRARY UNITS
##FACTOR=    0.620285442955139, 1,           1
##FIRST=     20137.2065510759, 0,            0
##LAST=      -20513.1999529892, 0,           0
##MIN=       -20513.1999529892, -9760430,    0
##MAX=       20137.2065510759, 410938799,    0
$$ Real data points
##PAGE= N=1
##DATA TABLE= (X++(R..R)), XYDATA
$$ [...]
41389c112351j164658J859239K524884N42439j723261j946155j48902J349308
41381a819457P59447p37080p50337N67506Q74103k54338n56549P89162J466920
41372C39377K9934j440014r35317q4380j236988l057895k344743Q40292L036045
41363d853689K165179j23531j131837k39744J052502J071449k82195j317566m82718
41354d142150J370161J840571M34472o36442K3615P92043n4520j251079p02367
41345b325696P63825N71224j353082k239253n24606J968452K501896O16753j703199
41336a723686k209762m67078J769865K356377J143006j03583l67785o11240j554465
41327a768351j882576k90363J916820K324050Q84963j79810J75269M85091o75893
$$ plain form
41389 -3112351 -4277009 -2417770 107114 649553 -1073708 -3019863 -3168765 -1819457
41381 -1819457 -1060010 -1797090 -2547427 -1979921 -1105818 -1360156 -1916705 -1127543 339377
41372 339377 369311 -1070703 -2006020 -2090400 -3327388 -6385283 -8730026 -7889734 -4853689
41363 -4853689 -2688510 -2812041 -3943878 -4183622 -3131120 -2059671 -2341866 -3659432 -4142150
41354 -4142150 -2771989 -931418 -496946 -1133388 -1109773 -317730 -372250 -1623329 -2325696
41345 -2325696 -1561871 -990647 -2343729 -4582982 -5107588 -3139136 -637240 -20487 -1723686
41336 -1723686 -3933448 -4400526 -2630661 -274284 868722 765139 397354 -213886 -1768351
41327 -1768351 -3650927 -3941290 -2024470 299580 1184543 1004733 1180002 1665093 989200
41318I89200k400086k598121o61990J766462K500753R91592j190554k051835j183589
41309c838168K44705J163728J415353J024708p7634j260428j331504j31376R41275
41300a849341O18520p64416j858824j571757L49561K882346L844991J971624r16756
41291B705948j615383J49650J203020m19404k555173k202633K10214J813786J209103
41282D99128n28467j789782j672783j31609J567119J391665r38451k854179j931578
41273f388937Q44218K497745K011882R48038N25458J81409o46371j105180k88519
41264a420257R82420R69372m69457j278887O9217J933325J265798j807420l417762
41255c173651j282768J716144J725171l11672m96155J710613L033235J777685
$$ plain form
41318 989200 -1410886 -4009007 -4670997 -2904535 -403782 587810 -602744 -2654579 -3838168
41309 -3838168 -3593463 -2429735 -1014382 10326 -67308 -1327736 -2659240 -2790616 -1849341
41300 -1849341 -1230821 -1995237 -3854061 -5425818 -5076257 -2193911 1651080 3622704 2705948
41291 2705948 1090565 1240215 2443235 2023831 -531342 -2733975 -2523761 -709975 499128
41282 499128 -29339 -1819121 -3491904 -3623513 -2056394 -664729 -1603180 -4457359 -6388937
41273 -6388937 -5544719 -3046974 -1035092 -87054 438404 619813 -26558 -1131738 -1420257
41264 -1420257 -437837 531535 62078 -1216809 -1147592 785733 2051531 244111 -3173651
41255 -3173651 -4456419 -2740275 -1015104 -1326776 -1822931 -112318 2920917 4698602
41247D698602l72873j895795k689170j870096J118276L139123M73185m128169
41239a526917l735099J919333M903234J280116k626194q70105K488926J085035
41231B918329k649977k335391R76435J344672j007455n70798K777146L286680
41223D739641k17629k219509k87801J207751m38284j590973N95541K881855J731841
41214F402433r06731j604943q65227p46557q31154j47738J26643q05279j076485
41205d55038N47479J911925R85437n80341m12848N78097K59180q52417q85956
41196A095518l9426J92035k02659k79148j68497m07762n70504m22069q24527j691725
41186c318764j048539J704369L677074K307482n00958j060067O36952J373248
$$ plain form
41247 4698602 4325729 2429934 -259236 -2129332 -1011056 2128067 2601252 -1526917
41239 -1526917 -5262016 -3342683 1560551 2840667 214473 -655632 1833294 2918329
41231 2918329 268352 -2067039 -1090604 254068 -753387 -1324185 1452961 4739641
41223 4739641 4522012 2302503 2014702 3222453 2784169 1193196 1788737 4670592 6402433
41214 6402433 5495702 3890759 3025532 2278975 1447821 1300083 1426726 621447 -455038
41205 -455038 92441 2004366 2989803 2409462 1996614 2574711 2833891 1981474 1095518
41196 1095518 1056092 1248127 1045468 766320 597823 190061 -380443 -802512 -1627039 -3318764
41186 -3318764 -4367303 -2662934 1014140 3321622 2820664 1760597 2397549 3770797
41178C770797p7907j468424r39596M17400O20617n30266j698432j732567n43300
41169b181678R78491J587352P51414p30821j449710p28868P46252J426719K88387
41160F87538j746266k242772r1050K563519K635609P5183k136506j917128j91273
41151b363146J124738J359423P98179j61092r27100j072430j059221j404371j345565
41142e050585M6372J796370K077972J017964K37784J9987n11071q96789r8582
41133a360578P13266k62119j426314L03654L457464L083529j117929l436371j117253
41124a162651J186734n50380k917139j323110J697613P38077l092108l784880
41116i207844q783L295349K759408M90060m94777q9216O29137J235910J170345
$$ plain form
41178 3770797 3692890 2224466 1284870 1702270 2322887 1792621 94189 -1638378 -2181678
41169 -2181678 -1203187 384165 1135579 404758 -1044952 -1773820 -1027568 399151 687538
41160 687538 -1058728 -3301500 -3392550 -829031 1806578 1881761 -254745 -2171873 -2363146
41151 -2363146 -1238408 121015 919194 758102 -168998 -1241428 -2300649 -3705020 -5050585
41142 -5050585 -5004213 -3207843 -1129871 -111907 125877 145864 -365207 -1261996 -1360578
41133 -1360578 -647312 -909431 -2335745 -2032091 1425373 4508902 3390973 -45398 -1162651
41124 -1162651 24083 -526297 -3443436 -4766546 -3068933 -2330856 -5422964 -9207844
41116 -9207844 -9216627 -5921278 -3161870 -2671810 -3166587 -3255803 -2626666 -1390756 -220411
41107b20411R0085o01658O04552K228164J428218j384527k913210k000803p53889
41098c523479l57920M35703J805587J660806m87899j832661m97899J302157O48334
41089h47271j634808k308150k18753K553318L360216J456936j572017l021546
41081b232075j487114J360734K390474P53872j286698j659692r04826m30777r2949
41072c589051R63061K168857J992859K55431j321909j092471N94798J671598N41586
41063B184759j929245k974200j019441K168788L342145J573838q83757j562221
41055I00666m47265O30528L32512r23746j526423l63136J671124K250210M47787
41046B972257j631468j388677N44886J014171j064944k949043j954855O92294
$$ plain form
41107 -220411 -130326 -731984 -127432 2100732 3528950 2144423 -768787 -2769590 -3523479
41098 -3523479 -3881399 -3445696 -1640109 20697 -467202 -2299863 -2797762 -1495605 -847271
41089 -847271 -2482079 -4790229 -5008982 -2455664 904552 2361488 789471 -2232075
41081 -2232075 -3719189 -2358455 32019 785891 -500807 -2160499 -3065325 -3496102 -3589051
41072 -3589051 -2625990 -457133 1535726 1791157 469248 -623223 -28425 1643173 2184759
41063 2184759 255514 -2718686 -3738127 -1569339 1772806 3346644 2462887 900666
41055 900666 453401 1083929 1416441 492695 -1033728 -1396864 274260 2524470 2972257
41046 2972257 1340789 -47888 496998 1511169 446225 -2502818 -4457673 -3765379
41038c765379J693125L45114p91013R4471J463306R52081r16317j445468J28277
41029b241803J387804M05791j259555j016220O97497J295911L24248j17086O42366
41020A18953O82827o57202j050106P43204K053581L59854k241629k016691O17582
41011a389627J969978Q29146m09469j62348L95727J96090j37719k60022p85681
41002B46075j280607l80880J258331J072459j155688k122249J17352K798383K375979
40993B929155l06184j571404l19308J027292N78203o56624r04679k25418l9592
40984E11441j014640k253113k394805j126470N66901J620026J936172J857271
40976b97217J219000p6452r84178k86860J299683J534758l67577k539501k866030
$$ plain form
41038 -3765379 -2072254 -1727140 -2518153 -2423682 -960376 -8295 -924612 -2370080 -2241803
41029 -2241803 -853999 -448208 -1707763 -2723983 -2026486 -730575 -406327 -523413 118953
41020 118953 801780 144578 -905528 -162324 1891257 2251111 9482 -2007209 -1389627
41011 -1389627 580351 1409497 1000028 837680 1233407 1429497 1291778 1031756 246075
41002 246075 -1034532 -1415412 -157081 915378 -240310 -2362559 -2245207 553176 2929155
40993 2929155 2622971 1051567 732259 1759551 2337754 1681130 776451 551033 511441
40984 511441 -503199 -2756312 -5151117 -6277587 -5710686 -4090660 -2154488 -297217
40976 -297217 921783 845331 -138847 -425707 873976 2408734 2041157 -498344 -3364374
40967c364374j366131M80944J573961J595638P23300k24925l34595N0104l31962
40958a198040j328076r78437J364222L166763J885529j113874k119375j65746
40950d87034J780565J071459j260337k371843j354331K44530R06619P85050Q22396
40941A37074J170524J029731j40798j696585k372439j702000n08720J92457M22089
40932c468667R47023J940690K481574J598555m17286j980292j598685N57187K460080
40923B520179J967763q69509l484192l359375q84850J111586R16111k7297M42844
40914a666740J679729J082956j532702k835715o07264K513773K314406j038000
40906h9557l210990j764569J003697K051091J547653J162086P98226n19680k004986
$$ plain form
40967 -3364374 -4730505 -4249561 -2675600 -1079962 -356662 -581587 -916182 -866078 -1198040
40958 -1198040 -2526116 -3504553 -2140331 1026432 2911961 1798087 -321288 -487034
40950 -487034 1293531 2364990 1104653 -1267190 -2621521 -2376991 -1470372 -685322 137074
40941 137074 1307598 2337329 2196531 499946 -1872493 -3574493 -4083213 -3890756 -3468667
40932 -3468667 -2521644 -580954 1900620 3499175 3081889 1101597 -497088 60099 2520179
40923 2520179 4487942 3618433 134241 -3225134 -4109984 -2998398 -2082287 -2109584 -1666740
40914 -1666740 12989 1095945 -436757 -3272472 -3879736 -1365963 948443 -89557
40906 -89557 -3300547 -5065116 -4061419 -2010328 -462675 699411 1497637 977957 -1027029
40897a027029j965885o36144J79807K1308J98853J258916J985952J393059J78705
40888A587542m23609k00175J80120J85749p2052o6406M05005O52367j57607j527939
40878E62995j944505j081920l24058l82301j55644Q38491R69498n97645j525295
40869c640384L72139L017190K689164j80946j575433k5881J642186J153478l31612
40860C119901j176405j630162j810400n91697J650368K150863j89691k430077
40852i07300j693335N50305R57317o58619j583183m40669J418507K270452J681367
40843A594842J57689j249042j375240k22986Q02193Q73946Q41586J259279R09862
40834C592129r86873k587003j709257O69392J588670K67022j196925j120311q9281
$$ plain form
40897 -1027029 -2992914 -3629058 -3449251 -3427943 -3229090 -1970174 15778 1408837 1587542
40888 1587542 1163933 963758 1143878 1329627 1257575 1191169 1596174 2248541 2090934 562995
40878 562995 -1381510 -2463430 -2787488 -3169789 -3325433 -2486942 -1517444 -2115089 -3640384
40869 -3640384 -3268245 -251055 2438109 2257163 681730 655849 2298035 3451513 3119901
40860 3119901 1943496 313334 -1497066 -2088763 -438395 1712468 1522777 -907300
40852 -907300 -2600635 -2050330 -1093013 -1751632 -3334815 -3775484 -2356977 -86525 1594842
40843 1594842 1752531 503489 -871751 -1094737 -292544 581402 1422988 2682267 3592129
40834 3592129 2605256 18253 -1691004 -1021612 567058 834080 -362845 -1483156 -1572437
40825a572437O80536J002060J237916J426828J341467P58029k90892j099418p81137
40816B702952J99865Q4301j571166k634772j267646J181114K055178J112805J56491
40807B019122j94098p56970j242223l25915J451787J593346o39524k652494j894460
40798b641429Q23097K605845J967547L1579j075880m29047P34520L81836j473363
40789I24705k229831l35323J754399P00354k405999l161398m28369J922644J090422
40780b168396n40694K11840J984714J382896j197924k182052m73318J235281R91428
40771g56225Q1339Q1735K57479n17503j327585o69951Q27365J069519m87258k049588
40761c490673j873303l15038R45117J031311N94955O38184J227995J588632J115232
$$ plain form
40825 -1572437 -891901 110159 1348075 2774903 4116370 4874399 4583507 3484089 2702952
40816 2702952 2902817 2987118 1415952 -1218820 -2486466 -1305352 749826 1862631 2019122
40807 2019122 1825024 1068054 -174169 -500084 951703 2545049 1905525 -746969 -2641429
40798 -2641429 -1818332 787513 2755060 2786639 1710759 1281712 2016232 2398068 924705
40789 924705 -1305126 -1640449 113950 814304 -1591695 -4753093 -5181462 -3258818 -2168396
40780 -2168396 -2709090 -2497250 -512536 870360 -327564 -2509616 -2982934 -1747653 -756225
40771 -756225 -674886 -593151 -335672 -853175 -2180760 -2850711 -2023346 -953827 -1441085 -3490673
40761 -3490673 -5363976 -5679014 -4733897 -3702586 -3107631 -2469447 -1241452 347180 1462412
40752A462412m3269j201815j576418p49924P56585J580272R17346k89744m89625
40743C65820J99120J22734j208674k118509j355207j90360m40579j522371j363488
40734g511514L44670J795205J851849J293543J053105R65346P40569O12693M32509
40725A577975m25331j621607j794091o77147K57517J91194L05764J426181K034819
40716A275274O00114j443408j473173K82113J086071n2283j117631n64044M68427
40707i38540M87249P784O5232J42328n90363j281214o51201O20065Q40654J80320
40697a117686M36337J884594K500433R79534j233914j958345r89133L08716J036877
40688A847413J105364L59179j092540j996085r79487J326640K531346J372284
$$ plain form
40752 1462412 1419143 217328 -1359090 -2109014 -1352429 227843 1145189 855445 365820
40743 365820 564940 687674 -521000 -2639509 -3994716 -4185076 -4625655 -6148026 -7511514
40734 -7511514 -7166844 -5371639 -3519790 -2226247 -1173142 -207796 532773 1145466 1577975
40725 1577975 1152644 -468963 -2263054 -2940201 -2682684 -2491490 -2185726 -759545 1275274
40716 1275274 1875388 431980 -1041193 -759080 326991 274708 -842923 -1406967 -938540
40707 -938540 -451291 -443507 -378275 -235947 -826310 -2107524 -2758725 -2138660 -1298006 -1117686
40697 -1117686 -681349 1203245 3703678 4683212 3449298 1490953 501820 810536 1847413
40688 1847413 2952777 3311956 2219416 223331 -756156 570484 3101830 4474114
40680D474114p22516j636246j106994k75203M15759J310093J833534N77367k257452
40671B612456m028424k583127P79084K666342J600357o27944j549440o60897Q20044
40662i71549J676645J510723N83434m76673j114713j276372j085998k66038J284017
40653a36524K415025J569620q64396k419913j635789j6347K68962n20533n20244
40644a860139O05062J256084M63356q76535j514692j162904q1551J271613J904128
40635D422R87671o74253j223371l41534J22064j048347k333509j452204J398594
40626d560467L620486L224013P62557j552326j896507j89638J908831K445402
40618C762351J034294q94773j845845j682153j086671n13186k50541n90245j107519
$$ plain form
40680 4474114 3751598 2115352 1008358 733155 1148914 2459007 4292541 4869908 2612456
40671 2612456 -1415968 -3999095 -3220011 -553669 1046688 418744 -1130696 -1791593 -971549
40662 -971549 705096 2215819 2799253 2322580 1207867 -68505 -1154503 -1420541 -136524
40653 -136524 2278501 3848121 2983725 563812 -1071977 -1088324 -819362 -1339895 -1860139
40644 -1860139 -1255077 1007 464363 -412172 -1926864 -3089768 -3171319 -1899706 4422
40635 4422 992093 317840 -905531 -1247065 -1125001 -2173348 -4506857 -5959061 -4560467
40626 -4560467 -939981 2284032 3046589 1494263 -402244 -591882 1316949 3762351
40618 3762351 4796645 3901872 2056027 373874 -712797 -1225983 -1476524 -2066769 -3174288
40609c174288p01391O55444J251004R6325j006025J54510K450952K598996P1304
40600B396831j972391j472760l70753j000048k080918r93825J587611K534572
40592a371681J140769m4679M68641R98705m2313j389754j152835J57913Q18412
40583d16822P25171R58891J432217J110588J36930l10285j76846n93811j594163
40574A271870j681688k74049J103011R66629j10705o64394m47080k29036k46905
40565c12347p1376L34127N30968N39715R25038J692158J768892J80407k347904
40556C239678l563711k040184Q12615K013495O36547r07437j44588J956253K378481
40547D381149L89165j563590j430803o0074O09358K30649r7368M07257J440170
$$ plain form
40609 -3174288 -3875679 -3220235 -1969231 -1872906 -2878931 -2724421 -273469 2325527 2396831
40600 2396831 424440 -1048320 -1419073 -2419121 -4500039 -5493864 -3906253 -1371681
40592 -1371681 -230912 -275591 193050 1191755 1149442 -240312 -1393147 -1235234 -416822
40583 -416822 308349 1267240 2699457 3810045 3946975 3636690 3459844 2866033 1271870
40574 1271870 -409818 -683867 419144 1385773 1275068 610674 163594 -65442 -312347
40565 -312347 -383723 -49596 481372 1021087 1946125 3638283 5407175 5587582 3239678
40556 3239678 -324033 -2364217 -1551602 461893 1098440 191003 46415 2002668 4381149
40547 4381149 4770314 3206724 1775921 1715847 2325205 2555854 2458486 2865743 4305913
40538D305913J878111N20927k410921m454090l135980O12026K999924J913884
40530B229794q82056k685765k854374j906925l9997J877503K049533M16918m36400
40521b231769R35112K275743J250642n53359l10847J198072J018017r30459j996103
40512F55049j325683n40350k39180M67437J060698N9848j508158j032839R03506
40503a499672R00115j301856j823041P75467K609784Q06557j644048r55355J238225
40494h93824J096446p69036p56797J210491J675898k27005j371808k5342J495466
40485A434489R91843k09786n1028O71392J3012j443487j341571M88214J363204
40476A916282k92221k283535j563392J207050K274751J54565k089894j393767
$$ plain form
40538 4305913 6184024 6704951 4294030 -160060 -3296040 -2684014 315910 2229794
40530 2229794 1347738 -1338027 -4192401 -6099326 -6139323 -4261820 -2212287 -1795369 -2231769
40521 -2231769 -1296657 979086 2229728 1676369 1365522 2563594 3581611 2651152 655049
40512 655049 -670634 -1210984 -1450164 -982727 77971 137819 -1370339 -2403178 -1499672
40503 -1499672 -599557 -1901413 -3724454 -2948987 -339203 467354 -1176694 -2132049 -893824
40494 -893824 202622 -566414 -1323211 -112720 1563178 1336173 -35635 -60977 1434489
40485 1434489 2426332 2216546 2165518 2836910 2849922 1406435 64864 553078 1916282
40476 1916282 1624061 -659474 -2222866 -1015816 1258935 1413500 -676394 -2070161
40468b070161O84107N89665j417393j755432M17756J712268J65321j460712k03152
40459c337733K491856L422682K305494Q18369p87731k787609l507400j477335
40451b859407J086191P70287j622866j980838P82247L054911J932354j002089
40443A60790k486653j559831M38080J733584J116534j029648k232054n51278K125021
40434b285455K059008p47538k223724m68920J330795K51492j565438n83926K245832
40425a987874L023060Q98128j156500j125685k17903j30042p22683j017656n92891
40416c030046M68320J597834J713542N56940l25347L89175J356790L51871j881520
40407A197559k272839j35515J652222J045174m04384o55191m29362j191474j959506
$$ plain form
40468 -2070161 -1386054 -796389 -2213782 -3969214 -3551458 -1839190 -1673869 -3134581 -3337733
40459 -3337733 -845877 2576805 4882299 5700668 4912937 2125328 -1382072 -2859407
40451 -2859407 -1773216 -1002929 -2625795 -4606633 -3824386 -769475 1162879 160790
40443 160790 -2325863 -3885694 -3447614 -1714030 -597496 -1627144 -3859198 -4410476 -2285455
40434 -2285455 -226447 -973985 -3197709 -3666629 -2335834 -2084342 -3649780 -4233706 -1987874
40425 -1987874 1035186 1933314 776814 -348871 -566774 -696816 -1419499 -2437155 -3030046
40416 -3030046 -2561726 -963892 749650 1306590 981243 1370418 2727208 3079079 1197559
40407 1197559 -1075280 -1210795 441427 1486601 1082217 427026 -2336 -1193810 -3153316
40398c153316q42654J400734K031352K09671j973631k324854p29966J413382K516864
40389a452418J715013k73686j473885r03430J93452N05779P51412J751886J907568
40380B721691m73145l245843k489461J456960L801859K005060j006184j799214
40372I71723r91958o20958k88024J046753K026692J031303m86932j27983J350426
40363C911042J309818l79699j406810q32717J21771O13769P58529K13733j123225
40354C186211j669408k35979J224265J35816k123923j820532J223063L195992
40346C115505K065767o1479j010658j229295j431125j113017n83385j098090j899815
40337c245592o55077K040139K520812m2955j757783j43422K038817J832935Q27034
$$ plain form
40398 -3153316 -3995970 -2595236 -563884 -354213 -2327844 -4652698 -5382664 -3969282 -1452418
40389 -1452418 262595 -11091 -1484976 -2388406 -2194954 -1689175 -937763 814123 2721691
40380 2721691 2248546 -997297 -3486758 -2029798 1772061 3777121 2770937 971723
40372 971723 -20235 -641193 -929217 117536 2144228 3175531 2688599 2560616 3911042
40363 3911042 5220860 4841161 3434351 2601634 2723405 3337174 4095703 4309436 3186211
40354 3186211 1516803 1280824 2505089 2640905 516982 -1303550 -80487 3115505
40346 3115505 5181272 5119793 4109135 2879840 1448715 335698 -247687 -1345777 -3245592
40337 -3245592 -3900669 -1860530 660282 617327 -1140456 -1283878 754939 2587874 3414908
40328C414908J349639J721611m27290l115409k897087o11056K87604n45442p59277
40319a581799j31773m48868j388504r52468M10864L60478q69261p64386P00395
40310d665322R29149k56837M8182K361425L103707L54491k591475k131483K72837
40301b575326P88666q58130j531178J94150K181654K182568P95701Q7441N98867
40292A864413R45682J23296r16702p03543L65776M85749o20464j023174K27006
40283G48039J092428m30819k684468k223757J195254L958415L133178k87088l099453
40274A401729l305915j338194R33620J881900J389262N56116K4950o25952j425471
40265e07955j335031o3903Q64894K90056o64585m11389O87412J391559J592161
$$ plain form
40328 3414908 4764547 6486158 6058868 2943459 46372 -564684 -277080 -822522 -1581799
40319 -1581799 -1713572 -2162440 -3550944 -4503412 -4092548 -3732070 -4601331 -5365717 -4665322
40310 -4665322 -3736173 -3993010 -3944828 -1583403 1520304 1874795 -716680 -2848163 -2575326
40301 -2575326 -1786660 -2644790 -4175968 -3981818 -1800164 382404 1178105 1265546 1864413
40292 1864413 2810095 2933391 2016689 1313146 1678922 2164671 1544207 521033 748039
40283 748039 1840467 1409648 -1274820 -3498577 -2303323 1655092 4788270 4501182 1401729
40274 1401729 -1904186 -3242380 -2308760 -426860 962402 1518518 1543468 917516 -507955
40265 -507955 -1842986 -1906889 -1041995 -751939 -1416524 -1827913 -1140501 251058 1843219
40256A843219J413786L7519k316971l060592o95153K051955J759176n01983j122933
40247e91977J54440M43010q92870j459785m59527J91568j92505p5035P30562N17001
40237a635118n19675n8738J740710J686177r04230k392539o27559J498022Q80734
40228c32216j052592j379306l05294L68115P34352J545424J679725J0260j902981
40219f34513j925502p53687n12318j161042q79270P99724K424716K619022J164541
40210A141671j055077k199263r35404J378885J835635J22437r44136q4447M21288
40201c18411q08861j285295R75767L247846J959047j614696l426186k603047j335460
40192e209296k97510J519470L171317K306856n45677k053358r52323M36125J83256
$$ plain form
40256 1843219 3257005 3294524 977553 -2083039 -2778192 -726237 1032939 530956 -591977
40247 -591977 -437537 5473 -887397 -2347182 -2806709 -2615141 -2807646 -2882681 -2152119 -1635118
40237 -1635118 -2154793 -2213531 -472821 1213356 309126 -2083413 -2710972 -1212950 -332216
40228 -332216 -1384808 -2764114 -3069408 -2701293 -1966941 -421517 1258208 1268468 -634513
40219 -634513 -2560015 -3313702 -3826020 -4987062 -5866332 -5066608 -2641892 -22870 1141671
40210 1141671 86594 -2112669 -3048073 -1669188 166447 288884 -655252 -739699 -318411
40201 -318411 -1127272 -2412567 -1436800 1811046 3770093 2155397 -1270789 -3873836 -5209296
40192 -5209296 -5506806 -3987336 -816019 1490837 945160 -1108198 -2060521 -1624396 -1441140
40183a441140p44221q05575j48583M10659O53783M50242l26047q93541j65039
40174c009462J424073K171655J375306j5509r67238j218450p87355l0866J32629
40165i25217n67725r09395k1077Q24041J27584j102185q67295L82299N31503m58982
40155b986449n38065P48444J542906J040122P02559J381911J875558J307414N26348
40146E600748Q2857q55578k321703k500920m69317J793748J821091k09647k225532
40137G15747k969016k499004j009001J168723K785706K390974Q4078k156972k252441
40128c741206j31419J986141J796659m17502k060914j603994m65471m60735q65574
40119e964015j5624J355327J101141n21223j023840K07479J049223N18173L88874
$$ plain form
40183 -1441140 -2185361 -2990936 -3139519 -2728860 -2075077 -1624835 -1950882 -2844423 -3009462
40174 -3009462 -1585389 586266 1961572 1946063 978825 -239625 -1026980 -1057846 -925217
40165 -925217 -1492942 -2402337 -2423414 -1599373 -1471789 -2573974 -3441269 -3058970 -2527467 -2986449
40155 -2986449 -3524514 -2776070 -1233164 -193042 509517 1891428 3766986 5074400 5600748
40146 5600748 5683605 4828027 2506324 5404 -463913 1329835 3150926 2941279 715747
40137 715747 -2253269 -4752273 -5761274 -4592551 -1806845 584129 668207 -1488765 -3741206
40128 -3741206 -3872625 -1886484 -89825 -507327 -2568241 -4172235 -4637706 -5098441 -5964015
40119 -5964015 -5979639 -4624312 -3523171 -4044394 -5068234 -4860755 -3811532 -3293359 -2904485
40110b904485J648791K280163N21617k047629k871174j946053p88209L92563K005436
40101c708980K922351J732038n42682j491526p40042l6601j21068J48404J312026
40092e26080K101903J356151m75953k252870l115426k246633N48663L363756L218742
40083A972253j11152k888625j813372J518314K716544N74369j621912j104999
40075g58580O60937P67594o73699j207870j16757Q65691Q22635R54821J847106
40066C161878J876553j05899k385579k640115j279408m27099n02105j39435R38861
40057a502348J406057P73999R8677j43141p28607j620219j401578J78280J122986
40048a815894Q6779j383468j213264M7978M24299k33973m28514J48346K82832
$$ plain form
40110 -2904485 -1255694 1024469 1546086 -501543 -3372717 -5318770 -6106979 -5714416 -3708980
40101 -3708980 -786629 945409 402727 -1088799 -1828841 -1865442 -1986510 -1838106 -526080
40092 -526080 1575823 2931974 2456021 203151 -2912275 -5158908 -4610245 -1246489 1972253
40083 1972253 1861101 -1027524 -2840896 -1322582 1393962 1968331 346419 -758580
40075 -758580 -97643 669951 -3748 -1211618 -1328375 -462684 359951 1314772 3161878
40066 3161878 5038431 4932532 2546953 -93162 -1372570 -1799669 -2301774 -2441209 -1502348
40057 -1502348 -96291 677708 776385 633244 -95363 -1715582 -3117160 -2938880 -1815894
40048 -1815894 -1729115 -3112583 -4325847 -4277869 -3853570 -4087543 -4516057 -4367711 -4084879
40039d084879k79983k48782Q33637J574440R66181K9257Q6977O55805L94558o84151
40029g56940j368814j187456q21711o59011k23205O27093R85712P3797j402211
40020d732746j764222k18901K113711L153200J907893m37210j749207j323759
40012c051241m42711k34506L0512J397880K820780K201014k42143j770123r04741
40003a95279O44740R20709N27739Q05429J064683L0609j271328q42344P30138
39994B415096Q78301q77230k195266j565562j71075M31619J65317n84157j516539
39985c019496j429079P46518L219869K570670j106120l352387j451660J645645
39977b176040J980535L60239J91154J651761J879703J09j715549j631281o29939
$$ plain form
40039 -4084879 -4364862 -4613644 -3780007 -2205567 -1239386 -1210129 -1123152 -467347 -72789 -756940
40029 -756940 -2125754 -3313210 -4134921 -4793932 -5017137 -4390044 -3404332 -3330535 -4732746
40020 -4732746 -6496968 -6715869 -4602158 -1448958 458935 21725 -1727482 -3051241
40012 -3051241 -3493952 -3728458 -3697946 -2300066 520714 2721728 2479585 709462 -195279
40003 -195279 449461 1370170 1897909 2703338 3768021 3798630 2527302 1684958 2415096
39994 2415096 3293397 2416167 220901 -1344661 -1515736 -1084117 -918800 -1502957 -3019496
39985 -3019496 -4448575 -3702057 -482188 2088482 982362 -2370025 -3821685 -2176040
39977 -2176040 -195505 164734 355888 2007649 3887352 3887461 2171912 540631 -89308
39968h9308N2778L82242N41713L90866J91915L46630N15598L44936M21123R32610
39958D031103M58778j752967l423814j960502J222548K324777Q36786M8767J437357
39949C222833K189400j96452l818301m924206k638811O16604K121946J078904
39941b348083j006363j473308O72223K899401K000781j083012j981328Q19063
39933a500626L504554K452520p00068k053498j163619n73256j066082q58911P36003
39924a222983J907696J211152l64616j042343n12834K11564K46777m34339j161450
39915a161376j187239n00512P3938m1418l66207j95852K29001K13786o7717K53139
39905b750457J249197J805254J040308m60638j261981p29503K52898L26802o93443
$$ plain form
39968 -89308 -36530 345712 887425 1278291 1470206 1816836 2332434 2677370 3098493 4031103
39958 4031103 4489881 2736914 -686900 -2647402 -1424854 899923 1736709 1785476 3222833
39949 3222833 5412233 5215781 1397480 -3526726 -6165537 -5548933 -3426987 -2348083
39941 -2348083 -3354446 -4827754 -4155531 -1256130 744651 -338361 -2319689 -1500626
39933 -1500626 2003928 4456448 3756380 1702882 539263 -33993 -1100075 -1958986 -1222983
39924 -1222983 684713 1895865 1531249 488906 -23928 187636 434413 74 -1161376
39915 -1161376 -2348615 -2849127 -2775189 -2816607 -3182814 -3378666 -3149665 -2935879 -3003596 -2750457
39905 -2750457 -1501260 303994 1344302 883664 -378317 -1107820 -854922 -528120 -1221563
39896a221563j555735j146425J05713R38641R70743Q26459P54610K96706m48702
39887d79553m37167P48934J802972J095095j160674k871405k241040K77173K259989
39878a005676J719909o07331j869801n14572J598757J586138n32869j939472r72844
39869b537761Q93590J541669Q76261J6511o28414j117785r75410K5725P96546
39860a109068J86365j069118j121895L36469J581135J290835K79108J28554R09166
39851A411551J218097L02670q06560p50739J47904K59507r37738j863984r44207
39842a963499J082918K078648J371539M10274M01672N60249n20833k465341l103262
39833b147635j029212K330738L787520J790497j644736l125084j799300M3900
$$ plain form
39896 -1221563 -2777298 -3923723 -3818010 -2879369 -1908626 -1082167 -327557 -30851 -479553
39887 -479553 -916720 -167786 1635186 2730281 1569607 -1301798 -3542838 -3265665 -1005676
39878 -1005676 714233 106902 -1762899 -2277471 -678714 907424 374555 -1564917 -2537761
39869 -2537761 -1644171 -102502 773759 790270 161856 -955929 -1931339 -1905614 -1109068
39860 -1109068 -922703 -1991821 -3113716 -2777247 -1196112 94723 373831 502385 1411551
39851 1411551 2629648 2932318 2125758 1375019 1522923 1782430 844692 -1019292 -1963499
39842 -1963499 -880581 1198067 2569606 2979880 3381552 3941801 3420968 955627 -2147635
39833 -2147635 -3176847 -846109 2941411 4731908 3087172 -37912 -1837212 -1793312
39825a793312M23674J14436P36498J914393J976024O18702q16199j308028r62235
39816I03953k33838L47578J13992q34854j227911l71159N02421P6444q17169n73400
39806b113943N37889J117050J079787J095497N79795j080953k209032q75415J371521
39797d97804J324862o45008j081291O64502J314300o00226k168015j019041J060038
39788a647683J605289J111670Q53077K92348q28523q43111P61037J516851l8425
39779B782530j471347n35056Q00839j28553j875544j537094J18704M38734j36979
39770a543766N87098J751255P87125j360073j342143N88128P60850j397223k155522
39761c324271N2920J866476P45368q45996K33159K739837L379313J670720m32102
$$ plain form
39825 -1793312 -1369638 -1255202 -518704 1395689 3371713 3990415 3174216 1866188 903953
39816 903953 670115 1017693 1131685 296831 -931080 -1302239 -799818 -723374 -1540543 -2113943
39806 -2113943 -1576054 -459004 620783 1716280 2296075 1215122 -993910 -1869325 -497804
39797 -497804 827058 182050 -899241 -234739 1079561 479335 -1688680 -2707721 -1647683
39788 -1647683 -42394 1069276 1922353 2214701 1386178 543067 1304104 2820955 2782530
39779 2782530 1311183 776127 1576966 1448413 -427131 -1964225 -1845521 -1406787 -1543766
39770 -1543766 -956668 794587 1581712 221639 -1120504 -532376 228474 -1168749 -3324271
39761 -3324271 -3271351 -1404875 -659507 -1505503 -1272344 1467493 4846806 6517526 6085424
39752F085424j824913k433778j747097J28591J185300j02931k042103j896252
39744b647759o8047N97556o14982j299099K4772J572697J285459k119k17869N98865
39734g70526Q00973K26850L62135J356964J334570m28282j863839j273428k14885
39725d69468r06611k192619j194742J579497K374568M6514j766965j29539K533566
39716a25799J989087j555623l857084k472606O19267K212840J432699l22373j348303
39707c427895r05711N48613J847523K051467R80102r32969k624298k518350r5133
39698e076651K527380K377727m47763k591538j976372l36930J8644m37683k21599
39689f164785L05012K55878M88297J828071K606821R53026j615657j969299J8716
$$ plain form
39752 6085424 4260511 1826733 79636 208227 1393527 1290596 -751507 -2647759
39744 -2647759 -2715806 -2118250 -2733232 -4032331 -4007559 -2434862 -1149403 -1151522 -1369391 -770526
39734 -770526 30447 257297 619432 1976396 3310966 2882684 1018845 -254583 -469468
39725 -469468 -1376079 -3568698 -4763440 -3183943 -809375 -762861 -2529826 -2659365 -125799
39716 -125799 1863288 307665 -3549419 -6022025 -5402758 -3189918 -1757219 -2079592 -3427895
39707 -3427895 -4333606 -3784993 -1937470 113997 1094099 161130 -2463168 -4981518 -5076651
39698 -5076651 -2549271 -171544 -619307 -3210845 -5187217 -5524147 -5505503 -5943186 -6164785
39689 -6164785 -5859773 -5603895 -5115598 -3287527 -680706 272320 -1343337 -3312636 -3293920
39680c293920J648055J655730J235099J021090K19878r35053q10172P25243J474154
39671B940104O5763j916546k055361j16722J911048K097731M59290j152539j215179
39662A017589n70668j222271k948649l089300n63708K231918L015948K596511
39654D67370K294973J194790j272785k697223j120934J177073J057994m74468
39646F26790o68119j69487j084654j937700O967K866013K445131n09411j497989
39637G7541j12060o3545j477831m57530K805631L155282l27803j918667J021721
39628B702739L575753K540584K495110O918938J0075327N064503m803994j0166528
39620A8402432q045113l351477l59061P83006N66315q09894j634637p26519j10243
$$ plain form
39680 -3293920 -1645865 9865 1244964 2266054 2485932 1550879 740707 1465950 2940104
39671 2940104 3005867 1089321 -966040 -1082762 828286 2926017 3385307 2232768 1017589
39662 1017589 446921 -775350 -3723999 -6813299 -7377007 -5145089 -2129141 467370
39654 467370 2762343 3957133 2684348 -12875 -1133809 43264 1101258 626790
39646 626790 -41329 -210816 -1295470 -3233170 -3226203 -360190 2084941 1575530 77541
39637 77541 -34519 -98064 -1575895 -2033425 772206 3927488 3599685 1681018 2702739
39628 2702739 6278492 8819076 11314186 18233124 28308451 33372954 28568960 18402432
39620 18402432 10357319 7005842 6646781 7429787 7996102 7186208 5551571 4825052 4714809
39611D714809j495332k274693J77068K750380R33009l188911l724134m31864J424400
39602a115268J04425p55442L85516O85136o81165n96532J565929K011798m08575
39593A195822j382305J287392L098781J41122m016002l783564j26304J666167
39585a918891K19092j165345n44008O82884J272085J517947J242057j08085j281167
39576h3431k57064K263442L187326J334841j033921j648902r88506o72726r24712
39567A176347r17695n30069m58059r34661j203290l79723J380354K679815K114319
39558B927338p5905j933909j790842q9342J254828J087626N8921n10279k23180
39549G05256K14357J50329j31779L6968M97116K55290j016220k127124j737001
$$ plain form
39611 4714809 3219477 944784 1121852 3872232 4805241 1616330 -2107804 -2539668 -1115268
39602 -1115268 -1010843 -1766285 -1380769 -695633 -1376798 -1973330 -407401 1604397 1195822
39593 1195822 -186483 1100909 4199690 4340812 324810 -3458754 -3585058 -1918891
39585 -1918891 -1699799 -2865144 -3409152 -2726268 -1454183 63764 1305821 1197736 -83431
39576 -83431 -340495 1922947 5110273 6445114 5411193 3762291 2773785 2101059 1176347
39567 1176347 258652 -271417 -729476 -1664137 -2867427 -3247150 -1866796 813019 2927338
39558 2927338 2851433 917524 -873318 -962660 292168 1379794 1438715 928436 705256
39549 705256 919613 1069942 938163 975131 1472247 1727537 711317 -1415807 -3152808
39540c152808j93282Q86745P53378K94783M90880R88519P91652j13094n63223
39531A83550K02054J244949Q84744r07985j974658p44872J209248J062004j094693
39522F4341k193958p62160R47355O72892m37527k08129Q07000N98304p06380j330314
39512b548576r35899m76274J57219J480959K266233J196262q6802Q17643K410323
39503D281088J115646k239400k728415P76820L177033J015629k098138j560165
39495A740098R18453P91865j552959j945643J52733Q97111j258662l073597j899926
39486e230527M42463J025461R5544j12183J074379K331814K372321J024014r45364
39477B077922k155772j528630L70115J593273J022364l61347r29365m07726K04281
$$ plain form
39540 -3152808 -3346090 -2459345 -1705967 -1411184 -920304 68215 859867 746773 183550
39531 183550 385604 1630553 2515297 1607312 -367346 -1112218 97030 1159034 64341
39522 64341 -2129617 -2891777 -1944422 -1271530 -1709057 -1917186 -1110186 -511882 -1218262 -2548576
39512 -2548576 -3484475 -3960749 -3803530 -2322571 -56338 1139924 1053122 1870765 4281088
39503 4281088 5396734 3157334 428919 1205739 4382772 5398401 3300263 1740098
39495 1740098 2658551 3450416 1897457 -48186 104547 1001658 -257004 -3330601 -5230527
39486 -5230527 -4788064 -3762603 -3667059 -3779242 -2704863 -373049 1999272 3023286 2077922
39477 2077922 -77850 -1606480 -1236365 356908 1379272 1017925 88560 -319166 -114885
39468a14885J68706k31509k86720K31039P90886P03028M9930k43224M08702J303957
39458B779910J249468J49536q16779o41690L70592J017716M81037q44590j720911
39449B024289j402654n26322k12310l98504J2068J160837J624843N18166r57352
39440A843061j180151l90647M5002p6087J70220Q77043J042193L13266m46109
39431B197791n68916l49271j63499M5330J67147r7044l91531Q3377J202398J798935
39421C924717J249723J42795r18320j934589k471298j460680R53126K624706J878951
39412C989131n3100o66868J86935J42474j967301m016824l311153k94969J983315
39403d008360J837582Q37382J218080K619945K658329L53584k368376k994838
$$ plain form
39468 -114885 53821 -177688 -464408 -233369 557517 1260545 1310475 1067251 1475953 2779910
39458 2779910 4029378 4178914 3362135 2720445 3091037 4108753 4589790 3745200 2024289
39449 2024289 621635 95313 -116997 -515501 -503433 657404 2282247 2800413 1843061
39440 1843061 662910 272263 317265 241178 411398 1288441 2330634 2643900 2197791
39431 2197791 1628875 1279604 1116105 1161435 1328582 1231538 840007 923384 2125782 3924717
39421 3924717 5174440 5317235 4398915 2464326 -6972 -1467652 -514526 2110180 3989131
39412 3989131 3936031 3269163 3456098 3598572 1631271 -2385553 -5696706 -5991675 -4008360
39403 -4008360 -2170778 -1333396 -115316 2504629 5162958 5516542 3148166 153328
39395A53328j323280O18043J024945L1702q00442k16634J415742K334501J213706
39386D451611j160307k642854k317687j399124j095932q10212M09223J695010
39378b870272J385857k63044j292093r58279n18208o69325j90639J756688L572330
39369d6985L072308N41601j607300j824012p39033K83939O12025K72826m46557
39360A18812r80950q61387m13239m09533p89296n13370Q20286J964281J466405
39351D02009k60362j297572o76962M76027O52229k5929l09149J61916M50608j2404
39341d39589m19030J84901J315237J483146P7395j757001k257734q71236J137650
39332a546261J937711J018084m03201r83393p05189k14434M69496J356596J279045
$$ plain form
39395 153328 -1169952 -551909 473036 504738 -295704 -512338 903404 3237905 4451611
39386 4451611 3291304 648450 -1669237 -3068361 -4164293 -4974505 -4565282 -2870272
39378 -2870272 -1484415 -1747459 -3039552 -3997831 -4516039 -5185364 -5376003 -3619315 -46985
39369 -46985 3025323 3566924 1959624 135612 -603421 -319482 292543 565369 118812
39360 118812 -862138 -1723525 -2136764 -2546297 -3335593 -3848963 -3028677 -1064396 402009
39351 402009 141647 -1155925 -1832887 -1356860 -704631 -730560 -1039709 -877793 -427185 -439589
39341 -439589 -858619 -673718 641519 2124665 2202060 445059 -1812675 -2683911 -1546261
39332 -1546261 391450 1409534 1006333 22940 -682249 -896683 -427187 929409 2208454
39323B208454p31888k936325k219124J297390L518732J814224j217151j690500
39315D3812P291O68546k86272n28001O00832J073969O8475p07352m28679n89420
39305g6799j782842k141901o17818R59051R15085L10153N85539J068481Q44076
39296F3025O92773R73535J44352k014477k424753O70203L598124J994309k174141
39287A522950l188040k55786J721102L07992j034179N88879K578861J475113j182805
39278B534087j386489J134062K870854J733249p37370k096608j658205l53850
39270B039730M93650J66282p32477p90259L25480J139151L05615j490035k502113
39261a044976k124061j178293n39850l06982K1939J011733K428144K847386J225265
$$ plain form
39323 2208454 1476566 -1459759 -3678883 -2381493 1137239 2951463 1734312 43812
39315 43812 51103 719649 433377 -94624 506208 1580177 1648652 941300 512621 -76799
39305 -76799 -1859641 -4001542 -4619360 -3660309 -2745224 -2435071 -1849532 -781051 63025
39296 63025 755798 1729333 1873685 -140792 -2565545 -1895342 1702782 3697091 1522950
39287 1522950 -1665090 -1920876 -199774 108218 -925961 -337082 2241779 3716892 2534087
39278 2534087 1147598 2281660 5152514 6885763 6148393 4051785 2393580 2039730
39270 2039730 2533380 2699662 1967185 1176926 1502406 2641557 2947172 1457137 -1044976
39261 -1044976 -3169037 -4347330 -4887180 -5194162 -5172223 -4160490 -1732346 1115040 2340305
39252B340305j002302j083594J100885K193620j27564l512776l826488n58418
39244d476332K816861L347062J424512p50401j652315j113749K6822N25959j27847
39235B0572j027780r62086O491Q73260J255485J595175J959809J671417K67783
39226E660126j772605l267693l066127j075872J102938J456095N1401q26143J51374
39217a586506J399441R52372m27644n87987N68386J217448O70486j3841l29890
39208A862265r30991j702527j414018J24656J428809J514144J057392P90828L95926
39199C126484k91468n68411k10371r9535o31450q31416J2138J067706J278922
39190B852599Q49843M67622R6299m82785q92413q84344r54648j328829j249294
$$ plain form
39252 2340305 1338003 254409 1355294 3548914 3421350 -91426 -3917914 -4476332
39244 -4476332 -1659471 1687591 3112103 2361702 709387 -404362 -377540 148419 20572
39235 20572 -1007208 -1969294 -1962803 -1089543 165942 1761117 3720926 5392343 5660126
39226 5660126 3887521 619828 -2446299 -3522171 -2419233 -963138 -911737 -1737880 -1586506
39217 -1586506 -187065 765307 337663 -250324 318062 1535510 2205996 2192155 1862265
39208 1862265 931274 -771253 -2185271 -2060615 -631806 882338 1939730 2730558 3126484
39199 3126484 2835016 2266605 2056234 1956699 1325249 493833 505971 1573677 2852599
39190 2852599 3702442 4170064 4266363 3783578 2891165 2006821 1052173 -276656 -1525950
39181a525950k33417Q64146J091032Q41937R18625R39669N6983j223728j387368
39172C41929p2830J270963J198175K1180o50073P5563J125890O68547j239011
39163B740333k097790k23525K222242J606071j790666l481055r45823K601469
39155F31256K739701p2233j825972r56627L47700L64509k4942J15067P4285n93766
39145G98978q94435l69631j59069p56684p10077Q06658J955974Q51647j167923
39136C55438j257761O98440J975553R72847r00436j592457q27301L28679Q30817
39127E83819J43584j315002j936653n72227J371634J296663o81732j425191N63898
39118a971207K578750J731534o36347j278888j10647M10413l9957M70439J653774
$$ plain form
39181 -1525950 -1759367 -895221 195811 1037748 1956373 2896042 2953025 1729297 341929
39172 341929 269099 1540062 2738237 2759417 2109344 2184907 3310797 3979344 2740333
39163 2740333 642543 419018 2641260 4247331 2456665 -1024390 -1970213 631256
39155 631256 3370957 3298724 1472752 516125 863825 1228334 1203392 1318459 1392744 798978
39145 798978 -95457 -465088 -624157 -1380841 -2090918 -1284260 671714 1523361 355438
39136 355438 -902323 -203883 1771670 2744517 1844081 251624 -575677 -246998 583819
39127 583819 727403 -587599 -2524252 -3096479 -1724845 -428182 -1109914 -2535105 -1971207
39118 -1971207 607543 2339077 1702730 423842 313195 723608 683651 1154090 2807864
39109B807864P32072k210306k895580O55464M012991K314269k354765l876681
39101h14672r08786J884406J234500o60281o69607N29267N05680p85031j511347
39092a195871j116414n77053k34508N59918J710179J915992M28731j609586k213261
39083b331873q07300R85054J171828j58392j022729l70167N15761K57804l77380
39074b137394l3815O75745L20977n25513k22392O92969K22228j146930o76597
39065b830722J702871K426226k5806k072176m35381K451708K156487p22967j582369
39056A067871Q87079K816299J232309j740237k431217o64030Q98115P82339j12911
39047B735617o47055p86676p50172k79553O11910J044566L27955p25932o26003
$$ plain form
39109 2807864 3539936 1329630 -1565950 -910486 3102505 5416774 3062009 -814672
39101 -814672 -1723458 160948 1395448 735167 65560 594827 1100507 315476 -1195871
39092 -1195871 -2312285 -2889338 -3123846 -2563928 -853749 1062243 1490974 -118612 -2331873
39083 -2331873 -3139173 -2154119 -982291 -1140683 -2163412 -2533579 -2017818 -1760014 -2137394
39074 -2137394 -2171209 -1495464 -1174487 -1700000 -1922392 -1229423 -1007195 -2154125 -2830722
39065 -2830722 -1127851 1298375 1272569 -799607 -1234988 1216720 3373207 2650240 1067871
39056 1067871 1954950 4771249 6003558 4263321 1832104 1168074 2066189 2848528 2735617
39047 2735617 2088562 1301886 551714 272161 884071 1928637 2256592 1530660 904657
39038I04657M70383M98633j541004l509502k705691J59128J757884Q67018j95973
39029c294467M99564J697699J522856N91971N38975J137073J121057O02362L82681
39020D799771j07306j732823l222470k439556O9970J333137J03448j468199j031469
39011c695497R04683K079541J423603n3879p25039j09038P03998M84567l03374
39002G09565l9393J323365J677274O9879j261358k48760J295268L01889k333217
38993A494512k811231m87704J109390Q2766r90955J86928J666200P86605j165095
38984a28584j206080L71786R08520J45892L11589J644873J603824o39304k260497
38975G52019j007540J302097J686006L70938l50943k60819j093527k663608k436288
$$ plain form
39038 904657 1375040 1873673 332669 -3176833 -5882524 -5723396 -3965512 -3098494 -3294467
39029 -3294467 -2794903 -1097204 425652 1017623 1556598 2693671 3814728 4417090 4799771
39020 4799771 4692465 2959642 -262828 -2702384 -2632414 -1299277 -1195829 -2664028 -3695497
39011 -3695497 -2790814 -711273 712330 658451 -66588 -175626 528372 1012939 709565
39002 709565 670172 1993537 3670811 3740690 2479332 2230572 3525840 3827729 1494512
38993 1494512 -1316719 -1804423 -695033 -612267 -1603222 -1416294 249906 1036511 -128584
38984 -128584 -1334664 -962878 -54358 91534 403123 2047996 3651820 3012516 752019
38975 752019 -255521 1046576 2732582 3103520 2752577 2491758 1398231 -1265377 -3701665
38966c701665J83689K096214Q81893j349489j020627J485073K467921M93831j744561
38957b07721j603476K10994J583243J896958J511482K36525j812244l082415k137080
38948c403734L06250K204379K429141J233886n23915j531429n16089K030747L534374
38939E763610K083762j269099l983799m676731l258441j30903L065817L643970
38931A238186J126844j082388R9018K789849K758330k10640k188398j273636m8559
38922C208606q49130k053423j112979J180099J902265K50159j537510j238217
38914b50130P30670J972780R63281j053418j513433M0075J228343L48738j021988
38905A444918o62571O35206O20246l56765l7978J454773J523968m21539j809851
$$ plain form
38966 -3701665 -3517976 -1421762 -539869 -1889358 -2909985 -1424912 1043009 1536840 -207721
38957 -207721 -1811197 -1600203 -16960 1879998 3391480 3628005 1815761 -1266654 -3403734
38948 -3403734 -3097484 -893105 1536036 2769922 2246007 714578 198489 2229236 5763610
38939 5763610 7847372 6578273 2594474 -2082257 -5340698 -5471601 -2405784 1238186
38931 1238186 2365030 1282642 1381660 4171509 6929839 6719199 4530801 3257165 3208606
38922 3208606 2359476 306053 -806926 373173 2275438 2525597 988087 -250130
38914 -250130 480540 2453320 3416601 2363183 849750 889825 2118168 2466906 1444918
38905 1444918 782347 1417553 2037799 1681034 1643056 3097829 4621797 4200258 2390407
38896B390407j116790n5851k50309o15887K26770J354591J247209K47257l72607
38887C054790l24011L7046N60918Q11619K02200o63528n08293K73799P942r95321
38877B457161m15647J781963K270762n08741l253975k489974K96696J358049L98976
38868A895270K4306Q22775P60276q34264k006822j324353K41481J158474J147191
38859A884334O10422k36256j082463j345460o95758O32475J918958K141340Q14617
38850D642209r36952j155377M47568J829514J240944n59404j539414q17804Q77379
38841D028663K111885J564701p81958k857427k472546l87979N71930k62333p40669
38832G74267l2893p7734j530252j900733N6941J698830J073533N13213K001631
$$ plain form
38896 2390407 1273617 1217766 967457 351570 578340 1932931 3180140 3427397 3054790
38887 3054790 2730779 2767825 3328743 4140362 4342562 3679034 3170741 3444540 3452482 2457161
38877 2457161 2041514 3823477 6094239 5585498 2331523 -158451 138245 1496294 1895270
38868 1895270 1919576 2742351 3502627 2668363 661541 -662812 -421331 737143 1884334
38859 1884334 2494756 2258500 1176037 -169423 -865181 -232706 1686252 3827592 4642209
38850 4642209 3705257 2549880 2997448 4826962 6067906 5508502 3969088 3151284 4028663
38841 4028663 6140548 7705249 6923291 4065864 1593318 1205339 1777269 1514936 774267
38832 774267 741374 663640 -866612 -2767345 -2710404 -1011574 61959 575172 2576803
38823B576803K578716p41343m394570k633811L032660N169924J194502l287231
38815C495650l124007m7050J750300J698601J475093J100870k12957j500440j251031
38806C385029Q3199R19619Q52276N20058J76955k21437l50477o3879O6512m45151
38796D922704j220742j459601o33680J178900K929742L067677J492796L27210
38788A0605006J186309K515948J734933o87468j888432r91146O6562J70343M48810
38779A3160865J437913J764090P28240l71460o70339j123785k238399k654741
38771A0032384j350030O83890K159486L016711L212021K068197L4437r27733m238
38762A8925125J300470J752347K062597K821397L117679K725387L277505N419537
$$ plain form
38823 2576803 5155519 4414176 19606 -2614205 418455 5588379 6782881 3495650
38815 3495650 371643 324593 2074893 3773494 5248587 6349457 6136500 4636060 3385029
38806 3385029 3468228 4387847 5240123 5760181 5937136 5715699 5365222 5301343 5367855 4922704
38796 4922704 3701962 2242361 1608681 2787581 5717323 8785000 10277796 10605006
38788 10605006 11791315 14307263 16042196 15354728 13466296 12475150 12541712 12712055 13160865
38779 13160865 14598778 16362868 17091108 16719648 16049309 14925524 12687125 10032384
38771 10032384 8682354 9366244 11525730 14542441 17754462 19822659 19857096 18929363 18925125
38762 18925125 20225595 21977942 24040539 26861936 29979615 32705002 35982507 41402044
38754D1402044P111451O923575O829004R227933J3205677J6588836J9913963K4947231
38746A46149714L0499066L3637156L4807981L7550296M1846637M1460949L0955625
38739C96907424J3794467K36908l259407l43331O69181l369031q806883j2884549
38731C82944779j8747688k9902035m2533152m8184524m3846168l5046491k8184805
38724A36499916k3978020k0077953j6028047j2746908j0092563p891318p075281
38717C8609826p290675n958058k423424j76636j608512l501170j964452Q03433
38709A6490332k2221l480755m008601n97946J615075p1004j903982n78994J360080
38700H801984N23676j399556r83837R12725J004304o25800j045938L03460J090859
$$ plain form
38754 41402044 48513495 55437070 62266074 71494007 84699684 101288520 121202483 146149714
38746 146149714 176648780 210285936 245093917 282644213 324490850 365951799 396907424
38739 396907424 410701891 410938799 407679392 407336061 408005242 404636211 395829328 382944779
38731 382944779 364197091 334295056 291761904 243577380 199731212 164684721 136499916
38724 136499916 112521896 92443943 76415896 63668988 53576425 45685107 38609826
38717 38609826 31319151 25361093 22937669 22761033 21152521 17651351 15686899 16490332
38709 16490332 16468111 12987356 8978755 8380809 9995884 9924880 8020898 7441904 8801984
38700 8801984 9325660 7926104 6942267 7854992 8859296 8233496 7187558 7491018 8581877
38691H581877M93352L25944J421023K169117J505340O25090O34235P34816l069
38682A6487725q92573j011140r05902j521225k465512k697051k171872j508864
38674C313586o21037Q79931K177960J711153n03595k262561j696736L44595J368415
38665D711711L78995j054202j055789R3436M87136p43459k226444k139991n39042
38656b087649Q33330P87299j55706r42125j310986j364865p77242M57324J126707
38647c433913J82066j177058o16348J765851K975991J300083j009778j073227
38639a086333K44643j7631j810673j942481O41824K729174J451869j570158k754986
38630d114752j339108O44275J803552K308172K107612P62759r76175j549132p77307
$$ plain form
38691 8581877 9075229 9401173 10822196 12991313 14496653 15121743 15755978 16490794 16487725
38682 16487725 15595152 14584012 13678110 12156885 9691373 6994322 4822450 3313586
38674 3313586 2692549 3572480 5750440 7461593 6957998 4695437 2998701 3343296 4711711
38665 4711711 5090706 4036504 2980715 3074151 3561287 2817828 591384 -1548607 -2087649
38656 -2087649 -1254319 -467020 -622726 -1564851 -2875837 -4240702 -5017944 -4560620 -3433913
38647 -3433913 -3251847 -4428905 -5045253 -3279402 -303411 996672 -13106 -1086333
38639 -1086333 -841690 -859321 -2669994 -4612475 -3970651 -1241477 210392 -1359766 -4114752
38630 -4114752 -5453860 -4809585 -3006033 -697861 1409751 2172510 1196335 -352797 -1130104
38621a130104O4093M51639J024902J586416Q22578j242191k538137j861145o90217
38612c512166o29811p34070N87175K263068J731441r67349k790319j737731Q22547
38603d967215K488485K539540J486964j81148j568138j355307K96426J281281
38595B0888N20242k07815O60642J380311k46487k374662j356778J997225K864043
38586C257609j34277k521224j038254J279551M36291j864792j429897J097146
38578i17847J372556j186024k339228J29905L100457L009705M52415j744098k227315
38569c49474j370611q1176M09740n08932j413363m71751J279339J050194r72070
38560b428104j449710O37871K169498J174505O87P06041J132430r57567l104877
$$ plain form
38621 -1130104 -1066011 -614372 410530 1996946 2819524 1577333 -960804 -2821949 -3512166
38612 -3512166 -4141977 -4876047 -4288872 -2025804 -294363 -1261712 -4052031 -5789762 -4967215
38603 -4967215 -2478730 60810 1547774 1366626 -201512 -1556819 -1260393 20888
38595 20888 541130 333315 993957 2374268 2127781 -246881 -1603659 393566 3257609
38586 3257609 3123332 602108 -436146 843405 1279696 -585096 -2014993 -917847
38578 -917847 454709 -731315 -3070543 -2940638 159819 3169524 3621939 1877841 -349474
38569 -349474 -1720085 -1801261 -1391521 -1900453 -3313816 -3785567 -2506228 -1456034 -2428104
38560 -2428104 -3877814 -3239943 -1070445 104060 104747 810788 1943218 985651 -2119226
38551b119226j762018J637972K734201R62640k38344O74665J522758O27521q61743
38542C178426j475999j276462o29316L73380R32630K21224r06108r93015l84687
38533i59927k40889M0392J466952K374276M40835k618485k681758J97481J528287
38524d52836k75107j324322Q31143K732355R22203k004904j769260M92575O44817
38515b03336j142794j091382J122615J667420o46376k135287m18157J715252J101239
38506c0806p71300o45350J188148J862255P00072l15204k16119j54498p09702
38497I07496p07117N52002J836847J690397K22689j553000k941289l349851k101243
38488e443069M02830K201708J735078j37717j182374n90425L46989L11425l76817
$$ plain form
38551 -2119226 -3881244 -2243272 490929 1453569 1215225 1889890 3412648 4040169 3178426
38542 3178426 1702427 425965 -203351 170029 1102659 1323883 417775 -575240 -959927
38533 -959927 -1200816 -1160424 306528 2680804 3121639 503154 -2178604 -1981123 -452836
38524 -452836 -727943 -2052265 -1221122 1511233 2433436 428532 -1340728 -848153 -203336
38515 -203336 -1346130 -2437512 -1314897 352523 -293853 -2429140 -2847297 -1132045 -30806
38506 -30806 -802106 -1447456 -259308 1602947 2303019 1987815 1771696 1617198 907496
38497 907496 200379 752381 2589228 4279625 4502314 2949314 8025 -3341826 -5443069
38488 -5443069 -5040239 -2838531 -1103453 -1241170 -2423544 -3013969 -2666980 -2355555 -2732372
38479b732372n21013K21885Q98362M42281q79098j433547p9449K048147K562607
38470E27803R38979o70697n57376R1441n59276j635180q70702J389859K377064
38461A031915J211590Q9855L35975K23120j580875k986690j436285J747227K721824
38452A357656K41550k918010l608271j610455Q82569J802570R39083j98841j70071
38443c282220P14102J108472Q88174J187367J898854J212267j254843k932067
38435d59894j665975J034266K084014Q16457j047293k122900k024767n66742J507818
38426b445016K125443M09708j523392j463085l54882j57471j89507J082691K139854
38417c75657M34107k445931k197716J405921L634779J716298j484401k248378
$$ plain form
38479 -2732372 -3253385 -3031500 -2133138 -1690857 -2569955 -4003502 -4082951 -2034804 527803
38470 527803 1466782 796085 238709 330150 -229126 -1864306 -2735008 -1345149 1031915
38461 1031915 2243505 2333360 2669335 2892455 1311580 -1675110 -3111395 -1364168 1357656
38452 1357656 1599206 -1318804 -4927075 -6537530 -5654961 -3852391 -2913308 -3112149 -3282220
38443 -3282220 -2568118 -1459646 -571472 615895 2514749 3727016 2472173 -459894
38435 -459894 -2125869 -1091603 992411 1808868 761575 -1361325 -3386092 -3952834 -2445016
38426 -2445016 -319573 90135 -1433257 -2896342 -3251224 -3408695 -3598202 -2515511 -375657
38417 -375657 58450 -2387481 -4585197 -3179276 455503 2171801 687400 -1560978
38409a560978p93869O31352J266827J307074M29539j093135j842589j358081p89536
38400c803396m08244R87842L007670K975922L6253k889838l203194j927862q68019
38391f092866M95080K594907L209259P42634k144974j869917O79736J713649L67674
38382c04818p18481p5341R21082J100283J068647J260043R95039Q5499o52057
38373C679896r47335j435522k167184k283486j430141k51312O01314R31875O82262
38364b619633J17432n8864L64202O78561N05588M42572O47229K40815p61587p04298
38354a147983R74597K154128J143120n06547o11429J23561p7284n78679J03231
38345A576715Q69892j80704j814231j449856P7917j42457j581586q41846K138614
$$ plain form
38409 -1560978 -2354847 -1723495 -456668 850406 1279945 186810 -1655779 -3013860 -3803396
38400 -3803396 -4211640 -3223798 -216128 2759794 2796047 -93791 -3296985 -5224847 -6092866
38391 -6092866 -5597786 -3002879 206380 949014 -1195960 -3065877 -2386141 -672492 -304818
38382 -304818 -1023299 -1098640 -177558 922725 1991372 3251415 4246454 4331953 3679896
38373 3679896 2732561 1297039 -870145 -3153631 -4583772 -4835084 -4233770 -3301895 -2619633
38364 -2619633 -2502201 -2561065 -2196863 -1518302 -1012714 -570142 77087 317902 -443685 -1147983
38354 -1147983 -173386 1980742 3123862 2617315 2005886 2129447 2052163 1473484 1576715
38345 1576715 2446607 2265903 451672 -998184 -920267 -1062724 -2644310 -3486156 -1347542
38336a347542L404690J425519o08664m70209j73163j359152j873378M7777J981574
38327A027452J142159j094894j956341j809581k267122k209838J33689K867451
38319d167025K588205N740q89537Q62957J889302J92327j662440p65382J632292
38310c13561K124711L6666j938792j535819L27193R89288n13569k239616j860196
38301d923695K47487J589322J128404N09495J030100J389654J15127j442958r42533
38292a299597J079978J858874O68181k81764L54658R52630j90492j901577j828197
38283e87306L7177J303414M03252j451903j864484j86512J631983J293790r51757
38274c72346k390198j217972J054716J640443K17100r82799o06471K56612M17407
$$ plain form
38336 -1347542 2057148 3482667 2874003 2403794 2230631 871479 -1001899 -954122 1027452
38327 1027452 2169611 1074717 -881624 -2691205 -4958327 -7168165 -7034476 -4167025
38319 -4167025 -1578820 -1573080 -2462617 -1599660 289642 481969 -1180471 -1945853 -313561
38310 -313561 1811150 1847816 -90976 -1626795 -1299602 -310314 -823883 -3063499 -4923695
38301 -4923695 -4676208 -3086886 -1958482 -1448987 -418887 970767 1085894 -357064 -1299597
38292 -1299597 -219619 1639255 2307436 2025672 2380330 3332960 3142468 1240891 -587306
38283 -587306 -550129 753285 1156537 -295366 -2159850 -2346362 -714379 579411 -372346
38274 -372346 -2762544 -3980516 -2925800 -1285357 -1068257 -2051056 -2657527 -2400915 -1983508
38265a983508N05527J300903J753195N36740j295254j328040O16085J905414P72905
38256B783967j082997q27535J562370L213198K031387q70191k762931k348553
38248A698715o02298Q16096J201280R43107O26113K90345m16800j442192k009053
38239A105313j500598m63074n1894m76946q27274o02401l75779m69624j36986
38230c799263J046623K024437J659122M20378n89882j376605k258264k269868
38222e143322m47411J849256K266956R61556K93544R36715J069314j7540n65797
38213A203271J63714J50320j609621k459706j19227K861492K255488j410768l312844
38204b277881j112356K120826K533667K67431j739182j808679p91634j76497k66927
$$ plain form
38265 -1983508 -1477981 -177078 1576117 2112857 817603 -510437 105648 2011062 2783967
38256 2783967 1700970 873435 2435805 5649003 7680390 6810199 4047268 1698715
38248 1698715 1096417 1912513 3113793 4056900 4683013 4973358 4556558 3114366 1105313
38239 1105313 -395285 -858359 -910253 -1387199 -2214473 -2816874 -3192653 -3662277 -3799263
38230 -3799263 -2752640 -728203 930919 1351297 761415 -615190 -2873454 -5143322
38222 -5143322 -5590733 -3741477 -1474521 -512965 -219421 717294 1786608 1769068 1203271
38213 1203271 1366985 1517305 -92316 -2552022 -2671249 190243 2445731 1034963 -2277881
38204 -2277881 -3390237 -1269411 1264256 1531687 -207495 -2016174 -2807808 -2984305 -3251232
38195c251232k77898K50210N87956p3317q78520q5275K002360K720900Q28281
38186A823465j322019j177776K97165O61681K4080O1702M30596l11866j135540
38177f48512J19298K183309J513278j609700k720724j56378K153677J007169j246530
38168E94887j181341J70044k0966j127158o53597Q76636Q25092q17996j451697
38159b786096k11593J051977J052317M98355K68435M73169J092092J564866N51096
38150C554618j780928k567660j09842K564944J564173j658440k294221K21902
38142e05454J619401J71328p55576P89785J600563q40215l341169j990188J264023
38133a987502J754251l97005q99903J489051L204524J709945r77066j825443p71982
$$ plain form
38195 -3251232 -3529130 -3278920 -2690964 -2764281 -3642801 -3728076 -1725716 995184 1823465
38186 1823465 501446 -676330 -379165 282516 306596 368298 798894 487028 -648512
38177 -648512 -529214 1654095 3167373 1557673 -1163051 -1319429 834248 1841417 594887
38168 594887 -586454 -416410 -437376 -1564534 -2218131 -1341495 -516403 -1334399 -2786096
38159 -2786096 -2997689 -1945712 -893395 -395040 -126605 346564 1438656 3003522 3554618
38150 3554618 1773690 -793970 -903812 1661132 3225305 1566865 -727356 -505454
38142 -505454 1113947 1285275 529699 1319484 2920047 2079832 -1261337 -3251525 -1987502
38133 -1987502 -233251 -630256 -1530159 -41108 3163416 4873361 3896295 2070852 1298870
38124A298870L70889P49205O17823J32164o07587j145486j206257r93449n02195
38115a286023N77504J786650J751236k1304j878891j619266P45509K686038J977360
38106D718813o76497k481611j892369j93137O50473N75910O27180N29451p96357
38097A061856k446230j855655J186771L262527J778105j208604j812680L30183
38089B96273J955310P78387k035065l835767l074993p1895L119584L797476J231086
38080B160396j947450k531542o09048J081191J217063J042718J425645J297365
38072C136338j19321j603236j694063p35382m0279p8805m36656p38144q32091
38063c141639o62331m07877k30502J58871R63708J545007J220899N42239M93789
$$ plain form
38124 1298870 1669759 2418964 3036787 3168951 2561364 1415878 209621 -783828 -1286023
38115 -1286023 -708519 1078131 2829367 2808063 929172 -690094 55415 2741453 4718813
38106 4718813 4042316 1560705 -331664 -524801 125672 701582 1328762 1858213 1061856
38097 1061856 -1384374 -3240029 -2053258 1209269 2987374 1778770 -33910 296273
38089 296273 2251583 3029970 994905 -2840862 -5915855 -5987750 -2868166 929310 2160396
38080 2160396 212946 -2318596 -2927644 -1846453 -629390 413328 1838973 3136338
38072 3136338 3017017 1413781 -280282 -1015664 -1055943 -1134748 -1571404 -2309548 -3141639
38063 -3141639 -3803970 -4211847 -4442349 -4283478 -3319770 -1774763 -553864 -11625 482164
38054D82164P12245M5604j299185j896891j333591n09334K00130J104276J618373
38045h76209Q17823l88167j86011R03178O49001p05053m16707J684498K095756
38036C578109n40070k579561j188316Q10225k69119k539437j615046K038555L897676
38027A593016K445138M66685m00665j498165k995851k578908K56044K446712J746174
38018A480180j81946p81651q2844N17084O28807M08319k62355p42775K18669K035797
38008C237285K153693j79964k241176j711189j11859j74809j559749j759779j62351
37999b509898J360582J472266P68662K04070q3570j72049R2212O41187J066668
37990B840130J043536M59020n76996j462054j368699k48194R43239J328637Q01772
$$ plain form
38054 482164 1194409 1240013 -59172 -1956063 -3289654 -3798988 -3598858 -2494582 -876209
38045 -876209 -58386 -446553 -632564 270614 919615 214562 -202145 1482353 3578109
38036 3578109 3038039 458478 -729838 80387 -188732 -2728169 -4343215 -2304660 1593016
38027 1593016 4038154 4504839 4104174 2606009 -389842 -2968750 -2712706 -265994 1480180
38018 1480180 1298234 516583 433739 950823 1579630 1987949 1725594 982819 1201488 3237285
38008 3237285 5390978 5211014 2969838 1258649 1146790 971981 -587768 -2347547 -2509898
37999 -2509898 -1149316 322950 1091612 1295682 1212112 1040063 1132275 1773462 2840130
37990 2840130 3883666 4342686 3765690 2303636 934937 686743 1629982 2958619 3760391
37981C760391m12802j836194k273877p64481J566949K222657N93115j186379j464092
37972B05287j171771j446311j324227K14727J770014J542937M26432M08866R94737
37963A620691K00321j530060j687305k5242P79563m28332j290224J13873J985969
37954b60746J638744l14397j130229k75096K0290j482746l003631k349043m8956
37945g205810J466960J235584Q39036J793601L084382K513744N0775j747295j078209
37936I52768P47644J269191J02571j120077j325022r96043q57747r55597j067732
37927c250044r16971k4381J591152K739475K273610Q18442j4626L3970j31641
37918C118986o92099n37493M68973Q48065l7585p76815l53174K5680q11331j553619
$$ plain form
37981 3760391 3347589 1511395 -762482 -1526963 39986 2262643 2855758 1669379 205287
37972 205287 -966484 -2412795 -3737022 -3522295 -1752281 -209344 217088 625954 1620691
37963 1620691 1821012 290952 -1396353 -1421595 -642032 -1070364 -2360588 -2246715 -260746
37954 -260746 1377998 1063601 -66628 -341724 -321434 -1804180 -4807811 -7156854 -7205810
37945 -7205810 -5738850 -4503266 -3664230 -1870629 1213753 3727497 3778272 2030977 952768
37936 952768 1700412 2969603 3072174 1952097 627075 -368968 -1226715 -2182312 -3250044
37927 -3250044 -4167015 -4191396 -2600244 139231 2412841 3231283 3216657 3250627 3118986
37918 3118986 2426887 1889394 2358367 3206432 3168847 2392032 2038858 2064538 1253207 -300412
37908c00412m77262J159413N43708k098382l216775j041414J569499J117780j466253
37899d210098k129516N32692L258927K498780r77086l199350j922011J037212
37891e110450K419236J320848l24083n47669L39457O45346m8864k25880J099846
37882d32213K265275Q41347k504834l999043j585113J969484K600589L54227j148401
37873a638682r0175J542621J649509P93323J27977p78954k193855k539224q48914
37864c976374Q23391J61477j461257p91328K101573L561730J557364j641272k826512
37855b491208j631137J23052J051025R90380M23925J44136O72510J446446J369234
37846B098363L60423o28924j149104j516149j519171m18943J457781K597198K158397
$$ plain form
37908 -300412 -777674 381739 925447 -1172935 -4389710 -5431124 -3861625 -2743845 -4210098
37899 -4210098 -6339614 -5806922 -2547995 -49215 -1026301 -4225651 -6147662 -5110450
37891 -5110450 -2691214 -1370366 -1694449 -2242118 -1902661 -1257315 -1306179 -1532059 -432213
37882 -432213 1833062 2674409 169575 -3829468 -5414581 -3445097 -844508 -490281 -1638682
37873 -1638682 -1728857 -186236 1463273 2256596 2384573 1605619 -588236 -3127460 -3976374
37864 -3976374 -3152983 -2991506 -4452763 -5244091 -3142518 419212 1976576 335304 -2491208
37855 -2491208 -4122345 -3999293 -2948268 -1957888 -1533963 -1389827 -717317 729129 2098363
37846 2098363 2458786 1829862 680758 -835391 -2354562 -2773505 -1315724 1281474 3439871
37837C439871O91427j042642k446566k437249m79725J654461J535725k17108n84769
37828A13425R39252J334299p64596k413819j209503N37855k47350k021735j234931
37819d967103J511360K378902N62696q09073j11166P07445L02836J96723J298224
37810A070844J664212p9082j878322j354152L42122M89539q29462j175804Q2808
37801a667297Q64994j16683j305309p56853R60678J747908J103169O88464J546448
37792C065519K127884L49693k900692m094384j528161K056856K742192L52088
37784B170995j704635j112444Q48502J751216J086779L182o29002p68207o09384
37775A037002l54363j35647K73892J075919J566745O72874j189044k036818r78794
$$ plain form
37837 3439871 4131298 3088656 642090 -1795159 -2274884 -620423 915302 698194 113425
37828 113425 1052677 2386976 1622380 -791439 -2000942 -1463087 -1710437 -3732172 -4967103
37819 -4967103 -3455743 -1076841 -514145 -1323218 -1434384 -726939 -424103 -227380 1070844
37810 1070844 2735056 2655974 777652 -576500 -234378 255161 -574301 -1750105 -1667297
37801 -1667297 -802303 -918986 -2224295 -2981148 -2020470 -272562 830607 1519071 3065519
37792 3065519 5193403 5543096 2642404 -1451980 -2980141 -923285 1818907 2170995
37784 2170995 466360 -646084 202418 1953634 3040413 3043595 2414593 1646386 1037002
37775 1037002 682639 546992 820884 1896803 3463548 4136422 2947378 910560 -68234
37766f8234K65320j86544j410065r85373J140717K247021P75573j277734j217352
37757g16671N05854J223129K25921k86467J057479K267993P95179k481402m162671
37748a571656k776799k60744J090314J176747J062671J194213J526160J945804
37740C386710J705610j19056k722654l694156k125275k895O68500L55357K24394
37731b323465m8405p78664o66780Q76415J779886N52222n36561R18264K527128
37722B300040M30712l546245l574756J046472M128046J713562k282883k523994
37714b309046Q3454J068405m20496j414201m42636Q13087O77729n26545j520308
37705c990557j347927J3722J308594J145763P6731k3779Q93625Q34164o00758
$$ plain form
37766 -68234 197086 10542 -1399523 -2384896 -1244179 1002842 1778415 500681 -716671
37757 -716671 -210817 1012312 1238233 951766 2009245 4277238 5072417 2591015 -1571656
37748 -1571656 -4348455 -4609199 -3518885 -2342138 -1279467 -85254 1440906 3386710
37740 3386710 5092320 4973264 2250610 -1443546 -3568821 -3571716 -2903216 -2547859 -2323465
37731 -2323465 -2371870 -3150534 -3817314 -2940899 -1161013 -608791 -1145352 -227088 2300040
37722 2300040 2730752 -815493 -4390249 -3343777 784269 2497831 214948 -2309046
37714 -2309046 -2225592 -1157187 -1577683 -2991884 -3434520 -2621433 -1943704 -2470249 -3990557
37705 -3990557 -5338484 -5324762 -4016168 -2870405 -2793674 -2817453 -1923828 -1089664 -1690422
37696a690422j238547j55192P50301N16772Q34208K022502J417644j457412k547667
37687a547813J38896K102589n58982l925342k331155J924388K330872q31746j473220
37678d171513J376842K288729m04943j766515M63074J860175k79330j994419j35412
37669b763312J931292P72855r47804O1974J419293j40484k258643j175618J421407
37660a679040J781402Q44040J370132J544042j629213n067171l344956J732239
37652d448525L163482L9146j285007J722177L622777O38702k982261k400658J35040
37643a795127J25667j415601o96832J634231J856512k8486m86315J067408J180851
37634A442308j485413l415463j593897J646508J821283j367945l656275j953916
$$ plain form
37696 -1690422 -2928969 -3084161 -2333860 -1817088 -982880 1039622 2457266 999854 -1547813
37687 -1547813 -1408917 693672 134690 -3790652 -6121807 -4197419 -1866547 -2698293 -4171513
37678 -4171513 -2794671 -505942 -910885 -2677400 -2214326 -354151 -633481 -2627900 -2763312
37669 -2763312 -832020 -59165 -1006969 -944995 474298 333814 -1924829 -3100447 -1679040
37660 -1679040 102362 946402 2316534 3860576 2231363 -2835808 -6180764 -4448525
37652 -4448525 -1285043 -1245897 -2530904 -808727 2814050 3452752 470491 -1930167 -1795127
37643 -1795127 -1669460 -3085061 -3781893 -2147662 -291150 -319636 -805951 261457 1442308
37634 1442308 -43105 -3458568 -5052465 -3405957 -1584674 -2952619 -6608894 -8562810
37626h562810J793901L444682K023437N07629J314594K902376K173845r07562
37618D690092l130396k320690J13988J425697P14246r25909k139215k173988r41513
37609d687688P47173J537281R28003o0491j56356O67124J420810J346422M74984
37600B217262o30960j264065j047669l58930Q581k27008o00328o71481n41552
37591c116150m09081q4936O88221J599266J767583O56952q85622j037608P39089
37582h2286K290518J165409j612775k365240o1256J822974M60719j988221j979766
37573b349924j78432L24307l09602O10955K597897K150508q49256k118489L645
37564a18391J527173m86814k798548j370693J851723K148911m92519j943258o46462
$$ plain form
37626 -8562810 -6768909 -3324227 -1300790 -793161 521433 3423809 5597654 4690092
37618 4690092 1559696 -760994 -647006 778691 1492937 567028 -1572187 -3746175 -4687688
37609 -4687688 -3940515 -2403234 -1475231 -1535722 -1692078 -1024954 395856 1742278 2217262
37600 2217262 1586302 322237 -725432 -1084362 -1075781 -1302789 -1903117 -2574598 -3116150
37591 -3116150 -3525231 -3610167 -2921946 -1322680 444903 1101855 216233 -821375 -82286
37582 -82286 2208232 3373641 1760866 -604374 -665630 1157344 1618063 -370158 -2349924
37573 -2349924 -2528356 -2204049 -2513651 -1902696 695201 2845709 1996453 -122036 -118391
37564 -118391 1408782 921968 -1876580 -3247273 -1395550 753361 260842 -1682416 -2328878
37555b328878Q42145O24396l29287q87406j146511p92273P23783J971743O71077
37546f51211k256844k862985L18115L613735K867209j153983l938392k784945
37538f849301M99256K190891Q66868j270089j195251J144198K830164K057016
37530B73752N12881L79113Q21308j08550j520113r40677J062995J224346j086428
37521F18627k537444j044249J092270J114636j13141l56291J19664k43924r77331
37512b327183m69866Q29033R62071k06578p95205L410R29251R76350O55265M90509
37502A047057R0106o01775o89305J51622P78750K20708p23570o19948M86780J274248
37492A414673J186315J007377J184716Q35530p09707k284331k206463q99885n01255
$$ plain form
37555 -2328878 -1486733 -862337 -1191624 -2079030 -3225541 -4017814 -3294031 -1322288 -651211
37546 -651211 -2908055 -5771040 -5452925 -1839190 1028019 -125964 -4064356 -6849301
37538 -6849301 -6350045 -4159154 -3292286 -4562375 -5757626 -4613428 -1783264 273752
37530 273752 786633 1165746 1987054 1878504 358391 -582286 480709 1705055 618627
37521 618627 -1918817 -2963066 -1870796 -756160 -869301 -1225592 -1105928 -1349852 -2327183
37512 -2327183 -2797049 -1968016 -1005945 -1212523 -2007728 -2004318 -1075067 -98717 556548 1047057
37502 1047057 1137163 535388 -153917 -2295 776455 997163 273593 -346355 140425 1414673
37492 1414673 2600988 3608365 4793081 5628611 4918904 2634573 428110 -471775 -973030
37483i73030j541359j889718r4427K013499J946875M11494k3610O98298K31495
37474G79517j582825j737719R52934L044487J128873k897831m237511j677898
37466f227973J337768J767801K68288r04745q19042K14268J721504K845901K398056
37457B601826M40066j070566n56764P96887M35362j788074k865129o29798K723025
37448H6835L005045k70011k834963j363399J873680K278434m93089k321057q47972
37439h86497J418717J358341l12060r21659j42642J29659p79356j332010j65060
37430a632567K010075L049221J447849j783397l353155j174177K342735K724208
37422C630792l46542k318954o76129J136037m87189l181101k651418n8654J74402
$$ plain form
37483 -973030 -2514389 -4404107 -4498534 -2485035 -538160 -126666 -150276 548022 779517
37474 779517 -803308 -2541027 -1588093 1456394 2585267 -312564 -4550075 -6227973
37466 -6227973 -4890205 -3122404 -2854116 -3758861 -4577903 -4363635 -2642131 203770 2601826
37457 2601826 3041892 1971326 1414562 2211449 2646811 858737 -2006392 -2636190 86835
37448 86835 3091880 2821869 -13094 -1376493 497187 2775621 2282532 -38525 -886497
37439 -886497 532220 1890561 1578501 656842 514200 643859 -135497 -1467507 -1632567
37430 -1632567 377508 3426729 4874578 3091181 -261974 -1436151 906584 3630792
37422 3630792 3284250 965296 289167 1425204 938015 -2243086 -4894504 -4953158 -4778756
37413d778756j594964o87638L312210M875273J241866k934128k660291M36031
37405b790397J870962J139050O35075O29029l11647j651704j653949p20674m93000
37396c347255n87204M27429J663912J032155p52948q44886R74108J684221r4068
37387A55464j759801o72583J963941K914371J180007j151260j744863n84984M01719
37378G02011k6272o75956L20709K193629J970981r23819k928573j228741J826709
37369A230678K145132n1324j292613q18212j067310k404806k082106N65425K352313
37360a422823J438933J88173N52178O09363j215311k188612L66878L588932K760193
37351D677904j198999k946522q34871J228060N34284o61707J65299J558253J200258
$$ plain form
37413 -4778756 -6373720 -7061358 -3749148 1126125 2367991 -566137 -3226428 -2790397
37405 -2790397 -919435 219615 854690 1483719 1172072 -479632 -2133581 -2854255 -3347255
37396 -3347255 -3934459 -3507030 -1843118 -810963 -1563911 -2408797 -1434689 249532 155464
37387 155464 -1604337 -2276920 -312979 2601392 3781399 2630139 885276 300292 702011
37378 702011 675739 -217 320492 2514121 4485102 3561283 632710 -596031 1230678
37369 1230678 3375810 3324486 2031873 1213661 146351 -2258455 -4340561 -3775136 -1422823
37360 -1422823 16110 204283 756461 1365824 150513 -2038099 -1671221 1917711 4677904
37351 4677904 3478905 532383 -302488 925572 1459856 798149 963448 2521701 3721959
37342C721959J03258M40193J311295J75587k483811l347273j210052J183623J156792
37333A051571l32000o24535O14551J167017l63224k551671k952327j019371J380317
37324c629672K100162R12980m80302m68213O57859J151684Q1762j345576j242596
37315b261912M85787J963438J723985L65701o00107o71671l48249O6419N39756
37306A263147N88796k62194j333598j297108n3075R58309O62081l85132j005560
37297h64334p57526J14993J117255J379853J23106k024346l084671j960191J75516
37288e780345J531495J826670J698118R83225p19025k238704j581194J125769
37280c153991L062387J982029j020990k964366k442058n69568J042983J884272
$$ plain form
37342 3721959 3825217 4265410 5576705 5752292 3268481 -78792 -1288844 -105221 1051571
37333 1051571 719571 95036 709587 1876604 1513380 -1038291 -3990618 -5009989 -3629672
37324 -3629672 -1529510 -616530 -1096832 -1565045 -907186 244498 326260 -1019316 -2261912
37315 -2261912 -1776125 187313 1911298 2276999 1676892 1005221 656972 723391 1263147
37306 1263147 1851943 1589749 256151 -1040957 -1094032 -135723 526358 141226 -864334
37297 -864334 -1621860 -1506867 -389612 990241 1113347 -910999 -3995670 -5955861 -5780345
37288 -5780345 -4248850 -2422180 -724062 259163 -459862 -2698566 -4279760 -3153991
37280 -3153991 -91604 1890425 869435 -2094931 -4536989 -5106557 -4063574 -2179302
37272b179302J921561P78259j349896k681446j404352J512194K673224M62316
37264b67442k435541k396095J84623J635470N28423l82022J250779L475347K902986
37255D496528k48859k575567k208082o08717K75932L38111K55894M226o30558
37246i01092j239855j340554r83813l23726O64613J621891J730518P11934o43680
37237g03764j306580r36277J26973J210053J551890Q81508p7873k97095K75798
37228G24633P62561O59749K67997j88219q39913j391422j182754m14905j61552
37219a763825n94386m13677J065113K402052J877716K5428j134993r02071l80035
37210A81322l50620l25463K6021J22260j93206k8255Q29215Q86379q74728k780302
$$ plain form
37272 -2179302 -257741 520518 -829378 -3510824 -4915176 -3402982 -729758 -267442
37264 -267442 -2702983 -5099078 -4914455 -3278985 -2750562 -3132584 -1881805 1593542 4496528
37255 4496528 4247669 1672102 -535980 -1144697 -868765 -530654 -274760 -270534 -901092
37246 -901092 -2140947 -3481501 -4465314 -4789040 -4124427 -2502536 -772018 -60084 -703764
37237 -703764 -2010344 -2946621 -2819648 -1609595 -57705 823803 745930 448835 724633
37228 724633 1487194 2146943 2414940 2226721 1386808 -4614 -1187368 -1602273 -1763825
37219 -1763825 -2358211 -2771888 -1706775 695277 2572993 2598421 1463428 561357 181322
37210 181322 -169298 -494761 -468740 -346480 -539686 -567941 261274 1147653 272925 -2507377
37200b507377k322221J85804J844565J144976l63797q66344n54159j06740Q35251
37191b710042K004429J474243j293340l180813j290604K186082K623486j65238
37183c51797j880801p12877L11840o95778r61435J670920M081727K482285j305542
37174B638542k577467p93494N49320j07674r60504r26437r50766j095989q9009
37165d313478J789009K629278K021355J206406J95037j826788l355522j931524
37157c586227J015730J189872j710444k907649j15259K651710J640900p88345
37149b609712o57201J104987J122722k79167k38733J132881J202201j41109m02447
37140B34422Q10346J162942n9601p69661P4933Q21034L48891j9801P73537J343301
$$ plain form
37200 -2507377 -4829598 -4643794 -2799229 -1654253 -2018050 -2884394 -3438553 -3545293 -2710042
37191 -2710042 -705613 768630 -524710 -3705523 -4996127 -2810045 -186559 -351797
37183 -351797 -2232598 -2945475 -2633635 -3329413 -4290848 -2619928 1461799 3944084 2638542
37174 2638542 61075 -732419 -183099 -290773 -1251277 -2177714 -3128480 -4224469 -4313478
37165 -4313478 -2524469 104809 2126164 3332570 3527607 1700819 -1654703 -3586227
37157 -3586227 -2570497 -1380625 -3091069 -5998718 -6113977 -3462267 -1821367 -2609712
37149 -2609712 -3266913 -2161926 -1039204 -1318371 -1557104 -424223 777978 636869 234422
37140 234422 1044768 2207710 2148109 1378448 1453381 2274415 2623306 2603505 3377042 4720343
37130D720343O9767k142395k946827j566795M58474J214364M49159l51352P8727
37121a6535R78832N97122r01423j225575N11538K004203J156105n45701l77927
37112B180639J325506J962486Q12476m84394j069338j555772j768671p57506P32078
37103A377504O51565r84163j793542p66794K68778j53784r00244m45026O83862
37094b061844J052711M69110j61541r1778P88857J778775J600753K4681j125002
37085B274722l33996Q20495k30588k539334k507814L81298K323162R23153j358490
37076b47392j503578m46132n22918j010638M07364L165307M096909J846493j441603
37067D343812k875423j702609M25343J137783k35516j542988l25698K320812K629935
$$ plain form
37130 4720343 4790110 2647715 -299112 -1865907 -1407433 -193069 256090 -95262 -16535
37121 -16535 962297 1559419 657996 -567579 -56041 1948162 3104267 2558566 2180639
37112 2180639 3506145 5468631 6281107 5796713 4727375 3171603 1402932 645426 1377504
37103 1377504 2029069 1044906 -748636 -1515430 -1246652 -1400436 -2300680 -2745706 -2061844
37094 -2061844 -1009133 -540023 -701564 -793342 -4485 1774290 3375043 3399724 2274722
37085 2274722 1940726 2761221 2530633 -8701 -2516515 -2135217 187945 1111098 -247392
37076 -247392 -1750970 -2197102 -2720020 -3730658 -3323294 -157987 3938922 5785415 4343812
37067 4343812 1468389 -234220 191123 1328906 1093390 -449598 -775296 1545516 4175451
37058D175451k79854k616573j479603P76124N58136j228426j202204N86440J057525
37049C47016l96218j127448o6692O71888k05696j112771o94644J02544M08028
37040b073993R97832J939548J420228j051922k665172j024975J868902K116552
37032A527000n34661k370838q99220J967110K624421J90564k769678l326323j238247
37023d829872J105469J513680L72146j86884P70999J771650R81171j323813l004825
37014b830279k436458j32299J824669J726394j50440j766114j452139K45199J396779
37005c574688J211545P33607Q53110R01859N4860r25594o74337N44477J037293
36996A62132J58965p59908m86083K26401j99211j706275k493210j386666O49695
$$ plain form
37058 4175451 3895597 1279024 -200579 575545 1133681 -94745 -1296949 -710509 347016
37049 347016 -49202 -1176650 -1243342 -571454 -777150 -1889921 -2584565 -2482021 -2073993
37040 -2073993 -1076161 863387 2283615 1231693 -1433479 -2458454 -589552 1527000
37032 1527000 992339 -1378499 -2277719 -310609 2313812 2504376 -265302 -3591625 -4829872
37023 -4829872 -3724403 -2210723 -1838577 -2025461 -1254462 517188 1498359 174546 -2830279
37014 -2830279 -5266737 -5399036 -3574367 -1847973 -1998413 -3764527 -5216666 -4971467 -3574688
37005 -3574688 -2363143 -1629536 -776426 125433 180293 -745301 -1419638 -875161 162132
36996 162132 321097 -438811 -924894 -698493 -897704 -2603979 -5097189 -6483855 -5834160
36987e834160J764162J285428O0286p08356l73701Q96559K031668J666644k29294
36978E59236j687665q89493J207006J867871L31897j215573j052505l64832q82505
36969b126563j768192r96159J152837K366801J786004Q93763P22728M11251p16653
36960A725817j608160j208668k35813J21000J66321R20367K085672K258511R59447
36951E184494p23258j549646j334958o67256p0556L83228R18473J512025J504566
36942E157112K41318j707217k709914k002229p22909k59619l05520K91073J293683
36933g24222J234001k12319j546681j576778q74688m48201k22738K03772M23214
36924c744640R7855R2031J200658K331281J714017k49086j225067l10719P37936
$$ plain form
36987 -5834160 -4069998 -2784570 -2724284 -3432640 -3806341 -2909782 -878114 788530 559236
36978 559236 -1128429 -2017922 -810916 1056955 1388852 173279 -879226 -1244058 -2126563
36969 -2126563 -3894755 -4890914 -3738077 -1371276 414728 1308491 2031219 2442470 1725817
36960 1725817 117657 -1091011 -1326824 -1205824 -1039503 -119136 1966536 4225047 5184494
36951 5184494 4461236 2911590 1576632 909376 838820 1222048 2140521 3652546 5157112
36942 5157112 5398430 3691213 981299 -1020930 -1743839 -2003458 -2308978 -2017905 -724222
36933 -724222 509779 297460 -1249221 -2825999 -3700687 -4148888 -4371626 -4167854 -3744640
36924 -3744640 -3646785 -3554754 -2354096 -22815 1691202 1442116 217049 -93670 644266
36915F44266L58130n49154m08523N03232Q67585M81339p5351r20535k111558k249905
36905c460474j73539K328257K085584q87865k941488j708197R05888J905881J161980
36896g83973M06917J42667k10725l25233M70298J275951N83966j051524j474883
36887i66539j63707J057765R46902M96801Q37869J260229O26823n16150p76689
36878B803304j66930P559p08904j320609j144421q78262j190828j263284L009
36869c859366J751053J736208m75477k386620j738478M17767J457559J087732
36861b009622J227015K227231K009163j97973j951444j187965M90436M54086p67651
36852B93276p59711M95469Q60948J19423K80113J421448Q72799j996367l551666
$$ plain form
36915 644266 1002396 453242 44719 547951 1415536 1896875 1821524 900989 -1210569 -3460474
36905 -3460474 -3634013 -1305756 779828 -108037 -3049525 -4757722 -3851834 -1945953 -783973
36896 -783973 -377056 -234389 -445114 -770347 -300049 975902 1559868 508344 -966539
36887 -966539 -1130246 -72481 874421 1371222 2209091 3469320 4096143 3579993 2803304
36878 2803304 2636374 2643933 1935029 614420 -530001 -1408263 -2599091 -3862375 -3859366
36869 -3859366 -2108313 -372105 -847582 -3234202 -4972680 -4554913 -3097354 -2009622
36861 -2009622 -782607 1444624 3453787 3255814 1304370 116405 606841 1060927 293276
36852 293276 -466435 29034 889982 1009405 1289518 2710966 3583765 1587398 -1964268
36843a964268j028951K672754K681373q23241k963586j246557J407315J619874
36835C54713K20380r8653O51077L70143j150984j823307o92497P98187J366420
36826d521J366753R85281o40978l131651l913261j622180J248381J517710j59859
36817d354325o54352P13118J754471J536959J430488J662958M23429k358703l656832
36808c502789j677889J233257K169276J638857J546011J485195o395k107736k619950
36799a842163j269344M07686J539570J965790R86587j340208k699731j099516
36791c351329J825187K803065J487536K53076J77085K42729L7437J50435J77898
36782C803119o68218j335674m16917O89773l68528k392027k065218K91100J058195
$$ plain form
36843 -1964268 -2993219 -320465 2360908 1537667 -1425919 -2672476 -1265161 354713
36835 354713 575093 476440 1127517 1497660 346676 -1476631 -2169128 -1370941 -4521
36826 -4521 1362232 2347513 1706535 -1425116 -5338377 -6960557 -5712176 -4194466 -4354325
36817 -4354325 -5008677 -4295559 -2541088 -1004129 426359 2089317 2512746 154043 -3502789
36808 -3502789 -5180678 -3947421 -1778145 -139288 1406723 2891918 2885523 777787 -1842163
36799 -1842163 -3111507 -2703821 -1164251 801539 1788126 447918 -2251813 -3351329
36791 -3351329 -1526142 1276923 2764459 3017535 3194620 3437349 3474786 3625221 3803119
36782 3803119 3134901 1799227 1382310 2072083 1703555 -688472 -2753690 -2462590 -1404395
36773a404395k42506n8903K387125K925161m21464l344824j932635J072999J112000
36764I2558p65620l56613K331304L425861J643985m30561j112397j416250j968916
36755A443351j755544m84495O05328P82465N65922L92592L32435O82121J097551
36746C661726J11696k416091l678447j414644K146512K934976P64935r27396m93742
36737F89525L70864L47815R0115k43759j478959k761055j842378R98448K590002
36728a239382J545445J01133L1696J12132o29511n55568J249665K323151M88528
36719C427289k200003k376917m01427Q13592N93361N98856R51095k1865k074970
36710f90989k560574n44414J494507J416691M70595Q42710K002131J676580m28971
$$ plain form
36773 -1404395 -1646901 -1705804 681321 3606482 3185018 -159806 -2092441 -1019442 92558
36764 92558 -673062 -1029675 1301629 4727490 6371475 5940914 4828517 3412267 1443351
36755 1443351 -312193 -796688 -191360 591105 1157027 1549619 1882054 2564175 3661726
36746 3661726 3773422 1357331 -2321116 -3735760 -1589248 1345728 2110663 1183267 689525
36737 689525 1060389 1408204 1498319 1254560 -224399 -2985454 -4827832 -3829384 -1239382
36728 -1239382 306063 407196 438892 551024 -78487 -634055 615610 2938761 3427289
36719 3427289 1227286 -1149631 -1551058 -737466 -144105 454751 1405846 1383981 -690989
36710 -690989 -3251563 -3795977 -2301470 -884779 -414184 428526 2430657 4107237 3678266
36701C678266k053485j536617J01615P81627J1889q53320n55663N84899J214299
36692A373510O34036l41608l71680O33632J161753m1597k065072k636305r57604
36683b610935J253933K094282J754556J413289R23571n40630k074173j693523
36675E20370K79145R69772q30020k522968j510461Q74508J524428J32270j027159
36666a590115r18377n27109k35329P42039K141428K459799J447782N28723K77590
36657D326431k72416j312590j613927q91020l98088l34062O93457K408214K010081
36648D616080j376352m101144k675455R71377K181779K07137j353502k86076J542699
36639b73457J671240K78930j039043j468682r16203M18744J462390R05430o77071
$$ plain form
36701 3678266 1624781 88164 189779 971406 983295 129975 -425688 159211 1373510
36692 1373510 2007546 1665938 1294258 1927890 3089643 3048046 982974 -1653331 -2610935
36683 -2610935 -1357002 737280 2491836 3905125 4828696 4288066 2213893 520370
36675 520370 799515 1769287 939267 -1583701 -3094162 -2219654 -695226 -562956 -1590115
36666 -1590115 -2508492 -3035601 -3270930 -2528891 -387463 2072336 3520118 4048841 4326431
36657 4326431 4054015 2741425 1127498 236478 -161610 -495672 197785 2605999 4616080
36648 4616080 3239728 -861416 -3536871 -2565494 -383715 -176578 -1530080 -1816156 -273457
36639 -273457 1397783 1676713 637670 -831012 -1747215 -1328471 133919 1039349 362278
36630C62278r75872P58933K213154J160944j296655k334077j248961J22618L11713
36621i25925k82006p33066q06868n40407Q8102O55099N24754k600J93837J257987
36611e71093J700679L92915j556949k009636n46327J048733J094707j02629j010646
36602a560246q57779k63535p8757k22128m0371M26807K60229q93075j854389j318084
36592f401328J16706N94541k51533p07251L26998J628484J685385R45458N77766
36583a484774L62820l28229o80081J53185P97883m12988j952126q46386K172712
36574b217984K997303L87586j939535j094066P90910N91691q61130j002942m1352
36565b389519K55377K01907R87284J507564K13904j255666l74304J391518M88297
$$ plain form
36630 362278 -613594 145339 2358493 3519437 2222782 -111295 -1360256 -1237638 -925925
36621 -925925 -1207931 -1940997 -2747865 -3288272 -3200170 -2545071 -2020317 -2022917 -1829080 -571093
36611 -571093 1129586 1522501 -34448 -2044084 -2590411 -1541678 -446971 -549600 -1560246
36602 -1560246 -2418025 -2681560 -2760317 -2982445 -3022816 -2596009 -2335780 -3228855 -5083244 -6401328
36592 -6401328 -6284622 -5690081 -5941614 -6648865 -6321867 -4693383 -3007998 -2062540 -1484774
36583 -1484774 -1121954 -1450183 -2130264 -1977079 -1179196 -1592184 -3544310 -4390696 -2217984
36574 -2217984 779319 1166905 -772630 -1866696 -1075786 -484095 -1345225 -2348167 -2389519
36565 -2389519 -2134142 -1932235 -944951 562613 776517 -479149 -853453 538065 1026362
36556A026362k424728k950998p4505K181377J445433M37669J501549K268414R7651
36547C508224k788467k600498n794J181035n0238j068911j99183J196972J417261
36538E90401O06612k10759m58997n2371N78351N16574m97375j332997r89954j78419
36528a428934l7655j10526O12993J302657K11673k060915k609347k33620K583746
36519a769928K918868J136755j45900J06912L94563n04395j538342j141353J44867
36510c97953L75923o95698j000489O42792K271277J319210j475819k710356q00451
36501b471564K014239K622263N52242k071794k958811j495134R04013J915814
36493i88732O24009j232791j342322Q8322Q54235K07971k96123K41047N73511
$$ plain form
36556 1026362 -1398366 -4349364 -4423869 -2242492 -797059 -359390 1142159 3410573 3508224
36547 3508224 719757 -1880741 -1886535 -705500 -755738 -1824649 -2023832 -826860 590401
36538 590401 1197013 986254 527257 474886 1053237 1569811 1072436 -260561 -1250515 -1428934
36528 -1428934 -1466589 -1577115 -964122 338535 550208 -1510707 -4120054 -4353674 -1769928
36519 -1769928 1148940 2285695 2139795 2246707 2641270 2136875 598533 -542820 -397953
36510 -397953 -22030 -717728 -1718217 -1075425 1195852 2515062 1039243 -1671113 -2471564
36501 -2471564 -457325 2164938 2717180 645386 -2313425 -3808559 -2904546 -988732
36493 -988732 -364723 -1597514 -2939836 -2851514 -1997279 -1789308 -2085431 -1844384 -1270873
36484a270873k39046j015556n09143M83089O67509M65441R61693J720884J379944
36475B643942j69882j580895j720118o87787M75854O93705q854l43317L47415
36466c49937O31084q02605k195769q58584J982331K226159n67660j979453K24590
36457a689844K341538R34231j489279j049250Q92634O41610j047639o32115J458086
36448C59972J478685q22265j671680J73400J573478O37737n79511l88958j10134
36439F50724o79421n57870R46747J726883M29238j016019o19797N04924L94565
36430A779974n83128r38888o12644l51717n3669N82125J013067P53347J49924
36421A738391m94797j154319j082779M25790J947453J140997j305877j863401
$$ plain form
36484 -1270873 -1509919 -2525475 -3034618 -2551529 -1884020 -1418579 -456886 1263998 2643942
36475 2643942 2474060 893165 -826953 -1514740 -1038886 -345181 -354035 -697352 -349937
36466 -349937 281147 -521458 -2717227 -3575811 -1593480 632679 65019 -1914434 -1689844
36457 -1689844 651694 1585925 96646 -952604 -59970 581640 -465999 -1098114 359972
36448 359972 1838657 1016392 -655288 -481888 1091590 1729327 1149816 760858 650724
36439 650724 -28697 -586567 360180 2087063 2516301 1500282 880485 1385409 1779974
36430 1779974 1196846 257958 -354686 -706403 -760072 -177947 835120 1588467 1738391
36421 1738391 1243594 89275 -993504 -567714 1379739 2520736 1214859 -648542
36413f48542N83384K741390J828119n49725j586142j459577j632216j473281K10452
36404a986138K014818J581674n73557j746134r38339L76639Q58588M73065m82779
36395d22163j552636j707721m55667J063348J470689R42970L47933l37258j231816
36386a882321j338790P5202J803739K105368R53287n31724j717700k079940p78692
36377c391571J524206K163622P6964j847194p82005J414999J038767j367545j885871
36368c055628L43400J977980J153578l5276N4342j58917j772893k508217l47714
36359d349345K592900K911897Q17153q46205j165662j600220k426171j949683
36351f015336K66160K017298J450662l49146j076599l05081N57687P50935J039181
$$ plain form
36413 -648542 -65158 2676232 4504351 3954626 2368484 908907 -723309 -2196590 -1986138
36404 -1986138 28680 1610354 1036797 -709337 -1647676 -1271037 -412449 60616 -422163
36395 -422163 -1974799 -3682520 -4138187 -3074839 -1604150 -661180 -313247 -650505 -1882321
36386 -1882321 -3221111 -3145909 -1342170 763198 1716485 1184761 -532939 -2612879 -3391571
36377 -3391571 -1867365 296257 373221 -1473973 -2255978 -840979 197788 -1169757 -3055628
36368 -3055628 -2712228 -734248 419330 384054 438396 279479 -1493414 -4001631 -4349345
36359 -4349345 -1756445 1155452 1972605 1126400 -39262 -1639482 -4065653 -6015336
36351 -6015336 -5749176 -3731878 -2281216 -2630362 -3706961 -4012042 -3454355 -2703420 -1664239
36342a664239K005823K763590K113983L25925j134290j465487j291385j428546
36334B25374j653749j185487K8776J089939J190983N34875N4451K80397P07222
36325A272781N59191J3526l3414M72360M35552n91226j481605j386173j200825
36316a939833j661846j352602J054393L572285K919741n23380k968341k611546
36308c511129j387809p39503N31992K680973L111330N50373k079130j850109j72958
36299b865970R6904o29659k71117P53173O45736p4887L19457J226908Q83885l3302
36289E1128L87831J470356J093076j44117J40059J505021J128048j215945k631550
36280A783907j834739o13512j82126K32325P29872L26818l46973L64637J486235
$$ plain form
36342 -1664239 341584 3105174 5219157 5545082 4410792 2945305 1653920 225374
36334 225374 -1428375 -2613862 -2585086 -1495147 -304164 230711 285162 565559 1272781
36325 1272781 1831972 1845498 1812084 2284444 2719996 2128770 647165 -739008 -1939833
36316 -1939833 -3601679 -4954281 -3899888 -327603 2592138 2068758 -899583 -3511129
36308 -3511129 -4898938 -5638441 -5106449 -2425476 685854 1236227 -842903 -2693012 -2865970
36299 -2865970 -2769066 -3398725 -3669842 -2916669 -2270933 -2345820 -2026363 -799455 84430 51128
36289 51128 438959 1909315 3002391 2858274 2998333 4503354 5631402 4415457 1783907
36280 1783907 -50832 -664344 -846470 -614145 115727 442545 95572 460209 1946444
36271A946444L48153k307405k590314J68510J955127N65916j120302n78940K56134
36262a356677o85367j360344O05386L155609K722867l84933k935589l205134j555443
36253d999625J382448M204415M369476J277419j934793k254412o99892L965m68041
36244H80960q99120j308824j955324j592125K98495J545193O08778l07948J135600
36235a594315K916622J729429j282028k274303r11581k54268j143656j302822
36227d116922J0156Q26353L94224L20019J081941J038855j84047o37977N42645
36218g24753J576042R98275k57622p30950l28898L02246N04807m26617k135450
36209a222920k427410M4505K818850K240109j209796l350020k099833M62904K083670
$$ plain form
36271 1946444 2294597 -12808 -2603122 -2434612 -479485 86431 -1033871 -1612811 -1356677
36262 -1356677 -2042044 -3402388 -2797002 358607 3081474 2696541 -239048 -3444182 -4999625
36253 -4999625 -3617177 587238 4956714 6234133 4299340 2044928 1345036 1349001 880960
36244 880960 -18160 -1326984 -3282308 -4874433 -4575938 -3030745 -2421967 -2729915 -1594315
36235 -1594315 1322307 3051736 1769708 -504595 -1416176 -1670444 -2814100 -4116922
36227 -4116922 -4106766 -3280413 -2886189 -2566170 -1484229 -445374 -629421 -1267398 -724753
36218 -724753 851289 1849564 1591942 860992 532094 834340 1339147 912530 -1222920
36209 -1222920 -3650330 -3605825 -786975 1453134 243338 -3106682 -5206515 -4743611 -2659941
36200b659941K805503K732150R41244j946281l224880j787775J92634O67915L15425
36191a964006L68408L64809k64417n15721N06060J827636J976566Q69295n59662
36182B608968j388931j008079J81809M67218r58157k006456m58089J971602J774834
36173A184719n17423r57613J017801J372715j439767l241956p88255K770828K735821
36164B136870k55472k061346j231258K96162Q17306M8827j647619k696216j000082
36155e592828K469669L448839M60599k009031K4538L544246L107375n95288k226140
36146B631979m93133M27885j791043m237759l830886j396971Q71735K430814L157291
36137b230088K145848l29476j890561r56584R38172J251600j99703j280010m24444
$$ plain form
36200 -2659941 145562 2877712 3818956 1872675 -1352205 -3139980 -2947346 -2279431 -1964006
36191 -1964006 -1595598 -1230789 -1495206 -2010927 -1504867 322769 2299335 3168630 2608968
36182 2608968 1220037 211958 393767 860985 -97172 -2103628 -2561717 -590115 1184719
36173 1184719 667296 -290317 727484 2100199 660432 -2581524 -3369779 -598951 2136870
36164 2136870 1881398 -179948 -1411206 -1115044 -297738 -248911 -1896530 -4592746 -5592828
36155 -5592828 -3123159 325680 786279 -1222752 -1198214 2346032 5453407 4858119 2631979
36146 2631979 2138846 2566731 775688 -3462071 -7292957 -8689928 -7818193 -5387379 -2230088
36137 -2230088 -84240 -413716 -2304277 -3260861 -2322689 -1071089 -1270792 -2550802 -2975246
36128b975246J478323K249486J211641J42803O09949J154441o53083l542445l294081
36119c618212P51993L690733J914750j623562k332585p80439k66098m98774R77650
36110a784544K937167J897549j307143k148362K27345J752849L46138j222429
36102F98570p49064P2221l40415n71006M15621R33638j1241m73027Q39817J888292
36092B703406P57301r53154p66191P98133J307809k04004k568798l765647k150610
36083d841755J665563L990009J867903k147665k662025P21116K706752O21999
$$ plain form
36128 -2975246 -1496923 752563 1964204 2107007 2716956 3871397 3218314 -324131 -3618212
36119 -3618212 -2866219 824514 2739264 1115702 -1216883 -1997322 -2263420 -2762194 -1784544
36110 -1784544 1152623 3050172 1743029 -405333 -177988 1574861 1920999 698570
36102 698570 -50494 21727 -318688 -889694 -474073 459565 448324 -24703 815114 2703406
36092 2703406 3460707 2507553 1741362 2539495 3847304 3643300 1074502 -2691145 -4841755
36083 -4841755 -3176192 813817 2681720 534055 -2127970 -1406854 1299898 1921897
$$ [...]
##END NTUPLES=NMR SPECTRUM
##END=
