##TITLE=31Pdec_675
 CDCl3, 24 sc
 25.12.2019
##JCAMPDX= 6.0         $$ Bruker NMR JCAMP-DX V2.0
##DATA TYPE= NMR SPECTRUM
##DATA CLASS= NTUPLES
##ORIGIN= UXNMR, Bruker Analytische Messtechnik GmbH
##OWNER= root
$$ XWIN-NMR		Version 3.5
$$ Wed Dec 25 13:57:41 2019 Russian Standard Time (UT+4h)  she@DPX200
##.OBSERVE FREQUENCY= 81.013821
##.OBSERVE NUCLEUS= ^31P
##.ACQUISITION MODE= SIMULTANEOUS
##.ACQUISITION SCHEME= undefined
##.AVERAGES= 24
##.DIGITISER RES= 17
##SPECTROMETER/DATA SYSTEM= spect
##.PULSE SEQUENCE= zgpg30
##.SOLVENT NAME= CDCl3
##.SHIFT REFERENCE= (INTERNAL, CDCl3, 0, 182.463)
##AUDIT TRAIL= $$ (NUMBER, WHEN, WHO, WHERE, WHAT)
$$ ##TITLE= Audit trail, XWIN-NMR		Version 3.5
$$ ##JCAMPDX= 5.01
$$ ##ORIGIN= Bruker BioSpin GmbH
$$ ##OWNER= she
$$ F:/spectra/data/she/nmr/P31/1/pdata/1/auditp.txt
$$ ##AUDIT TRAIL=  $$ (NUMBER, WHEN, WHO, WHERE, WHAT)
(   1,<2019-12-25 13:56:53.57 +0400>,<she>,<DPX200>,
      <created by zg, POWCHK disabled, PULCHK disabled
       configuration hash MD5:
       00 E9 B6 7A A2 85 ED C7 34 08 36 98 17 FE 4E 26
       data hash MD5: 32K
       21 FB B6 EF 15 A1 71 F4 A6 6E E0 20 7E E2 36 64>)
(   2,<2019-12-25 13:56:56.29 +0400>,<she>,<DPX200>,
      <Start of raw data processing
       efp BC_mod = 2 LB = 1 FT_mod = 6 PKNL = 1 PHC0 = -1719.591 PHC1 = 156.0012 SI = 64K 
       data hash MD5: 64K
       6B C4 7B A1 32 51 99 6A 8C CD E1 E4 F0 B6 0B 58>)
(   3,<2019-12-25 13:57:12.07 +0400>,<she>,<DPX200>,
      <pk PHC0 = 29.63955 PHC1 = 0 
       data hash MD5: 64K
       AF 61 16 DC CB 4A 08 DA C6 85 05 86 BE 4C 60 41>)
(   4,<2019-12-25 13:57:15.18 +0400>,<she>,<DPX200>,
      <abs ABSG = 5 
       data hash MD5: 64K
       5C 1E 85 86 0E 51 7D E3 4E 04 40 07 AD 24 2A D7>)
$$ ##END=
$$ 
$$ hash MD5
$$ 88 19 0E BD E3 9E 51 3D 3C 6B BB 04 EE 04 D9 BB
##$RELAX= 
##$RELAX= 
##$RELAX= 
##$RELAX= 
##$RELAX= 
##$RELAX= 
##$RELAX= 
##$RELAX= 
$$ Bruker specific parameters
$$ --------------------------
##$DU= <F:/spectra>
##$EXPNO= 1
##$NAME= <P31>
##$PROCNO= 1
##$TYPE= <nmr>
##$USER= <she>
##$AMP= (0..31)
100 100 100 100 100 100 100 100 100 100 100 100 100 100 100 100 100 100 
100 100 100 100 100 100 100 100 100 100 100 100 100 100 
##$AQSEQ= 0
##$AQ_mod= 1
##$AUNM= <au_zg>
##$AUTOPOS= <>
##$BF1= 81.014009
##$BF2= 200.13
##$BF3= 200.13
##$BF4= 200.13
##$BF5= 200.13
##$BF6= 200.13
##$BF7= 200.13
##$BF8= 200.13
##$BYTORDA= 1
##$CFDGTYP= 0
##$CFRGTYP= 5
##$CHEMSTR= <none>
##$CNST= (0..31)
1 1 145 1 1 1 1 1 1 1 1 1 1 1 1 1 1 1 1 1 1 1 1 1 1 1 1 1 1 1 1 1 
##$CPDPRG= <waltz16>
##$CPDPRG1= <>
##$CPDPRG2= <waltz16>
##$CPDPRG3= <>
##$CPDPRG4= <mlev>
##$CPDPRG5= <mlev>
##$CPDPRG6= <mlev>
##$CPDPRG7= <mlev>
##$CPDPRG8= <mlev>
##$CPDPRGB= <>
##$CPDPRGT= <>
##$D= (0..31)
0 1 0 0 0 0 0 0 0 0 0 0.03 2e-05 3e-06 0 0 0 0 0 0 0 0 0 0 0 0 0 0 0 0 
0 0 
##$DATE= 1577267813
##$DBL= (0..7)
120 120 120 11 120 120 24 19 
##$DBP= (0..7)
150 150 150 150 150 150 150 150 
##$DBP07= 0
##$DBPNAM0= <>
##$DBPNAM1= <>
##$DBPNAM2= <>
$$ [...]
##$SUBNAM3= <"">
##$SUBNAM4= <"">
##$SUBNAM5= <"">
##$SUBNAM6= <"">
##$SUBNAM7= <"">
##$SUBNAM8= <"">
##$SUBNAM9= <"">
##$SW= 369.568048894756
##$SWIBOX= (0..15)
0 1 3 0 0 0 0 0 0 0 0 0 0 0 0 0 
##$SW_h= 29940.119760479
##$TD= 32768
##$TD0= 1
##$TE= 0
##$TE2= 300
##$TE3= 300
##$TEG= 300
##$TL= (0..7)
0 120 53 12 22 120 120 120 
##$TP= (0..7)
150 150 150 150 150 150 150 150 
##$TP07= 0
##$TPNAME0= <>
##$TPNAME1= <>
##$TPNAME2= <>
##$TPNAME3= <>
##$TPNAME4= <>
##$TPNAME5= <>
##$TPNAME6= <>
##$TPNAME7= <>
##$TPOAL= (0..7)
0.5 0.5 0.5 0.5 0.5 0.5 0.5 0.5 
##$TPOFFS= (0..7)
0 0 0 0 0 0 0 0 
##$TUNHIN= 0
##$TUNHOUT= 0
##$TUNXOUT= 0
##$USERA1= <user>
##$USERA2= <user>
##$USERA3= <user>
##$USERA4= <user>
##$USERA5= <user>
##$V9= 5
##$VALIST= <valist>
##$VCLIST= <CCCCCCCCCCCCCCC>
##$VD= 0
##$VDLIST= <DDDDDDDDDDDDDDD>
##$VPLIST= <PPPPPPPPPPPPPPP>
##$VTLIST= <TTTTTTTTTTTTTTT>
##$WBST= 1024
##$WBSW= 4
##$XGAIN= (0..3)
0 0 0 0 
##$XL= 0
##$YL= 0
##$YMAX_a= 97322
##$YMIN_a= -95370
##$ZGOPTNS= <>
##$ZL1= 120
##$ZL2= 120
##$ZL3= 120
##$ZL4= 120
##$ABSF1= 182.463
##$ABSF2= -187.1042
##$ABSG= 5
##$ABSL= 3
##$ALPHA= 0
##$AQORDER= 0
##$ASSFAC= 0
##$ASSFACI= 0
##$ASSFACX= 0
##$ASSWID= 0
##$AUNMP= <proc_1d>
##$AZFE= 0.1
##$AZFW= 0.5
##$BCFW= 0
##$BC_mod= 2
##$BYTORDP= 0
##$COROFFS= 0
##$CY= -3
##$DATMOD= 1
##$DC= 0
##$DFILT= <>
##$DTYPP= 0
##$F1P= 0
##$F2P= 0
##$FCOR= 1
##$FTSIZE= 65536
##$FT_mod= 6
##$GAMMA= 0
##$GB= 0
##$INTBC= 1
##$INTSCL= 5.30512e-09
##$ISEN= 30
##$LB= 1
##$LEV0= 0
##$LPBIN= 0
##$MAXI= 10000
##$MC2= 0
##$MEAN= 0
##$ME_mod= 0
##$MI= 50
##$NCOEF= 0
##$NC_proc= -4
##$NLEV= 6
##$NOISF1= 182.463
##$NOISF2= 159.3651
##$NSP= 0
##$NTH_PI= 0
##$NZP= 0
##$OFFSET= 182.463
##$PC= 4
##$PHC0= -1689.951
##$PHC1= 156.0012
##$PH_mod= 1
##$PKNL= yes
##$PPARMOD= 0
##$PSCAL= 0
##$PSIGN= 0
##$REVERSE= no
##$SF= 81.0140089999434
##$SI= 65536
##$SIGF1= 159.3651
##$SIGF2= -187.1042
##$SINO= 113.3802
##$SIOLD= 16384
##$SREGLST= <1H.CDCl3>
##$SSB= 0
##$STSI= 65536
##$STSR= 0
##$SW_p= 29940.119760479
##$SYMM= 0
##$S_DEV= 0
##$TDeff= 32768
##$TDoff= 0
##$TI= <>
##$TILT= no
##$TM1= 0
##$TM2= 0
##$TOPLEV= 0
##$USERP1= <user>
##$USERP2= <user>
##$USERP3= <user>
##$USERP4= <user>
##$USERP5= <user>
##$WDW= 1
##$XDIM= 65536
##$YMAX_p= 525016919
##$YMIN_p= -8491236
$$ End of Bruker specific parameters
$$ ---------------------------------
##NTUPLES= NMR SPECTRUM
##VAR_NAME=  FREQUENCY,     SPECTRUM/REAL,   SPECTRUM/IMAG
##SYMBOL=    X,             R,               I
##VAR_TYPE=  INDEPENDENT,   DEPENDENT,       DEPENDENT
##VAR_FORM=  AFFN,          ASDF,            ASDF
##VAR_DIM=   65536,         65536,           65536
##UNITS=     HZ,            ARBITRARY UNITS, ARBITRARY UNITS
##FACTOR=    0.456856943014862, 1,           1
##FIRST=     14782.0589164792, 0,            0
##LAST=      -15158.0608439998, 0,           0
##MIN=       -15158.0608439998, -8491236,    0
##MAX=       14782.0589164792, 525016919,    0
$$ Real data points
##PAGE= N=1
##DATA TABLE= (X++(R..R)), XYDATA
$$ [...]
42499A17990R8790J59637r0440k60896j92577p9759j5514P7939J28803K1025m3256
42488g8258J92591M70078K99621j79082k73311J96918N62814K93624k71316n15256
42478F98423l52574o6688J96092L49860J93808k31579m55844k02477J17129J4395
42468B60545k85679k33478J07831J66183j94753m86531l85858j16102P6532K73358
42458h17952N06401N15026J63927k44605l41939j22037J84919L99290L87110O5895
42448F96035l78238n46044l08408N172P7794j3802p9740j44912k25498j14438
42438a032079K47269M76876K54740j15254j30789J08236P8803k69037m03016o9759
42428h54010L06607K92047L5420p2737L9604J83204K31261J42093p9472k41055
$$ y = [117990, 216780, 376417, 285977, 25081, -167496, -247255, -262769, -184830, -56027, -35002, -78258, 114333, 584411, 884032, 704950, 431639, 628557, 1191371, 1484995, 1213679, 698423, 345849, 279161, 475253, 825113, 1018921, 787342, 331498, 129021, 246150, 260545, -25134, -258612, -150781, 15402, -179351, -665882, -1051740, -1167842, -1091310, -817952, -311551, 203475, 367402, 122797, -219142, -341179, -156260, 243030, 630140, 696035, 317797, -228247, -536655, -531483, -453689, -467491, -547231, -692143, -917641, -1032079, -784810, -307934, -53194, -168448, -299237, -191001, -112198, -381235, -784251, -854010, -547403, -255356, -219936, -292673, -253069, -69865, 161396, 303489, 224017, -17038]
42418a7038p5156L00507L72928m9526m67451l89725n7663j2118k20314k00273
42408h15829J29245L26562J68434l4697J4606J93829K59072J74462r975k72703
42398A33006m66321l63742k845L02559M00433M28837M18559J74467k69421m94814
42388B60718k70694P8321J63881N1562k2656r5454k51213k78973n583K82888K21784
42377A34581l9698j03709J6220K3157m5307P7825K61087J03516k93040l48621
42367b13989O3477L54884J33242k19283k12478K6578R9043j4807q0780o4301n0073
42356a78487K2952J64999J29778k04640m83411l16388J15886L13518J67359L873
42346b64561K6660J19493J49521J02390l9793k34242k72385o3931R3444r4003
$$ y = [-17038, -92194, 208313, 581241, 531715, 64264, -325461, -383124, -395242, -615556, -815829, -686584, -360022, -191588, -226285, -211679, -17850, 241222, 415684, 405709, 133006, -333315, -697057, -699902, -397343, 3090, 431927, 850486, 1024953, 755532, 260718, -9976, 68345, 232226, 283788, 261132, 165678, -85535, -364508, -370091, -87203, 134581, 94883, -8826, 7394, 30551, -14756, 63069, 324156, 427672, 134632, -213989, -150512, 204372, 337614, 118331, -94147, -67569, 31474, 16667, -64113, -128414, -178487, -155535, 9464, 139242, -65398, -548809, -865197, -749311, -435793, -268434, -264561, -237901, -118408, 31113, 133503, 93710, -140532, -412917, -476848, -383404, -477407]
42336d77407l77059k68283J85845M40915K70501K7240K081M0690k4519m2154R9471
42325a22679J82497J8445k20261k98357k73638l06110l60383l25252k00374J3438
42315a892674L42074O00453M73254M0676j65771Q8820L46784J63795k09432l05033
42305e17054j89383j61678o0242M10800Q87433O97717k5046m02043j09404J75038
42295G06138r7006n12051m42239j4340K22436J53258M3994n7565k82242m78727
42285g58344l43089M6624K87200K37447J57817K42653L56304K95031M8875k49385
42275C21133m42384m10359j85236K8976J00082J41993K76466L64987K16894o8307
42265C44245k41236k66750k58601j84338K3231J84849J01112m2941M7336J78467
$$ y = [-477407, -854466, -1122749, -936904, -495989, -225488, -198248, -196167, -155477, -179996, -222150, -122679, 59818, 78263, -141998, -440355, -713993, -1020103, -1380486, -1705738, -1906112, -1892674, -1550600, -950147, -476893, -436217, -601988, -513168, -166384, -2589, -212021, -517054, -706437, -868115, -928357, -517557, 369876, 1067593, 1042547, 640504, 531100, 706138, 609132, 97081, -345158, -359498, -137062, 16196, 60190, 2625, -279617, -758344, -1101433, -1054809, -767609, -530162, -372345, -129692, 226612, 521643, 570518, 321133, -121251, -531610, -716846, -687870, -587788, -445795, -169329, 195658, 412552, 344245, 103009, -163741, -422342, -606680, -583449, -398600, -297488, -340429, -293093, -114626]
42255a14626r9997o54486p90312k85839K23939K09507L880J47785M87657N13885
42245c58607K42594J09387J76703J01288j56702k20593J7392J57819n4720l04551
42235b89990k16642N5798J09182n4435m0354K86603N01708J55266n46212q67173
42225i06249m28151K63547M16460l9093m19426k65917J07422K31970J73473K16605
42215f49359K54113L2511k30726q3199L85059N88954L12027j7427k2117J46385
42205G16221J85847O3902j16883k91348l17467o8043K34521J85816j69767l40535
42195H2264j74746j00730l27249m00666K0473M86486L94834j06927m24013l81691
42185i31965k13191J5579L43103N06074K47097j24251j12390J50241J27795j80417
$$ y = [-114626, -214623, -869109, -1659421, -1945260, -1721321, -1511814, -1507934, -1360149, -872492, -358607, -116013, -6626, 170077, 271365, 114663, -105930, -88538, 69281, 14561, -289990, -506632, -450834, -341652, -396087, -436441, -149838, 351870, 507136, -39076, -906249, -1334400, -1070853, -654393, -693486, -1112912, -1378829, -1271407, -1039437, -865964, -649359, -395246, -362735, -593461, -676660, -291601, 297353, 609380, 591953, 569836, 716221, 902068, 965970, 849087, 557739, 240272, 172229, 406750, 592566, 422799, 82264, -92482, -193212, -520461, -921127, -900654, -414168, -19334, -126261, -550274, -931965, -1145156, -1129577, -786474, -280400, -33303, -157554, -269944, -119703, 8092, -172325]
42175a72325k49073L3378J85951K330j32311J4650J52892R6072R7988K57697K34538
42164E21787p7818k27643M938J19227k53872n89202k44045M51353O47221K27855
42154E79801j67257k12941k02156k97587k39448M9831K12372N0390j23857O189
42144c44663K89500L78425J76761j59388m09242l64243K764L59418L15054k3215
42134B21171j56786M5660J37867j49142m08282j84605K65517L22375r4872m53442
42124d54539l58757M5449M19788N78995M50334N1032l65131m40119j55198R5084
42114a33062L4182j28156p5365R0261K9282k38637l13156l9107K20291J34295
42104d19172p5251J2499L29782L95291N5676k61184j68464J49392K63555J03390
$$ y = [-172325, -421398, -388020, -202069, -199739, -332050, -317400, -164508, -68436, 29552, 287249, 521787, 443969, 216326, 221264, 340491, 86619, -502583, -746628, -295275, 351946, 579801, 412544, 199603, -2553, -300140, -539588, -489757, -277385, -226995, -350852, -344663, -55163, 323262, 500023, 340635, -68607, -432850, -430086, -70668, 244386, 221171, 64385, 110045, 247912, 98770, -309512, -494117, -228600, 93775, -1097, -454539, -813296, -767847, -348059, 230936, 681270, 732302, 367171, -72948, -228146, -133062, -98880, -227036, -302401, -212140, -182858, -421495, -734651, -773758, -553467, -419172, -494423, -481924, -152142, 243149, 298825, 37641, -130823, 18569, 282124, 385514]
42094C85514n6107m9608L7569J09039J57240J37316j9204k44301l73219l57211
42084b72972k87186k28527j85210j77460j79163m5775K80617N56734M80952J15671
42074E7681j93269k80606k50239j45295Q4371K55044L5637m77224o89294k79520
42064a882714L05645M50537J85972L7864K43301N05990M81910J93146p1132q1586
42054C68933J09145J90664o5256m35245m29695L1202M08492K38735k45025n03762
42044c31812m40727l39073k50953K2251L81567M06570J2160l15262j60885K61030
42034g55134M34305K02329j32754k40639r2366R1915J00123o4866k11952k06155
42024h75194j17310n7025M009J01653J05237p2003j96036L0090M58527N97757
$$ y = [385514, 329407, 279799, 317368, 426407, 583647, 720963, 701759, 457458, 84239, -272972, -560158, -788685, -973895, -1151355, -1330518, -1376293, -1095676, -538942, -57990, 57681, -135588, -416194, -666433, -811728, -727357, -472313, -436676, -913900, -1603194, -1882714, -1577069, -1126532, -940560, -902696, -659395, -153405, 328505, 521651, 450519, 368933, 478078, 668742, 603486, 168241, -261454, -230252, 178240, 416975, 171950, -331812, -772539, -1111612, -1362565, -1340314, -958747, -552177, -540017, -855279, -1016164, -755134, -320829, -118500, -251254, -491893, -584259, -492344, -392221, -457087, -669039, -875194, -992504, -1049529, -1045520, -943867, -838630, -910633, -1106669, -1076579, -618052, -20295]
42014b0295K82232r1538j30392M2366L4330k53062n17662m32927k815M33159N28994
42003a27610L06680J31710K24356L47534J81054j63692l20697k40367j91946k43444
41993i6422j66405J08239L46329L86404K82713M4999l37965n87203l53048J62058
41983b10301L37181K7651k40802j41193K9837L9963J23649L25571J84218m07520
41973F8254p48296l82188R0467K4080j48006K33280P04801L95266l36320l51511
41963d50173L29839M91715k39131p58799l26119L00954K53554r3705k9199K05602
41953c15462L9900k54093q0293L10444K35081j75101j92848K07429K87984j96569
41943a33528o02432m27217L2185K92915L18984K70343J50175p033j3841J35553
$$ y = [-20295, 261937, 170399, 40007, 82373, 116703, -136359, -654021, -1086948, -1089763, -656604, -127610, 179070, 310780, 535136, 882670, 1063724, 900032, 579335, 338968, 147022, -96422, -262827, -154588, 191741, 578145, 860858, 905857, 567892, -19311, -372359, -210301, 126880, 154531, -86271, -227464, -197627, -157664, -34015, 291556, 475774, 68254, -680042, -1062230, -971763, -947683, -1095689, -862409, -157608, 237658, -98662, -450173, -120334, 371381, 132250, -626549, -952668, -651714, -398160, -491865, -521064, -315462, -275562, -529655, -609948, -299504, -64423, -239524, -432372, -224943, 63041, -133528, -735960, -1163177, -1130992, -838077, -519093, -248750, -98575, -105608, -119449, 16104]
41933A6104J47571j22767m01287l83020j35333P7017J41315R4393k2716j27533
41923g16256p8931J30885K83527J78354j03958k83294j82086J00489K78255J45336
41913b47679j99821m38111l86179j77889k2531O1679J35347J36669J1135r6615
41903a223995k8400J18217J53268J10336J26044J27919k9263k06503j24011J75375
41893h01013L59630K85308R9181r6154k90572l16086o333L66841L10435j36103
41883b24866l69191j09041J99098J28102r1238l8976K12612L14693K10400O1036
41873B92629j17917l17178k83009J23955N10198L82328j14228l68545j54006J68785
41863A23012K82461K57650J99544K5670k23119k41704J16394N35372N91041K40457
$$ y = [16104, 163675, 40908, -360379, -743399, -878732, -801715, -660400, -566007, -588723, -716256, -795187, -664302, -380775, -202421, -306379, -589673, -771759, -671270, -393015, -247679, -447500, -885611, -1271790, -1449679, -1472210, -1410531, -1275184, -1138515, -1127380, -1223995, -1252395, -1134178, -980910, -870574, -744530, -616611, -645874, -852377, -976388, -801013, -441383, -156075, -56894, -153048, -443620, -759706, -766039, -399198, -88763, -224866, -594057, -703098, -504000, -375898, -467136, -506112, -293500, 21193, 231593, 292629, 174712, -142466, -425475, -301520, 208678, 591006, 476778, 108233, -45773, 123012, 405473, 663123, 862667, 888337, 665218, 423514, 539908, 1075280, 1666321, 1906778]
41853A906778k11348m75987m58811k20122O5382J93760J16463l132M933J17895
41843A035811J88595J40917K9951l9692p312Q8085J26738M3218n1251K9496K91090
41832A875646M91335L93253M6665k39676k17349K4574J41900n6113l33220l06888
41822A820127K340J40245j41990m72900l48439J48755M74414L89348J97279J73812
41812B382991J70865k2395k67982l20939k57754l29927m93967m22624j2108L90983
41802H17143L93142L6682k58418j91217Q9702J87156o2564l95874m48233j84830
41792a7311J16171K57751L05536L40961K57874l2832l45671l88413j40349J34504
41782D88221K46995K60875K69894J99191k9520k62077k40264L9153K60385J57517
$$ y = [1906778, 1695430, 1219443, 760632, 540510, 605892, 799652, 916115, 912983, 917916, 1035811, 1224406, 1365323, 1395274, 1355582, 1348270, 1436355, 1563093, 1606311, 1555060, 1584556, 1875646, 2366981, 2760234, 2806899, 2567223, 2349874, 2374448, 2516348, 2460235, 2127015, 1820127, 1822467, 1962712, 1820722, 1347822, 999383, 1148138, 1622552, 2011900, 2209179, 2382991, 2553856, 2531461, 2263479, 1942540, 1684786, 1354859, 860892, 438268, 426160, 817143, 1210285, 1246967, 988549, 797332, 887034, 1074190, 1011626, 615752, 167519, -17311, 98860, 356611, 662147, 1003108, 1260982, 1228150, 882479, 494066, 353717, 488221, 735216, 996091, 1265985, 1465176, 1435656, 1173579, 933315, 972468, 1232853, 1390370]
41772A390370j56244l34987k27879l6273k7517k03460l26929k16422O8942L13360
41762B42961L38943J26403j82432l78918l31822p9497K09352L59479K92958O6035
41752F63462j74480l13401l58519l58703k52930N7447M45569N62558K66817r2497
41742D45323n0281L77742P05776N71831R4536l72851o00703n38208k57612L3932
41732D09485J19645L1889J2416J17559R5476j79808m02719k38603J45273K80674
41722C91287M5766k22819k52018j37289p1881q1514j43904k92563m31079k87657
41712a483671K11560O90213O99802K68710j54062k51461j07784N0758J30450J24191
41702A78706J7551j22184j16013J02711L15934K39450j01015l56213k57023O6409
$$ y = [1390370, 1234126, 899139, 671260, 634987, 607470, 404010, 77081, -139341, -70399, 242961, 581904, 708307, 525875, 146957, -184865, -264362, -55010, 304469, 597427, 663462, 488982, 175581, -182938, -541641, -794571, -737124, -291555, 271003, 537820, 445323, 395042, 772784, 1478560, 2050391, 2144927, 1772076, 1171373, 633165, 375553, 409485, 529130, 561019, 573435, 690994, 786470, 606662, 203943, -34660, 110613, 391287, 437053, 214234, -37784, -175073, -246954, -328468, -472372, -764935, -1196014, -1483671, -1272111, -581898, 117904, 386614, 232552, -18909, -126693, -75935, 54515, 178706, 196257, 74073, -41940, 60771, 376705, 616155, 515140, 158927, -98096, -31687]
41692c1687K44720J09378j16767j07214J49130L28051J96236p7547j73671q8320
41682D32309j11419l26774m19673j46059K41664L12972P4607n4315J32140L46180
41672D81632K49685p6929k77525j81212L9948J12886k2442j10237J75479P59583
41662A150868J023756M24164p16269j373010r45674O2912O93030N72956O4714
41653I57447l43115m15154j37353K77418M33354J61520j86920j95146n748o8624
41643D77679l64519m14061q2969J90356J25616J7370J59309L35880K37517q517
41633F73661j01584m8562j2161M0319J63327J71699n4642k49440j55791J430r6193
41622C32063k38647k3914L45910K76894k13035m02980L8415N10183L65444j72199
$$ y = [-31687, 213033, 322411, 205644, 98430, 247560, 575611, 771847, 694300, 520629, 432309, 320890, -5884, -425557, -571616, -329952, -16980, 57627, 3312, 135452, 481632, 731317, 654388, 376863, 195651, 235599, 348485, 326043, 215806, 391285, 1150868, 2174624, 2598788, 1882519, 509509, -436165, -373253, 319777, 892733, 957447, 614332, 199178, 61825, 339243, 772597, 934117, 747197, 552051, 546303, 477679, 113160, -300901, -383870, -193514, -67898, -50528, 108781, 444661, 682178, 673661, 572077, 523515, 511354, 551673, 715000, 886699, 832057, 582617, 426826, 428256, 332063, 93416, 69502, 415412, 692306, 479271, 76291, 114706, 624889, 990333, 818134]
41612H18134m09480j46480K09638K87868J07522j12632j87439o5154Q8715L075
41602E93767l17507m78801k01714K14063K39249j54377m41030k28782K89168O41641
41592A55677O06614L28720P9394J6977R6457J38417K6082j62598k76831l01244
41582G07665l21679l15768j57237J27757K82781J23941j78639k69591m3091K15160
41572A71299J74388j22130k89300p7566K82300L39039K722l07995j85861K41287
41562B28183M67737K24849k31951m49821k51713J42190L56592J92303k03661m76655
41552a947m24670j93405l8738K8468J91311M52064N44547L04980o7312k62962
41542E32336k32488j39791o0755O2502K05271K15122M1334j42309j43259J017
$$ y = [818134, 408654, 262174, 471812, 759680, 867202, 754570, 567131, 501977, 590692, 593767, 276260, -202541, -404255, -190192, 49057, -105320, -546350, -775132, -485964, 155677, 762291, 1091011, 1170405, 1187382, 1283839, 1422256, 1448338, 1285740, 1008909, 707665, 385986, 70218, -87019, 40738, 323519, 447460, 268821, -770, -43861, 171299, 345687, 223557, -65743, -143309, 138991, 478030, 480752, 172757, -13104, 228183, 695920, 920769, 688818, 238997, -12716, 129474, 486066, 678369, 474708, -1947, -426617, -620022, -658760, -630292, -438981, 13083, 557630, 862610, 795298, 532336, 299848, 160057, 99302, 161804, 367075, 582197, 623531, 481222, 337963, 338980]
41532C38980Q2377O049q7135l0276J09711J07673p1495j67866p44K04304J13299
41521F04877j73867k29491K1946J47916q1747k62580k419L71509K89088j19553
41511E65679k13705R5275J99851j48949l75836l1642M27407L46015j21109l29242
41501D13744j53699k2787j14450j70764p2677n344j7486N0253J47489M6707j40121
41490c9135k5682L48840M40855M4461l53890l44661j86654k53780l78256k18246
41480i66148J01942K26849J65355J64134K11971J41732L2011M3498L7691j64652
41470e617l23020j02260K78176K95498l8525j89336L1547K12988P1978j39008
41460I2421j44167m7177J1950J30759L07969K67310p6949l58590k80860n6931
$$ y = [338980, 421357, 427406, 340271, 309995, 419706, 527379, 455884, 288018, 287274, 491578, 604877, 431010, 201519, 223465, 371381, 289634, 27054, 24635, 396144, 685232, 565679, 351974, 447249, 647100, 498151, 122315, 90673, 518080, 864095, 742986, 413744, 260045, 237258, 122808, -47956, -120633, -125977, -143463, -93210, 54279, 100986, -39135, -64817, 284023, 724878, 769339, 415449, 70788, -115866, -369646, -747902, -966148, -864206, -637357, -472002, -307868, -95897, 45835, 77846, 121344, 159035, -5617, -328637, -430897, -152721, 142777, 104252, -85084, -53537, 159451, 231429, 92421, -51746, -98923, -86973, 43786, 351755, 619065, 542116, 183526, -97334, -154265]
41450a54265o216m2332O7303K17192J52102n7006j21564J0627J57278K38280K80250
41439G41649J98830p9529l51236l22971l4306J93177J91870O3089r0821k52695
41429B57057l28499j94831O5569K22267K05833J32433L9639j35066l05681k61873
41419c03152j2945J54637O8530j01373j18674Q814J18240J34508R5939M7340J1919
41408A03783m526m0492j40752k75841l83699m66858n22161m25254r3251K48703
41398b000348K32015j45478m36767l23614m2320j4330k37034l30540j12970J69884
41388c241502K24136O9786q1251j20670o1741J10207L91521N90996M43090p859
41378a683287l27743j93507J50910K08856n3008j63639R4436K98583M6819l37592
$$ y = [-154265, -160481, -202813, -135510, 81682, 233784, 176778, 55214, 65841, 223119, 461399, 741649, 940479, 860950, 509714, 186743, 152437, 345614, 537484, 600573, 509752, 257057, -71442, -266273, -200704, 21563, 227396, 359829, 399468, 264402, -41279, -303152, -316097, -161460, -92930, -194303, -312977, -304163, -185923, -51415, 44524, 91864, 103783, 99257, 58765, -81987, -357828, -741527, -1208385, -1730546, -2155800, -2249051, -2000348, -1768333, -1913811, -2350578, -2674192, -2716512, -2730842, -2967876, -3298416, -3411386, -3241502, -3017366, -2947580, -3028831, -3149501, -3211242, -3101035, -2709514, -2118518, -1675428, -1683287, -2011030, -2204537, -2053627, -1844771, -1897779, -2061418, -1966982, -1668399, -1621580, -1959172]
41368a959172k30020L36012O71707M12560k5303j31470K2944Q3355J0365Q32N3151
41357g55039Q510j03970j27563j04009j86768k70975q4662L14064M97996K54999
41347e57417j03215j95693o6315J1217P556J11205L22170L83280J58060j46407
41337g5559k32183o4585J09821M5056k41642m60952l27315J04691M37578L66513
41327c38577N5744q1357O0159J73583M2135j25567m4502J69332J51826j57347
41317i4571m03814k93971M9098K92922K84805J20765m5328j19923n6739J29817
41307a36939L07680K73698m2547m07414m29604r283M26463L65136j01360l35615
41297h9785l3093L23756J90710k13234k98193o6178k9186k48736k08284K22115
$$ y = [-1959172, -2189192, -1853180, -1181473, -768913, -794216, -925686, -902742, -819387, -809022, -808190, -755039, -746529, -850499, -978062, -1082071, -1268839, -1539814, -1624476, -1310412, -812416, -557417, -660632, -856325, -922640, -911423, -903867, -792662, -470492, -87212, 70848, -75559, -307742, -372327, -262506, -217450, -459092, -920044, -1247359, -1142668, -705090, -338577, -282833, -364190, -304031, -130448, -88313, -213880, -258382, -89050, 62776, -94571, -498385, -792356, -743258, -450336, -165531, -44766, -90094, -210017, -266756, -136939, 170741, 444439, 401892, -5522, -435126, -444409, -17946, 347190, 245830, -89785, -122878, 200878, 391588, 178354, -119839, -186017, -215203, -463939, -672223, -450108]
41287d50108M53738J51140j59982L9863L89643K73909j62639l57155l16229m41288
41277e79108n97911k65928M11422O43664K29509p5703K37844O32647M14056k02048
41267H48444n09492l56446j40161l9291J12969K93976K10977j77782m88885l96092
41257f41783j6687K93531L38685J77872m2177k26962l26535k77326n8453J64237
41247f15598J11399k26753m28080j36160L82013N40358K52774M86L4641L6380
41237d8540k19153l72095l1176N48257P58188L89440k39703o95375o92383k05621
41227h08161L82513N10156J15364k04950k9636K67085J57579j69456j69444J20381
41217A71431J89224m7260j52947L7123J82120O5237j13588j68257j41432l0821
$$ y = [-450108, 3630, 154770, -5212, 34651, 424294, 698203, 535564, 178409, -137820, -579108, -1177019, -1442947, -1031525, -387861, -158352, -234055, 3789, 636436, 1050492, 848444, 338952, -17494, -157655, -196946, -83977, 209999, 420976, 243194, -245691, -641783, -658470, -364939, -26254, 151618, 109441, -117521, -444056, -721382, -779835, -615598, -504199, -730952, -1159032, -1295192, -913179, -372821, -120047, -119561, -84920, -48540, -267693, -639788, -670964, -122707, 635481, 1024921, 785218, 89843, -602540, -808161, -425648, 84508, 199872, -5078, -34714, 232371, 389950, 220494, 51050, 171431, 360655, 313395, 160448, 197571, 379691, 444928, 331340, 163083, 21651, -9170]
41207i170J90651K60128r6868n38994m17408J82707M33794J6280l91609k43935
41197f14424K1726j72216n16982l66699J54563L74105J20097j82575k92155l29228
41187a803788k71944M7329M37844M67968J54498k4517J16198K55874K17536K42959
41177a60043M00336K98424k29808o34445l49370L02716M59950j02364o54016m81833
41167a150453K04656N94902L11832j83098k40874J72526N24290M51986J56538
41158H42305o260l2125j37303l23031l87644k97123k30311k50854k15274m8813
41148a086433J40245K72565L79745M20398K75951J5107j00290J2076J32630J16493
41138E78487J12340K30509K84265J14701q2626o3741M0427m3969k36431k24651
$$ y = [-9170, 181481, 441609, 344741, -194253, -611661, -428954, 4840, 21120, -370489, -614424, -592698, -764914, -1281896, -1648595, -1494032, -1119927, -999830, -1182405, -1474560, -1803788, -2075732, -2028403, -1590559, -1122591, -968093, -992610, -876412, -620538, -403002, -160043, 240293, 538717, 308909, -325536, -674906, -372190, 87760, -14604, -668620, -1150453, -945797, -350895, -39063, -222161, -463035, -290509, 233781, 685767, 842305, 836045, 803920, 666617, 343586, -44058, -341181, -571492, -822346, -1037620, -1086433, -946188, -673623, -293878, 126520, 402471, 417578, 317288, 329364, 461994, 578487, 690827, 921336, 1205601, 1320302, 1237676, 1173935, 1214362, 1170393, 933962, 709311]
41128G09311K750J44559Q5593J5227K6042r029q7793j2384J93766K02652q2518
41117A188176k89670j43417Q5988L3280j76843j95854m7337m697n9177N087J26420
41106E21956O5425p9059L748K07726J03577k63653l16693J07991M08129J55845
41096I14992k24099j83463J01203J86015J65103L17875L58200j33892p76339p77782
41086e2187j92343J22544j35620l18526n709L36468K72384J28101K56359L19602
41076G31073j8402l17525n6150L93550L29844r8221j69985J65001K59473o4315
41066A154343k49205l4597J12439j23245l52251j87553J26376K05791J14524M0785
41056H07407j20949m10216m67063o6681L75033L55904M4936n6197N7620J0735
$$ y = [709311, 712061, 856620, 942213, 957440, 983482, 974453, 886660, 874276, 1068042, 1270694, 1188176, 898506, 755089, 841077, 874357, 697514, 501660, 454323, 449626, 390449, 395536, 521956, 587381, 508322, 512070, 719796, 823373, 559720, 243027, 351018, 759147, 914992, 690893, 507430, 608633, 794648, 959751, 1277626, 1635826, 1501934, 725595, -52187, -244530, -121986, -257606, -576132, -581841, -245373, 27011, 155112, 411471, 731073, 712671, 395146, 338996, 732546, 1062390, 964169, 794184, 959185, 1218658, 1154343, 905138, 870541, 982980, 859735, 507484, 319931, 446307, 652098, 766622, 807407, 686458, 276242, -190821, -257502, 117531, 473435, 518371, 462174, 519794, 530529]
41046E30529j87348j54790J19585J95502o3961k54616j37143l2068k09570l47452
41036e41332j1823O10573Q87581N34431r9332m94262m67782k26804q7142j57745
41026e3637k46937j29685J05650J54677l1621j39298J9380J97882J17496r5137
41016a01230j72924j62968k27799j94404J96107O66796O00206m9584n72441m51286
41006d69527k4195J20088l731L2220K94539M02866J47256k17280l26372r1407
40996a35543K77851M48485K24903j91320l34101o7398J61460l7584l46435j85286
40986a84968L57794O17079L38624l2754j46962j94334l28994k71952J16089L94136
40976F63758J71759k21911k31009P8347K18211R3662L5767J57847K48974K45571
$$ y = [530529, 343181, 188391, 307976, 503478, 439517, 184901, 47758, 15690, -193880, -541332, -553155, 57418, 944999, 1479430, 1380098, 885836, 418054, 191250, 104108, -53637, -300574, -430259, -324609, -169932, -201553, -340851, -321471, -123589, -6093, -101230, -274154, -437122, -664921, -859325, -663218, 3578, 603784, 554200, -18241, -469527, -493722, -373634, -377365, -345145, -50606, 352260, 499516, 282236, -44136, -135543, 142308, 590793, 815696, 624376, 290275, 222877, 384337, 346753, 318, -184968, 172826, 789905, 1128529, 1095775, 948813, 754479, 425485, 153533, 269622, 663758, 835517, 613606, 382597, 460944, 679155, 772817, 808584, 966431, 1215405, 1460976]
40966A460976K67911K26025n0257k87743M341O64696Q59323K02945o34205q04722
40956A909290l34436J23302K35551J97817J85826J09794p1333j78998q4825P0195
40946B162183O5153q0105r2735K01155N61529N32997M9778l63550k40381J69357
40936B965381K76957N1212j1676J94317J78268k23092m22432l9132L47951O0962
40926C378716n40150n76866k2692L14277R8103j28371L0549K22429Q7442j09060
40916B754377k4892J38155N0834j47980j79665j89216m38351p06401n73378j43051
40906E40432R1071L8926R7381L94073N13905J81997k47029k88670J421J83734
40896A507241O6613j27381j39257L3301K03098J89005m2339l20406l88011j63940
$$ y = [1460976, 1728887, 1954912, 1904655, 1616912, 1621253, 2285949, 3145272, 3348217, 2714012, 1909290, 1574854, 1698156, 1933707, 2131524, 2317350, 2427144, 2355811, 2176813, 2091988, 2162183, 2227336, 2147231, 2054496, 2255651, 2817180, 3350177, 3399955, 3036405, 2796024, 2965381, 3242338, 3293550, 3281874, 3476191, 3654459, 3431367, 3008935, 2969803, 3317754, 3378716, 2838566, 2261700, 2239008, 2553285, 2651388, 2523017, 2553566, 2775995, 2863437, 2754377, 2729485, 2867640, 2918474, 2770494, 2590829, 2401613, 1963262, 1256861, 683483, 540432, 631503, 670429, 767810, 1161883, 1675788, 1857785, 1610756, 1322086, 1323507, 1507241, 1573854, 1446473, 1307216, 1340517, 1543615, 1732620, 1690281, 1369875, 981864, 817924]
40886H17924J45916K58816Q4256k42704m88861m50075j18743J93654J06497l07175
40876d95m77038o5893M73742M56417n2263l04765M1316M46697L38833n3491j43876
40865F59184P9280J22114j55437l40069j89733k4667j61175l71336k53626J20320
40855e15145L13955J66831l3958k5535R8913J25100M9893K1219Q1684J42362J63529
40844E88848K07759K91287K98614J21225j69379l67733l48931j80613k4939J0441
40834D26579p2893j79282j81292n8968J8380j15495l26423k74020J02098M24058
40824b37258L89498J98777J73593J85352p9947m19188k73244L30639O19483J52568
40814A040273m86597n32210j32961j0919l00336m26501j02518K38024J84646l5370
$$ y = [817924, 963840, 1222656, 1306912, 1064208, 575347, 125272, 6529, 200183, 306680, -495, -477533, -543426, -69684, 386733, 334470, 29705, 71021, 517718, 856551, 803060, 659184, 738464, 860578, 705141, 365072, 175339, 150672, -10503, -381839, -635465, -515145, -201190, -34359, -68317, -93852, 5061, 130161, 180054, 201273, 282957, 425319, 588848, 796607, 1087894, 1386508, 1507733, 1338354, 970621, 621690, 441077, 416138, 426579, 353686, 174404, -6888, -65856, -47476, -162971, -489394, -763414, -661316, -237258, 152240, 351017, 524610, 709962, 630015, 210827, -62417, 268222, 887705, 1040273, 553676, 21466, -111495, -122414, -422750, -849251, -951769, -713745, -529099, -564469]
40804e64469j077K47477L65844K55102Q9069n2917k24266l39680k02057J43704
40794b83270L47078J75725j57824k49270m298K77030L15636J80182R5074O1703
40784G57766j04912l82612m62232j93631J18776J01281j57805k50892n7359J18003
40774e13617N1907o7102K9372K55427K85393K648l45495m23879j48577K30554
40764f43369L49656Q6291k79802l36224M877M04629M83719K17079j01267j97137
40754a1548n6061J21127J49534N1954r92M9872O7574j6278j3879K26270M68072
40743A035645L49233m8437k67460j66001j23137l71287n38861k13372L29737M14954
40733D01014j10665o52737o10297m2647M93705N74794K77489J5393O2660K39932
$$ y = [-564469, -565546, -318069, 47775, 302877, 391946, 339029, 114763, -224917, -426974, -283270, 63808, 239533, 81709, -167561, -171859, 105171, 420807, 600989, 696063, 757766, 652854, 270242, -191990, -385621, -266845, -165564, -323369, -574261, -631620, -513617, -461710, -528812, -499440, -244013, 41380, 44028, -301467, -725346, -873923, -643369, -293713, -207422, -487224, -823448, -818571, -413942, 69777, 286856, 185589, -11548, -67609, 53518, 203052, 255006, 254014, 303886, 371460, 355182, 341303, 567573, 1035645, 1384878, 1336441, 1068981, 902980, 779843, 408556, -130305, -343677, -13940, 401014, 290349, -362388, -972685, -1015332, -521627, 53167, 330656, 346049, 408709, 648641]
40723F48641J51758k45093n06191k68573K43550N08301L49838L0388j82945k47022
40713D82652k07661j37788j78825l58434m08993q5996L68401M62350J75742J1869
40703A23317K13648L86079J50187k36562k84900q071J66750N3790j31091j86863
40693B46284j28461R179K19408L45224J77633j79003l24273q1511K30324K21188
40683G35992l8284j24090J54850M75269L84817j07842m67244k48547L02854M95337
40673A563112Q1974l84432l05146J33276K80975J0909j58833M4713K29878O1527
40663A557953j38299M1688L39659K10622k47752m06452j02371J26765n8497k76690
40653A046626j13244J78535J18166k07150l06378o5265J50217J29562P6151J50652
$$ y = [648641, 800399, 555306, 49115, -219458, 24092, 532393, 882231, 912619, 729674, 482652, 274991, 137203, -41622, -400056, -809049, -895045, -526644, -64294, 111448, 123317, 336965, 723044, 873231, 636669, 351769, 343698, 510448, 564238, 433147, 246284, 117823, 127002, 346410, 691634, 869267, 690264, 365991, 284480, 514804, 735992, 697708, 573618, 728468, 1203737, 1588554, 1480712, 1013468, 764921, 1067775, 1563112, 1645086, 1260654, 955508, 1088784, 1369759, 1380668, 1221835, 1266548, 1496426, 1557953, 1419654, 1461342, 1801001, 2011623, 1763871, 1357419, 1255048, 1381813, 1323316, 1046626, 933382, 1111917, 1230083, 1022933, 716555, 651290, 801507, 931069, 1007220, 1157872]
40643A157872J73340l3150l07085l74227k18636l1945P4760J36392J95552K33696
40633A006569J94453J9111k53135l97495j88505K46047M55981K11346j64726k22974
40623I06672j578P6955j41007l29653k03196N4349P8101j47615k99439j90866
40613a97277N621N3810k9155p3940l9616q080M2252K24347M59945M56432J31123
40602A025462j54776o0643J84543Q0884l27974m13492R6923N94305L77867l41087
40592A062012p04370l38604K67354N15257L58869Q9427j26524k54936k29386n3862
40582E85237Q9856N8782l7732q631J45042K74508K85911J59930r8860l74909m38596
40571F40538k16652M5007P7505o1003j31892q8352m6386J1217J79963L21464J72306
$$ y = [1157872, 1331212, 1298062, 990977, 616750, 398114, 366169, 440929, 577321, 772873, 1006569, 1201022, 1220133, 966998, 569503, 380998, 627045, 1083026, 1294372, 1129646, 906672, 905094, 982049, 841042, 511389, 308193, 362542, 440643, 293028, -6411, -197277, -191656, -137846, -167001, -240941, -280557, -288637, -246385, -22038, 437907, 894339, 1025462, 870686, 810043, 994586, 1075470, 747496, 334004, 430927, 1025232, 1403099, 1062012, 357642, 19038, 286392, 801649, 1160518, 1249945, 1123421, 868485, 639099, 585237, 675093, 733875, 696143, 687512, 832554, 1107062, 1392973, 1552903, 1454043, 1079134, 640538, 423886, 468893, 546398, 485395, 353503, 265151, 218765, 229982, 409945, 731409, 903715]
40560I03715j72205k45485J50307N93073N63662R8531l29260m11302k24282K0851
40550I47605J62426Q3220j97185m26442l52948o1545J42609J69702J97146K70760
40540I35348J83676j21156l39324k18037N9285J62694J01347J20843K46579K64035
40530A395290J08204n2458j32817k23042l14599k47023l8023L3825j44164k68399
40520A16794l5448L79123N25742K59260j32467l16800k13408N2141K73925K55279
40510A164141k9220l46817m38055l22706k11207j52729r977J99177K22105k5221
40500D9491k12610L117M46592N67497J42938l87050m28857L2923M13692K62343
40490H90076j80504l20939J7047M26555N12426L24307P4022k28472n65027o28777
$$ y = [903715, 731510, 486025, 636332, 1229405, 1793067, 1891598, 1562338, 1151036, 926754, 947605, 1110031, 1193251, 996066, 569624, 216676, 155131, 297740, 467442, 664588, 935348, 1119024, 997868, 658544, 440507, 499792, 662486, 763833, 884676, 1131255, 1395290, 1503494, 1451036, 1318219, 1095177, 780578, 533555, 495532, 529357, 385193, 116794, 81346, 460469, 986211, 1245471, 1113004, 796204, 582796, 634937, 908862, 1164141, 1134921, 788104, 350049, 27343, -183864, -336593, -346570, -147393, 74712, 49491, -163119, -160002, 286590, 854087, 997025, 609975, 181118, 214041, 627733, 890076, 709572, 388633, 405680, 832235, 1344661, 1668968, 1742990, 1514518, 949491, 320714]
40480C20714k03819L15891K99976k10570m73423o0429N64916P18122L26617k00633
40470A397362n52483n99116k41534L63497O77690L74335j18722j77456P8887K3503
40460A225963l71459m17949J22633N10357J14295n58387n49149J77174P11969
40451I65447M50211k34426o08582l98094J30099N34546N00250M6168m31288n08602
40441D45729j94184J31565K16502J37936L3531n0856k6086J72770L25556J27133
40431A319596k54249k84452Q2058J95950k76567o85499l25924L99076N16151m8977
40421F37163m08128j14205K62528J95306J038J22869L11219J40317j67022j23865
40411H57220J44518J23450j69628k02287J50785L76672J53055j63133j22841J67685
$$ y = [320714, 116895, 432786, 732762, 522192, 48769, -11660, 553256, 1271378, 1597995, 1397362, 844879, 245763, 4229, 367726, 1045416, 1419751, 1301029, 1123573, 1202460, 1225963, 854504, 436555, 559188, 1069545, 1183840, 625453, 76304, 253478, 965447, 1415658, 1181232, 572650, 174556, 304655, 839201, 1339451, 1385619, 954331, 445729, 251545, 383110, 599612, 737548, 771079, 720223, 694137, 866907, 1192463, 1319596, 1065347, 780895, 862953, 1058903, 782336, 96837, -229087, 169989, 686140, 637163, 229035, 114830, 377358, 572664, 573702, 696571, 1007790, 1148107, 981085, 857220, 1001738, 1125188, 955560, 753273, 904058, 1280730, 1433785, 1270652, 1147811, 1315496]
40401A315496K74435L4932l14859m45264k17219J97258M17048K35119j03889k20856
40391A172201j39699j84576l73319l53916l2882K03623J05175m4931O1258K48827
40381F61761K28733J25167J92469K76296N9772l14249l86276r5975J33865N8047
40371I39610r8542r9200k8069r343M3411J93721K88019K07494P7119K3277m5683
40360A491814j90423k01988Q0597L75404K54839j99688m25066j49708K16763J89966
40350A442510q1750q2775K32633L30063q0289n30330m12858J52586M77310K29954
40340A677054k08122l49039j74312L7484J34689J29697M6500m8640l3263P6338
40330A288386Q8368n0357j22158q653O5986p1156j66343P4686M29525M32727R6105
$$ y = [1315496, 1589931, 1624863, 1310004, 864740, 647521, 844779, 1261827, 1496946, 1393057, 1172201, 1032502, 847926, 474607, 120691, 87809, 291432, 396607, 351676, 412934, 661761, 890494, 1015661, 1208130, 1484426, 1544198, 1229949, 843673, 747698, 881563, 939610, 841068, 741868, 713799, 704456, 747867, 941588, 1229607, 1437101, 1514220, 1537497, 1491814, 1301391, 1099403, 1180000, 1555404, 1810243, 1610555, 1185489, 1035781, 1252544, 1442510, 1360760, 1277985, 1510618, 1840681, 1760392, 1230062, 817204, 969790, 1447100, 1677054, 1468932, 1119893, 945581, 983065, 1117754, 1247451, 1293951, 1245311, 1212048, 1288386, 1376754, 1326397, 1204239, 1195586, 1261572, 1190416, 1024073, 1098759, 1528284, 1961011, 2057116]
40319B057116j21261m5184L260j77724l12098j14473K43888L95472K60176M7166
40309B236338m2446N8668K86857M36884L17757K8852j12141j2229O6351n8473
40299C206418k03746j67425q4987j67305k97831k06452Q8669L13606L28752K19789
40289C029488P7752m7478m5467J23366K44278Q9549j84053k04998K2764O2745
40279C167946k91896o46155n45100j31778O9535j00512k67985j15461J93060L16858
40269A648512K14395Q8998J6799q9031j90300j07137J33312K09533n3296l69993
40259A501792l68415j24707k4542j57719j91901R3879M52207M94607J76966j95878
40249A656289l26350j73437N5967R6355j03803k87661j99253M6597J23253K76
$$ y = [2057116, 1935855, 1890671, 1893931, 1716207, 1404109, 1289636, 1533524, 1928996, 2189172, 2236338, 2193892, 2252560, 2539417, 2976301, 3294058, 3322910, 3210769, 3198540, 3264891, 3206418, 3002672, 2835247, 2750260, 2582955, 2285124, 2078672, 2167341, 2480947, 2809699, 3029488, 3107240, 3059762, 3014295, 3137661, 3381939, 3471488, 3287435, 3082437, 3105201, 3167946, 2876050, 2229895, 1684795, 1553017, 1622552, 1522040, 1254055, 1138594, 1331654, 1648512, 1862907, 1951905, 1968704, 1879673, 1689373, 1582236, 1715548, 1925081, 1871785, 1501792, 1133377, 1008670, 984128, 826409, 634508, 728387, 1180594, 1675201, 1852167, 1656289, 1329939, 1156502, 1212469, 1308824, 1205021, 917360, 718107, 764704, 887957, 888233]
40239H88233k4337J41633J92372n6781l18832k78042p2474k801k9492N0808J49129
40228F39416N3563r2356L0378L16175L21493j0352k11834j9149K24329J26385
40218A378048j81443l29932k71274k11842j82541k6034K62344M69278M37751K16966
40208A561321m6355k15540j96862k0167J22878N6964j47393k25728k8328K84455
40198A145245L86944J26434k78476m16316j27714K66913L11198k7953l21423k40139
40188H24713M7913J66140L1435j30835j60592j18271q7178l3125Q0237J79142
40178G99579J69724P3561N434L5916J14758J39734R1168N9692J01458J13970l9734
40167A665260k95999m20506l07114r8814M7674J41076J93247Q5885j94146l62912
$$ y = [888233, 863896, 1005529, 1197901, 1141120, 822288, 544246, 471772, 468971, 439479, 490287, 639416, 692979, 600623, 631001, 947176, 1268669, 1258317, 1046483, 1027334, 1251663, 1378048, 1196605, 866673, 595399, 383557, 201016, 174982, 437326, 906604, 1344355, 1561321, 1514966, 1299426, 1102564, 1082397, 1205275, 1262239, 1114846, 889118, 860790, 1145245, 1532189, 1658623, 1380147, 963831, 836117, 1103030, 1414228, 1386275, 1064852, 824713, 872626, 1038766, 1070201, 939366, 778774, 660503, 573325, 540200, 620437, 799579, 969303, 1042864, 1048298, 1084214, 1198972, 1338706, 1429874, 1489566, 1591024, 1704994, 1665260, 1369261, 948755, 641641, 542827, 590501, 731577, 924824, 1010709, 816563, 453651]
40157D53651j81265J10030O0122k79342l17489K29943Q18172P23183L495n70979
40147A049521m98077q2987Q6016j00576k46448m3752L25933M16327O1809l64604
40137F03162l11408K88756Q35636P17128P4149l68618k54446j3539j41871m28150
40127A000799l14216J74999M00148N5358l46318j85544M08640P58778N20548K3875
40117B497067k35509j59742k0156l4504j14558l7217K01998L21550J24100j75438
40107B367591k08242l456K4453k71431m67961j63454M02048O62817M97078K95560
40097C135003L27843M43029M52497M41563N42394O71426O91565O55038O87989
40088H048347P41740O41840L50790M5214r2174r6667j95429n34960r56735j136922
$$ y = [453651, 272386, 382416, 442538, 163196, -154293, 75650, 893822, 1617005, 1620500, 1049521, 551444, 468457, 554473, 453897, 207449, 163697, 489630, 905957, 967766, 603162, 291754, 580510, 1416146, 2133274, 2207423, 1838805, 1584359, 1570820, 1428949, 1000799, 686583, 861582, 1261730, 1317088, 970770, 785226, 1193866, 1952644, 2473192, 2497067, 2261558, 2101816, 2081660, 2047156, 1932598, 1895381, 2097379, 2418929, 2543029, 2367591, 2159349, 2155893, 2180346, 1908915, 1440954, 1277500, 1679548, 2342365, 2839443, 3135003, 3462846, 3905875, 4358372, 4799935, 5342329, 6013755, 6705320, 7360358, 8048347, 8790087, 9431927, 9782717, 9827931, 9735757, 9639090, 9443661, 8908701, 7951966, 6815044]
40078F815044r76646p17077n86352n09396l30998j38947j03225j38748n5498N2734
40068C310891m6552k36690j62014J26730J40102k56004n15272k07770K93672L69482
40058B816575O1543j08331j9318n1092l37061n06822l11475j2671Q3379P6746
40048A691473J69716K49008J39415L5200K37087N54109M41444j79787o68421m81939
40038B187305O1987K18102j43479l78335j5069N64451O70514K53118r8310k2666
40028C297618J71189N3496k82568m09402k16322k8507p2073j36513N8688L70158
40018B805764L91713O6049j84765o3587J57710P2838j96555j87661J31552K75939
40008C268997K1789k40697j80429n8386j95315l49708j64501J10117q141l50251
$$ y = [6815044, 5838398, 5121321, 4534969, 4025573, 3694575, 3555628, 3452403, 3313655, 3258157, 3310891, 3264339, 3027649, 2865635, 2992365, 3132467, 2876463, 2361191, 2153421, 2447093, 2816575, 2878118, 2769787, 2750469, 2699377, 2362316, 1855494, 1544019, 1531348, 1614727, 1691473, 1861189, 2110197, 2249612, 2284812, 2521899, 3076008, 3517452, 3337665, 2669244, 2187305, 2249292, 2467394, 2323915, 1945580, 1930511, 2494962, 3165476, 3418594, 3320284, 3297618, 3468807, 3522303, 3239735, 2830333, 2614011, 2585504, 2513431, 2376918, 2435606, 2805764, 3197477, 3263526, 3078761, 3015174, 3172884, 3245722, 3049167, 2861506, 2993058, 3268997, 3290786, 3050089, 2869660, 2811274, 2615959, 2266251, 2101750, 2211867, 2203726, 1853475]
39998A853475l09090J35659L54831R6913j65342r9210K720r8473j13206J53091
39988A811368L11455K8202l54376l63245j20157J4267J01643L36038M61040J37694
39978B363929l66035n08311k97045j42859q3801J40969L73875J71865l27757m39173
39968H85657K1953M16342K55007j22588j73530N2341J25010j06606m13877n24126
39958D15583l22132R6535M31290M26910J87596L2920N4485R3665R6044J08218
39948A621114j2834m01521p15656m45059K39889N69656K65516r7301n5319J03427
39938A071912L6702l898K40887M01205P9718l73312l76257m7974P6787l4718k3948
39927A047104N3869j52073m53498k53642L95292O67915J61394m69791m49617Q9290
$$ y = [1853475, 1544385, 1680044, 2034875, 2131788, 1966446, 1867236, 1869956, 1771483, 1658277, 1811368, 2122823, 2151025, 1796649, 1433404, 1313247, 1327514, 1429157, 1765195, 2226235, 2363929, 1997894, 1489583, 1192538, 1049679, 965878, 1106847, 1480722, 1652587, 1324830, 885657, 907610, 1323952, 1578959, 1456371, 1282841, 1335182, 1460192, 1353586, 939709, 415583, 93451, 189986, 621276, 1048186, 1235782, 1268702, 1323187, 1416852, 1512896, 1621114, 1608280, 1206759, 491103, 46044, 285933, 855589, 1121105, 1023804, 968485, 1071912, 1108614, 1104716, 1345603, 1746808, 1826526, 1453214, 1076957, 1028983, 1105770, 1071052, 1047104, 1100973, 948900, 495402, 241760, 637052, 1304967, 1466361, 996570, 546953, 636243]
39917F36243M42246L06550k3392j92285j23569N2258J27661k6919k54840k12374
39907G31579J48894M01124J83214k57019l73752p1260K04583J23593j17034j51277
39897H22645O2393K98750M16377M06690K25696j19440l55056j64733K83966L95789
39887B273077n0165m89834l22530K00518L33525n6056l32278r3568K69359K51733
39877A983781m1260j89878q6013R5961K39398K58191K7869l23980l72503L324
39867A594890L15186J71651q3630L6870K98185J45762k80952l30675M9401K14132
39857B130820p9599k75823K6299M34543M42294J52549p8006k13301l29957k69365
39847A940454M8833L08752K30700L6346P2019K34915J97041k6310j60994j50828
$$ y = [636243, 1078489, 1385039, 1361647, 1169362, 1045793, 1098051, 1225712, 1198793, 943953, 731579, 880473, 1281597, 1464811, 1207792, 834040, 762780, 967363, 1090956, 973922, 822645, 885038, 1183788, 1600165, 2006855, 2232551, 2113111, 1758055, 1593322, 1877288, 2273077, 2222912, 1733078, 1410548, 1611066, 1944591, 1888535, 1556257, 1462689, 1732048, 1983781, 1942521, 1752643, 1666630, 1762591, 2001989, 2260180, 2288049, 1964069, 1591566, 1594890, 1910076, 2081727, 1998097, 2034967, 2333152, 2478914, 2197962, 1867287, 1916688, 2130820, 2051221, 1775398, 1801697, 2236240, 2678534, 2831083, 2753077, 2539776, 2209819, 1940454, 1989287, 2298039, 2528739, 2565085, 2637104, 2872019, 3069060, 3042750, 2881756, 2730928]
39837B730928j41682j35543m8057K6484j1743K0809K90174M92158J90100m41678
39827B971950p24165l88022R1590K14311O8831o023l243j45818m00767m45504
39817A233140j13116L48094N29085K98831o3338j85942k4600J34908J07173M8527
39807B312762J35242K22047J00685o4410N3180L52516L72590J8634k32131m5236
39797C225879K70637K81352Q2935L3810J05494j030k27797j94318J13750K17031
39787C907743j14473m40794k78248J85976L78330J35533j72715k30149j07674
39778C263529L720O3785R3102O4060j30J995Q8290J65038K17685L30473M42408
39767D733955L28069l1369k94898j96210O2466J09146n8380j30279J5382J96002
$$ y = [2730928, 2589246, 2453703, 2405646, 2432130, 2420387, 2441196, 2731370, 3223528, 3413628, 2971950, 2247785, 1859763, 1951353, 2165664, 2234495, 2228472, 2225229, 2079411, 1678644, 1233140, 1120024, 1468118, 1997203, 2296034, 2232696, 2046754, 2022154, 2157062, 2264235, 2312762, 2448004, 2670051, 2770736, 2706326, 2759506, 3112022, 3484612, 3503246, 3271115, 3225879, 3496516, 3777868, 3860803, 3894613, 4000107, 3999077, 3771280, 3576962, 3690712, 3907743, 3793270, 3352476, 3074228, 3260204, 3638534, 3774067, 3601352, 3371203, 3263529, 3267249, 3331034, 3424136, 3488196, 3488066, 3490061, 3578351, 3743389, 3961074, 4291547, 4733955, 5062024, 5030655, 4735757, 4539547, 4602013, 4711159, 4652779, 4522500, 4537882, 4733884]
39757D733884K77001L09009K81462P7782k06020k12056J89800N82296M46723j60329
39747F319552o35331n56075j74987n4677l14516m67398j06372M53433N40256R2276
39737E096161j94438J17866N19796L41078j54114j59169L40659M68591j54743
39728F221687p50286n48885O5820K23997j08760k39493P5786L58010K94189J75411
39718E767476K64559L11941J3232m36978n72873k32189L13377O52637N37846O8621
39708F687649l22774k47386J88765M85073L59528M4609j05109m1373Q4300K08924
39698G342206L31257L73344K81358J47830O6333j1564j21517j44092q791J08772
39688H365136K6213j25927p8530J69291L91126N15263O50342P46625N95106K46779
$$ y = [4733884, 5010885, 5319894, 5601356, 5679138, 5473118, 5261062, 5450862, 6033158, 6479881, 6319552, 5684221, 5128146, 4953159, 4898482, 4583966, 4116568, 4010196, 4463629, 5003885, 5096161, 4901723, 5019589, 5539385, 5880463, 5726349, 5567180, 5907839, 6376430, 6221687, 5471401, 4922516, 4988336, 5212333, 5103573, 4864080, 4939866, 5297876, 5592065, 5767476, 6032035, 6343976, 6357208, 5920230, 5347357, 5115168, 5428545, 6081182, 6619028, 6687649, 6364875, 6117489, 6306254, 6791327, 7150855, 7195464, 7090355, 7048982, 7133282, 7342206, 7673463, 8046807, 8328165, 8475995, 8542328, 8530764, 8409247, 8265155, 8256364, 8365136, 8391349, 8265422, 8186892, 8356183, 8747309, 9262572, 9912914, 10659539, 11254645, 11501424]
39678A1501424P3715K37658M22962L40745J91594K84368M49083K87052j24579
39669A3664022k96870j05766L1912r8599j35482J81321M52918K31438j71206r5779
39659A3657909M13078O21973K04273k90052k54363J87228N03374M89885L50082
39650A5883387K87429L24624L94934M07300L29753L01015M70137O71214N63222
39641A9633015K03291R6707M58826Q23818P12064L24814J70531L11616M52042
39632B3186724N28289O94263Q76592Q66987P64529Q24745R46557Q35359O26980
39623C0151025P66944J229209J454366J214008R72016J145919J507784J627474
39615D0068745J508062J450508J588594J854379K172175K451786K589469K628824
$$ y = [11501424, 11575139, 11812797, 12235759, 12576504, 12768098, 13052466, 13501549, 13788601, 13664022, 13367152, 13261386, 13293298, 13194699, 13059217, 13240538, 13693456, 13924894, 13753688, 13657909, 14070987, 14692960, 14897233, 14607181, 14352818, 14540046, 15043420, 15533305, 15883387, 16170816, 16495440, 16890374, 17297674, 17627427, 17928442, 18398579, 19069793, 19633015, 19836306, 19933013, 20391839, 21215657, 21927721, 22252535, 22423066, 22734682, 23186724, 23715013, 24409276, 25285868, 26152855, 26917384, 27742129, 28688686, 29524045, 30151025, 30917969, 32147178, 33601544, 34815552, 35787568, 36933487, 38441271, 40068745, 41576807, 43027315, 44615909, 46470288, 48642463, 51094249, 53683718, 56312542]
39607E6312542K703985K761479K661476K601592K980046L698302M127652M026058
39599H1873132L947000M374259M995104N329957N583395O223967P085293P610046
39591A27022153P789968Q156037Q916111R769604J0574122J1560304J2808093
39584A96596392J4074783J5246979J6460599J7702732J8820451J9992266K1581471
39577C20475673K3344468K4405229K4325500K3649776K3003637K2137962K0326813
39570D81669058J7320706J3408950Q847600L770605j501632o565425j1266293
39563E05683569j5534068j9019995k1350970k2672096k3473569k3895011k3668634
39556C56069226k2782971k1691477k0700509j9616047j8253002j6881501j5812164
$$ y = [56312542, 59016527, 61778006, 64439482, 67041074, 70021120, 73719422, 77847074, 81873132, 85820132, 90194391, 95189495, 100519452, 106102847, 112326814, 119412107, 127022153, 134812121, 142968158, 151884269, 161653873, 172227995, 183788299, 196596392, 210671175, 225918154, 242378753, 260081485, 278901936, 298894202, 320475673, 343820141, 368225370, 392550870, 416200646, 439204283, 461342245, 481669058, 498989764, 512398714, 521246314, 525016919, 523515287, 516949862, 505683569, 490149501, 471129506, 449778536, 427106440, 403632871, 379737860, 356069226, 333286255, 311594778, 290894269, 271278222, 253025220, 236143719, 220331555]
39549B20331555j4860032j3658118j2315818j1299813j0713533j0149800r333496
39542A38000945q499404p942028p523961o919345o137410n484169n090113m774352
39534H5630163m382489m008173l809737l776875l747075l548979l129203k660683
39526E6566949k474875k682905k900674k633937j960501j488262j528377j699338
39518C9198080j581854j363191j432665j659561j605218j277271j090182j119870
39510B8068268j003426o65094n30112p81686r68948p19835l64961l84800o14484
39501B2034922n57399k54875k37040o62614j066952j048276p46543m98363l93277
39492A6569583l53069l55744l84942l61876k80391k46496k86434k90959k26611
$$ y = [220331555, 205471523, 191813405, 179497587, 168197774, 157484241, 147334441, 138000945, 129501541, 121559513, 114035552, 107116207, 100978797, 95494628, 90404515, 85630163, 81247674, 77239501, 73429764, 69652889, 65905814, 62356835, 59227632, 56566949, 54092074, 51409169, 48508495, 45874558, 43914057, 42425795, 40897418, 39198080, 37616226, 36253035, 34820370, 33160809, 31555591, 30278320, 29188138, 28068268, 27064842, 26399748, 25869636, 25087950, 24119002, 23399167, 23034206, 22649406, 22034922, 21477523, 21222648, 20985608, 20322994, 19256042, 18207766, 17461223, 16962860, 16569583, 16216514, 15860770, 15475828, 15113952, 14833561, 14587065, 14300631, 14009672, 13783061]
39483A3783061k06220k72263l18970l05095l09125k92256r2921K11074K56987
39474A2454272p0231l70019k78475k792M9666q5261r9052k2931j35099l45218
39464A1094860k59201R6309K08689r0945l10126j01616J52763r029l60422m10556
39454A0010726k43278k90293m83234l54129N2015J15449l29426o01038j89865
39445G686927L91041L13865l64217q11389n86380j13395M7810r6637k02324j54770
39435F110531j15171j71096k23211j94957j45766j22222m2778J51236L03011J74343
39425E723920j89927m13689k54571K7919R306k79723l93377j46041J25172J16342
39415D325331M888O7777J69087K3777k27855j68057K28876N08944L74318L5520
$$ y = [13783061, 13576841, 13304578, 12985608, 12680513, 12371388, 12079132, 11986211, 12197285, 12454272, 12384041, 12014022, 11735547, 11732755, 11782421, 11697160, 11598108, 11575177, 11440078, 11094860, 10835659, 10931968, 11140657, 11049712, 10739586, 10637970, 10790733, 10781704, 10421282, 10010726, 9767448, 9477155, 8993921, 8639792, 8691807, 8807256, 8477830, 7876792, 7686927, 8077968, 8391833, 8027616, 7216227, 6629847, 6516452, 6564262, 6467625, 6265301, 6110531, 5995360, 5824264, 5601053, 5406096, 5260330, 5138108, 5095330, 5246566, 5549577, 5723920, 5533993, 5120304, 4865733, 4893652, 4902958, 4623235, 4229858, 4083817, 4208989, 4325331, 4330219, 4397996, 4567083, 4590860, 4363005, 4194948, 4423824, 4932768, 5307086, 5342606]
39405E342606j79000k42833l03579l82906l82108k42954J326K20848K27447m63
39395D058384j55295O6334M60393M93020O6883k79434j31898K18316K56567j0364
39385E042906j73543p0216R0700J31462O0655j04336l29882m31128k60545J7756
39375C973829J43048J62479K73352L58132J22800l20566n05170l18862j62958
39366C726084k59539l23433j63128o8657k25899k49710J78855O17340M36052j79457
39356C488508m82896k82825q3287j25148n4022K81163M31196J03898k92271l04306
39346B680010j18323q8616n4354K56657N13533K12198l72690m56798L3471K94273
39336B899361j16533o09436n06502l7656J30348q0112k03030m8139J28574J86306
$$ y = [5342606, 5163606, 4920773, 4617194, 4234288, 3852180, 3609226, 3610552, 3831400, 4058847, 4058384, 3903089, 3969423, 4429816, 4922836, 4989719, 4710285, 4578387, 4796703, 5053270, 5042906, 4869363, 4799147, 4889847, 5021309, 5081964, 4977628, 4647746, 4216618, 3956073, 3973829, 4116877, 4279356, 4552708, 4910840, 5033640, 4713074, 4207904, 3889042, 3726084, 3466545, 3143112, 2979984, 2911327, 2685428, 2435718, 2614573, 3231913, 3667965, 3488508, 3005612, 2722787, 2639500, 2514352, 2460330, 2741493, 3172689, 3276587, 2984316, 2680010, 2561687, 2473071, 2418717, 2675374, 3188907, 3401105, 3028415, 2571617, 2605088, 2899361, 2782828, 2173392, 1666890, 1629234, 1759582, 1679470, 1476440, 1428301, 1556875, 1743181]
39326A743181K69935L73735K29753k09207n66267n34877k80734j15450j3130K46567
39316A143506N86650O24598K00055l35547m94554k00397J73404K55814L1277k59327
39306A725479m15642l83826j80462J25875L81297M45557L42309J95101K7485k10609
39296B052564m18591l77965r3668J25926Q0502l8182K6253J74830J35675n9083
39286A608261j05620Q0013K16496Q4964j43960j52564R8143L21860K36773j30364
39276B114002m60778m64894j95242K5147J3017o8690o904J22082R6281q3848j97698
39265H92475j21962N9899K26183L03136K27641J8864j51864j39739j3569R4538
39255A395602J91400K70435J62328j45073k54922J16095N21767K70047n10109
$$ y = [1743181, 2013116, 2386851, 2616604, 2407397, 1841130, 1306253, 1025519, 910069, 896939, 1143506, 1730156, 2354754, 2554809, 2219262, 1724708, 1524311, 1697715, 1953529, 1984806, 1725479, 1309837, 926011, 745549, 871424, 1252721, 1698278, 2040587, 2235688, 2263173, 2052564, 1633973, 1256008, 1162340, 1288266, 1368768, 1330586, 1356839, 1531669, 1667344, 1608261, 1502641, 1582654, 1799150, 1884114, 1740154, 1587590, 1685733, 2007593, 2244366, 2114002, 1653224, 1188330, 993088, 1018235, 1031252, 962562, 955658, 1077740, 1174021, 1090173, 892475, 770513, 830412, 1056595, 1359731, 1587372, 1606236, 1454372, 1314633, 1301064, 1395602, 1587002, 1857437, 2019765, 1874692, 1619770, 1735865, 2257632, 2527679, 2017570]
39246B017570r24354n46644M5738K11939R6626J45889L03581K03306j74628n05581
39236H73442n56199k81919K33593O31639M37003k56589o46136k28780M24219M55848
39226A086121n8865l49037j53065O8512M0626L4372K31917L84030K75060K1473
39216A581144k22154m03272l62957K1698M42583M35880R7330n4185L4755r5422
39206A475400m44785l63174L10040P29370K52499n05925n50351O7241M76789L06478
39196A753582l6714k19177l18956l37695j03190K40105K63133o8567k76177j01799
39186G94545J20432M0348j91333k45863j10490K4739J16136K22592K85413K00618
39176A257137J6605j18030j40103r9695p8189j39754k67359l14147j49669J15484
$$ y = [2017570, 1093216, 546572, 592310, 804249, 900875, 1046764, 1350345, 1553651, 1379023, 873442, 317243, 35324, 268917, 900556, 1337559, 1080970, 434834, 206054, 630273, 1086121, 1027256, 678219, 525154, 593666, 634292, 668664, 900581, 1284611, 1559671, 1581144, 1358990, 955718, 592761, 614459, 1057042, 1492922, 1590252, 1536067, 1570822, 1475400, 1030615, 667441, 977481, 1706851, 1959350, 1453425, 903074, 970315, 1447104, 1753582, 1716868, 1497691, 1178735, 841040, 737850, 977955, 1241088, 1172521, 896344, 794545, 914977, 955325, 763992, 518129, 407639, 432378, 548514, 771106, 1056519, 1257137, 1273742, 1155712, 1015609, 915914, 837725, 697971, 430612, 116465, -33204, 82280]
39166H2280K13165P6436n8062J5609K01809K71543J65465J5226m4438M336O5992
39155A009361J8510j27128j69668M4261L42799L86024J21234j43161j74999p5777
39145A231456J0105J61845M37672N92206L47330j53985m55582l35526j1609K06056
39135B029968K45033J99362J24092K5243m3534l852J24015J88484N5631j98473
39125B745969l16174j65391M2195M354k15070k18404J51315N13557M24464k9171
39115B937644l51037k50095R4894L26008K57359j8516k05567o0671K67151L02699
39105C299869j26591n26568l56701J55119L14602J7824j02515K80964O30719L78899
39095C965621k00516m52605l06832k13422l24880l31154p7045J75097J81247J8668
$$ y = [82280, 295445, 371881, 313819, 329428, 531237, 802780, 968245, 983471, 939033, 943369, 1009361, 1027871, 900743, 731075, 775336, 1118135, 1504159, 1625393, 1482232, 1307233, 1231456, 1241561, 1403406, 1841078, 2433284, 2780614, 2626629, 2171047, 1835521, 1823912, 2029968, 2275001, 2474363, 2598455, 2623698, 2580164, 2576312, 2700327, 2888811, 2944442, 2745969, 2429795, 2264404, 2306599, 2310953, 2095883, 1877479, 2028794, 2542351, 2966815, 2937644, 2586607, 2336512, 2431406, 2757414, 3014773, 2996257, 2790690, 2730019, 2997170, 3299869, 3173278, 2646710, 2290009, 2445128, 2759730, 2777554, 2675039, 2956003, 3586722, 3965621, 3765105, 3312500, 3005668, 2792246, 2467366, 2136212, 2059167, 2234264, 2415511, 2434179]
39085B434179j41024k39746k31842o2636J66058K48954J54233L3887n0122j67498
39075B144443k92526l07020k34480j95619j47901J6902J50199J3847k31983j70939
39065G44923J76631L18678R4588m6735J67433L40272R7861k43330k15403K4093
39055A459011L9263j04261m9903J11002J732k78384k61517M9602J43483j35776
39045I74252l53943k56029j23547j48532q4197J64314J96721k00772n32249k74390
39035f38372K88417M72365J91789k8310Q0791K27725J63144P3139J81948L33561
39025A346197K42430l7785j69060m966K05185J52337j27693l25059k85509j75181
39015H20896j55271j14726P8035K45360J33486j24192j50541P2184J44422j08177
$$ y = [2434179, 2293155, 2053409, 1821567, 1758931, 1924989, 2173943, 2328176, 2362063, 2311941, 2144443, 1851917, 1544897, 1310417, 1114798, 966897, 983799, 1133998, 1147845, 915862, 744923, 921554, 1240232, 1334820, 1288085, 1455518, 1795790, 1893651, 1650321, 1434918, 1459011, 1498274, 1394013, 1344110, 1455112, 1456844, 1178460, 916943, 966545, 1110028, 974252, 620309, 364280, 240733, 92201, 8004, 172318, 369039, 168267, -363982, -638372, -349955, 122410, 314199, 285889, 366680, 594405, 757549, 830688, 1012636, 1346197, 1588627, 1550842, 1381782, 1376816, 1582001, 1734338, 1606645, 1281586, 996077, 820896, 665625, 550899, 628934, 874294, 1007780, 883588, 733047, 805231, 949653, 841476]
39005H41476l29066j66069K20489M33231L56642J46708p1538k33456k43039r8004
38995H57374L9876Q7037J57886K61284J51068k42011n00568k27799L19494N22902
38985A426543K24141j59449k87004k30535j35627K5735K29373K74505P7531j49677
38975A295536j90659j13624j14791k14222k56755j33229J02404K78905K22833
38966H76398q7453m33876n10972k29833J80104M08114L53274J57200P956k9697
38956F91215J019O5662J57688J99184O2302j98009k72863J5475L50533K61129
38946A333335j83537l96347r1771L11787L23320M3149j19152q3805p0004j37740
38936I29235j68120j80830k89276m00061k95972R951K83526L90141L64845K47403
$$ y = [841476, 512410, 346341, 566830, 1000061, 1356703, 1503411, 1431873, 1198417, 955378, 857374, 897250, 984287, 1142173, 1403457, 1554525, 1312514, 811946, 584147, 903641, 1426543, 1650684, 1491235, 1204231, 973696, 838069, 863804, 1093177, 1367682, 1445213, 1295536, 1104877, 991253, 876462, 662240, 405485, 272256, 374660, 653565, 876398, 788945, 355069, -155903, -385736, -205632, 202482, 555756, 712956, 720912, 691215, 692234, 757896, 915584, 1114768, 1177070, 979061, 706198, 721673, 1072206, 1333335, 1149798, 753451, 661680, 973467, 1296787, 1339936, 1220784, 1136979, 1066975, 929235, 761115, 580285, 291009, -109052, -405024, -395073, -111547, 278594, 643439, 890842]
38926H90842R5904N7766J68127K00891j6487k99711m03802m09192m57591l51623
38916e24876J01936N52306M90649P1722p6773J50834K04976j52693m30822k24444
38906A62815J36450J26829k20306m75952m16973j48644J26479K18556N9350j27235
38896e58631k1026L06798M27685K04262J3046J33405L27337K83905R0731l6084
38886A171428j26972k35458j82478J08372L16588J53119j62012k35078j00185
38877G07324q9955k61929l45633j84298R5871L09302L55639K10276k0295j15941
38867F60361J6463K21090L22961L13820K18666K1045j65346j48298k0406j22361
38857A317995m66152o00934l02629M1329O7133K954J74725L75828K63715K8485
$$ y = [890842, 986746, 1044512, 1212639, 1413530, 1397043, 1097332, 693530, 284338, -173253, -524876, -422940, 129366, 620015, 691737, 614964, 765798, 970774, 818081, 387259, 162815, 299265, 426094, 205788, -270164, -687137, -835781, -709302, -490746, -431396, -558631, -579657, -272859, 154826, 359088, 372134, 505539, 832876, 1116781, 1207512, 1171428, 1044456, 808998, 626520, 734892, 1051480, 1204599, 1042587, 807509, 707324, 617369, 355440, 9807, -174491, -78620, 230682, 586321, 796597, 776302, 660361, 676824, 897914, 1220875, 1534695, 1753361, 1774406, 1609060, 1460762, 1440356, 1317995, 851843, 250909, -51720, -10391, 56742, 59696, 234421, 610249, 873964, 902449]
38847I02449O9998K77786K49850K9534l147J62175J97710R0825J31405K68833
38837B377418J19437l17671n49084l30743o308N9851o0574j32402r6043J6781
38827A080662J76302K57873J47432j6073p141R7513M9859r5184n7695J34891J55348
38816A923787n9616k19070j97923j79356k22572j74692q6609k05319m43157l81896
38806b46423L6086L34797K09026r1117k63067l25170k82908K6611M77003N72599
38796D47437J65655k27539j73031Q6103J39365L6141m043n2848j93785j97300
38786B6155N8629K36587Q3132q1501O1196J84490j19631n00771l23549K48435
38776a26828M39837O6955k27220k5500K88672K29028r8975k86762j84352Q4149
$$ y = [902449, 972447, 1250233, 1500083, 1529617, 1526470, 1688645, 1886355, 1977180, 2108585, 2377418, 2496855, 2179184, 1630100, 1299357, 1293049, 1352900, 1292326, 1159924, 1063881, 1080662, 1256964, 1514837, 1662269, 1646196, 1639055, 1736568, 1786427, 1691243, 1633548, 1768439, 1923787, 1864171, 1645101, 1447178, 1267822, 1045250, 870558, 783949, 578630, 135473, -246423, -210337, 124460, 333486, 242369, -20698, -345868, -628776, -602165, -125162, 447437, 613092, 385553, 212522, 298625, 437990, 474131, 470088, 417240, 223455, 26155, 84784, 321371, 404503, 323002, 384198, 568688, 449057, -51714, -375263, -126828, 313009, 379964, 152744, 127244, 415916, 644944, 545969, 259207, 74855, 159004]
38766A59004L42850L96855J25224k84270m43395k51341l5258p1459k09932j46242
38756d17964J24114L13912K13699q1324k84352k11026K1637J23818p930j66215
38746c71631j41863R60R5797J43000K11412K40220J72147J23107J64447J13567
38736G51163j56220l81263k53518N6569J49781M6090R1569K85378K63401k833
38726H50117q4702J46585K11827k03773o48313n14739O0054L79885J28370l02451
38716B2860m15678k04303k7542o9678r5902J97803O64534P59233K54105l31613
38706G53819l47432R1951K75343p5126m66888m37887j62772j5279p530K16m7426
38695d39011j45976k987M81493Q16631N09871j66962n15083l48856p5882L2252
$$ y = [159004, 501854, 898709, 1023933, 739663, 296268, 44927, 9669, -61790, -271722, -417964, -293850, 20062, 233761, 152437, -131915, -342941, -321304, -197486, -205416, -371631, -513494, -512534, -416737, -273737, -62325, 177895, 350042, 473149, 637596, 751163, 594943, 213680, -39838, 16731, 166512, 212602, 304171, 589549, 852950, 850117, 765415, 912000, 1123827, 920054, 271741, -242998, -182944, 196941, 325311, 22860, -392818, -597121, -624663, -694341, -790243, -592440, 72094, 831327, 1085432, 753819, 406387, 498338, 773681, 698555, 231667, -206220, -368992, -384271, -391801, -391585, -439011, -584987, -587974, -106481, 710150, 1220021, 1053059, 537976, 189120, 113238, 145490]
38685A45490P0543M6331j87278m55755l11035K44209O02743L93223J1277k0086
38675E39662J88555J85142p5599k43090j74322q8521j48135k30987j57132P7506
38665a26921L05732L03300q340l51408k84664J86870M55943J08867l79571k58978
38655d9170L43953N49899N7781l71333q0156M75647M33080k01083o36984m57089
38645F4545l4523J73047J56166P9905k0254q9941m438J45569P0327k24753l17963
38634b313L459L31398J89553k56150m37886j94403P5801N3274r0708k9986K37756
38623a20205M12752K66332j25464m66632n04781k43972Q5501K70720K83481K02009
38613E9741Q9565K0482Q5322K36721K51445J4232k60594k83846q5657O4674P1233
$$ y = [145490, 216033, 262364, 75086, -380669, -691704, -447495, 155248, 548471, 559748, 539662, 728217, 913359, 837760, 594670, 420348, 331827, 183692, -47295, -204427, -126921, 178811, 482111, 473771, 122363, -162301, 24569, 480512, 589379, 209808, -49170, 294783, 844682, 902463, 531130, 450974, 926621, 1359701, 1158618, 521634, 64545, 30022, 203069, 359235, 439140, 418886, 328945, 324507, 470076, 540403, 315650, -2313, 1146, 332544, 522097, 265947, -171939, -366342, -290541, -237267, -327975, -357961, -120205, 292547, 558879, 433415, -33217, -537998, -781970, -696469, -425749, -142268, 59741, 149306, 169788, 255110, 491831, 743276, 757508, 496914, 213068, 127411, 192085, 263318]
38602B63318Q0266J41880R4008j25873l03740k37917k9757P4939R976r9529j55213
38591b87642j59276j23183m3460M7150J05894J41572J72206J57253O4096l0392
38581D4218j5258Q5602J33498P7420K0927M9374J08592J22155J07595P1417p9125
38570G26415l38095m22561p4279M64644O08044J85235k69018k20028J47491K62717
38560A070565K1238j48329j8608J15236l8129l21405m12695k56767o651K24301
38550B28756L56822L06264J35769N4896J03588N9164j64696k82540n2678K89563
38540A034908L14675k2234l63469m17825k15174K1924O8344j36754l53052k27338
38530b95995K15990M92365K83400j06918k14417p8254o0197k05495k38087r3242
$$ y = [263318, 343584, 485464, 579472, 453599, 149859, -88058, -117815, -42876, -32900, -132429, -287642, -446918, -570101, -613561, -566411, -460517, -318945, -146739, 10514, 74610, 44218, 28960, 114562, 248060, 325480, 346407, 395781, 504373, 626528, 734123, 805540, 726415, 388320, -34241, -108520, 356124, 964168, 1149403, 880385, 660357, 807848, 1070565, 1091803, 943474, 924866, 1040102, 1001973, 680568, 267873, 11106, 4455, 228756, 585578, 891842, 1027611, 1082507, 1186095, 1245259, 1080563, 798023, 745345, 1034908, 1349583, 1327349, 963880, 546055, 330881, 352805, 421149, 284395, -68657, -295995, -80005, 412360, 695760, 588842, 374425, 296171, 235974, 30479, -207608, -300850]
38520c00850n512p8075j50383j04031K3312J99254L58191K82240j13635m57322
38510c46811l00588K11560M86686K91370l7994k04162k76502l20953j92284J22496
38500e67182L56483L45049K23092J13941l0584j70534j35830K6187L1856j83244
38490I234l58508l53133k81214j22363K83284O97340N40209k03891p06416l53257
38480h48715L91504O70557L78083P0154L7150O4701k1678j15148j14321m9207
38470D63080P3577K50061L44323K24185l4524k70198m29247m64288k55221J37436
38460C9184L71774K49808K6753J7730J27460Q0941j04026k13914k12124j85796
38450A97790j15262j3067o7718l11487l97520r0337K82891K99638R0749K9570
$$ y = [-300850, -306362, -384437, -534820, -638851, -615539, -416285, -58094, 224146, 110511, -346811, -647399, -435839, 50847, 342217, 304223, 100061, -176441, -497394, -689678, -567182, -210699, 134350, 357442, 471383, 440799, 270265, 134435, 160622, 192478, 9234, -349274, -702407, -983621, -1105984, -822700, -125360, 414849, 210958, -495458, -848715, -457211, 213346, 591429, 661583, 698733, 763434, 741756, 626608, 512287, 463080, 536657, 786718, 1131041, 1355226, 1320702, 1050504, 621257, 156969, -98252, 39184, 410958, 660766, 687519, 705249, 832709, 913650, 809624, 595710, 383586, 197790, 82528, 69461, 1743, -309744, -707264, -797601, -514710, -215072, -124323, -94753]
38440i4753M7171j37107l16113m8708M52338M48944j92322p03030m87616J10080
38430i21116M24896L32397J21603o4570k29473k47470j1300K86160L48589J73990
38420B13706J0978j975O1542J07205J05816J5419j89303l75982l01255Q7279M65811
38409A99241M20441k5076l39899j30006K83904K50096k91614o88306m84297j0518
38399h16034J89956J12634Q6646J49502R3046o6451j19065m9041j049L4780J43506
38388b41570K10571Q3503j12765j64422j26762j55356j71432o4348K330r6672
38378h36923r6128K10892M61135K49704j01803o367L73002L64298p8529l39865
38368A99416k22112j63379k91266j87886J87459K62759j20780l23089J5919L34448
$$ y = [-94753, -47582, -184689, -500802, -549510, -97172, 351772, 159450, -543580, -1031196, -921116, -496220, -163823, -42220, -106790, -336263, -583733, -595033, -308873, 39716, 213706, 224684, 222709, 284251, 391456, 497272, 512691, 323388, -52594, -353849, -266570, 199241, 619682, 594606, 254707, 124701, 408605, 658701, 367087, -321219, -805516, -816034, -626078, -513444, -426798, -277296, -184250, -250701, -369766, -418807, -419856, -385076, -241570, -30999, 52504, -60261, -224683, -351445, -506801, -678233, -742581, -740251, -836923, -933051, -722159, -261024, -11320, -113123, -119490, 253512, 617810, 539281, 199416, -22696, -186075, -477341, -665227, -477768, -215009, -335789, -658878, -642959, -308511]
38358c08511J17942k43325j89055O6802Q949k79161l69364k38569j29714p136
38348a571142K51485M20401K50740k6052k9373J88458L48398M32803N01253L57325
38338A124296p4411l60705j25142K74388K33320j68263l47694j57491L873p0979
38328C31192j73913j84733k33696l15291k24774N5455K99103L85002L56130J82109
38318D76584j55262l97925k49674J33540K81733M5908k59563l46271k37464n7202
38308g65596J36857K71651K70569J70226M7475r9752k27735j63202J27360L64110
38298A31963L06287R0957l3845p9888j41943j31760k3243n6571l07066l78941
38288f24050N434M37829L88516L6162p7149N0206R646j87336j58746P2916J09030
$$ y = [-308511, -190569, -433894, -622949, -556147, -547198, -826359, -1195723, -1434292, -1564006, -1571142, -1319657, -899256, -648516, -674568, -703941, -515483, -167085, 265718, 766971, 1124296, 1049885, 689180, 564038, 838426, 1071746, 903483, 555789, 398298, 402171, 331192, 157279, -27454, -261150, -576441, -801215, -745760, -446657, -61655, 294475, 476584, 321322, -76603, -326277, -192737, 88996, 134904, -124659, -470930, -708394, -765596, -628739, -357088, -86519, 83707, 131182, 31430, -196305, -359507, -232147, 131963, 438250, 529207, 495362, 415474, 273531, 141771, 118528, 61957, -245109, -624050, -618616, -180787, 207729, 243891, 166742, 216948, 226594, 39258, -119488, -46572, 62458]
38277F2458n4925l0871J80733J63308j02920j63251N7175Q9818j97847l20336
38267c16658l8135K23303J44999J6850R5624J21196q8627j72183J46098M90461
38257F22928M23661J41725M7776N1798j32275l41197k29188N4258N8662k16731
38247D81417l25879j01134J24694Q3744n3389j5966J34865J03167k11846n20396
38237c00723m29495P4855N37176N44672K24888K3629Q6836J68840J05003O064
38227A041745m0066q2478o6106J36544L71394K89882q6509l00352j14978J69136
38217A318212K38103J97364K55981L56575L67108L13574K09675j7293k52615k16325
38207B770359N5160J51915p7822k69902j60465m147p0834j67412k8634J99778
$$ y = [62458, 7533, -23338, 157395, 320703, 217783, 54532, 111707, 201525, 3678, -316658, -354793, -131490, 13509, 30359, 125983, 247179, 158552, -13631, 132467, 622928, 1046589, 1188314, 1236090, 1287888, 1155613, 814416, 585228, 639486, 698148, 481417, 155538, 54404, 179098, 262842, 209453, 193487, 328352, 431519, 219673, -300723, -730218, -655363, -118187, 426485, 651373, 675002, 761838, 930678, 1035681, 1041745, 1001679, 919201, 853095, 989639, 1361033, 1650915, 1564406, 1264054, 1149076, 1318212, 1556315, 1753679, 2009660, 2366235, 2733343, 3046917, 3256592, 3239299, 2986684, 2770359, 2825519, 2977434, 2899612, 2629710, 2469245, 2465098, 2394264, 2226852, 2198218, 2397996]
38197B397996K45650J45242N1823n9297j72635p3975K51268M11615J49648k43516
38187C103819l77131k79777j71000r9829j07586l18554n61892l93071J75968N23739
38177A494686L63331J87062L10429K39216l43041p31758k52322M87254M45370
38168B200227k29043n37306k52940l2782j05077m5578J77939J17120j23099P8015
38158A247476N96821N01485m00217j047126o76557O9629K14727j77566l89718
38149f1046k06470N991r582j85628l39542k44609K13949P24986P73020L52966
38139A024035N053j7745m9840k82368l87879j86265l0867j38257j63893J12101
38129a15925K99926J04428r3265O8459K33645j7693l41438j96986J78770J60270
$$ y = [2397996, 2643646, 2788888, 2840711, 2781414, 2608779, 2534804, 2786072, 3197687, 3347335, 3103819, 2726688, 2446911, 2275911, 2176082, 2068496, 1749942, 1188050, 794979, 970947, 1494686, 1858017, 2045079, 2355508, 2594724, 2251683, 1519925, 1267603, 1754857, 2200227, 1971184, 1433878, 1180938, 1148156, 1043079, 997501, 1175440, 1292560, 1169461, 1247476, 1844297, 2345782, 1945565, 898439, 221882, 291511, 506238, 328672, -61046, -267516, -261525, -271107, -456735, -796277, -1040886, -826937, -101951, 671069, 1024035, 1029088, 1011343, 961503, 679135, 291256, 104991, 74124, -64133, -228026, -115925, 184001, 288429, 195164, 263623, 497268, 479575, 138137, -58849, 119921, 280191]
38119B80191k00046k98338m850K04829Q4405j10446j86292k26347k02928N8387
38109f01435M48682N96736M06125J65499P6612M9911o347n5166j04571j87996
38099G88050j98151n4998M5258r7706k85313k10097l3516j63588m98954m65386
38089a174401J03243O50174O41088J84851k74274m79423l80542k6304L15162K67572
38079a72854j48060l97901r4701M71377P35606N69179K75451N4148j53309l30444
38069H08492k75460N1438L20088J77235k83424n82970m12659R911K33925J31940
38059A78516R5J12251L61326M29375J81217k12258m48899l25903Q6072M32625
38049G94417L79559k44l01601l06698k04498j96985j81731k1876J60376K31082
$$ y = [280191, 80145, -218193, -223043, -18214, 66191, -44255, -230547, -456894, -659822, -601435, -152753, 443983, 850108, 1015607, 1092219, 1142130, 1135783, 1080617, 976046, 788050, 589899, 534901, 580159, 482453, 197140, -12957, -46473, -210061, -709015, -1174401, -1071158, -420984, 220104, 404955, 130681, -348742, -729284, -755588, -440426, -172854, -320914, -718815, -813516, -342139, 393467, 962646, 1238097, 1292245, 1138936, 808492, 533032, 584470, 904558, 1081793, 798369, 215399, -197260, -187349, 46576, 178516, 178611, 290862, 652188, 1081563, 1262780, 1050522, 601623, 275720, 361792, 794417, 1173976, 1173732, 872131, 565433, 360935, 163950, -17781, -39657, 120719, 351801]
38039C51801L12846M77306M34082m8522o07071o55475k02846J85935K15532J45936
38029F09524K06199K27685L6274j96836k19632l2973K02323L44640K55202j15364
38019A317042n10088n25725j33281K21413J76804j25123l02780j84959J10822
38010D4125L22762K00083k26239m95231j80248M44803O30567J71037k90173k08914
38000D12572J20970J62937r710N49J32195J0614k98246l28008J0077K71969J84179
37989F70098j1615n6983n6304j52039k12019r4459P3790J30188J39044J84614
37979F14315J38935q8859k70765j55260P7401K0477l10063m04969K0645N36850
37969A78707M93394j32659o75133n76018k941M29634L67535k1481l62362m18617
$$ y = [351801, 664647, 1141953, 1576035, 1527513, 920442, 264967, 62121, 248056, 463588, 609524, 815723, 1043408, 1079682, 882846, 663214, 630241, 832564, 1177204, 1432406, 1317042, 806954, 281229, 147948, 369361, 546165, 421042, 118262, -66697, 44125, 366887, 566970, 340731, -154500, -334748, 110055, 740622, 911659, 621486, 412572, 533542, 696479, 686769, 687318, 819513, 830127, 531881, 203873, 213950, 485919, 670098, 658483, 601500, 545196, 393157, 181138, 86679, 160469, 290657, 429701, 614315, 753250, 664391, 393626, 238366, 315767, 336244, 26181, -378788, -358143, 178707, 672101, 539442, -135691, -711709, -714650, -285016, 82519, 61038, -301324, -719941]
37959g19941j57899K82599O23492O18577L09320j0929j43911j53020j37842o5807
37949D44639M1715n852k70341m69461l48552j09506j13199k61199j22081L11941
37939i01896M95787J47881k63613j94627J70176K41924n6975k23836J2222L14912
37929b58045L07417R6880k575L4560J6484q4158j09545K009J48777K41968K61188
37918F54960J66588o6179l31355m63086m18092k75350r4621Q9965J84295J08273
37908d44602o3794j83533k11859j73363j3552K76941M73987L50095N9687m4790
37898B5217K1263q8302l75017l70166P1139L66188L2225m95238m41070J76415
37888a077346O21140N28736K67629J84997J32410p3000k65270k84272k74136l30334
$$ y = [-719941, -877840, -595241, 28251, 646828, 956148, 945219, 801308, 648288, 510446, 444639, 486354, 480502, 210161, -259300, -607852, -717358, -830557, -1091756, -1213837, -901896, -406109, -258228, -521841, -716468, -546292, -304368, -361343, -585179, -572957, -258045, 49372, 146252, 143677, 178237, 194721, 110563, 1018, 3027, 151804, 393772, 654960, 821548, 755369, 424014, -39072, -457164, -732514, -827135, -737170, -552875, -444602, -508396, -691929, -903788, -1077151, -1090703, -813762, -339775, 10320, 70007, 25217, 46480, -41822, -416839, -787005, -715866, -349678, -317453, -812691, -1253761, -1077346, -456206, 72530, 340159, 525156, 657566, 584566, 319296, 35024, -239112, -569446]
37878e69446k27326J69717N29619M51626L1705k87274k80957r1229N7458N7832
37868a58275m5439n6826J68902M09367K42741k88400n53945j91303K93923K35111
37858E5856k09171l50563l6458K37729K02053J05477P9460r7315m03914m09460
37848h26306k0970K03132q5148l82472r6928M74120N67118Q5080l56799l91114
37838h30287k44904j31208N5310K93539K75313m2935k03712J06312N44489N97121
37828D19038K79702k1185j66678l03039m22501l40760j06691k1877j57605k01838
37818a043434M6867L18318K42767r4272k42668J2227L74979M21799J04207k35771
37808i4981k90213j06368M1030O351r4976q5148O3657K46703L46989K82583N0849
$$ y = [-569446, -796772, -627055, -97436, 354190, 385895, 98621, -182336, -273565, -216107, -158275, -203714, -260540, -91638, 317729, 560470, 272070, -281875, -473178, -179255, 55856, -153315, -503878, -540336, -302607, -100554, 4923, 84383, -12932, -416846, -826306, -847276, -644144, -729292, -1111764, -1208692, -734572, -167454, -82374, -439173, -830287, -1075191, -1206399, -1151089, -857550, -582237, -625172, -828884, -722572, -178083, 419038, 698740, 677555, 510877, 207838, -214663, -555423, -662114, -683991, -841596, -1043434, -996567, -678249, -435482, -529754, -772422, -760195, -385216, 36583, 140790, -94981, -385194, -491562, -450532, -444181, -539157, -624305, -560648, -313945, 33044, 315627, 366476]
37797C66476j87664j96763L0626J76324j4204l51048m37109k10459L0451J12478
37787f80892J58609K16069Q9095k59711m59771j89648L07851M84116J70178k69866
37777d33970m31277k76054m7915K9242o1206j37558k8338J82257K26274L4587
37767i43958j39615j10369m3432j38608k64547k12702j06894j81855l12978k04940
37757b659898M7542O9159j52412k40516q9409j8257j43405j45843J07505K39018
37747b986516j2210l01216k12085J05008K54531K19250K17666K28229J25726N1631
37737b309986J72373K83784J44579j5369J29639L20546O7297m21927m09531K10647
37727a827948O60105M00895j53995l68851k23159k9943J52732L61100M03269J86371
$$ y = [366476, 178812, -17951, 12675, 188999, 174795, -176253, -613362, -823821, -793370, -680892, -522283, -306214, -217119, -476830, -936601, -1126249, -818398, -334282, -164104, -433970, -865247, -1141301, -1189216, -1159974, -1221180, -1358738, -1387076, -1204819, -978545, -943958, -1083573, -1193942, -1237374, -1375982, -1640529, -1853231, -1960125, -2141980, -2454958, -2659898, -2612356, -2543197, -2695609, -2936125, -3025534, -3043791, -3187196, -3333039, -3225534, -2986516, -2998726, -3299942, -3512027, -3407019, -3152488, -2933238, -2715572, -2487343, -2361617, -2309986, -2137613, -1853829, -1709250, -1724619, -1594980, -1274434, -1207137, -1629064, -2038595, -1827948, -1167843, -766948, -920943, -1289794, -1512953, -1542896, -1390164, -1029064, -625795, -439424]
37717d39424K5608J57026K65324m825l76796l50180k7076J02404J9852J20414
37707e07673L69032K82763j53450l20697L0407L23108R1478k65051j78639J71832
37697a56890K58232J03381R5338J81843o860l54408l30948J00343L64509K07988
37687D62528O8463K51252L80795Q2075l25647l27051j8745J14142l1874j55259
37677E00679j31447j21125j80430k03422j99884k36424j72330J36038M34710L29244
37667A55609p3489k49381k3058K19356J76046J9878j7597j5381r5265j53897r3467
37656a50646j3658J4557O3029Q7224q9083l66148l51593L0416L30820K34069n756
37645b16769p4776o8683r3883P6997M65676N26236m3834n87785l43247L49998
$$ y = [-439424, -413816, -256790, 8534, 3709, -373087, -723267, -750343, -647939, -628087, -507673, -138641, 144122, -9328, -330025, -299618, 23490, 114968, -150083, -328722, -156890, 101342, 204723, 300061, 481904, 475044, 120636, -210312, -109969, 254540, 462528, 530991, 782243, 1163038, 1245113, 919466, 592415, 573670, 687812, 655938, 500679, 369232, 248107, 67677, -135745, -335629, -572053, -744383, -608345, -173635, 155609, 82120, -167261, -190319, 29037, 205083, 224961, 207364, 191983, 96718, -57179, -150646, -164304, -149747, -86718, 506, -88577, -454725, -806318, -775902, -445082, -211013, -216769, -291545, -360228, -454111, -377114, 88562, 614798, 570964, -16821, -360068, -10070]
37635a0070N56837K04330N5315L17954L49499j02412m11515j96026K0910j97212
37625E87610l93197p2812L43757K24501j60114j04822K94920K97702k15773n25028
37615B76744k28197J60357O6782k76379k34225K95643P50871O06821l7561n81829
37605G99027n45842n7396L11716K05565j58564l72077l55724k84112j90445J7494
37595f30358K36303K22891p299j45540k4496J59431J46148n5877k21489j65914
37585d86200Q8008L05443K30494j14379l98409l76661j79707l8279Q3350K92906
37575e93434M02579J68639k04566k67995j6504J20287J8710M0460L11062L96265
37565C75503K6141l61345k44416K00882M27263L19843J54643m430k82856m99894
$$ y = [-10070, 546767, 751097, 806412, 1124366, 1473865, 1371453, 959938, 763912, 784822, 587610, 194413, 121601, 465358, 689859, 529745, 424923, 719843, 1017545, 801772, 276744, 48547, 208904, 275686, -693, -234918, 60725, 811596, 1418417, 1380856, 799027, 253185, 195789, 507505, 713070, 554506, 182429, -173295, -457407, -647852, -630358, -394055, -171164, -178463, -324003, -348499, -189068, -42920, -98797, -320286, -486200, -398192, -92749, 137745, 23366, -375043, -751704, -931411, -969690, -886340, -593434, -190855, -22216, -226782, -494777, -511281, -390994, -372284, -331824, -20762, 375503, 401644, 40299, -204117, -3235, 424028, 743871, 898514, 894084, 611228, 111334]
37555A11334l16505J08332K01745j59336m20417k05915J08629K8062k70370k33824
37545a048265K11430N71503M90472J52163p0281p5983m0109j21052k63833k54271
37535d48226K6090L81775M52057J58326j53271j73126o2387j67783m29817m40694
37525h57056r7793J92043J15879p3066L9663L78092M76644J62263k00451k17592
37515h1374L3728J73477M6593j17290o8851J02071R2524j79451m26520l53409
37505g78502m5558J63419J59114J66197L53692N33240M08073J394l42580l52189
37495B66300r4594J37742J17782j17810k94007j59117K21408M94124M04516P6789
37485A053133j68647j82092o8695m170q9251k97334m38972k85058J17375L68850
$$ y = [111334, -205171, -96839, 104906, -54430, -474847, -680762, -572133, -544071, -814441, -1048265, -836835, -265332, 225140, 377303, 307022, 231039, 190930, 69878, -193955, -448226, -422136, -40361, 411696, 570022, 416751, 243625, 181238, 13455, -416362, -857056, -954849, -762806, -646927, -719993, -680330, -302238, 174406, 336669, 136218, -81374, -47646, 125831, 172424, 55134, -13717, 88354, 180878, 1427, -425093, -778502, -824060, -660641, -501527, -335330, 18362, 551602, 959675, 961069, 618489, 266300, 171706, 309448, 427230, 309420, 15413, -143704, 77704, 571828, 976344, 1053133, 884486, 702394, 633699, 629529, 540278, 242944, -196028, -481086, -363711, 5139]
37475E139J66158k63541m21573j72046J55541K77937K66379K88354L34562L29138
37465I66048K80183J83690k9533l20415m91689m41170l01522k05456q7723J30154
37455c17433L24986L27266J76346M5689m332m7678j32675k26629k65706j82516
37445c02682K7007K09910J80654J9607M5492L43600N38972K76028k46896n14942
37435E76750l65101j00632K1617P1652J49819J37375o9412k97207l05070j45863
37425c26072p4331j11961L4623M85896Q22260N08157l19893q33403m93708K07842
37415a00590L55577j76793n86750k72569L77169N80024J81426k83955l46495n3744
37405c26700K49730K94808N6893k37084k88271m8873K04014K24439Q7591p143
$$ y = [5139, 171297, -92244, -513817, -685863, -530322, -252385, 13994, 302348, 636910, 966048, 1246231, 1429921, 1400388, 1079973, 588284, 147114, -154408, -359864, -447587, -317433, 7553, 334819, 511165, 556854, 552522, 504844, 372169, 145540, -120166, -302682, -275675, -65765, 114889, 134496, 179988, 523588, 1062560, 1338588, 1091692, 576750, 211649, 111017, 132634, 204286, 354105, 491480, 422068, 124861, -180209, -326072, -400403, -512364, -477741, 8155, 830415, 1338572, 1018679, 185276, -308432, -100590, 254987, 78194, -508556, -781125, -403956, 176068, 357494, 73539, -272956, -326700, -76970, 217838, 274731, 37647, -250624, -299497, -95483, 128956, 216547, 209404]
37395B09404l3808n5127l5642L5830K9169p5978l4497K73058N12114L23535j01912
37384A046146k89794j73695p0146q0157k4642P0642l2283k68357k79381l5265
37374a36932P8609o1855q9012J90390M16382K70177q167n2652O4491P3075k5946
37363G18560j02593j99814l21236k31876J14741K65460j12393n57508l57146L71475
37353d12330P79659M77093r567j28672n7109k08516m38618k54357L49993P52271
37343H49847M87301j31434l71458M8013O40582P43716K75130k52427m04337k74677
37333A610256j94180k26578j69197O9571L37416M62707M16329K33599o0100l90192
37323B089631o03285n60511k47620J84229M69426M08600Q0379j93019j72412O9442
$$ y = [209404, 175596, 120469, 84827, 120657, 149826, 73848, 39351, 312409, 824523, 1148058, 1046146, 756352, 582657, 512511, 432354, 407712, 478354, 446071, 177714, -101667, -136932, -58323, -120178, -209190, -18800, 397582, 667759, 659592, 606940, 671431, 744506, 718560, 615967, 416153, 94917, -136959, -22218, 243242, 130849, -426659, -783805, -412330, 367329, 844422, 834855, 706183, 649074, 440558, 1940, -252417, 97576, 849847, 1337148, 1205714, 834256, 882269, 1522851, 2266567, 2541697, 2289270, 1884933, 1610256, 1416076, 1189498, 1020301, 1089872, 1427288, 1889995, 2306324, 2539923, 2479823, 2089631, 1486346, 925835, 678215, 862444, 1331870, 1740470, 1820849, 1627830, 1455418, 1524860]
37313A524860L01471L95034L29864R2097k40124m06523k01211K04063L82260J45194
37303B526985k40154l83548j92800R7556K13675Q0632j63122l09256k47819m2107
37293A340042J40665J77586R0594J4050M2433J03578M3934j31970k19418j05164
37283A496330K9906k9571j90648k06047p4182J3297N1926J77918K64298K4226
37273A557453m04473m88816j14930J44327j05239m45488l22518P9214J91462l8858
37263E2134k07369j77501j30495n3882J81786L36048N6099m04305m13718L0656
37253g30547K32504j09870m50504l18415j9317n914j29918k5951K11694K67132
37243a079106J77847J60449J39139m4903j81981K1161L56441L38435n9756l90575
$$ y = [1524860, 1826331, 2221365, 2551229, 2643326, 2403202, 1996679, 1795468, 1999531, 2381791, 2526985, 2286831, 1903283, 1710483, 1808039, 2021714, 2102346, 1939224, 1629968, 1382149, 1340042, 1480707, 1658293, 1748887, 1762937, 1805370, 1908948, 1952882, 1820912, 1601494, 1496330, 1526236, 1496665, 1306017, 1099970, 1025788, 1039085, 1091011, 1268929, 1533227, 1557453, 1152980, 664164, 549234, 693561, 588322, 142834, -179684, -100470, 90992, 52134, -155235, -332736, -463231, -517113, -335327, 721, 56820, -347485, -761203, -730547, -498043, -607913, -1058417, -1376832, -1396149, -1402063, -1531981, -1557932, -1346238, -1079106, -901259, -740810, -601671, -646574, -828555, -807394, -450953, -112518, -172274, -562849]
37233e62849m27676l81780l70525j72419K94433O48809N05421L7240k16421k8937
37223f74704K67714K56038j3966j08185J59250L90104J12889m86896p09058k68400
37213a075214L11707M41436K17686Q5809P8757r7552l88539l74458M1187M28761
37203c30420M45587K26707J162k68058o04288p30985m23916N4623K32720N7337
37193a339531o8077J26867M21562M26767R7261k12906j74658J28374K97654J04061
37183a92626k20151k71099J1939K87579K62817J6934j70965j36426J01702L94183
37173H3887M69964J03329n30111q39230m35974L10743O31053K65703k65975l84777
37163e91388j47949k4439j83501l22890j82820O6515R5112j03426k15628o1863
$$ y = [-562849, -990525, -1372305, -1742830, -1915249, -1620816, -972007, -466586, -429346, -645767, -674704, -406990, -150952, -164918, -273103, -113853, 276251, 389140, -97756, -806814, -1075214, -763507, -322071, -104385, -18576, 60181, -37371, -425910, -800368, -759181, -330420, 115167, 341874, 343036, 74978, -529310, -1260295, -1684211, -1629588, -1396868, -1339531, -1407608, -1280741, -859179, -432412, -335151, -548057, -722715, -594341, -296687, -192626, -412777, -683876, -671937, -384358, -121541, -104607, -275572, -411998, -310296, 83887, 553851, 657180, 127069, -712161, -1148135, -837392, -206339, 59364, -206611, -591388, -739337, -763776, -947277, -1270167, -1452987, -1386472, -1291360, -1394786, -1610414, -1672277]
37153a672277J68803K24269J58774K03608L44529K91696n6453l64852k80790N7266
37143i25427K08134O4467l0795J26137K39319j4321m00986l89367P8789M61131
37133e82919L41847m0440j85212n592J61563Q9848r1214j68974r6724R0342L73916
37122a13559O37529O28742K21161l57511p10361o56043l31020K2480K24066J62251
37112b72265j54169m94446n27632j66405L00474N10075L78434Q1474j87614l06833
37102h38907j93571J04711L37031K83865N6622n2695j0450n3871k24203k30622
37092h22090N3728K92995J69769j01933j03660J34723K12909q068k58194l08793
37082g38614j86549M3094L10641L74480O5691k76850j27627L77658M93464k5436
$$ y = [-1672277, -1503474, -1279205, -1120431, -916823, -572294, -280598, -337051, -701903, -982693, -925427, -717293, -652826, -683621, -557484, -318165, -332486, -733472, -1122839, -1044050, -582919, -241072, -281512, -466724, -472316, -310753, -220905, -312119, -481093, -577817, -487475, -113559, 523970, 1152712, 1373873, 1016362, 306001, -350042, -681062, -658582, -434516, -272265, -426434, -920880, -1448512, -1614917, -1314443, -804368, -425934, -344460, -532074, -838907, -1032478, -927767, -590736, -306871, -250249, -302944, -313394, -367265, -591468, -822090, -768362, -475367, -305598, -407531, -511191, -376468, -163559, -171627, -429821, -738614, -925163, -882069, -571428, -196948, -131257, -408107, -535734, -158076, 335388, 309952]
37072C09952m80994k75225J89357K03577j29964j67978J69594L19669M0270k33243
37062e4985j17282J64921J63250j96202n55824n10975k8811M24693L42976j12007
37052d80246k15904K42498N07771M354o08673l72675L76572M46604l03302p17757
37042a120758k06965L76505K35687j16669J05378N71882M66581j00285l34548
37033a23192q1608N6429j94655m26589l10329l2505J23449J19366J7686j01325
37023i53273o7415J87857M12493L24942K6288j81449k28383k04672p0879J78179
37013e76312K85067R3850p7189J09434M02031L19703p5358l17454k84032k22661
37003c42921j70737L2244K37048J19384k06477l04970j20381K3156N1982J36899
$$ y = [309952, -171042, -446267, -256910, -53333, -183297, -351275, -181681, 137988, 178258, -54985, -172267, -7346, 155904, -40298, -596122, -1107097, -1135908, -711215, -368239, -480246, -696150, -453652, 54119, 58473, -550200, -922875, -546303, -99699, -403001, -1120758, -1327723, -951218, -715531, -832200, -726822, -154940, 311641, 211356, -123192, -204800, -148371, -343026, -769615, -1079944, -1112449, -989000, -869634, -851948, -953273, -1020688, -832831, -420338, -95396, -69108, -250557, -478940, -683612, -754491, -576312, -291245, -197395, -274584, -165150, 236881, 556584, 481226, 163772, -120260, -342921, -513658, -481414, -244366, -124982, -331459, -636429, -756810, -733654, -681672, -544773]
36993e44773J45709j65341m65613j86662M27104N16951m146k49543J66512M81618
36983A21816J12187l59768k35930J21011K8756k75608j12770L79318M56335Q963
36973B44310l14136j56400J43469K04750L1611k17110l64400j86470K63955M56361
36963A05940N2190m13676j90867M80539O14459m3531o19598m30272P5734J28386
36953b40696k22434l44289k9490L11337L26570J29635J5766Q0997J91358J70387
36943C89141l3215k96085m21139l08589l3785K07590K19243l3430l22404l43450
36933i76123q9663J16984P1553n3463n4570k8817r2962n5778K45136N13674L67648
36922c6381k3521j78143n8466l1686j51823j13155O7947J8739k17001j07423L96938
$$ y = [-544773, -399064, -564405, -1030018, -1216680, -789576, -272625, -276771, -526314, -359802, 121816, 234003, -125765, -361695, -240684, -211928, -487536, -600306, -220988, 235347, 244310, -69826, -226226, -82757, 121993, 153604, -63506, -427906, -614376, -350421, 105940, 158130, -255546, -446413, 34126, 648585, 605054, -14544, -444816, -369082, -240696, -463130, -807419, -836909, -525572, -199002, -69367, -53601, 27396, 218754, 389141, 355926, 59841, -361298, -669887, -703672, -496082, -276839, -310269, -632673, -976123, -1065786, -948802, -877249, -930712, -985282, -1014099, -1107061, -1162839, -917703, -404029, -36381, -59902, -238045, -296511, -328197, -480020, -593175, -525228, -506489, -723490, -830913, -433975]
36911d33975N69745L7732m85688k25332M46609N76941L6336m39747m14608j59439
36901d91426M5449K42692L46321Q4663l90447m72055L0099N29320N00189J75817
36891F00622K4325L388j62257l31949j75912J50119J59921j81803l80844j68533
36881d62923J47191K01674K5266j71301k84343k23500J01938M93577N10966O9817
36871D08362l23330k34485R6339J71010k3490j27179n9216m7159r7720K1582K49416
36860C4130K15566j07026k40852O3133L74680K05417k60841m55796k24688O9494
36850c26783J36377P3528Q0694J55555J61846L5853j45700k35578j51198K1972
36840a93434J12381P7554M2573Q6953J25163O4504n5268j55187k12450j97208
$$ y = [-433975, 135770, 173502, -312186, -537518, -90909, 486032, 522368, 82621, -331987, -491426, -445977, -203285, 143036, 227699, -162748, -634803, -604704, -75384, 424805, 600622, 624947, 628335, 466078, 134129, -41783, 108336, 268257, 86454, -294390, -462923, -315732, -114058, -88792, -260093, -544436, -767936, -665998, -172421, 338545, 408362, 85032, -149453, -53114, 117896, 94406, -32773, -91989, -139148, -236868, -215286, 34130, 249696, 142670, -98182, -35049, 339631, 545048, 284207, -171589, -396277, -326783, -190406, -116878, -36184, 119371, 281217, 317070, 171370, -64208, -215406, -193434, -81053, -3499, 39074, 126027, 251190, 315694, 260426, 105239, -107211, -304419]
36830c04419p3356O9518O8624m9462o4630Q9632K13385J90064J75183K58943K18943
36819G92425j32193n61543o55748l25898J31943L70892K60180k4387r9276K05062
36809c8543M83720J87330n15487q20582m23717M4027O5321K7340L79131O70037
36799E8577K81408l74467l96964J30750K76506j96592m89025j17195L80585M04631
36789d1786J21084n0818p7087o2186L0554R2699j21309m43279l61928J17480L66976
36778d29600J53336m455J63173J70396k25083l88669J17682O08404K89436m22480
36768C2140n49212o0075K56301J23382j0761N2267J6391j78166k05015n839R9539
36757d29048J5765k8625R768k1845j3737K43986M85925K42374l20507n40434k68622
$$ y = [-304419, -377775, -308257, -239633, -289095, -353725, -264093, -50708, 139356, 314539, 573482, 792425, 660232, 98689, -557059, -882957, -751014, -380122, -119942, -144329, -243605, -38543, 445177, 632507, 117020, -703562, -1127279, -1083252, -1017931, -990591, -611460, 58577, 339985, -34482, -431446, -300696, -24190, -220782, -709807, -827002, -446417, -41786, 79298, 28480, -48607, -110793, -80239, 12460, -108849, -552128, -914056, -796576, -429600, -276264, -280719, -117546, 52850, -172233, -560902, -443220, 165184, 454620, 32140, -517072, -577147, -320846, -197464, -208225, -155958, -139567, -317733, -522748, -528587, -429048, -413283, -441908, -432140, -453985, -467722, -223736, 262189, 504563, 184056, -356378, -625000]
36746f25000l906M2052K02339N06182M21992j99062o81807m92127j2794J35760
36736g06371K933P781J75358K18292P7911q1319j84282j98065k9453K36406L00672
36725a80137J21255M1774J71753J17836k78089m63323l625N70229M48509k38004
36715C08178o33544m03084O02K23525L67578M16502J01445m46829o15679j89389
36705h70695K90642L69804K93200L72929L38768r7205n03368k84381K92658L96963
36695E99315j14063n01782l06623L3367J5561j36905o801K01868K2548l80982
36685e74497l77381J25080M88505K91105j11094k22377j09093q2834o9045K06920
36675d34711N93693N88395N0687n49321o90292l43599J12114L00792J09386k69428
$$ y = [-625000, -628906, -586854, -384515, 121667, 543659, 344597, -337210, -829337, -842131, -706371, -703438, -695657, -520299, -302007, -224096, -305415, -489697, -687762, -717215, -480809, -180137, -58882, -17108, 154645, 272481, -5608, -468931, -472556, 97673, 546182, 308178, -325366, -728450, -727848, -504323, -136745, 279757, 381202, -65627, -681306, -870695, -580053, -210249, 82951, 455880, 794648, 697443, 194075, -90306, 202352, 599315, 485252, -16530, -323153, -289786, -274225, -411130, -417931, -216063, -193515, -574497, -951878, -826798, -338293, -47188, -158282, -380659, -489752, -572586, -641631, -434711, 158982, 747377, 798064, 248743, -441549, -785148, -673034, -372242, -262856, -532284]
36665e32284m79339l20576L2557K41965K11317J35399J76293K73502K79585J24782
36655A43201j42185l30095j88893K73977O30171M59078q3181m25682l24193j00044
36645h7846o8664j07698J3637J99278K03245L8191p0676k6196P6292J49989J85642
36634E05194J60018L4023j57715k98887k74645o6424J80583K33312L9366j40459
36624B14366n3413J58019J51757p5083j83919n0166P0870K9529J1324R5677J6310
36613C85271l37100n55834k41546L67987O92861N32991J39574k35183m71020m25006
$$ y = [-532284, -1011623, -1332199, -1299642, -1057677, -846360, -710961, -534668, -261166, 18419, 143201, 1016, -329079, -517972, -243995, 386176, 845254, 762073, 336391, 12198, -87846, -156510, -264208, -250571, -51293, 151952, 190143, 119467, 93271, 169563, 319552, 505194, 665212, 699235, 541520, 242633, -32012, -98436, 82147, 315459, 354825, 214366, 160953, 318972, 470729, 395646, 211727, 161561, 232431, 261960, 273284, 368961, 385271, 48171, -507663, -749209, -381222, 311639, 844630, 984204, 749021, 278001, -147005]
$$ [...]
##END NTUPLES=NMR SPECTRUM
##END=
