##TITLE=31Pdec_640-03
 CDCl3, 24 sc
 25.12.2019
##JCAMPDX= 6.0         $$ Bruker NMR JCAMP-DX V2.0
##DATA TYPE= NMR SPECTRUM
##DATA CLASS= NTUPLES
##ORIGIN= UXNMR, Bruker Analytische Messtechnik GmbH
##OWNER= root
$$ XWIN-NMR		Version 3.5
$$ Wed Dec 25 14:04:56 2019 Russian Standard Time (UT+4h)  she@DPX200
##.OBSERVE FREQUENCY= 81.013821
##.OBSERVE NUCLEUS= ^31P
##.ACQUISITION MODE= SIMULTANEOUS
##.ACQUISITION SCHEME= undefined
##.AVERAGES= 24
##.DIGITISER RES= 17
##SPECTROMETER/DATA SYSTEM= spect
##.PULSE SEQUENCE= zgpg30
##.SOLVENT NAME= CDCl3
##.SHIFT REFERENCE= (INTERNAL, CDCl3, 0, 182.463)
##AUDIT TRAIL= $$ (NUMBER, WHEN, WHO, WHERE, WHAT)
$$ ##TITLE= Audit trail, XWIN-NMR		Version 3.5
$$ ##JCAMPDX= 5.01
$$ ##ORIGIN= Bruker BioSpin GmbH
$$ ##OWNER= she
$$ F:/spectra/data/she/nmr/P31/1/pdata/1/auditp.txt
$$ ##AUDIT TRAIL=  $$ (NUMBER, WHEN, WHO, WHERE, WHAT)
(   1,<2019-12-25 14:03:57.96 +0400>,<she>,<DPX200>,
      <created by zg, POWCHK disabled, PULCHK disabled
       configuration hash MD5:
       00 E9 B6 7A A2 85 ED C7 34 08 36 98 17 FE 4E 26
       data hash MD5: 32K
       93 F3 DF 0E C2 13 3E 83 27 E4 8C 78 8C 36 7C F7>)
(   2,<2019-12-25 14:04:01.17 +0400>,<she>,<DPX200>,
      <Start of raw data processing
       efp BC_mod = 2 LB = 1 FT_mod = 6 PKNL = 1 PHC0 = -1689.951 PHC1 = 156.0012 SI = 64K 
       data hash MD5: 64K
       70 CB 3A ED 2A 42 62 25 F5 48 38 13 E7 1E 9E 50>)
(   3,<2019-12-25 14:04:17.82 +0400>,<she>,<DPX200>,
      <pk PHC0 = 31.63307 PHC1 = -79.60001 
       data hash MD5: 64K
       D2 18 BA CF D4 C5 80 D7 FC 2F 54 A8 5C 8A 97 73>)
$$ ##END=
$$ 
$$ hash MD5
$$ 0A F7 2D 48 29 11 48 5B F4 FF 9C AC 1A E0 D9 08
##$RELAX= 
##$RELAX= 
##$RELAX= 
##$RELAX= 
##$RELAX= 
##$RELAX= 
##$RELAX= 
##$RELAX= 
$$ Bruker specific parameters
$$ --------------------------
##$DU= <F:/spectra>
##$EXPNO= 1
##$NAME= <P31>
##$PROCNO= 1
##$TYPE= <nmr>
##$USER= <she>
##$AMP= (0..31)
100 100 100 100 100 100 100 100 100 100 100 100 100 100 100 100 100 100 
100 100 100 100 100 100 100 100 100 100 100 100 100 100 
##$AQSEQ= 0
##$AQ_mod= 1
##$AUNM= <au_zg>
##$AUTOPOS= <>
##$BF1= 81.014009
##$BF2= 200.13
##$BF3= 200.13
##$BF4= 200.13
##$BF5= 200.13
##$BF6= 200.13
##$BF7= 200.13
##$BF8= 200.13
##$BYTORDA= 1
##$CFDGTYP= 0
##$CFRGTYP= 5
##$CHEMSTR= <none>
##$CNST= (0..31)
1 1 145 1 1 1 1 1 1 1 1 1 1 1 1 1 1 1 1 1 1 1 1 1 1 1 1 1 1 1 1 1 
##$CPDPRG= <waltz16>
##$CPDPRG1= <>
##$CPDPRG2= <waltz16>
##$CPDPRG3= <>
##$CPDPRG4= <mlev>
##$CPDPRG5= <mlev>
##$CPDPRG6= <mlev>
##$CPDPRG7= <mlev>
##$CPDPRG8= <mlev>
##$CPDPRGB= <>
##$CPDPRGT= <>
##$D= (0..31)
0 1 0 0 0 0 0 0 0 0 0 0.03 2e-05 3e-06 0 0 0 0 0 0 0 0 0 0 0 0 0 0 0 0 
0 0 
##$DATE= 1577268237
##$DBL= (0..7)
120 120 120 11 120 120 24 19 
##$DBP= (0..7)
150 150 150 150 150 150 150 150 
##$DBP07= 0
##$DBPNAM0= <>
##$DBPNAM1= <>
##$DBPNAM2= <>
##$DBPNAM3= <>
##$DBPNAM4= <>
##$DBPNAM5= <>
##$DBPNAM6= <>
##$DBPNAM7= <>
##$DBPOAL= (0..7)
0.5 0.5 0.5 0.5 0.5 0.5 0.5 0.5 
##$DBPOFFS= (0..7)
$$ [...]
##$SUBNAM2= <"">
##$SUBNAM3= <"">
##$SUBNAM4= <"">
##$SUBNAM5= <"">
##$SUBNAM6= <"">
##$SUBNAM7= <"">
##$SUBNAM8= <"">
##$SUBNAM9= <"">
##$SW= 369.568048894756
##$SWIBOX= (0..15)
0 1 3 0 0 0 0 0 0 0 0 0 0 0 0 0 
##$SW_h= 29940.119760479
##$TD= 32768
##$TD0= 1
##$TE= 0
##$TE2= 300
##$TE3= 300
##$TEG= 300
##$TL= (0..7)
0 120 53 12 22 120 120 120 
##$TP= (0..7)
150 150 150 150 150 150 150 150 
##$TP07= 0
##$TPNAME0= <>
##$TPNAME1= <>
##$TPNAME2= <>
##$TPNAME3= <>
##$TPNAME4= <>
##$TPNAME5= <>
##$TPNAME6= <>
##$TPNAME7= <>
##$TPOAL= (0..7)
0.5 0.5 0.5 0.5 0.5 0.5 0.5 0.5 
##$TPOFFS= (0..7)
0 0 0 0 0 0 0 0 
##$TUNHIN= 0
##$TUNHOUT= 0
##$TUNXOUT= 0
##$USERA1= <user>
##$USERA2= <user>
##$USERA3= <user>
##$USERA4= <user>
##$USERA5= <user>
##$V9= 5
##$VALIST= <valist>
##$VCLIST= <CCCCCCCCCCCCCCC>
##$VD= 0
##$VDLIST= <DDDDDDDDDDDDDDD>
##$VPLIST= <PPPPPPPPPPPPPPP>
##$VTLIST= <TTTTTTTTTTTTTTT>
##$WBST= 1024
##$WBSW= 4
##$XGAIN= (0..3)
0 0 0 0 
##$XL= 0
##$YL= 0
##$YMAX_a= 108848
##$YMIN_a= -100201
##$ZGOPTNS= <>
##$ZL1= 120
##$ZL2= 120
##$ZL3= 120
##$ZL4= 120
##$ABSF1= 0
##$ABSF2= 0
##$ABSG= 0
##$ABSL= 0
##$ALPHA= 0
##$AQORDER= 0
##$ASSFAC= 0
##$ASSFACI= 0
##$ASSFACX= 0
##$ASSWID= 0
##$AUNMP= <proc_1d>
##$AZFE= 0.1
##$AZFW= 0.5
##$BCFW= 0
##$BC_mod= 2
##$BYTORDP= 0
##$COROFFS= 0
##$CY= -3
##$DATMOD= 1
##$DC= 0
##$DFILT= <>
##$DTYPP= 0
##$F1P= 0
##$F2P= 0
##$FCOR= 1
##$FTSIZE= 65536
##$FT_mod= 6
##$GAMMA= 0
##$GB= 0
##$INTBC= 1
##$INTSCL= 5.30512e-09
##$ISEN= 30
##$LB= 1
##$LEV0= 0
##$LPBIN= 0
##$MAXI= 10000
##$MC2= 0
##$MEAN= 0
##$ME_mod= 0
##$MI= 50
##$NCOEF= 0
##$NC_proc= -3
##$NLEV= 6
##$NOISF1= 182.463
##$NOISF2= 159.3651
##$NSP= 0
##$NTH_PI= 0
##$NZP= 0
##$OFFSET= 182.463
##$PC= 4
##$PHC0= -1658.318
##$PHC1= 76.40119
##$PH_mod= 1
##$PKNL= yes
##$PPARMOD= 0
##$PSCAL= 0
##$PSIGN= 0
##$REVERSE= no
##$SF= 81.0140089999434
##$SI= 65536
##$SIGF1= 159.3651
##$SIGF2= -187.1042
##$SINO= 113.3802
##$SIOLD= 16384
##$SREGLST= <1H.CDCl3>
##$SSB= 0
##$STSI= 65536
##$STSR= 0
##$SW_p= 29940.119760479
##$SYMM= 0
##$S_DEV= 0
##$TDeff= 32768
##$TDoff= 0
##$TI= <>
##$TILT= no
##$TM1= 0
##$TM2= 0
##$TOPLEV= 0
##$USERP1= <user>
##$USERP2= <user>
##$USERP3= <user>
##$USERP4= <user>
##$USERP5= <user>
##$WDW= 1
##$XDIM= 65536
##$YMAX_p= 311792333
##$YMIN_p= -1809682
$$ End of Bruker specific parameters
$$ ---------------------------------
##NTUPLES= NMR SPECTRUM
##VAR_NAME=  FREQUENCY,     SPECTRUM/REAL,   SPECTRUM/IMAG
##SYMBOL=    X,             R,               I
##VAR_TYPE=  INDEPENDENT,   DEPENDENT,       DEPENDENT
##VAR_FORM=  AFFN,          ASDF,            ASDF
##VAR_DIM=   65536,         65536,           65536
##UNITS=     HZ,            ARBITRARY UNITS, ARBITRARY UNITS
##FACTOR=    0.456856943014862, 1,           1
##FIRST=     14782.0589164792, 0,            0
##LAST=      -15158.0608439998, 0,           0
##MIN=       -15158.0608439998, -1809682,    0
##MAX=       14782.0589164792, 311792333,    0
$$ Real data points
##PAGE= N=1
##DATA TABLE= (X++(R..R)), XYDATA
$$ [...]
45114 165729 271203 367998 415753 358297 256493 232206 290316 338711 378758 500822 666072
45103 666072 694535 550130 441815 516230 628155 578056 419536 333142 324777 281766 237041
45092 237041 313144 436754 384800 146154 -24350 4369 38544 -114732 -326474 -340942
45082 -340942 -157424 -11594 -35414 -118006 -99074 37429 179665 209131 100038 -43587
45072 -43587 -72135 32361 109440 22429 -151509 -231465 -174408 -78838 5012 98785 137036
45061 137036 -13069 -300725 -438110 -231153 153975 395965 401694 329693 293946 235160
45051 235160 97510 -42818 -101502 -122463 -203380 -352751 -488996 -529541 -430315 -200394
45041 -200394 59089 191622 145412 61749 120786 318612 476086 459910 319383 203058
45031 203058 208448 319145 427159 412174 258016 88037 19781 553 -114127 -319039
45021 -319039 -426759 -323169 -129134 -24619 -23811 -36379 -55325 -136604 -246666 -285870 -248824
45010 -248824 -221913 -224029 -185101 -88828 245 62956 130332 146007 8341 -190540 -174998
44999 -174998 130443 409106 337031 27114 -140905 -52457 44109 -33687 -150326 -125745
44989 -125745 -40799 -100091 -308750 -455592 -381778 -141091 104915 261068 342698 390971
44979 390971 387495 284381 123140 58500 192173 421888 547636 502025 372582 228795
44969 228795 71012 -58885 -91824 -87082 -191400 -383847 -452129 -310935 -141668 -92869
44959 -92869 -61467 47670 69706 -147268 -397356 -375009 -168709 -131325 -296892 -324928 -85034
44948 -85034 99278 -39195 -290437 -297556 -61284 150159 219401 234697 234253 162983 50800
44937 50800 12419 61247 85939 19753 -95990 -217357 -349765 -481078 -547547 -489273 -316654
44926 -316654 -139626 -112259 -255372 -347937 -161003 173057 249345 -52760 -354297 -303956
44916 -303956 -71636 -35917 -185519 -200089 -14713 102170 27190 -51159 -15176 -14204 -148233
44905 -148233 -256007 -182365 -18196 79973 100539 72123 -37516 -175353 -171865 -15730 52562
44894 52562 -100143 -260582 -201623 -51106 -68451 -212712 -222158 -24194 216764 396279
44884 396279 534173 570627 381003 28687 -232761 -268902 -193026 -146462 -128332 -95842 -76413
44873 -76413 -112224 -195077 -281097 -286492 -111346 196812 362161 161338 -238934 -446778 -350131
44862 -350131 -210814 -221214 -255123 -177920 -125820 -266543 -486973 -562684 -504684 -490970 -531690
44851 -531690 -448714 -177848 114276 241185 176344 11454 -131184 -143558 -30371 24864
44841 24864 -164056 -512286 -706624 -574231 -275305 -55290 59525 195784 362895 418547
44831 418547 288953 76405 -89758 -200781 -308968 -403415 -428436 -386244 -339270 -318161
44821 -318161 -296539 -263100 -252787 -280999 -302326 -276842 -241160 -265095 -351800 -421375 -394587
44810 -394587 -271329 -128928 -56687 -86938 -182125 -289300 -389756 -474737 -507443 -472359 -444074
44799 -444074 -516087 -647939 -678405 -527546 -298426 -137337 -84960 -108261 -166897 -186291 -92163
44788 -92163 43107 27465 -169347 -319811 -271293 -195514 -290515 -409101 -286810 -14250
44778 -14250 90438 30669 131566 441659 574224 315725 -9007 -42221 73364 -6431
44768 -6431 -257497 -389606 -346723 -322323 -360101 -303463 -130388 -19808 -56226 -134760 -190392
44757 -190392 -275795 -372365 -355224 -201512 -32429 96252 248620 412730 455408 335390
44747 335390 175471 62464 -42080 -138184 -138011 -59389 -65347 -202893 -290844 -193692 -34588
44736 -34588 3639 -67205 -133129 -178007 -227895 -225887 -143933 -116235 -269207 -488097 -541705
44725 -541705 -398741 -241672 -185911 -158111 -65050 64664 139142 95817 -79723 -327031
44715 -327031 -490045 -422586 -148162 144902 277031 202975 -588 -189619 -218605 -56332
44705 -56332 149967 201887 53461 -167105 -323706 -385179 -381984 -339803 -278764 -222807 -195955
44694 -195955 -235078 -369372 -534273 -568211 -399515 -193325 -178661 -346110 -470877 -446807
44684 -446807 -414839 -488529 -538304 -405667 -204275 -196694 -405353 -554317 -446404 -228272
44674 -228272 -175640 -332756 -504178 -540944 -473099 -361284 -193757 -13099 3911 -243586
44664 -243586 -557317 -611798 -359437 -96364 -69514 -173330 -139942 94838 356528 485557
44654 485557 474635 384092 263698 169890 150012 180668 188562 138573 49185 -55232 -144076
44643 -144076 -174805 -169649 -242008 -432742 -577677 -494287 -265134 -143332 -174645 -140929 52071
44632 52071 166307 -28909 -384205 -545530 -408585 -195759 -119651 -160448 -190152 -158345
44622 -158345 -97455 -39410 15662 83715 164072 207389 152967 31449 -33867 11576 68875
44611 68875 52521 54863 204178 420757 491829 376539 254191 242762 247556 153995 10466
44600 10466 -72789 -73338 -7454 140528 320719 364803 180228 -79088 -188245 -146630 -144233
44589 -144233 -263052 -374644 -343379 -185386 1650 132469 121406 -83138 -375269 -517535
44579 -517535 -391590 -153141 -50438 -148025 -314273 -421606 -449485 -418089 -337340 -240067
44569 -240067 -181275 -171612 -162919 -121470 -72327 -51640 -51439 -32147 35452 153489 296876 415055
44557 415055 453377 392194 265767 140132 65291 32190 -21546 -133652 -242649 -239401 -112388
44546 -112388 17787 49736 24439 34515 73036 65453 8853 -28675 -24265 -4796 46296 159121
44534 159121 260480 238156 145054 172329 353847 463106 316025 37800 -108015 -45786
44524 -45786 101496 229528 312920 316236 225135 140964 185365 324381 427526 469196 507453
44513 507453 490728 291296 -40940 -255273 -203002 -9387 120579 116662 -2657 -224111
44503 -224111 -477526 -609477 -536100 -335969 -122411 60065 151976 61871 -148868 -230850
44493 -230850 -62424 136628 95785 -119089 -225082 -137805 -20513 35857 109795 203736
44483 203736 167138 -36278 -196355 -127461 80281 220239 264020 341982 490072 570989
44473 570989 463112 230875 59394 50167 125287 154894 146080 219456 376917 416739 188606
44462 188606 -161827 -358410 -344471 -286482 -263268 -172553 28563 216882 316431 412723 545092
44451 545092 582467 453920 323040 340585 364802 156167 -227567 -462674 -373920 -125915
44441 -125915 15533 -39300 -181229 -223765 -33561 338207 638820 638469 384462 132583
44431 132583 32854 6325 -62290 -155253 -196666 -182100 -163867 -175030 -212749 -245666 -225611
44420 -225611 -154244 -128308 -226650 -359835 -354523 -206315 -113924 -207157 -364838 -385605 -241933
44409 -241933 -73434 -3873 -59060 -210397 -401639 -552579 -609323 -590095 -549716 -515455 -470876
44398 -470876 -371498 -179970 60739 206405 156249 13501 -19681 78269 120022 1677
44388 1677 -145063 -174317 -120566 -45360 125531 417353 611915 491071 191488 55560
44378 55560 164483 278886 234165 116221 10980 -123342 -238323 -149231 120500 219876
44368 219876 -57180 -392513 -339198 41738 277365 162241 -14824 25595 163723 160782
44358 160782 65974 98873 272400 388003 356792 294740 279233 212174 11136 -206310 -253394
44347 -253394 -118415 40299 114959 146065 186479 185559 87135 -29528 -22670 105270 185717
44336 185717 110447 -13460 -15769 94652 152646 83382 1109 24216 99465 94499 -2184
44325 -2184 -83526 -109637 -176801 -355324 -537080 -531371 -300729 -27466 84091 26879 -33115
44314 -33115 24428 147262 216949 212296 205385 234282 263874 268719 264445 231795 105248 -96925
44302 -96925 -214430 -123622 72749 163275 126039 162227 386045 622504 622260 382362 121158
44291 121158 -7494 -26242 13265 114818 235061 258295 167224 111928 187146 245963 98431
44280 98431 -165631 -251458 -70524 116324 50021 -189602 -329224 -277006 -191717 -223621 -346187
44269 -346187 -452723 -484637 -427638 -291527 -143165 -68113 -50597 14378 128827 121345 -118672
44258 -118672 -418541 -489022 -290667 -74746 -33392 -66429 17333 192659 253908 110187
44248 110187 -94352 -170202 -92430 18039 54965 15420 -40120 -62084 -35278 46780 194667
44237 194667 382965 515428 491169 329498 172514 119424 112327 48887 -48380 -73573 -16010
44226 -16010 21609 -12964 -57085 -59363 -55795 -71606 -54778 23848 95002 87872 19788 -76834
44214 -76834 -213814 -344180 -318236 -85593 146364 126163 -117277 -331656 -385322 -365778
44204 -365778 -347272 -276665 -138343 -32003 1413 58925 177671 216051 58714 -192311
44194 -192311 -366713 -453542 -541002 -631055 -665942 -657765 -638069 -548814 -343190 -135342 -78854
44183 -78854 -134938 -130590 -17636 100061 173029 246112 293805 224276 84067 55495 184145
44172 184145 301509 303664 309460 415059 478545 336494 107448 64204 249808 411566 330346
44161 330346 75607 -109634 -98437 -11584 -73357 -338134 -591030 -590161 -380861 -235017 -273508
44150 -273508 -338485 -304354 -286541 -383907 -430516 -248341 14355 89477 22684 66139 194722
44139 194722 119373 -172608 -299874 -78371 135932 -32551 -401181 -509107 -282821 -47930
44129 -47930 27641 108480 292180 403946 316872 185697 179347 200002 85016 -62125 11322
44118 11322 315011 564014 537107 313225 105159 3969 -30778 -36543 -18667 -12490 -73489
44107 -73489 -201775 -336494 -428654 -475049 -484615 -462180 -429187 -409843 -386716 -318146 -206337
44096 -206337 -89155 40444 214737 358554 300340 19268 -223439 -163928 106210 254525
44086 254525 178849 140924 345705 596627 547448 173363 -206920 -328163 -219835 -65463
44076 -65463 13587 7440 -22770 213 70526 60425 -112936 -300624 -256902 15523 225519
44065 225519 172982 8977 -2049 155197 283900 287216 257135 275164 299169 275861 224106
44054 224106 157488 40806 -113766 -204909 -173953 -105813 -115398 -185215 -202922 -128565 -35278
44043 -35278 5156 -11169 -76100 -200403 -346029 -399565 -285952 -79256 66151 87571 60666
44032 60666 73580 116236 122275 74089 21020 12655 52898 112765 156504 157190 116324 74631
44020 74631 83169 154467 248856 307343 294790 227794 174135 200251 288213 326657 233712 81801
44008 81801 36771 151809 281311 249085 64785 -92365 -98345 -24645 -24604 -129579 -220426
43997 -220426 -196505 -109344 -90578 -185462 -315589 -393342 -403991 -360740 -252530 -83712 89891
43986 89891 221512 323322 396203 370552 213835 50334 40251 146387 166962 32354
43976 32354 -80311 -3444 186436 302866 307364 291579 280991 224436 150738 166043 272685
43965 272685 333514 265094 150032 94571 69657 -26089 -201868 -348224 -357759 -236759 -112019
43954 -112019 -128951 -302878 -474894 -472353 -305609 -126399 -726 152244 365143 515670
43944 515670 511691 459322 505227 591624 528125 269485 -37413 -269202 -418511 -454468 -282174
43933 -282174 68953 374495 469838 469007 577056 760124 787381 586814 366017 321507 392869
43922 392869 415661 389909 434307 534255 521309 330432 125079 84691 168562 190585 69709
43911 69709 -95019 -168047 -95056 113672 408865 676000 766834 622585 339354 81738
43901 81738 -40326 -2672 155341 333060 399789 300595 126265 29549 76498 215809 369985
43890 369985 491756 534888 453011 273696 122168 107139 197087 263695 245402 207773 221742
43879 221742 248331 209349 133982 137042 238232 301925 220393 85483 83995 252888 434159
43868 434159 471741 368339 233641 154230 142137 153094 129513 65793 31602 81117 161886
43857 161886 195650 221353 328448 449247 385229 96049 -201778 -318559 -317868 -337042 -340094
43846 -340094 -227552 -67677 -2669 1726 91776 249420 300816 191702 41184 -82117
43836 -82117 -215381 -311787 -237205 -25372 91551 4986 -127547 -166808 -195702 -294199 -328942
43825 -328942 -165695 83484 239569 334817 483753 607561 550597 389481 353700 471996
43815 471996 555674 520824 464593 405813 226685 -53710 -206018 -117105 20968 -3433 -120879
43804 -120879 -135936 -55635 -76254 -291682 -558917 -648193 -455570 -94381 184647 218642
43794 218642 102752 54741 105362 74805 -92382 -168910 26360 301949 316927 49740
43784 49740 -187691 -187848 -73536 -42035 -88879 -97529 -57996 -45622 -45321 59786 311245 575974
43772 575974 667541 536354 308557 144848 89939 74525 37121 -3747 -1551 43499 87182
43761 87182 86920 26905 -65383 -110652 -33649 144175 313874 408364 467676 543887 613002 634598
43749 634598 623475 586785 465324 242233 50026 35594 141408 158686 7208 -168662
43739 -168662 -216192 -164020 -135882 -176557 -244025 -302327 -332410 -289526 -136769 78565 236605
43728 236605 247574 129522 -7989 -51748 18522 105986 89242 -49496 -205482 -258634 -172916
43717 -172916 -535 160872 210600 107562 -76437 -207886 -225605 -189149 -176647 -190609
43707 -190609 -203804 -238248 -323110 -400659 -358394 -169376 57915 193386 206144 147070 54201
43696 54201 -75262 -233086 -371480 -443545 -449491 -432997 -446292 -509421 -566295 -491603 -222023
43685 -222023 87791 143197 -150948 -496115 -495571 -131134 215233 239555 39715 -110437
43675 -110437 -123298 -82572 -11515 132784 289473 313013 161642 -73767 -311147 -509037
43665 -509037 -588249 -489820 -309372 -211250 -202874 -157493 -61366 -42335 -122699 -157182 -89687
43654 -89687 -64065 -172557 -288499 -282166 -221718 -202507 -146719 36295 230246 263564 176391
43643 176391 123568 99493 -7060 -139118 -105989 101257 256564 206862 44887 -79120
43633 -79120 -149220 -217494 -283238 -312256 -281366 -162673 47424 269457 410190 484747 549130
43622 549130 534443 323141 764 -172617 -107596 -8894 -55918 -145702 -96035 51709 112128
43611 112128 41041 -32895 -11931 76469 150566 124744 -58653 -327618 -465127 -334918 -91399
43600 -91399 -22070 -188345 -362027 -337549 -178371 -98065 -186003 -323871 -346370 -238090 -152540
43589 -152540 -222475 -374268 -404210 -246818 -53302 50608 143835 322759 464281 373872
43579 373872 105724 -84465 -98998 -93566 -182443 -269225 -256672 -226123 -278705 -356087 -364575
43568 -364575 -350202 -395319 -441387 -373132 -200971 -8324 198448 409914 461933 199337
43558 199337 -216871 -409259 -256954 -60886 -130631 -383717 -500974 -350042 -89687 70334
43548 70334 57736 -70722 -184829 -147716 50684 238164 245102 123020 59863 99778 98692
43537 98692 -28136 -178385 -240124 -242559 -233710 -147947 61968 260633 270615 133146 56000
43526 56000 107325 138653 53286 -26269 33131 137549 97852 -70349 -158706 -80113 3019
43515 3019 -61491 -165051 -83207 194045 431516 457073 363662 339220 397207 383131 208187
43504 208187 -28330 -156717 -108102 40688 139107 76604 -119319 -289674 -295895 -163358
43494 -163358 -19340 92173 233087 394107 421284 207394 -118504 -295473 -198852 68813
43484 68813 325379 465707 479470 396936 257161 107774 11933 32508 176628 363277
43474 363277 497093 572092 634308 650616 532347 317782 185429 201488 196133 22785 -184433
43463 -184433 -188836 -1679 142544 116960 9963 -76849 -128307 -101147 72517 305528 372487
43452 372487 198214 -25396 -98246 -40749 30831 110784 254424 420564 489622 392453 159507
43441 159507 -86192 -150929 88987 496383 745168 666828 409585 184136 14512 -140003
43431 -140003 -193194 -62968 117447 137081 6704 -74179 -25267 27678 -14910 -74920 -30056
43420 -30056 109599 212726 169804 17538 -59755 97875 417202 634345 598155 428628
43410 428628 307911 256095 226682 262501 375693 407357 230311 -988 -37377 99178
43400 99178 187137 189586 278986 475287 558513 419877 242277 215242 277132 266005 165345
43389 165345 82356 97597 210660 332004 308971 100296 -75291 47019 400884 642408
43379 642408 611351 489539 441501 389541 278232 273216 483765 710576 699293 476962 232522
43368 232522 32877 -127971 -164978 -32606 109883 102810 43274 105971 225436 216805 118523
43357 118523 133955 283864 391991 397153 421164 523736 625805 686668 743391 775527 738988
43346 738988 712245 777996 790202 538583 148877 5868 210987 425940 376784 219777
43336 219777 229030 377821 459808 438003 425185 429146 347895 174079 29584 13931 128641
43325 128641 311586 456725 456638 311091 142128 48638 26675 71317 221293 424870 513289
43314 513289 429421 346237 415804 531536 510497 393562 355120 393585 346315 194261 126362
43303 126362 262434 494424 663182 749415 823134 911537 975307 943656 758045 469565
43293 469565 289122 414081 779433 1106674 1234020 1258417 1294984 1266048 1065744 806840
43283 806840 711220 796751 858006 774290 670022 703966 837022 915859 891778 827622 745131
43272 745131 618027 512259 574895 826772 1095437 1242689 1354322 1592987 1949589 2283548
43262 2283548 2561131 2899479 3386213 4004606 4745765 5645366 6683433 7803541 9082872
43253 9082872 10724795 12792952 15077399 17294370 19254981 20723499 21309423 20758012
43245 20758012 19299429 17496070 15739451 14057149 12390641 10838849 9544371 8499241
43237 8499241 7586048 6734317 5942574 5197928 4467343 3767052 3186299 2820037 2677231
43228 2677231 2652177 2597696 2442189 2226441 2023876 1858172 1707274 1533209 1282674 926926
43218 926926 549650 326032 343358 491419 591029 573100 473742 339798 230909 230577 338767
43207 338767 422744 392165 343366 391477 450473 365869 194975 127155 152280 59639 -202435
43196 -202435 -409107 -378929 -199905 -42863 55627 115294 100226 16097 -30710 3315 9704
43185 9704 -86734 -194011 -216902 -206543 -222858 -200038 -88327 19446 50466 86088 172558
43174 172558 166630 -31918 -254094 -294633 -221316 -200217 -164388 34474 265243 272627 134976
43163 134976 173645 393695 424401 116606 -190505 -177414 20186 112087 103093 169969 303902
43152 303902 363667 348088 351432 339055 206787 6960 -92821 -42897 59639 128039 125500
43141 125500 12649 -187313 -323563 -265829 -73088 105689 222003 288842 255347 93917
43131 93917 -71876 -113122 -98656 -162340 -243737 -183392 -22294 39959 -31969 -77646 -41967
43120 -41967 -52682 -148665 -178121 -60574 60047 34802 -86500 -170842 -174338 -113766 -4349
43109 -4349 99468 131143 131261 198056 288347 246831 74537 -41089 -27603 -26697 -98465 -82500
43097 -82500 95998 229391 136281 -48780 -114184 -100322 -145086 -185912 -100027 4756 -55938
43086 -55938 -205129 -228451 -149136 -149539 -177330 -1407 323458 425403 156010 -162917 -189052
43075 -189052 11557 162769 179689 161579 138506 39612 -151911 -364875 -526953 -599799
43065 -599799 -579172 -518994 -493813 -502600 -487594 -461180 -500723 -597628 -646134 -614017 -575925 -534189
43053 -534189 -377877 -100012 111630 116261 16704 -9313 36214 13088 -136298 -314264 -369798
43042 -369798 -222804 42630 188935 43495 -268487 -446480 -388495 -265995 -203416 -126412
43032 -126412 -10445 -1114 -121287 -125388 118444 330123 187158 -185421 -405852 -381185
43022 -381185 -326292 -324583 -233807 -27551 108739 81421 3398 -61568 -202777 -424231 -552043
43011 -552043 -496666 -397897 -389533 -406471 -347527 -256775 -207979 -158294 -60467 2357 -57711 -163776
42999 -163776 -173292 -87207 -31871 -69371 -142607 -196822 -248634 -304025 -281444 -96272 166701
42988 166701 244160 -33702 -470972 -654906 -441110 -138256 -95928 -271695 -388501 -369057
42978 -369057 -355014 -390800 -387884 -371027 -452431 -548010 -434110 -145160 -229 -128354 -267741
42967 -267741 -178313 29971 148985 180318 192123 120522 -58097 -179278 -151952 -157745 -340127
42956 -340127 -507737 -438101 -281052 -319413 -480427 -465707 -278978 -222692 -377510 -473449
42946 -473449 -344064 -163409 -118117 -138379 -97651 -42466 -72378 -167274 -256789 -318331 -326161
42935 -326161 -253742 -185391 -255054 -417157 -468475 -363961 -297749 -375643 -434571 -329981 -188199
42924 -188199 -185671 -255267 -225777 -120646 -98857 -190984 -301668 -403351 -523055 -585997 -476827
42913 -476827 -241952 -54861 11269 22218 23019 11895 50118 200679 349501 292807 49499
42902 49499 -106102 348 222467 309613 186171 -69596 -353669 -529362 -468399 -256850
42892 -256850 -201879 -440409 -684915 -599965 -314222 -247859 -474497 -614117 -430212 -176422
42882 -176422 -160157 -261768 -171893 94407 246985 182109 67496 -11680 -170025 -420338
42872 -420338 -537605 -366368 -68010 88254 42381 -82918 -205183 -327509 -430851 -460609
42862 -460609 -406173 -318153 -268051 -319369 -469856 -588890 -512101 -258313 -49107 -37647 -126989
42851 -126989 -151388 -120058 -145136 -222460 -252487 -233142 -263031 -353249 -383318 -280969 -143916
42840 -143916 -137586 -322060 -596140 -781501 -773012 -633459 -518055 -501784 -543012 -612046 -725182
42829 -725182 -806534 -678774 -310119 62986 205581 165211 129720 122902 43594 -73416 -63257
42818 -63257 121623 358540 529000 572330 409793 29013 -367285 -513877 -403608 -267364
42808 -267364 -236747 -238802 -229596 -283841 -399044 -449509 -418779 -458472 -619759 -733732 -666209
42797 -666209 -499083 -353430 -227481 -122395 -125289 -229545 -262012 -134374 14663 69159
42787 69159 123569 249124 288040 110621 -104546 -112590 12420 12258 -133283 -205842 -116668
42776 -116668 7113 93378 215262 380772 462691 389614 226293 37518 -156332 -286662
42766 -286662 -296847 -302174 -465068 -676144 -611791 -208956 156359 128119 -178881 -379852
42756 -379852 -330631 -211381 -172597 -143194 -24676 118478 165753 127902 112129 147021 154791
42745 154791 103586 83238 168008 276724 271182 164139 105964 149081 160114 36193 -109137
42734 -109137 -89621 100945 302525 406181 431492 414666 351846 261942 194220 148289 70763
42723 70763 -49542 -157024 -214344 -243411 -267635 -275395 -254247 -209347 -142037 -56364 18899
42712 18899 63852 111901 209685 346404 469069 540296 531466 408868 206442 65469 94175
42701 94175 208838 223875 92313 -54729 -109376 -103821 -96056 -60217 38445 142073 158831
42690 158831 90626 39541 88370 198657 228612 63971 -244464 -489166 -495058 -302340 -126150
42679 -126150 -129668 -261988 -324358 -183486 83995 269473 267046 192270 212453 307914 316689
42668 316689 194710 73549 35688 9609 -43187 -21204 122606 251656 256546 236928 306790
42657 306790 372910 304816 184450 159683 168889 61037 -106188 -155353 -104028 -111489 -161487
42646 -161487 -92655 75913 151215 105291 105800 177831 140015 -61061 -244438 -298693 -315072
42635 -315072 -346802 -325062 -289928 -388629 -542565 -456746 -106379 136756 59828 -57649 81363
42624 81363 312816 320704 141634 8992 -73469 -221848 -314606 -148908 143893 219813 17928
42613 17928 -196807 -251961 -213184 -134422 26468 233041 381036 480327 576042 536592 225730
42602 225730 -143537 -182693 107246 298805 153197 -78626 -112508 -45293 -86220 -158025
42592 -158025 -60236 143213 192935 14041 -212300 -321796 -313410 -237037 -110898 26172
42582 26172 109247 129030 137524 156218 149109 101694 61649 69103 86216 36187 -93462 -215830
42570 -215830 -228634 -117693 49059 214402 366336 480999 508418 452557 399664 415030
42560 415030 461603 463522 394312 264926 97031 -47001 -89402 -41162 8423 44124 139650
42549 139650 269082 276381 134995 50619 154998 286594 269809 217567 299163 384230 241819
42538 241819 -34104 -164982 -173783 -319892 -559881 -525258 -138889 180083 125578 -58880
42528 -58880 -18873 149908 110344 -156135 -346355 -299206 -163069 -117961 -159788 -181535 -119850
42517 -119850 -5604 48709 -61345 -293991 -468630 -461795 -321814 -160104 -46024 -41373
42507 -41373 -175200 -316664 -253840 233 163863 71680 -89635 -86709 16570 26821 -39796
42496 -39796 -35013 29573 31761 2822 79855 227080 248485 77107 -160522 -364794 -532696
42485 -532696 -594961 -411743 -7701 361152 471298 358480 222313 191352 224508 180069
42475 180069 -32299 -316908 -441149 -299992 -85856 -82483 -322758 -573431 -632306 -506252
42465 -506252 -311977 -152626 -109521 -212329 -365505 -405338 -279618 -106207 -30068 -74113
42455 -74113 -132115 -64610 171055 436436 510922 340940 120962 47023 85780 103225 110712
42444 110712 207066 353571 410289 362774 317238 289396 194997 43940 -56462 -98923 -178421
42433 -178421 -286840 -314789 -279249 -323828 -446326 -457805 -286472 -96470 -15275 27965 85222
42422 85222 54292 -87250 -142881 15387 215910 247982 171252 140003 94263 -100018 -334326
42411 -334326 -385680 -288911 -274592 -365113 -350742 -196789 -152421 -340602 -517627 -419488 -145471
42400 -145471 3985 -61692 -175187 -199788 -174303 -178608 -203265 -186284 -98600 27674 113208
42389 113208 85098 -39869 -150402 -167126 -137926 -143523 -150228 -59937 99395 153657 4759
42378 4759 -218173 -311935 -248912 -181737 -226532 -345875 -454926 -533602 -577259 -526043 -341557
42367 -341557 -112732 16497 19019 -5618 4086 -57 -48547 -62924 19882 101472 17671 -232605
42355 -232605 -460770 -512632 -430419 -350899 -325711 -317109 -310025 -320393 -310895 -218716 -91620 -72135
42343 -72135 -172267 -181340 62682 380533 413257 80400 -303330 -426159 -324649 -228446
42333 -228446 -218034 -206173 -163212 -166287 -249423 -369363 -513566 -686711 -787038 -666426 -359623
42322 -359623 -103092 -54370 -116760 -118635 -46290 5175 17832 60076 150818 223485 219078 141946
42310 141946 25841 -100319 -207077 -255132 -203693 -46240 134846 185543 34885 -174719
42300 -174719 -218108 -74653 24979 -105807 -370483 -523229 -454075 -250852 -52667 53462
42290 53462 41123 -46392 -122576 -168482 -268811 -453565 -569589 -440532 -130339 85755
42280 85755 25772 -227406 -465745 -559226 -500537 -359084 -239839 -204293 -184269 -45922 217280
42269 217280 431137 437009 275185 107294 17325 -26128 -54359 -52263 -25929 -18041 -22534 41992
42257 41992 220746 429940 532682 488026 376404 286515 222516 125519 -49760 -285038
42247 -285038 -495905 -581428 -512947 -377176 -299252 -326085 -415771 -510331 -548979 -441950 -155537
42236 -155537 164207 295686 225439 182003 299783 412256 324869 134216 61175 89923
42226 89923 43818 -51663 -3439 147587 108727 -178160 -367086 -216693 21417 -12701 -239672
42215 -239672 -295883 -97322 91206 103704 63975 93368 109551 15092 -123852 -202334 -230183
42204 -230183 -258050 -267362 -230701 -195859 -226150 -314594 -409608 -466624 -436834 -276895 -23108
42193 -23108 195244 265822 192790 72752 3842 15809 45741 -6799 -148473 -238306 -138359
42182 -138359 100514 292524 344401 322538 290192 208108 50287 -92334 -116391 -59573 -68700
42171 -68700 -232009 -491724 -710474 -790396 -731413 -594257 -425740 -248304 -119341 -127513
42161 -127513 -275269 -425003 -443239 -355759 -274803 -225831 -167968 -150359 -288880 -563414 -777669
42150 -777669 -777483 -612094 -438584 -360486 -394999 -495835 -558441 -494662 -352184 -275428 -307985
42139 -307985 -330937 -246409 -119097 -67267 -103914 -159872 -185740 -161551 -81661 4658 18040
42128 18040 -23890 -2048 106911 148069 21067 -116444 -48499 159684 216144 -3129 -294407
42117 -294407 -410339 -349537 -273050 -250724 -220410 -145647 -75887 -34267 41013 173409 236561
42106 236561 76187 -259626 -518786 -519989 -345905 -201434 -168891 -202037 -276265 -388152
42096 -388152 -444034 -328933 -103336 34730 23900 14647 113146 216888 196418 86163 -20664
42085 -20664 -128532 -259389 -339021 -308845 -249553 -250017 -250880 -168017 -71398 -70846 -114869 -93710
42073 -93710 -65472 -166014 -344182 -413420 -345209 -280218 -249069 -130294 72828 160413 30377
42062 30377 -165713 -260575 -271601 -260369 -191432 -68875 -34733 -169060 -336094 -386336 -373795
42051 -373795 -409498 -442902 -385171 -321743 -371404 -430204 -317011 -125452 -149855 -443324 -717224
42040 -717224 -749359 -647503 -598677 -583906 -506770 -426099 -454159 -528545 -492619 -359427 -307231
42029 -307231 -408626 -522467 -492265 -332534 -171173 -100418 -138432 -262652 -410414 -486925
42019 -486925 -443499 -344831 -308792 -364516 -403078 -300514 -78642 100920 121583 44218 3587
42008 3587 10997 -47769 -219263 -397835 -477743 -485620 -485748 -450337 -336500 -216490 -185813 -182337
41996 -182337 -64975 122265 142573 -111649 -438898 -575698 -515058 -458682 -527402 -652170
41986 -652170 -722088 -715352 -670092 -613393 -546849 -456127 -327212 -186094 -106707 -132282 -201605
41975 -201605 -207791 -131857 -71210 -123611 -273167 -406979 -437949 -403261 -420182 -525239 -601339
41964 -601339 -537154 -423004 -455850 -635809 -723035 -580251 -394157 -402152 -529022 -508791 -303780
41953 -303780 -161651 -237846 -384562 -398756 -300880 -240374 -243112 -197182 -43774 135055 220530
41942 220530 178012 57072 -90973 -259080 -434971 -542756 -511926 -410790 -400438 -503630
41932 -503630 -549691 -448054 -364752 -452084 -542115 -368335 -16051 155734 43769 -68726
41922 -68726 15726 124610 55900 -79699 -70306 64360 185465 304266 490070 640184
41912 640184 599259 432178 343820 376590 402066 374600 381320 452531 515335 539693 564716
41901 564716 580392 537457 469635 457619 484104 478071 486923 630678 876217 1030873 998607
41890 998607 893825 857368 891302 921459 907121 844496 760784 736772 841215 1019461 1137483
41879 1137483 1149043 1125719 1116915 1087452 1011346 926657 871227 839348 804843 717592 511668
41868 511668 220154 42276 156787 479463 743514 814418 780191 734939 650049 506084
41858 506084 398587 434388 611824 836533 974012 902324 639101 405240 415202 609117
41848 609117 750883 768323 779748 780213 585397 193189 -67015 57787 372599 481746
41838 481746 283818 19619 -82823 -10132 139926 272135 303547 211138 96906 104213
41828 104213 245585 380133 373630 237721 111778 132503 306672 501421 586089 571408
41818 571408 551903 535267 437224 255643 124596 142750 247863 317269 305134 230994 124180
41807 124180 38578 43198 139574 243926 277731 218306 72918 -100912 -172826 -73606 61432
41796 61432 43496 -87520 -132280 -84124 -153248 -378072 -500681 -374825 -228337 -304331 -463838
41785 -463838 -409232 -149956 30883 -7447 -130878 -175862 -112271 27093 201818 340046
41775 340046 379844 330125 230245 121301 113488 335479 698403 867364 642952 245858
41765 245858 32299 34531 -8590 -242238 -527085 -644607 -507058 -202644 45464 48154
41755 48154 -103904 -96738 161447 333872 112292 -297353 -435814 -209263 73556 203360
41745 203360 267952 361829 423601 407052 349136 229002 -3122 -232132 -245855 -25142 235783
41734 235783 388938 405229 246678 -59352 -258977 -104016 250669 404742 285961 217825
41724 217825 363698 484889 380275 205345 163211 184649 128759 48018 44636 78026 101905
41713 101905 189385 349053 421120 328867 231962 258779 292817 208711 116102 163336 277163
41702 277163 301676 236476 149519 24478 -106239 -52854 271568 617114 660403 410339
41692 410339 145200 30344 -709 -43100 -82793 -52526 73964 220474 230053 54235 -99156
41681 -99156 -3940 211887 216156 14298 -38616 133069 141625 -185398 -413891 -171759 201006
41670 201006 153328 -248741 -529441 -576023 -597486 -489193 64633 851354 1172735 801501
41660 801501 334449 350173 685302 836144 690169 517334 494930 569161 651663 704565
41650 704565 699868 640027 553908 418184 202005 11639 14711 180608 282980 203440 41999
41639 41999 -101089 -227309 -283883 -162268 62805 134852 -39167 -262815 -359505 -376814
41629 -376814 -383980 -315927 -157618 -54256 -80281 -98000 5045 130887 170557 198047 309138
41618 309138 441683 508927 548752 600063 592512 486847 358411 234145 45195 -150729
41608 -150729 -142841 89673 263392 203970 118984 241677 455189 524285 460454 375367 207774
41597 207774 -78500 -242851 -89094 137373 82686 -114601 -2775 456837 800222 734057
41587 734057 482172 366165 405795 462301 466427 370098 137662 -99401 -129161 2550 84
41576 84 -237851 -462080 -488799 -480450 -625107 -794720 -754461 -518351 -270256 -87389 42925
41565 42925 70252 -34388 -143586 -125438 -47741 -53285 -121852 -136683 -97563 -73601 -22910
41554 -22910 127270 269332 204170 -63825 -312663 -388962 -331949 -209753 -27085 162860
41544 162860 237941 178810 121977 163041 226752 211979 153998 145673 182914 193848 169825 167882
41532 167882 199292 188690 50521 -217901 -502546 -627786 -501158 -230690 -40522 -31333
41522 -31333 -81066 -25380 133177 264655 297417 267927 217652 143677 51449 -31694 -106309
41511 -106309 -187720 -234819 -176267 -30711 82537 92024 59965 74464 126000 146638 110711
41500 110711 37687 -47888 -101308 -68730 18453 36989 -49384 -88085 55872 263548 302363
41489 302363 161824 47594 42091 4380 -130565 -199817 -101899 -16253 -118850 -249746 -136817
41478 -136817 147633 262000 115133 -4083 102558 236624 145462 -57757 -67984 139516
41468 139516 278029 170553 -34828 -123119 -96601 -100770 -198098 -337051 -470329 -585642
41458 -585642 -657116 -675713 -715477 -866846 -1093478 -1247962 -1256892 -1207417 -1213589 -1279513 -1345674
41447 -1345674 -1384070 -1371555 -1255971 -1064060 -976617 -1141520 -1428530 -1534160 -1362577 -1150259
41437 -1150259 -1143775 -1287017 -1329080 -1145170 -841224 -606257 -561930 -706879 -912441 -1007655
41427 -1007655 -949553 -875570 -920728 -1035355 -1064473 -956280 -800511 -700704 -694905 -759473 -804889
41416 -804889 -719614 -511493 -341508 -306519 -269511 -64905 191190 205922 -74799 -365214
41406 -365214 -407657 -260188 -139399 -137238 -195645 -235655 -208421 -117494 -72906 -213440 -485667
41395 -485667 -617893 -432038 -85928 118273 81219 -69978 -218290 -340288 -388889 -285535
41385 -285535 -72656 69195 31288 -84538 -109197 -32232 -8478 -150423 -372417 -472470
41375 -472470 -356084 -138852 -1880 14749 9106 31652 7406 -130068 -328354 -493647
41365 -493647 -586596 -578356 -420159 -164318 -21280 -143421 -392931 -476316 -301179 -55200
41355 -55200 78411 128478 202174 276430 226266 809 -308944 -552588 -633635 -579550 -526523
41344 -526523 -586828 -703603 -690237 -445461 -75826 226109 360787 337621 191942 -27058
41334 -27058 -226611 -322044 -318838 -286479 -263402 -244281 -237635 -253475 -237246 -112585 79274
41323 79274 173249 76939 -93981 -157772 -97844 -57393 -129715 -268023 -408412 -548110 -642808
41312 -642808 -558772 -255331 66752 159632 46119 -19586 80796 179894 108018 -51151
41302 -51151 -123939 -126885 -194895 -307215 -303530 -173765 -123289 -279112 -491358 -525180 -336696
41291 -336696 -67820 129021 163268 8393 -237474 -367304 -284429 -158746 -217068 -412727
41281 -412727 -477454 -304536 -88237 -22400 -45709 -5022 82178 94843 35308 1244 -17307
41270 -17307 -117946 -270676 -320303 -241872 -199800 -265584 -260792 -32004 257332 308037 89541
41259 89541 -142051 -217165 -234957 -318812 -380844 -261452 11407 251929 357666 387834 410520
41248 410520 394724 287670 107335 -96843 -311302 -519276 -639471 -597629 -461083 -404804
41238 -404804 -490569 -555526 -411545 -111833 99363 97531 1448 -51683 -99874 -216061 -307799
41227 -307799 -235104 -61809 7759 -67408 -120649 -65113 -22091 -80204 -121112 -28552 85440
41216 85440 51082 -66216 -58988 76218 109218 -74185 -290149 -316683 -186220 -87905 -69841
41205 -69841 5329 220638 458549 549526 483377 389473 342998 292737 196183 112745 77672
41194 77672 -23779 -301441 -611702 -659596 -399673 -141618 -137857 -245998 -192336 -23878
41184 -23878 -20337 -206933 -271268 -41117 234266 248289 75719 25209 173838 291882 207019
41173 207019 26216 -56783 -18829 15299 -33520 -113376 -124485 -39666 62945 90136 60120
41162 60120 97286 259861 420992 401759 199770 -5519 -69636 -7526 104075 227574
41152 227574 317918 290148 134080 -2818 47910 275519 497279 544003 384277 110376
41142 110376 -121267 -177259 -72708 12794 -60706 -200700 -204756 -45649 116026 197101 278159
41131 278159 376661 347107 138736 -30512 48442 247907 270976 76220 -92423 -80403
41121 -80403 -3822 -22185 -118184 -166038 -83868 119550 329950 360445 149781 -80868 -54332
41110 -54332 181875 323013 261811 189903 186650 56758 -247504 -389008 -122525 270045
41100 270045 375898 264135 290517 439974 344521 -59539 -364070 -281389 -5922 167183
41090 167183 236443 315872 360479 297609 213036 197635 184882 112525 66184 101614 116233
41079 116233 60447 61303 146669 87154 -232325 -508267 -404373 -66378 103586 56402 81749
41068 81749 249913 305332 161341 81489 224794 368297 286055 117626 124092 293391 430710
41057 430710 483976 537790 581683 508640 306043 81612 -72805 -125093 -67429 45502 88897
41046 88897 24912 6710 193556 511296 729228 738214 626959 517943 458983 455608 482713
41035 482713 471033 392557 344997 441259 632902 758906 752605 678399 582619 454880 345254
41024 345254 367510 540004 741361 864197 908934 905124 864876 846423 930783 1086671 1185811
41013 1185811 1198900 1234298 1327144 1360376 1290199 1270888 1407785 1544976 1486983 1305104 1208029
41002 1208029 1205593 1150683 1064580 1142256 1408612 1632753 1669350 1654338 1734084 1798413 1656857
40991 1656857 1347522 1090641 1011577 1069082 1204431 1400390 1602606 1722010 1742084 1734613
40981 1734613 1751383 1770033 1756677 1714567 1649931 1541501 1375117 1185439 1034961 940753
40971 940753 828651 600214 282251 63391 91247 250206 264193 49013 -162760 -110864
40961 -110864 192047 525986 716103 720219 576972 401568 348107 431291 454671 267135
40951 267135 20021 -18825 135237 190733 4869 -217076 -226707 -54967 88597 108585
40941 108585 83888 108976 190398 273597 302632 270564 235359 247833 264441 205741 103170
40930 103170 81758 170598 248518 233167 208994 283263 407033 436238 313129 112619 -36751
40919 -36751 -23344 175018 415996 474509 294521 90646 97869 280474 401249 332552 173370
40908 173370 75598 77099 122268 149558 125171 54227 -10875 -9589 62587 144238 156121 55874
40896 55874 -116464 -234298 -187398 -22849 84342 45572 -36405 -36752 17037 43121 85463
40885 85463 245629 481492 633950 644647 594505 520187 359967 129143 -14667 19689
40875 19689 105310 71087 -62230 -145942 -136502 -114612 -94263 21150 245579 415492 392238
40864 392238 269159 246892 345250 387180 278890 151388 151978 228203 239639 188110 184274
40853 184274 237403 241968 160397 60154 -40095 -200040 -398981 -500625 -428435 -240341
40843 -240341 5225 289628 491749 418891 101918 -133021 -52588 180179 258769 130132
40833 130132 -62521 -278070 -556122 -794626 -831478 -715779 -639788 -613959 -465346 -166955
40823 -166955 91926 204462 265941 334680 320491 202347 122835 147653 143764 27830 -68100
40812 -68100 -32223 13961 -85889 -274035 -412745 -513475 -620312 -601572 -319656 61062
40802 61062 208052 63630 -90305 -51679 49082 12506 -113462 -141239 -47129 13286 -44495
40791 -44495 -128368 -136650 -103866 -113614 -150177 -128022 -26932 101373 244800 430609 593160
40780 593160 579457 370278 178140 197035 341368 387947 312666 292195 386472 436115 331362
40769 331362 187065 140522 129808 18058 -159281 -224550 -100100 104980 254532 338594
40759 338594 425560 501792 431591 139332 -194224 -256288 695 226688 99676 -226261
40749 -226261 -321762 -68528 222011 271744 128201 -57539 -239914 -345773 -230192 42888
40739 42888 130671 -145541 -494872 -540302 -325099 -165001 -147183 -85529 107376 305566
40729 305566 404757 419641 364774 269764 284106 520482 805446 841861 634216 493893 575560
40718 575560 667866 540166 266006 68517 29393 101525 268419 522673 757222 822201
40708 822201 682717 449711 265808 192864 189451 180225 153680 163876 216677 227441 154372
40697 154372 89979 124580 205430 250276 300771 400611 418683 213373 -80278 -172728 -26047
40686 -26047 102960 53201 -47803 -45622 14082 21951 -17527 -47858 -46506 27820 214393 407696
40674 407696 409132 201709 -429 -54205 -44128 -42738 60289 332455 600802 676583 625031
40663 625031 610526 602585 455197 191426 -11108 -78401 -92248 -107008 -91388 -55889 -82365
40652 -82365 -192286 -291121 -276847 -143366 32165 164514 229383 273308 329492 344598 267813
40641 267813 184619 223808 336601 350537 268665 290215 458164 543186 425837 333056 465526
40630 465526 619035 479702 142077 3496 217204 555470 771240 799029 625745 280531
40620 280531 -20361 -21188 213758 355672 293499 281374 498597 744225 749695 572745 464680
40609 464680 494206 517424 442149 338288 308870 369637 442530 412812 240299 44996 -356
40598 -356 110736 219611 249525 293807 391673 400271 225199 24896 12447 163337 300874
40587 300874 388244 535604 751557 880903 807461 577884 312021 109730 42845 112387
40577 112387 209965 242090 283969 466537 714149 778879 584089 345865 257346 237626 146660
40566 146660 77723 199595 406571 414088 207671 106348 279097 465935 374779 143597
40556 143597 130983 367232 536537 491871 455775 609618 778038 715803 490546 339566
40546 339566 291031 193701 51329 51862 249907 455626 502229 439757 390252 367074 323205
40535 323205 253253 162352 30624 -125159 -241944 -302417 -330905 -272949 -37254 277367
40525 277367 384227 175428 -76448 -69651 105739 135090 -13921 -44517 182962 405103
40515 405103 334868 74903 -47895 61679 194488 182344 106050 111035 175968 171884 74085
40504 74085 9787 108013 363687 646265 805351 781076 650158 558374 578772 645650 648779
40493 648779 562885 447700 360868 335083 403909 550204 637667 516383 236326 46957
40483 46957 115679 332464 469597 455949 401073 412549 495548 595576 646196 606078 529953
40472 529953 549631 680690 708278 418390 -68471 -353152 -189529 254385 607914 670182
40462 670182 528893 401090 419333 529744 569728 473325 375708 447171 656596 801868
40452 801868 755734 565915 329963 117155 19292 110189 303756 401445 345674 292202 368249
40441 368249 498498 547045 496901 406011 315077 276663 335171 401934 317633 128548 93998
40430 93998 283101 400765 232305 34144 172539 540711 712831 601058 548608 740720
40420 740720 927316 866323 693365 642789 674074 617492 492627 436693 455879 476876 535320
40409 535320 689832 837196 841280 784304 855388 1018802 1034754 825546 589366 494822 476589
40398 476589 423470 372628 388699 412930 386767 397133 524418 640273 556903 340268 272554
40387 272554 478047 755707 842049 707640 523805 444690 499640 615800 673116 606568
40377 606568 510869 559407 758744 892469 804037 621816 564720 625853 638819 596420 668768
40366 668768 889010 1053381 1021290 923955 953227 1096890 1224015 1308397 1406276 1496493 1507615
40355 1507615 1460077 1436424 1442097 1433986 1460763 1621803 1877427 2040241 1992808 1806225 1610237
40344 1610237 1450328 1317963 1225718 1184641 1165312 1134883 1092898 1041474 971977 911334 922920
40333 922920 1018844 1123061 1170038 1190017 1230180 1229309 1068804 765747 526188 530146 698466
40322 698466 768340 618969 427264 428553 601838 720787 682933 616181 618160 571134 348409
40311 348409 76632 6094 165411 326912 328200 268365 327015 510407 664064 671028 559664
40300 559664 443358 409651 461928 535264 557433 498056 377983 267148 266745 421155 618839
40289 618839 664895 514014 348576 340118 421630 421006 342419 341160 446480 499197 397927
40278 397927 246918 200275 284835 429461 552652 573196 456152 304618 284985 401369
40268 401369 474470 416915 381614 519555 724143 777051 660335 549539 539600 548470 491530
40257 491530 398294 324712 275648 263410 339242 495729 607032 549310 358957 204164 191534
40246 191534 251002 245923 166673 150712 296864 527399 686006 715122 661821 568849 478688
40235 478688 501958 710286 947749 939952 668654 457605 556450 802485 881142 793797 815991
40224 815991 1032805 1190988 1089306 899611 951267 1316148 1757949 2044665 2186955 2370290
40214 2370290 2736999 3249217 3714574 3934775 3863590 3629439 3387940 3168058 2899651 2574694
40204 2574694 2300024 2145813 2009405 1731617 1339736 1061201 1048961 1189064 1257068 1180323
40194 1180323 1039801 889021 725219 608103 629900 740701 763422 639204 518445 540965
40184 540965 659339 758802 815005 827159 724715 483052 244155 180498 293202 455377
40174 455377 583820 649420 599832 425120 252033 224896 322012 417654 477807 546219 583835
40163 583835 507509 386195 415557 655761 938512 1076649 1043069 911791 750061 611740
40153 611740 524238 439526 294337 139530 102732 209827 366122 525866 730179 941645
40143 941645 1007054 864204 650047 523395 507385 577523 743808 925813 903043 573320
40133 573320 171176 40476 223114 437537 455323 342228 299651 402135 557831 648205
40123 648205 636431 566665 504776 485715 506834 555275 619273 680633 733769 806912 913098
40112 913098 988100 956075 864151 849896 938858 987710 904954 826396 956383 1293461 1629534
40101 1629534 1793688 1793581 1727384 1655122 1579189 1494222 1431393 1456960 1596182 1750028 1759748
40090 1759748 1599849 1432878 1407777 1480123 1516717 1498893 1503241 1539424 1551742 1561574 1659635
40079 1659635 1833800 1930266 1837350 1627205 1474351 1487615 1633869 1767979 1742025 1562560
40069 1562560 1438017 1576329 1919585 2173717 2131525 1878426 1643877 1545488 1542739 1561671
40059 1561671 1571666 1566911 1542933 1492216 1398461 1259025 1134113 1131129 1291737 1508571 1593879
40048 1593879 1442734 1130380 858330 793757 934740 1134297 1267144 1336322 1380223 1340206
40038 1340206 1130035 820999 624787 644501 747622 759023 696985 718681 872665 1009450
40028 1009450 952290 697763 421480 304501 370052 500203 609918 753477 1002965 1268772
40018 1268772 1360196 1235838 1065881 989075 931078 764530 546714 454015 529619 644861
40008 644861 705112 756457 859109 969759 1004878 948097 850669 778873 784650 866884 939919
39997 939919 911996 826067 842981 1031217 1246939 1299937 1185557 1062892 1036469 1064229 1083562
39986 1083562 1120609 1221560 1346492 1408358 1395025 1385348 1436458 1506666 1519857 1478040 1468410
39975 1468410 1556382 1703631 1813054 1837945 1814831 1784882 1718391 1554951 1315526 1131302
39965 1131302 1124640 1272742 1429579 1488827 1480130 1479888 1484026 1441763 1387431 1434035 1608714 1789026
39953 1789026 1864765 1885235 1955749 2043739 2006009 1799860 1558941 1442170 1494135 1665434
39943 1665434 1870895 2002047 1992498 1924798 1969439 2147970 2259674 2138046 1883570 1720378
39933 1720378 1709203 1762367 1880883 2162200 2548285 2770832 2656539 2363520 2203177 2300117
39923 2300117 2513815 2633059 2566135 2386712 2262271 2301602 2429209 2463980 2357290 2268144
39913 2268144 2342735 2515102 2616836 2597079 2521144 2427936 2326066 2278108 2335376 2407889 2344236
39902 2344236 2140826 1943470 1850492 1855163 1971088 2232713 2537507 2675314 2598224 2502448
39892 2502448 2544181 2625230 2583949 2459044 2401624 2422179 2400065 2295695 2195182 2165164 2194858
39881 2194858 2263066 2344273 2373160 2319769 2266243 2282898 2275239 2119571 1920884 1927153 2159490
39870 2159490 2342347 2284400 2126786 2081641 2108750 2044405 1916145 1887547 1945621 1899326 1720813
39859 1720813 1652345 1859378 2153602 2226303 2056184 1905863 1950108 2090235 2167660 2192171
39849 2192171 2252127 2310911 2244602 2049308 1864706 1768064 1672062 1492567 1315995 1296500
39839 1296500 1441820 1611407 1707591 1759250 1804994 1803377 1721697 1649266 1740376 2041519 2407916
39828 2407916 2603659 2498736 2194173 1947409 1937820 2104962 2252309 2293178 2319756 2417644
39818 2417644 2510541 2468840 2323544 2271755 2450436 2761178 2955896 2885330 2646621 2481225
39808 2481225 2527841 2689414 2758738 2650095 2456268 2289069 2156117 2045164 2047377 2281567
39798 2281567 2700918 3076364 3216349 3145677 3021882 2925306 2806321 2626359 2458318 2392669
39788 2392669 2396402 2351533 2231306 2147644 2182977 2258902 2256994 2211595 2260145 2415115 2523721
39777 2523721 2493378 2426970 2450410 2514099 2488109 2386133 2352253 2445771 2575719 2660315 2722719
39766 2722719 2789077 2812823 2778602 2791303 2956884 3214670 3387451 3396642 3346466 3366256 3424221
39755 3424221 3357682 3096372 2812320 2782929 3082322 3471239 3662939 3652540 3674818 3859552
39745 3859552 4088619 4235938 4366729 4566167 4720103 4674233 4537460 4591706 4898248 5220336
39735 5220336 5386055 5499305 5682185 5830232 5813920 5757253 5870001 6084265 6113885 5873838
39725 5873838 5612587 5578546 5743990 5929316 6034764 6057500 6018361 5979249 6030250 6162944
39715 6162944 6245555 6207687 6152371 6193032 6284729 6335239 6387197 6540627 6755926 6891149 6910676
39704 6910676 6915574 6977994 7080532 7220863 7441748 7729271 7990185 8163777 8277877 8387806
39694 8387806 8545252 8821365 9253282 9755547 10183627 10496796 10767093 11038628 11298151
39685 11298151 11579704 11954421 12400133 12827955 13256672 13791918 14402925 14925536 15357451
39676 15357451 15922344 16713155 17503312 18103481 18688066 19505112 20440155 21203920 21858890
39667 21858890 22786066 24120085 25578724 26941861 28360196 30020294 31798496 33490976
39659 33490976 35175437 37071728 39179848 41339017 43581197 46145798 49128264 52352355
39651 52352355 55655990 59115469 62896579 67029232 71439331 76111853 81117090 86517794
39643 86517794 92322946 98513814 105086977 112111504 119765079 128260198 137707825 148106336
39635 148106336 159478879 171934718 185544511 200232801 215851705 232252129 249129699
39628 249129699 265804422 281263377 294444888 304430239 310427410 311792333 308242100
39621 308242100 300050240 287980680 273038162 256266143 238638578 220952817 203745475
39614 203745475 187336594 171956754 157785369 144872787 133114028 122364880 112562071
39607 112562071 103697167 95715497 88512199 82023013 76242491 71115261 66463972 62090858
39599 62090858 57937663 54088283 50613726 47475840 44602493 41989458 39666943 37595294
39591 37595294 35655852 33745790 31851028 30042460 28432080 27094547 25967182 24852471
39583 24852471 23604745 22314566 21221242 20424836 19770334 19048457 18224919 17419107 16731326
39574 16731326 16160003 15640341 15103055 14527050 13971302 13515398 13153656 12815932 12496978
39565 12496978 12242542 11972808 11491622 10784535 10145394 9831428 9722753 9539971 9293474
39556 9293474 9235822 9395123 9458574 9191381 8719963 8294050 7986235 7752355 7588273 7468009
39546 7468009 7286551 7026251 6843774 6831526 6826756 6641637 6367170 6236103 6260650 6234005
39536 6234005 6065859 5894696 5840884 5837880 5767938 5623091 5472864 5385288 5425329 5618176
39526 5618176 5853754 5927188 5758001 5516135 5459170 5661425 5939221 6029545 5828722 5476665
39516 5476665 5219647 5181731 5270755 5300577 5166952 4893790 4569094 4284387 4096931 4000659
39506 4000659 3952597 3940352 3970895 3984774 3878186 3652742 3436320 3287986 3099461 2791480
39496 2791480 2494746 2399418 2510394 2691366 2867786 3026759 3092233 2993752 2825556 2751200
39486 2751200 2764357 2721833 2601175 2532941 2565817 2591700 2537632 2450837 2350623 2178202 1957966
39475 1957966 1839399 1898202 2039024 2165619 2304986 2491501 2670743 2796651 2888690 2920001
39465 2920001 2799580 2560782 2418851 2511363 2686911 2673111 2381630 1962375 1637323 1550069
39455 1550069 1686205 1876772 1971504 2040126 2266599 2618441 2827756 2785489 2716499 2797207
39445 2797207 2828489 2545083 2091183 1881517 2044695 2290076 2339702 2241940 2192637 2248191
39435 2248191 2324611 2360637 2377072 2411658 2439858 2362717 2115605 1816706 1713372 1888336
39425 1888336 2104110 2070051 1805611 1591946 1595527 1697653 1709807 1621006 1574108 1660268 1779086
39414 1779086 1714753 1397067 1071442 1074436 1398846 1662463 1616250 1474022 1540249 1714021
39404 1714021 1670151 1410791 1269975 1383308 1518022 1504740 1498243 1652251 1815180 1763395
39394 1763395 1547976 1396309 1386795 1404771 1347161 1225999 1118836 1109876 1215316 1306349 1213117
39383 1213117 976526 862580 1021761 1268943 1336139 1218394 1102536 1057674 1003626 941575
39373 941575 1003235 1242240 1533554 1720455 1742413 1596309 1310550 1018659 932752 1130111
39363 1130111 1420022 1523307 1370480 1146810 1050834 1095499 1172999 1222948 1249731 1227247
39353 1227247 1114712 977546 962477 1088752 1176091 1078482 895163 820640 860376 860418 783877
39342 783877 768858 884881 1002403 977336 843969 751944 797709 964112 1142798 1192116
39332 1192116 1073748 946148 993140 1141787 1121460 860011 625674 656541 834977 908530
39322 908530 881452 948757 1118387 1159831 952999 677530 576016 669819 793619 815381
39312 815381 740000 652111 627609 682625 770503 832829 856667 865408 865510 837650 776414 701076
39300 701076 622707 533477 442611 404418 488589 706430 962144 1105313 1069017 944000 873670
39289 873670 888022 897351 840495 761161 721686 717857 716590 721625 762784 853045 971297 1057491
39277 1057491 1041157 930567 846885 886748 975492 960520 825586 680385 555644 381115
39267 381115 186849 137679 302300 555495 777028 971984 1119971 1111488 953421 834476
39257 834476 837223 789254 583592 436227 577539 860678 965378 866782 793051 799898 721654
39246 721654 530524 421038 490529 609852 667764 694684 691143 585405 430494 395843 480609
39235 480609 481755 342971 277423 412633 569866 572560 539044 652383 837011 906975 880985
39224 880985 896337 929135 865907 773697 825387 989062 1057248 989000 962111 1041276 1052794
39213 1052794 894721 746434 808973 998443 1078314 993816 893851 879160 912137 965967 1081865
39202 1081865 1227625 1250213 1071253 840530 786749 958946 1204084 1360925 1380130 1289754
39192 1289754 1170319 1161700 1350732 1610663 1691373 1543750 1420528 1544373 1799857 1910287
39182 1910287 1827366 1752100 1808747 1902420 1915608 1857141 1764341 1626971 1489325 1482519 1650124
39171 1650124 1849328 1930226 1929455 1984565 2125629 2257670 2305334 2276305 2202649 2101116 1987586
39160 1987586 1878458 1785488 1738933 1786117 1929546 2093438 2187473 2184224 2113299 2008781 1885602
39149 1885602 1747730 1612314 1538562 1596106 1750905 1830593 1705415 1475640 1350128 1351863
39139 1351863 1309761 1163663 1075394 1146718 1224702 1145200 1010582 1024183 1159290 1217102 1149157
39128 1149157 1081752 1039701 910064 735273 778597 1142496 1516485 1515881 1166135 837479
39118 837479 750709 777823 750162 723476 813709 952447 995343 969513 1001947 1049715 938797
39107 938797 694605 587418 743486 931013 898955 740086 695877 749460 695409 543246
39097 543246 541588 774966 1011131 1027474 860532 644711 424950 246935 230576 400079
39087 400079 590099 660057 673937 749144 866118 954562 1028334 1097238 1085071 988201 976480
39076 976480 1156294 1351643 1319613 1098121 943591 985314 1127384 1242587 1282631 1233034
39066 1233034 1125453 1061626 1078803 1048537 863583 646483 584876 637650 630373 583372 676274
39055 676274 892384 983586 853218 715793 764668 900139 932186 882061 915198 1077129
39045 1077129 1248306 1319859 1310326 1317288 1395918 1477428 1429255 1243782 1112606 1212708 1470767
39034 1470767 1672129 1749084 1785674 1780669 1639065 1413659 1308660 1375006 1435704 1407476 1450583
39023 1450583 1648429 1773452 1597510 1269299 1129181 1242694 1370887 1372091 1389453 1593586
39013 1593586 1925072 2183906 2269820 2249405 2233798 2256583 2271277 2236188 2171754 2125752 2124017
39002 2124017 2198836 2410735 2745938 3032334 3100527 3032185 3093346 3386992 3735521 3968756
38992 3968756 4145721 4371805 4563548 4578812 4488333 4534120 4843579 5317702 5786743 6175479
38982 6175479 6530398 6956610 7504715 8084265 8555821 8937627 9399768 9990824 10525336
38973 10525336 10859676 11120854 11488323 11887152 12121812 12220623 12390383 12661828 12838665
38964 12838665 12815398 12692739 12513123 12129574 11477311 10787642 10347951 10148086 9929966
38955 9929966 9537064 9063047 8657166 8315309 7926106 7462474 7044797 6791444 6653121
38946 6653121 6465964 6174052 5913373 5822179 5850173 5850839 5800162 5791864 5838641 5827833 5705355
38935 5705355 5568956 5503716 5422632 5174372 4769763 4402493 4227663 4180400 4065295 3815833
38925 3815833 3597099 3590733 3720794 3714331 3459370 3169663 3103850 3231441 3310028 3217284 3047414
38914 3047414 2914012 2826329 2772240 2772224 2808527 2817404 2791674 2792330 2832722 2857739 2865241 2928073
38902 2928073 3045410 3088763 2971629 2780905 2658313 2624935 2606907 2575170 2563980 2573402 2535115
38891 2535115 2387828 2150801 1913744 1758617 1684391 1621341 1539683 1509516 1598129 1737382
38881 1737382 1777058 1669855 1525789 1473721 1536011 1643196 1705529 1672767 1588318 1562918 1619062
38870 1619062 1612040 1426762 1200410 1170273 1318275 1387620 1286600 1225073 1338650 1424555
38860 1424555 1251236 943065 807197 888047 950677 859252 723592 661935 642281 613851
38850 613851 615594 678635 756544 823302 928744 1087341 1202073 1166563 984722 754048 591667
38839 591667 587775 739852 904630 913641 781037 700743 782480 895286 864381 737207 722844
38828 722844 891351 1056901 995275 709020 431684 390452 590936 837139 951081 944391
38818 944391 948777 1012605 1044732 967000 828614 714337 619083 504991 431822 510634 725132
38807 725132 908663 941792 894385 916073 1042705 1176179 1221338 1174515 1087665 1007170 957413
38796 957413 940151 934831 925049 924883 948901 964595 924812 852411 830958 882765 916777 851811
38784 851811 745467 724590 804921 862068 797234 661492 575588 574917 588744 553125 486307
38773 486307 437958 406069 348344 270394 250398 337572 456888 478320 378900 265129 219189
38762 219189 212014 218254 314314 548098 776992 789576 587239 400496 389828 462560 452157
38751 452157 359200 308415 341539 369166 305418 166478 44185 33828 164605 356064 477441
38740 477441 493473 502431 580677 663894 670066 666914 778870 955722 990950 799216 538215
38729 538215 393311 358011 316934 253801 254804 340228 407557 358961 217324 95545 89359
38718 89359 207326 376302 516454 631547 799426 1030060 1166846 1019475 612515 218132
38708 218132 86889 199320 342616 382617 369602 389715 417098 360962 202148 29460
38698 29460 -39846 50611 259897 474290 586874 573199 476909 332306 154837 11198
38688 11198 10458 168528 347623 405194 355490 305947 281668 214670 82392 -50129 -120725
38677 -120725 -103427 37325 301945 553556 602614 452044 334938 424457 608605 653816
38667 653816 509625 332829 260012 277667 301157 273427 175592 24417 -115920 -169160 -108682
38656 -108682 36121 208699 325481 298568 137266 -1626 38227 211177 308088 221083
38646 221083 82591 86471 237366 359053 329214 223914 205764 324132 475814 541781
38636 541781 501521 397973 250441 59923 -126281 -226453 -214837 -157062 -140360 -191860
38626 -191860 -261438 -260794 -144655 5714 21178 -160765 -379909 -433140 -336136 -267638 -269422
38615 -269422 -190625 23351 190661 162143 58343 72915 174694 201510 154505 174404 261151
38604 261151 241805 42297 -195913 -316801 -309451 -218553 -53670 130369 195399 73286
38594 73286 -120084 -215945 -180774 -96842 -12844 89209 200236 256068 233390 211284 276314
38583 276314 381662 374914 202922 18049 -11148 54482 13095 -150900 -217999 -76387 89321
38572 89321 92140 40513 136808 323266 381819 294487 226804 198377 69177 -135839 -192403
38561 -192403 -34642 135178 190044 250045 376230 376622 122339 -182657 -290851 -273135 -320209
38550 -320209 -343372 -97343 367579 696608 693657 533086 462464 520714 620049 705623 735414
38539 735414 661778 538526 517047 628796 684101 513982 233965 124041 271891 471347
38529 471347 499068 375964 280749 283497 286632 220890 163117 189081 219955 145764 36798
38518 36798 62043 204558 246165 92272 -65898 -24584 143300 218864 151473 77992 90183
38507 90183 145651 186427 201802 176502 99918 33668 69626 216636 403678 565999 641701
38496 641701 541740 261854 -9823 -61561 64494 134211 85520 133725 419415 731881
38486 731881 756684 500892 282119 315364 481687 541776 433538 269157 134868 21195
38476 21195 -74800 -102239 -41061 58971 168353 317465 478796 506689 317070 65331
38466 65331 -5415 128599 268741 287171 245007 200128 104802 -28853 -61919 52307 160319
38455 160319 158951 177914 337105 487169 415491 191194 67056 118737 215295 281037 337753
38444 337753 328360 160741 -74299 -176046 -137582 -136179 -204697 -173468 10959 173308 202417
38433 202417 209149 283382 329348 274447 220700 236403 202137 35784 -114277 -89083 27065
38422 27065 67200 55854 117512 226479 260708 222748 205371 202025 145655 83849 123481 236162
38410 236162 300954 311654 357025 410913 337251 128041 -37654 -26050 90533 154897 103633
38399 103633 -15406 -116617 -129966 -41182 102516 258895 426857 563854 546220 328632
38389 328632 83608 28124 132805 165991 32147 -109506 -113559 -64309 -114490 -231346 -247946
38378 -247946 -120585 -4424 -58312 -258588 -445799 -509298 -468351 -378720 -238568 -51245
38368 -51245 72746 1160 -219241 -374936 -354709 -283601 -302500 -344611 -275001 -151860 -155777
38357 -155777 -290325 -344855 -185560 68385 213840 197211 121617 99107 149450 208322 213679
38346 213679 195765 245737 362463 404942 273767 62060 -79544 -146856 -213751 -242296 -150851
38335 -150851 -28413 -61500 -231709 -294255 -113016 163092 325077 341853 299672 256195
38325 256195 240861 271321 289171 193841 3523 -134181 -136904 -55588 85332 327554 584906
38314 584906 624732 388664 150111 172989 363134 458717 441040 516540 751578 968135
38304 968135 1014790 939953 843050 710976 492258 248809 141171 261717 515798 700901
38294 700901 720109 667838 648618 599072 437348 312026 450592 758735 875009 712950
38284 712950 619832 819014 1036638 973450 836055 991168 1313487 1361452 1100262 948652
38274 948652 1102533 1303503 1373577 1505162 1820988 2054620 1944020 1642237 1464492 1465386
38264 1465386 1523483 1628981 1809283 1931304 1854148 1677964 1611984 1684539 1782226 1873175
38254 1873175 1982594 2033640 1922230 1695726 1486618 1334347 1223448 1201954 1292242 1381031
38244 1381031 1372894 1351305 1411137 1460861 1404404 1381004 1555608 1783136 1792473 1634350 1605496
38233 1605496 1745039 1765694 1537674 1295413 1248974 1293279 1249525 1133159 1022696 892945
38223 892945 743835 689399 753534 768188 640826 535476 605447 724440 692624 559455
38213 559455 512673 556774 538041 429758 375854 466075 634892 774888 826484 783763 715287
38202 715287 729045 823097 848325 717329 545472 465726 428312 341143 286565 398814 611354
38191 611354 730677 702742 617675 517858 403749 363116 467904 589026 547274 412688
38181 412688 406438 526917 541727 361477 150712 33831 -36848 -69017 29186 212355 280148
38170 280148 204554 200743 347262 425252 302844 188613 282197 443962 480034 511929 740350
38159 740350 1028056 1072092 876168 704883 642030 545278 410230 420533 597028 723828
38149 723828 701665 679703 736957 720033 545166 405733 482002 635072 601822 369050 156320
38138 156320 109284 190138 320817 462332 556498 528332 382060 223079 162347 226515 346826
38127 346826 409687 346609 201333 81142 36007 36836 72799 181608 351159 482001 506097
38116 506097 471410 451535 442038 409321 372609 364748 374494 403408 512259 712018 861257
38105 861257 793285 535921 302101 255477 370387 527886 653877 727961 737924 692800 649729
38094 649729 671702 752380 803700 733314 547840 375935 351570 453251 504634 382885 184361
38083 184361 107144 193883 292967 284369 230688 248742 332308 398581 440635 512051 594268 615769
38071 615769 605214 675361 803688 781321 497582 159270 59546 184242 233732 39934
38061 39934 -226278 -329182 -282521 -263971 -327915 -363095 -298389 -201761 -152642 -128812 -82107
38050 -82107 -64362 -191629 -467918 -703867 -686056 -432218 -192392 -148932 -217105 -245703 -296422
38039 -296422 -517036 -797782 -837045 -595248 -393327 -428009 -469601 -258062 47834 116066
38029 116066 -37457 -117928 -54262 -75384 -284483 -488191 -515413 -427139 -321373 -173674
38019 -173674 23879 169684 199992 164556 97327 -8536 -60640 75180 317856 410038
38009 410038 293764 191727 210455 153769 -91497 -265873 -93443 276560 461249 340034
37999 340034 103935 -80373 -203666 -282311 -320961 -367792 -436755 -442078 -359353 -336381 -463322
37988 -463322 -563456 -434336 -179562 -49675 -48393 30077 236796 422508 518076 577125
37978 577125 554157 332112 -3532 -191118 -142057 -26015 21403 27185 -8356 -149883 -314928
37967 -314928 -303231 -124077 -15847 -38367 47141 329962 491063 246420 -186005 -357487
37957 -357487 -180404 35402 49881 -78934 -211696 -327887 -456744 -560696 -550779 -366536
37947 -366536 -50643 223224 267264 82659 -138517 -274612 -417663 -660550 -876757 -865268
37937 -865268 -620821 -302575 -14467 211018 277705 87929 -249340 -452522 -369885 -141106
37927 -141106 -17710 -102603 -290911 -403764 -366070 -287928 -341406 -515215 -569204 -333315
37917 -333315 16603 131490 -80805 -353839 -416134 -300353 -229639 -307670 -426395 -434219
37907 -434219 -302628 -125341 -12144 -7776 -88020 -194310 -256624 -219989 -107032 -46744 -162755
37896 -162755 -403689 -557444 -488111 -303096 -224504 -337779 -526618 -617923 -532425 -328886
37886 -328886 -159784 -150347 -265309 -334519 -268861 -195529 -287656 -498023 -583681 -412373 -141991
37875 -141991 -38487 -173311 -367925 -419426 -309682 -157523 -21782 142694 315178 326503
37865 326503 67239 -296545 -477464 -416979 -315530 -310882 -320778 -255719 -183627 -176133 -174418
37854 -174418 -144738 -197187 -380788 -512196 -409311 -173651 -22776 51813 202984 369430
37844 369430 295524 -59426 -393413 -437946 -272605 -167958 -263594 -492970 -707226 -786923
37834 -786923 -718388 -621344 -632661 -741258 -821139 -821339 -800214 -772935 -687202 -586602 -622520
37823 -622520 -818184 -976064 -937550 -810668 -805069 -934778 -1035853 -1027834 -1001868 -1043160 -1095648
37812 -1095648 -1061129 -963725 -940457 -1067416 -1245958 -1308438 -1227307 -1154477 -1229117 -1419384 -1606085
37801 -1606085 -1737892 -1809682 -1765184 -1560705 -1290324 -1108748 -1046547 -1030578 -1049839 -1130184
37791 -1130184 -1165213 -988851 -656901 -444218 -478969 -578905 -563418 -530176 -653072 -863687
37781 -863687 -942749 -838629 -691663 -582545 -443419 -221832 19825 198419 299474 349374
37771 349374 370705 372828 336654 230442 92692 51655 183269 390412 511107 508743 459812
37760 459812 399295 310586 248757 310112 439277 423363 178065 -78524 -78396 135685 266625
37749 266625 173652 45632 88943 207726 162879 -44228 -167073 -90052 17716 737
37739 737 -44157 23106 113892 56241 -102344 -170246 -132689 -162174 -317265 -452703 -454627 -369538
37727 -369538 -269555 -175819 -141317 -212200 -273557 -146571 110163 221554 90485 -63975
37717 -63975 -60890 -886 -13196 -5805 133983 294408 313957 238504 195117 164547 92195 66165
37705 66165 143652 148657 -78979 -347659 -333980 -77720 53904 -107769 -334609 -371527 -247683
37694 -247683 -139880 -125496 -155299 -134678 9226 225043 312624 141926 -132166 -238464
37684 -238464 -137627 -11959 54572 150380 288486 336820 252077 160927 139409 118040 78309
37673 78309 132006 304089 426301 363331 188724 36052 -70911 -145466 -161015 -160095 -279713
37662 -279713 -527539 -667351 -488401 -106210 147417 90272 -150667 -298924 -175996 160582
37652 160582 468849 548084 424181 259276 127392 12244 -21696 124117 343364 372935
37642 372935 162410 -35101 -56569 -72818 -261316 -456044 -373536 -45792 236023 336791
37632 336791 388527 509910 642109 695989 689489 683142 690767 697039 692135 666356 613083 534150
37620 534150 422300 280025 175537 202859 343456 451438 428943 330205 243473 177368
37610 177368 126689 130300 181222 198936 181289 257111 483303 718507 813353 790592 709724
37599 709724 512033 180437 -83275 -62544 166543 326323 274419 77248 -166121 -367113
37589 -367113 -383719 -148327 153742 239694 69970 -134324 -196688 -131979 -10991 122422
37579 122422 189352 119463 -8007 -21369 112397 239941 221306 71598 -84112 -99768
37569 -99768 94219 367889 452781 271750 96740 189318 413088 455078 308002 205379
37559 205379 163461 -8334 -238796 -179313 221900 537130 455847 218604 205507 385974
37549 385974 473562 408817 372585 446080 536760 573357 555140 465970 319971 232020 288477
37538 288477 412163 481894 499022 516397 510547 453309 401482 395372 391488 402274 529494 719921
37526 719921 697615 345576 -43114 -147376 -66481 -82293 -136705 65343 495577 755769
37516 755769 640662 388379 264664 218780 116170 48396 190156 496848 738145 768808
37506 768808 652620 570875 668204 923823 1148548 1191690 1148170 1239330 1495065 1719949
37496 1719949 1799027 1851257 2011720 2236043 2415078 2527990 2574679 2497664 2288547 2047853
37486 2047853 1824122 1521025 1096684 730617 626224 736102 852066 892118 908668 866467
37476 866467 648688 316396 142260 270334 488464 479763 217150 -32834 -59063 85430
37466 85430 232138 315017 370130 418484 456482 511811 593959 611098 465777 248688 199567
37455 199567 411514 691791 805819 756691 709800 728197 727267 647168 529327 435871 407757
37444 407757 479773 620520 686139 567087 365020 285059 358272 414717 337804 202477 146677
37433 146677 238723 469110 721797 768292 491148 131077 85069 399686 698980 704216
37423 704216 566164 531688 547133 437865 277720 281489 445716 586378 665386 793655
37413 793655 941840 945059 822661 807859 969832 1055709 849498 499151 323302 418021
37403 418021 610133 717816 712117 663159 651838 724408 841148 869936 704171 399500 145048
37392 145048 85973 205560 388393 558172 711140 827144 825787 678329 521578 545527
37382 545527 747323 913003 903173 840220 909167 1078232 1169337 1143025 1134883 1215138 1281985
37371 1281985 1234054 1115030 1034218 1047176 1159462 1352544 1557556 1681489 1697475 1645355
37361 1645355 1538439 1362693 1173464 1074630 1075199 1085309 1081367 1133213 1219818 1185070 978313
37350 978313 789192 805677 957068 1048321 1043991 1039008 1025689 904325 709070 611305 656525
37339 656525 679889 559392 399325 354888 391353 351329 199766 66533 49148 81298 36767
37328 36767 -94920 -189818 -142191 -4061 59777 -32606 -164691 -152181 23388 183460 172822
37317 172822 34176 -85602 -127185 -130158 -112044 -66102 -68423 -234213 -512869 -666558 -560573
37306 -560573 -364685 -319281 -382625 -305805 -39107 156287 67244 -187892 -344357 -309991
37296 -309991 -173713 -28205 65834 47308 -49266 -56640 94193 200443 55618 -188744
37286 -188744 -194793 54571 221980 137799 42668 164194 330363 238880 -74438 -297656
37276 -297656 -279765 -167776 -137985 -192091 -238610 -233357 -202926 -202098 -254122 -303595 -277027 -214037
37264 -214037 -236591 -339368 -350640 -196226 -52962 -100926 -263822 -367844 -426953 -555550
37254 -555550 -697104 -686617 -540126 -445408 -472109 -502487 -450325 -352467 -246899 -150670 -140185
37243 -140185 -246888 -301155 -120162 167424 261574 161044 174388 401992 551943 409357
37233 409357 158250 33242 -50497 -261454 -495521 -554634 -504443 -554480 -701764 -770244
37223 -770244 -712674 -616797 -495030 -318480 -182517 -186606 -221964 -136627 -35233 -123331 -310829
37212 -310829 -303996 -91329 11096 -135863 -280451 -195109 -2528 85415 97139 165137 261051
37201 261051 278348 230203 172039 57063 -142296 -285563 -233169 -73077 14823 43274 160257
37190 160257 354611 435597 311985 103136 -58266 -167950 -246239 -242943 -126876 33865
37180 33865 161695 269715 405351 547846 623679 590536 462426 286045 134809 91695
37170 91695 178202 304009 336563 239572 114716 80960 129995 143913 63757 -16462 20301
37159 20301 126239 127651 -28976 -169319 -106895 94735 182733 32527 -194729 -249818 -78278
37148 -78278 155997 285244 290961 242047 171182 77418 5114 29004 151311 283456 349854
37137 349854 341477 242599 2734 -340490 -592790 -581241 -371739 -191472 -143491 -117949 2651
37126 2651 178144 298479 329292 299328 217418 73328 -121235 -336126 -525900 -611804 -531508
37115 -531508 -338646 -177039 -113444 -70250 29572 130937 123361 -14625 -205541 -351444
37105 -351444 -384298 -314613 -267004 -364604 -527423 -520441 -294962 -130855 -277103 -570056 -624500
37094 -624500 -352013 -65770 -63705 -312390 -585129 -721069 -670668 -458371 -219900 -151043
37084 -151043 -289077 -427242 -365414 -178611 -106827 -215170 -304360 -180262 95983 283678
37074 283678 231161 13567 -171901 -194863 -69951 109290 266409 364275 373725 274931 105884
37063 105884 -24672 -19846 93759 167082 86307 -72728 -109318 51660 242224 255697 109224
37052 109224 -8341 -11705 6360 -25175 -56243 -66798 -137755 -270143 -302050 -151712 1266
37041 1266 -43323 -199205 -227897 -93380 35164 75385 92582 99123 43186 4388 138426
37030 138426 372411 415926 182382 -40367 8030 192790 206679 5840 -184454 -206193
37020 -206193 -114831 -32970 -20042 -69595 -113676 -51853 120354 241398 144776 -127858 -361795
37009 -361795 -403179 -289444 -167313 -142017 -193170 -205777 -110811 4181 -2078 -110057 -151085
36998 -151085 -69787 -25636 -149407 -343898 -442967 -432096 -370072 -226109 19543 211823
36988 211823 166719 -65689 -271195 -366615 -436761 -502504 -456470 -253491 1122 180386
36978 180386 218999 78607 -207522 -456750 -483516 -345389 -271562 -329766 -361376 -284991 -238605
36967 -238605 -324961 -428913 -428763 -404131 -459543 -494267 -357131 -134012 -63132 -199973 -361175
36956 -361175 -397609 -342944 -263902 -134160 61046 212374 182923 -28383 -285338 -441762
36946 -441762 -424016 -236302 34204 227095 214598 46994 -59568 49631 268960 332523
36936 332523 117876 -225813 -473882 -560545 -561306 -528616 -446529 -309347 -153093 -24964 21644
36925 21644 -47194 -155956 -137078 46419 176619 44566 -214030 -254852 -825 237548
36915 237548 183853 -62718 -225456 -231364 -238711 -366486 -537077 -577500 -415322 -182943 -112575
36904 -112575 -262745 -397815 -279292 -34805 -19025 -297050 -537290 -507967 -389216 -410186
36894 -410186 -450522 -280962 1375 107604 14531 -42191 14463 12414 -129458 -262969 -271816
36883 -271816 -225987 -205406 -184782 -162665 -197941 -239803 -125087 151212 342149 243379 -59726
36872 -59726 -335925 -458929 -426659 -286370 -153641 -163366 -279254 -283914 -82036 128469 137275
36861 137275 28760 7960 33313 -118229 -444581 -639404 -492994 -172690 14815 1059
36851 1059 -45858 -14512 25436 -9611 -72172 -73892 -26457 4959 30980 94921 122975 -17639
36839 -17639 -267577 -360377 -175108 57432 75425 -31212 -1340 138855 115948 -106250
36829 -106250 -228132 -82963 124209 193991 233921 366021 425735 252720 56735 141213
36819 141213 402871 469629 262667 60389 25919 34849 9539 67779 232524 307171 183638
36808 183638 8386 -100226 -229846 -393808 -349130 42837 478620 539285 241413 -27985
36798 -27985 -64464 -43120 -157268 -332219 -388439 -299567 -176023 -102333 -78775 -62245 -14424
36787 -14424 53279 81752 59651 78448 198297 296544 190260 -87487 -286908 -262017 -146762
36776 -146762 -132124 -202730 -220578 -171169 -159798 -192202 -127089 105180 354761 405986 221940
36765 221940 -35662 -195821 -214086 -132598 11855 202488 406498 562695 597868 461653
36755 461653 189932 -67241 -163604 -141650 -206212 -433848 -608908 -490785 -171521 28750
36745 28750 2827 -37289 60800 155919 91994 -11994 44146 218457 323790 327131 311776
36734 311776 241597 40695 -149698 -100460 118804 192465 43059 -56990 44465 125616
36724 125616 -18634 -231186 -271281 -183540 -120067 -20003 214293 398536 288590 18757
36714 18757 -53579 105237 190207 90473 44190 189433 347218 393140 477619 667917 707993
36703 707993 413698 31274 -114295 -101217 -189673 -305852 -166172 170798 320141 163499
36693 163499 11597 71241 139301 14582 -130674 -61175 102391 93244 -43379 -37780 141268
36682 141268 239005 123592 -59252 -188103 -336600 -527652 -567631 -316486 39259 190976
36672 190976 99128 -10118 5297 44959 -31697 -206226 -360845 -426359 -406437 -329845 -239494
36661 -239494 -177585 -128322 -12929 208572 452299 569100 486440 279662 112589 101970
36651 101970 210189 278999 215688 136739 249177 571372 864405 900500 724336 567059
36641 567059 558287 620034 612789 485541 290478 139211 139621 287335 422743 389851 236322
36630 236322 146344 169895 162693 44133 -44624 39522 185781 162917 -46443 -221251 -214785
36619 -214785 -128374 -119498 -174669 -177595 -122213 -130205 -260113 -396563 -376912 -191544 -11039
36608 -11039 -7760 -173945 -337396 -350335 -233153 -120764 -101283 -146847 -190687 -220017 -266648
36597 -266648 -332792 -369492 -343921 -303805 -333954 -436713 -496789 -411462 -236822 -142021 -209437
36586 -209437 -339650 -380404 -296583 -174114 -100270 -90045 -105521 -103156 -72517 -50915 -78395
36575 -78395 -126959 -119849 -43486 18412 1021 -55987 -94890 -142023 -237591 -318685 -283976 -157167
36563 -157167 -80179 -135956 -260518 -335561 -292030 -122805 121082 330587 406246 343067 202444
36552 202444 25687 -146101 -205183 -65092 174713 289167 196901 48581 -6766 -16716
36542 -16716 -100744 -239533 -302719 -222597 -41441 163635 315171 344791 258718 155216 97533
36531 97533 20027 -145485 -302354 -277243 -67726 122277 125718 -933 -76022 -9509 129265
36520 129265 224022 242335 246493 285084 303315 214689 66693 43572 231237 449618 435237
36509 435237 167020 -111518 -202430 -156581 -116064 -78330 61207 286319 422527 354922
36499 354922 184648 95623 120625 136328 78339 41906 114393 214102 211198 145141 172102
36488 172102 313273 422433 429070 431155 468355 393475 122621 -141774 -147932 37599 127216
36477 127216 33831 -47461 11969 98354 109759 151388 321657 479213 423771 214103 106114
36466 106114 203960 347468 357541 242681 114981 20069 -73119 -183776 -295769 -387148
36456 -387148 -424034 -355632 -186599 -45800 -96782 -339232 -562561 -562460 -364190 -157878 -56147
36445 -56147 -33896 -88025 -277963 -540934 -645772 -481509 -261741 -251423 -384033 -382667 -214390
36434 -214390 -144329 -297167 -448071 -381673 -214697 -162773 -175414 -52865 185274 313197
36424 313197 243689 110565 -6897 -201019 -500852 -726591 -710836 -527551 -364071 -264520
36414 -264520 -146437 -11203 21818 -105375 -299841 -437744 -485195 -470735 -422144 -376508
36404 -376508 -381307 -426452 -433593 -377371 -354752 -439651 -520542 -419804 -169107 -12529 -88736
36393 -88736 -254476 -308132 -254954 -231232 -283314 -374028 -512020 -692419 -776379 -635290 -382692
36382 -382692 -249987 -246750 -183503 -44563 -55712 -292037 -499241 -470065 -358481 -410738 -580212
36371 -580212 -643674 -546633 -393833 -228030 -68193 -48742 -242793 -437384 -384563 -213575
36361 -213575 -263001 -524507 -621074 -394448 -143469 -139309 -245752 -231805 -167517 -233229 -346970
36350 -346970 -284970 -59419 93127 41708 -136357 -323749 -432420 -361969 -98737 170413
36340 170413 231130 106560 -18856 -91017 -196861 -318276 -318983 -200156 -132880 -174898 -182045
36329 -182045 -96097 -94956 -300067 -517134 -469927 -185851 42576 21252 -186189 -415459
36319 -415459 -551090 -537837 -403142 -282318 -292123 -368081 -349970 -230931 -172540 -246242 -330969
36308 -330969 -340905 -375607 -501742 -541207 -296052 92724 261766 107730 -93443 -122717
36298 -122717 -125286 -314243 -572437 -609123 -410896 -252151 -268009 -295942 -206187 -126885 -199184
36287 -199184 -321771 -328597 -263522 -266897 -304852 -247496 -149732 -199938 -392564 -495908 -392377
36276 -392377 -229621 -155675 -111799 -3050 110904 143630 149493 197252 197000 36850 -190190
36265 -190190 -283190 -212724 -133422 -148609 -225192 -317666 -407480 -428361 -321945 -170329 -107622
36254 -107622 -104142 -29047 71810 2049 -226844 -326794 -146812 97688 187054 239550 435685
36243 435685 617334 510254 225569 149140 344571 453726 270356 45035 47787 143546
36233 143546 52105 -200435 -371250 -390600 -377291 -353023 -230329 -72294 -98140 -368436
36223 -368436 -658823 -725179 -561656 -341154 -217729 -238752 -351831 -450057 -480201 -510770
36213 -510770 -602689 -634615 -409173 41927 421217 504860 379215 255019 190233 126370
36203 126370 79625 117623 193604 173899 39951 -68592 -43887 54291 88938 463 -159939
36192 -159939 -291662 -309763 -201817 -54242 18426 799 -9370 44137 53201 -136275 -476801
36181 -476801 -688279 -557198 -218398 -20318 -103332 -249795 -222751 -106070 -138102 -294431
36171 -294431 -280598 24433 342790 338716 23770 -329449 -552210 -670635 -706358 -606582
36161 -606582 -396847 -233381 -234564 -357986 -483955 -530439 -459819 -284695 -124411 -150703
36151 -150703 -383579 -606273 -581150 -318532 -46309 62119 32709 -32021 -100618 -172003
36141 -172003 -173751 -22688 218519 359041 306195 191994 191969 274535 244051 21798 -234786
36130 -234786 -324405 -216569 -33486 89829 74911 -75181 -241251 -253364 -73684 146907
36120 146907 261085 286508 291159 233606 63760 -107696 -124902 -21665 50255 88010 204060
36109 204060 328912 220935 -141361 -434452 -412294 -239884 -214313 -340195 -422743 -439024
36099 -439024 -520478 -625076 -539958 -249814 -25453 -41836 -139311 -110051 -26603 -84698 -243188
36088 -243188 -250189 276 332619 530328 551203 456634 275606 37575 -157531 -224322
36078 -224322 -211591 -237865 -322431 -371102 -327724 -245209 -187337 -156667 -162297 -257153 -423496
36067 -423496 -506923 -391592 -199804 -172317 -344661 -487247 -416524 -233038 -157382 -229426
36057 -229426 -293962 -236326 -108585 -23752 -22365 -67588 -110593 -134077 -157357 -201275 -235950
36046 -235950 -195551 -76423 23208 13291 -81738 -192613 -330484 -537446 -735353 -756961 -564067
36035 -564067 -327376 -227058 -253718 -278954 -258147 -266155 -352074 -452610 -478298 -432081 -398920
36024 -398920 -431164 -479161 -449995 -320600 -170061 -102462 -166448 -352894 -619248 -876787
36014 -876787 -997966 -911119 -692357 -512038 -474142 -533213 -567714 -508978 -403351 -366519 -459965
36003 -459965 -602406 -649787 -583583 -541387 -610526 -698176 -711736 -753692 -954841 -1187735 -1187866
35992 -1187866 -961608 -816780 -916206 -1049813 -981803 -796638 -715349 -758903 -815487 -891437
35982 -891437 -1047884 -1195401 -1208256 -1165990 -1215723 -1254637 -1053985 -691001 -527951 -689746
35972 -689746 -869833 -781631 -523931 -330159 -209257 -54856 91712 134930 136322 185041
35962 185041 166189 -82569 -439838 -580365 -390691 -97817 40234 3097 -54886 9820
35952 9820 228764 487160 590354 472504 309102 299862 395277 400641 296824 250028 326039
35941 326039 427074 523898 699744 907688 942904 768339 632560 715425 865602 862401
35931 862401 748038 695044 699979 637576 510053 416573 351989 252728 179511 230433 311607
35920 311607 225475 -14561 -174552 -127313 5869 67874 29504 -92783 -281934 -419257
35910 -419257 -332038 -38586 217527 275218 238011 239205 196574 -29556 -357222 -559204 -561798
35899 -561798 -488669 -428411 -326804 -130423 102303 283799 395650 453605 442886 342672
35889 342672 181525 31887 -35910 14852 171629 366552 501454 503522 369746 165363
35879 165363 -18840 -115169 -95925 37107 241739 404440 385235 166030 -75769 -133102
35869 -133102 -8505 105478 96544 66362 136940 237399 202218 28433 -92389 -5823 231701
35858 231701 434551 480786 392586 263588 146701 21086 -135669 -266108 -269152 -134989
35848 -134989 591 -17133 -194048 -378712 -413160 -270238 -57290 84546 85096 -25990
35838 -25990 -174444 -307222 -397675 -421217 -373248 -299376 -255146 -235179 -190787 -114841 -52389
35827 -52389 -26558 -13233 13523 75579 211938 409154 523629 410809 156237 21778
35817 21778 94721 154480 9302 -188591 -154331 95331 244001 108671 -131064 -198998
35807 -198998 -64868 83260 123967 139531 263342 466002 560499 431425 194137 48573
35797 48573 13867 -61320 -218469 -288655 -151775 60668 151721 121378 93932 97054 90095
35786 90095 120112 248059 377603 360662 233852 149223 115569 39941 -9699 132736 386513
35775 386513 449680 260578 133323 277277 462330 387297 144449 28009 42680 -61189
35765 -61189 -314307 -421887 -201871 117888 176762 -82788 -387050 -474512 -355584 -228709
35755 -228709 -216141 -251920 -234420 -198164 -234319 -292571 -226452 -53879 10971 -129139 -279625
35744 -279625 -226520 -41768 47650 -19324 -132873 -236350 -342052 -374301 -227824 8563
35734 8563 98533 -21198 -142863 -76472 110441 215345 144258 -34171 -177028 -155740 42741
35723 42741 249889 248309 24643 -201243 -245481 -158963 -109164 -174305 -317743 -454886 -472915
35712 -472915 -305189 -76866 -39088 -222421 -293041 38791 552439 718773 375716 -56223
35702 -56223 -121594 143449 397104 503534 592149 690749 608679 260418 -127098 -280620
35692 -280620 -214536 -144759 -165104 -180344 -116464 -23966 34510 51699 11047 -99867 -174586
35681 -174586 -45504 259900 464862 371506 132411 42005 134662 173829 23461 -158582
35671 -158582 -156240 14551 146645 100055 -66337 -190016 -166670 -24942 115166 146570
35661 146570 52396 -104329 -244442 -311954 -277659 -148573 20801 156144 218386 228625
35651 228625 239981 283914 334134 328801 244543 131436 42720 -43015 -171889 -315231 -408696
35640 -408696 -474713 -588263 -713971 -718794 -586685 -468169 -444691 -402464 -246508 -80738
35630 -80738 -32167 -46546 -35400 -84452 -291964 -505209 -473054 -210322 32593 126819 144754
35619 144754 117289 -1327 -111568 -10109 276360 470625 441774 351638 310845 194120
35609 194120 -43030 -169327 -37822 113894 6292 -238311 -301370 -168908 -97807 -167284
35599 -167284 -198176 -104628 -15790 -6550 22225 118226 158101 49515 -120402 -222454 -224913
35588 -224913 -133477 49325 220080 180910 -124739 -478223 -609637 -504920 -385678 -402159
35578 -402159 -440942 -281170 86286 366580 262067 -148419 -453170 -383443 -113981 19535
35568 19535 -36305 -79961 -29241 -19572 -134647 -276645 -356369 -409315 -453381 -420772 -318504
35557 -318504 -277216 -335133 -344965 -221745 -116985 -185536 -324259 -339656 -270776 -321833 -519457
35546 -519457 -661252 -618909 -492399 -405820 -321031 -154060 44965 154544 170715 218444
35536 218444 370200 529566 532742 341371 99610 -10759 49902 174283 266623 337628
35526 337628 413945 431786 311716 111776 2626 68168 211106 293880 298498 282353 238472
35515 238472 106693 -86143 -211892 -211179 -182251 -217781 -229106 -62955 232097 411475 351842
35504 351842 226156 268250 462549 585737 494835 254882 21392 -85515 -19700 153092
35494 153092 269233 239733 192936 307258 512302 535124 287868 31514 56112 338223
35484 338223 628860 762493 749798 662101 575640 577859 685662 772519 685917 426582 130766
35473 130766 -91126 -212348 -234911 -188337 -154789 -185047 -208263 -127175 29008 167028 306415
35462 306415 527928 745665 728508 425686 100796 12901 86262 51726 -158638 -334508
35452 -334508 -300565 -147147 -82662 -153316 -202160 -82486 159930 340198 338952 213025 90517
35441 90517 -1933 -142051 -341527 -460381 -362224 -110873 82022 109291 79187 132728 225609
35430 225609 181015 -59358 -330130 -423405 -315523 -158373 -80459 -72816 -78663 -117029 -249946
35419 -249946 -446899 -554280 -442231 -167118 49658 25108 -209197 -447161 -517189 -427773
35409 -427773 -307720 -251198 -261188 -309681 -380609 -445315 -458684 -411709 -348961 -308658 -285021
35398 -285021 -274463 -302695 -351489 -308171 -81679 233395 406030 332074 184048 219918 463765
35387 463765 662779 586373 295711 55893 30997 158943 310905 446617 558050 575505
35377 575505 450899 279828 210077 241805 242990 168065 123578 173301 214246 138821 18808
35366 18808 8648 119689 209084 180002 93328 63286 108361 138811 75496 -33367 -38736
35355 -38736 127664 326475 359138 245133 217737 387091 552269 467990 177955 -78916
35345 -78916 -205859 -293622 -370219 -332302 -164871 -27707 -25834 -41568 88551 329936 501991
35334 501991 518489 471671 491852 590650 648284 542914 310249 153656 229452 437537 527435
35323 527435 416965 274808 248950 268673 215667 148244 191732 294169 286393 168827 149178
35312 149178 343917 590574 648252 492178 310213 255498 299843 329295 308643 315339 436014
35301 436014 657112 857854 902468 744588 462794 211284 120113 201757 336584 376860
35291 376860 293097 206551 256457 447802 653710 755381 744744 687932 629728 568481 509577
35280 509577 495373 556359 657493 730306 749817 739281 705262 633318 570916 638775 887242
35269 887242 1178559 1291461 1141310 847086 594518 482541 480074 467141 330690 83652
35259 83652 -122235 -159606 -72964 7118 50951 122065 218076 264215 267468 324341 443118
35248 443118 508005 470291 424229 426275 400345 320438 319695 467160 576000 429296 118026
35237 118026 -43573 84869 326651 442308 384614 282085 276279 394898 520974 502264
35227 502264 340373 211032 233392 320055 357329 403418 534970 608974 412874 5202
35217 5202 -329233 -449968 -455589 -417428 -284942 -96596 -12509 -45588 -11820 139228 198130
35206 198130 50130 -91161 -5724 189494 249920 176620 124518 83857 -58594 -226953
35196 -226953 -217904 -33260 106179 83134 -6900 -76108 -152314 -240850 -282972 -284896 -300584
35185 -300584 -266431 -58589 249625 401959 293238 90127 -42004 -118173 -163547 -106443
35175 -106443 23411 15948 -215024 -431381 -376578 -133107 35345 70675 120045 240904
35165 240904 344764 391422 423970 434726 388276 347343 382193 391590 232320 6825 -22302
35154 -22302 174992 334095 279129 126794 24988 -67121 -205999 -291080 -235571 -134732
35144 -134732 -92002 -38823 84643 121580 -100660 -464320 -687364 -689322 -605834 -492863 -274333
35133 -274333 8147 147563 55389 -94207 -99040 24889 106253 17073 -245597 -569936
35123 -569936 -775800 -753430 -589933 -457331 -371031 -204572 38703 159294 47827 -134150
35113 -134150 -174397 -68873 57649 150587 204897 169887 36616 -73067 -60963 -8169 -18901
35102 -18901 -13606 115873 228934 82508 -244820 -349534 -20092 457660 651635 487324
35092 487324 243896 145145 128406 12387 -233857 -442373 -429403 -192578 89105 250424
35082 250424 293692 315230 337307 298817 182038 46176 -60179 -126646 -132584 -78551 -54653
35071 -54653 -143563 -248403 -174437 76592 259395 211923 69168 33624 80687 58491 -24849
35060 -24849 -14999 119486 215935 142046 -38974 -164132 -141608 -4402 130669 144686 26738
35049 26738 -91554 -78498 23628 46698 -74818 -213621 -222058 -116948 -30461 -19808 -1178
35038 -1178 113081 258446 257662 36665 -247831 -365429 -276607 -144571 -80034 -11490 123981
35027 123981 205971 94685 -119687 -211723 -137177 -78040 -155847 -265948 -254318 -122995 19423
35016 19423 107532 134243 94912 4709 -73366 -86530 -49000 -592 48873 97524 125287 132791
35004 132791 158083 211848 244293 219564 171478 137526 93620 17557 -29973 37738 222062
34993 222062 445702 636313 732375 646584 338691 -60491 -304151 -270514 -88938 33682
34983 33682 60000 112512 246055 351471 332561 273098 312216 402867 345970 87257 -169934
34972 -169934 -229087 -146407 -87923 -57716 44014 158609 103046 -111995 -234328 -139017 -37388
34961 -37388 -155442 -365072 -356077 -97130 111133 55328 -122746 -157159 -10316 127346
34951 127346 120607 45048 46176 129142 162555 85742 30534 158538 405470 502545 295865
34940 295865 -48005 -231782 -159269 10090 97073 92098 102866 184023 258092 211764 74829
34929 74829 51157 277058 574977 613734 356509 150589 247125 432004 350085 38890
34919 38890 -150503 -83665 32384 54969 97089 220446 252578 86292 -88930 -65492 67187
34908 67187 107357 75465 111859 156002 6716 -329007 -593902 -606299 -437905 -250199 -126270
34897 -126270 -84296 -93339 -47914 120134 280765 221767 -31846 -187709 -59241 181751
34887 181751 239868 71639 -99914 -77860 119837 333894 431197 399641 329902 309877 335006
34876 335006 349069 349663 373367 383346 289246 114501 22021 99063 219570 212688 81068 -51485
34864 -51485 -130518 -183180 -194196 -113230 19521 77358 -1659 -151656 -277853 -344393 -360497
34853 -360497 -355495 -377093 -448027 -520454 -535380 -515406 -516075 -493696 -333307 -41040 193668
34842 193668 196952 14176 -142895 -116179 67036 238522 229414 11629 -255700 -348745 -182369
34831 -182369 122241 369323 440416 324606 94895 -103997 -137357 -28099 41155 -49195
34821 -49195 -196684 -237382 -200199 -255926 -429010 -525950 -408106 -202800 -137935 -241812 -321735
34810 -321735 -219021 10086 177761 161412 -4039 -184180 -264587 -230086 -147528 -76423
34800 -76423 -6096 112403 290442 479136 611042 641291 558095 385536 181689 10957
34790 10957 -92636 -131197 -127240 -123547 -177851 -306947 -428462 -408472 -201459 79130 253545
34779 253545 224623 33216 -188823 -298117 -228697 -57335 55733 48497 39888 156462 323248
34768 323248 352616 232839 169008 279004 404545 348485 179232 125382 232214 320985
34758 320985 284902 220769 208234 152416 -24967 -182836 -122947 118673 316456 367031 387252
34747 387252 479803 559675 490884 284244 63075 -97318 -198875 -236771 -193974 -110028 -53835
34736 -53835 -7963 127771 369278 565345 566417 429537 348380 384769 388666 232576 17635
34725 17635 -55758 40818 148748 161985 146658 186386 230982 186492 81744 41908 116617
34714 116617 214190 211183 79767 -94294 -189751 -156305 -69124 -60071 -174634 -327863 -422409
34703 -422409 -457378 -477293 -472092 -402233 -287856 -193979 -143249 -108973 -72873 -23883 66732
34692 66732 185138 225855 115807 -28815 -4193 202967 372989 339302 193204 127482
34682 127482 185539 268843 314755 352006 419492 528292 680065 840269 915038 834007 644405
34671 644405 458457 325573 218477 120103 51693 32142 77879 219918 442937 630430
34661 630430 664764 572864 473509 386578 222203 -13479 -146179 -56507 133053 212444 153510
34650 153510 92221 85492 50398 -29706 2894 279456 685214 958948 978415 844145 696942
34639 696942 570624 453585 385092 410966 503917 603756 694739 770359 766184 629013 439054
34628 439054 356480 428508 540897 584270 571944 552779 512565 441333 413676 492231 593735
34617 593735 562954 376709 183772 127176 196553 278401 297312 274864 278800 346149 457110
34606 457110 572301 673736 747613 751998 661225 538406 485275 501774 482755 386121 298990
34595 298990 279965 259478 197228 210967 388112 562381 480792 160745 -116491 -164418 -48189
34584 -48189 122270 323942 479132 418433 134264 -101204 -42589 221784 423996 468545
34574 468545 464293 500184 579593 717877 905073 996424 845402 564043 457908 647744
34564 647744 925096 1054836 1055937 1073889 1122725 1114723 1060718 1065995 1144332 1184261 1120983 1026212
34552 1026212 990711 1009896 1029133 1021943 970554 843931 669451 567704 618977 722312 692236
34541 692236 499730 314137 275870 329868 348736 332681 385347 534780 682334 723500 640598
34530 640598 478511 300852 173206 126190 129467 148136 203342 312980 405907 396486 336469
34519 336469 378646 565531 754757 789465 655677 441817 239496 127711 158055 286784
34509 286784 383338 357459 233813 92998 15119 76390 279824 470965 466059 307914 239683
34498 239683 360072 478231 413295 258617 199182 228633 233673 224824 268535 286379 151088
34487 151088 -65061 -147491 -23219 185294 349175 404603 298246 64145 -96386 -30787
34477 -30787 110733 70877 -105521 -128998 79496 290270 352262 364816 384766 284096 42222
34466 42222 -113593 -45374 68621 37175 -48152 -28844 36713 46874 106626 321460 503798
34455 503798 395674 90547 -63606 62873 268241 349641 301831 201009 118389 144559
34445 144559 289824 369186 194671 -126136 -295140 -221387 -90354 -30544 40544 182263
34435 182263 278622 223145 72945 -82962 -255435 -460829 -628659 -692302 -663465 -556829
34425 -556829 -357159 -112693 63343 139442 198118 285255 359277 421188 535335 670034
34415 670034 688730 572089 475111 473771 436728 269438 107462 108393 203663 238536 235062 314908
34403 314908 444697 466282 349690 239200 254971 387353 569529 722473 747627 609635
34393 609635 421224 329282 329376 308574 250237 257122 364495 466092 464004 389465 336874 357595
34381 357595 444123 545332 579901 509407 414075 417335 510893 532517 361037 78808 -106826
34370 -106826 -78315 85624 205676 186359 96773 56195 61593 -3921 -178402 -329543 -316445
34359 -316445 -163087 9780 146851 244683 249515 120801 -29014 -17816 162439 321456
34349 321456 325187 245867 202077 172632 67975 -90287 -171895 -100300 67706 227781 334454
34338 334454 397282 407484 326975 174753 71335 114055 220902 209781 56699 -59939
34328 -59939 -36867 -7269 -93289 -157715 -16755 214168 261447 133968 117582 301629 428455
34317 428455 323245 168570 166077 199245 91521 -22610 84727 277689 187601 -210048
34307 -210048 -497554 -383191 -82210 18690 -139950 -310889 -312827 -186041 -48990 22360
34297 22360 -7381 -108661 -151858 -16170 236100 384369 286970 28509 -197804 -283848
34287 -283848 -241585 -125161 -5643 22958 -75446 -191695 -173392 -44389 -13039 -194491
34277 -194491 -424629 -455958 -265266 -39381 91141 147795 154672 74348 -70001 -173626
34267 -173626 -217477 -304838 -449601 -486813 -314546 -78094 40310 82730 177085 254250 151420
34256 151420 -58165 -120171 -7030 9942 -204251 -401904 -321048 -92492 -32748 -154888
34246 -154888 -169932 41586 234220 160320 -83509 -222143 -179651 -115190 -143372 -204929 -235707
34235 -235707 -304463 -491998 -723403 -824976 -718420 -485769 -264598 -140805 -114472 -96721
34225 -96721 34488 287820 485785 442770 211219 27735 -2397 -24404 -184663 -408581
34215 -408581 -523717 -478512 -322324 -88367 151999 216372 -19159 -414327 -690353 -735853
34205 -735853 -644212 -497788 -302999 -120056 -50427 -69394 -55651 -14564 -78736 -249195 -352968
34194 -352968 -333187 -357077 -513665 -618145 -488079 -237397 -99699 -100646 -115195 -134382 -237977
34183 -237977 -361545 -323818 -85142 202828 403125 488671 446676 266864 47365 -39553
34173 -39553 73267 302031 534895 685506 656653 409685 75794 -145161 -204805 -197590
34163 -197590 -159445 -49971 71430 60631 -71620 -124354 17253 233834 369542 418451
$$ [...]
##END NTUPLES=NMR SPECTRUM
##END=
