##TITLE=31Pdec_5E2003-05
 CDCl3, 64 sc
 21.3.2023
##JCAMPDX= 6.0         $$ Bruker NMR JCAMP-DX V2.0
##DATA TYPE= NMR SPECTRUM
##DATA CLASS= NTUPLES
##ORIGIN= UXNMR, Bruker Analytische Messtechnik GmbH
##OWNER= root
$$ XWIN-NMR		Version 3.5
$$ Tue Mar 21 14:18:31 2023 Russian Standard Time (UT+4h)  she@DPX200
##.OBSERVE FREQUENCY= 81.013821
##.OBSERVE NUCLEUS= ^31P
##.ACQUISITION MODE= SIMULTANEOUS
##.ACQUISITION SCHEME= undefined
##.AVERAGES= 64
##.DIGITISER RES= 16
##SPECTROMETER/DATA SYSTEM= spect
##.PULSE SEQUENCE= zgpg30
##.SOLVENT NAME= DMSO
##.SHIFT REFERENCE= (INTERNAL, DMSO, 0, 248.564)
##AUDIT TRAIL= $$ (NUMBER, WHEN, WHO, WHERE, WHAT)
$$ ##TITLE= Audit trail, XWIN-NMR		Version 3.5
$$ ##JCAMPDX= 5.01
$$ ##ORIGIN= Bruker BioSpin GmbH
$$ ##OWNER= she
$$ F:/spectra/data/she/nmr/P31/1/pdata/1/auditp.txt
$$ ##AUDIT TRAIL=  $$ (NUMBER, WHEN, WHO, WHERE, WHAT)
(   1,<2023-03-21 14:17:13.01 +0400>,<she>,<DPX200>,
      <continue with go, POWCHK disabled, PULCHK disabled
       configuration hash MD5:
       00 E9 B6 7A A2 85 ED C7 34 08 36 98 17 FE 4E 26
       data hash MD5: 32K
       1C F6 D3 78 8F 24 B8 29 65 F2 81 E2 E9 64 52 E6>)
(   2,<2023-03-21 14:17:15.29 +0400>,<she>,<DPX200>,
      <Start of raw data processing
       efp BC_mod = 2 LB = 1 FT_mod = 6 PKNL = 1 PHC0 = -10636.28 PHC1 = -572.9341 SI = 64K 
       data hash MD5: 64K
       0C 6B 00 0D 1D 01 D5 A1 C0 02 D8 67 D9 DB A0 CB>)
(   3,<2023-03-21 14:17:54.35 +0400>,<she>,<DPX200>,
      <pk PHC0 = 116.6195 PHC1 = -362.8 
       data hash MD5: 64K
       6C 5A E6 E7 A2 61 D9 33 11 9E 8F 0E 12 1A 1D A5>)
(   4,<2023-03-21 14:17:57.50 +0400>,<she>,<DPX200>,
      <abs ABSG = 5 
       data hash MD5: 64K
       41 39 97 9F 3A 62 45 7B D9 F3 5E 60 A0 C6 11 83>)
$$ ##END=
$$ 
$$ hash MD5
$$ 45 48 D5 83 84 01 01 19 78 14 4A 3F 0F 78 D3 E3
##$RELAX= 
##$RELAX= 
##$RELAX= 
##$RELAX= 
##$RELAX= 
##$RELAX= 
##$RELAX= 
##$RELAX= 
##$RELAX= 
$$ Bruker specific parameters
$$ --------------------------
##$DU= <F:/spectra>
##$EXPNO= 1
##$NAME= <P31>
##$PROCNO= 1
##$TYPE= <nmr>
##$USER= <she>
##$AMP= (0..31)
100 100 100 100 100 100 100 100 100 100 100 100 100 100 100 100 100 100 
100 100 100 100 100 100 100 100 100 100 100 100 100 100 
##$AQSEQ= 0
##$AQ_mod= 1
##$AUNM= <au_zg>
##$AUTOPOS= <>
##$BF1= 81.014009
##$BF2= 200.13
##$BF3= 200.13
##$BF4= 200.13
##$BF5= 200.13
##$BF6= 200.13
##$BF7= 200.13
##$BF8= 200.13
##$BYTORDA= 1
##$CFDGTYP= 0
##$CFRGTYP= 5
##$CHEMSTR= <none>
##$CNST= (0..31)
1 1 145 1 1 1 1 1 1 1 1 1 1 1 1 1 1 1 1 1 1 1 1 1 1 1 1 1 1 1 1 1 
##$CPDPRG= <waltz16>
##$CPDPRG1= <>
##$CPDPRG2= <waltz16>
##$CPDPRG3= <>
##$CPDPRG4= <mlev>
##$CPDPRG5= <mlev>
##$CPDPRG6= <mlev>
##$CPDPRG7= <mlev>
##$CPDPRG8= <mlev>
##$CPDPRGB= <>
##$CPDPRGT= <>
##$D= (0..31)
0 1 0 0 0 0 0 0 0 0 0 0.03 2e-05 3e-06 0 0 0 0 0 0 0 0 0 0 0 0 0 0 0 0 
0 0 
##$DATE= 1679393729
##$DBL= (0..7)
120 120 120 11 120 120 24 19 
##$DBP= (0..7)
150 150 150 150 150 150 150 150 
##$DBP07= 0
##$DBPNAM0= <>
##$DBPNAM1= <>
$$ [...]
##$SUBNAM3= <"">
##$SUBNAM4= <"">
##$SUBNAM5= <"">
##$SUBNAM6= <"">
##$SUBNAM7= <"">
##$SUBNAM8= <"">
##$SUBNAM9= <"">
##$SW= 501.771253377433
##$SWIBOX= (0..15)
0 1 3 0 0 0 0 0 0 0 0 0 0 0 0 0 
##$SW_h= 40650.406504065
##$TD= 32768
##$TD0= 1
##$TE= 0
##$TE2= 300
##$TE3= 300
##$TEG= 300
##$TL= (0..7)
0 120 53 12 22 120 120 120 
##$TP= (0..7)
150 150 150 150 150 150 150 150 
##$TP07= 0
##$TPNAME0= <>
##$TPNAME1= <>
##$TPNAME2= <>
##$TPNAME3= <>
##$TPNAME4= <>
##$TPNAME5= <>
##$TPNAME6= <>
##$TPNAME7= <>
##$TPOAL= (0..7)
0.5 0.5 0.5 0.5 0.5 0.5 0.5 0.5 
##$TPOFFS= (0..7)
0 0 0 0 0 0 0 0 
##$TUNHIN= 0
##$TUNHOUT= 0
##$TUNXOUT= 0
##$USERA1= <user>
##$USERA2= <user>
##$USERA3= <user>
##$USERA4= <user>
##$USERA5= <user>
##$V9= 5
##$VALIST= <valist>
##$VCLIST= <CCCCCCCCCCCCCCC>
##$VD= 0
##$VDLIST= <DDDDDDDDDDDDDDD>
##$VPLIST= <PPPPPPPPPPPPPPP>
##$VTLIST= <TTTTTTTTTTTTTTT>
##$WBST= 1024
##$WBSW= 4
##$XGAIN= (0..3)
0 0 0 0 
##$XL= 0
##$YL= 0
##$YMAX_a= 172
##$YMIN_a= -256
##$ZGOPTNS= <>
##$ZL1= 120
##$ZL2= 120
##$ZL3= 120
##$ZL4= 120
##$ABSF1= 248.5645
##$ABSF2= -253.2056
##$ABSG= 5
##$ABSL= 3
##$ALPHA= 0
##$AQORDER= 0
##$ASSFAC= 0
##$ASSFACI= 0
##$ASSFACX= 0
##$ASSWID= 0
##$AUNMP= <proc_1d>
##$AZFE= 0.1
##$AZFW= 0.5
##$BCFW= 0
##$BC_mod= 2
##$BYTORDP= 0
##$COROFFS= 0
##$CY= -3
##$DATMOD= 1
##$DC= 0
##$DFILT= <>
##$DTYPP= 0
##$F1P= 0
##$F2P= 0
##$FCOR= 1
##$FTSIZE= 65536
##$FT_mod= 6
##$GAMMA= 0
##$GB= 0
##$INTBC= 1
##$INTSCL= 6.047779e-11
##$ISEN= 30
##$LB= 1
##$LEV0= 0
##$LPBIN= 0
##$MAXI= 10000
##$MC2= 0
##$MEAN= 0
##$ME_mod= 0
##$MI= 50
##$NCOEF= 0
##$NC_proc= -14
##$NLEV= 6
##$NOISF1= 182.463
##$NOISF2= 159.3651
##$NSP= 0
##$NTH_PI= 0
##$NZP= 0
##$OFFSET= 248.5645
##$PC= 4
##$PHC0= -10519.66
##$PHC1= -935.7341
##$PH_mod= 1
##$PKNL= yes
##$PPARMOD= 0
##$PSCAL= 0
##$PSIGN= 0
##$REVERSE= no
##$SF= 81.0140089999694
##$SI= 65536
##$SIGF1= 159.3651
##$SIGF2= -187.1042
##$SINO= 113.3802
##$SIOLD= 16384
##$SREGLST= <1H.CDCl3>
##$SSB= 0
##$STSI= 65536
##$STSR= 0
##$SW_p= 40650.406504065
##$SYMM= 0
##$S_DEV= 0
##$TDeff= 32768
##$TDoff= 0
##$TI= <>
##$TILT= no
##$TM1= 0
##$TM2= 0
##$TOPLEV= 0
##$USERP1= <user>
##$USERP2= <user>
##$USERP3= <user>
##$USERP4= <user>
##$USERP5= <user>
##$WDW= 1
##$XDIM= 65536
##$YMAX_p= 524558941
##$YMIN_p= -174493310
$$ End of Bruker specific parameters
$$ ---------------------------------
##NTUPLES= NMR SPECTRUM
##VAR_NAME=  FREQUENCY,     SPECTRUM/REAL,   SPECTRUM/IMAG
##SYMBOL=    X,             R,               I
##VAR_TYPE=  INDEPENDENT,   DEPENDENT,       DEPENDENT
##VAR_FORM=  AFFN,          ASDF,            ASDF
##VAR_DIM=   65536,         65536,           65536
##UNITS=     HZ,            ARBITRARY UNITS, ARBITRARY UNITS
##FACTOR=    0.620285442955139, 1,           1
##FIRST=     20137.2065510682, 0,            0
##LAST=      -20513.1999529968, 0,           0
##MIN=       -20513.1999529968, -174493310,  0
##MAX=       20137.2065510682, 524558941,    0
$$ Real data points
##PAGE= N=1
##DATA TABLE= (X++(R..R)), XYDATA
$$ [...]
$$ plain form
43327 -6241172 8166197 36065167 53146664 46871691 31392379 19361380 7941496
43320 7941496 1330119 11673601 27272377 19846225 -4461226 -6671834 17491691 24371389
43312 24371389 -696171 -11815159 17414532 42057295 21965806 -6486269 5369071
43305 5369071 32150380 22282267 -9062963 -13966092 -7479218 -40684296 -93837142 -90824643
43297 -90824643 -24903355 20681489 -1044410 -36437386 -26807076 5416987 12088920
43290 12088920 598567 5226266 20141804 16112956 -2883257 -8893131 1367862
43283 1367862 9166093 13008990 27829493 51560754 64261713 58451248 46493167 39701916
43275 39701916 37692198 34709832 23326507 -1164415 -28776238 -37429147 -19157937
$$ packed form
43327f241172J4407369K7898970J7081497o274973j5479312j2030999j1419884
43320G941496o611377J0343482J5598776p426152k4307451k210608K4163525O879698
43312B4371389k5067560j1118988K9229691K4642763k0091489k8452075J1855340
43305E369071K6781309r868113l1345230m903129O486874l3205078n3152846L012499
43297i0824643O5921288M5584844k1725899l5392976R630310L2224063O671933
43290A2088920j1490353M627699J4915538m028848j8996213o009874J0260993
43283A367862P798231L842897J4820503K3731261J2700959n810465j1958081o791251
43275C9701916k009718k982366j1383325k4490922k7611823q652909J8271210
$$ plain form
43268 -19157937 7202466 19927020 17658798 8382332 -7711787 -29205889 -42687147
43261 -42687147 -38173673 -23391596 -8399227 9728164 31285347 39294111 21358811
43254 21358811 -5630871 -13950748 -296674 15946431 21623217 18503785 10143461 -1532658
43246 -1532658 -11149248 -16480240 -24390341 -37434726 -44015741 -36217714 -25871636 -25806777
43238 -25806777 -27458200 -17535734 -5105454 -7474109 -17429188 -11143741 14636185 37792401
43230 37792401 41615878 28649342 7373884 -12020396 -13089617 9645465 31747114
43223 31747114 24573727 -2055334 -12732139 -492943 7267612 -303175 -1272700 12966879
43215 12966879 17430787 713345 -7431609 13821512 33896702 17601456 -13261928
$$ packed form
43268a9157937K6360403J2724554k268222r276466j6094119k1494102j3481258
43261d2687147M513474J4782077J4992369J8127391K1557183Q008764j7935300
43254B1358811k6989682q319877J3654074J6243105N676786l119432q360324j1676119
43246a532658r616590n330992p910101j3044385o581015P798027J0346078O4859
43238b5806777j651423R922466J2430280k368655r955079O285447K5779926K3156216
43230C7792401L823477j2966536k1275458j9394280j069221K2735082K2101649
43223C1747114p173387k6629061j0676805J2239196P760555p570787r69525J4239579
43215A2966879M463908j6717442q144954K1253121K0075190j6295246l0863384
$$ plain form
43208 -13261928 -11816796 16537428 19260630 -22437602 -64467234 -61317891 -19137743
43201 -19137743 25783887 49924972 49091297 30478857 15839280 28339784 57594236
43194 57594236 60202828 16437365 -34477210 -41797590 -8894608 19743744 25472209
43187 25472209 31103993 48948475 54048829 27526845 -4505814 -4077041 23759552 39279810
43179 39279810 24157583 -464683 -12642592 -16808949 -22281548 -21347683 -8506000 -2090024
43171 -2090024 -20419613 -46161185 -42755143 -5712051 29433310 36269641 28892077 31315266
43163 31315266 38849045 31757104 12531898 3345181 10163747 12953293 -4482873 -32492639
43155 -32492639 -50263184 -50689756 -43767641 -42468095 -49834842 -55396027 -43562633 -11761816
$$ packed form
43208a3261928J445132K8354224K723202m1698232m2029632L149343M2180148
43201a9137743M4921630K4141085q33675j8612440j4639577J2500504K9254452
43194E7594236K608592m3765463n0914575p320380L2902982K8638352N728465
43187B5472209N631784J7844482N100354k6521984l2032659M28773K7836593J5520258
43179C9279810j5122227k4622266j2177909m166357n472599R33865J2841683O415976
43171b090024j8329589k5741572L406042L7043092L5145361O836331p377564K423189
43163C1315266P533779p091941j9225206r186717O818566K789546j7436166k8009766
43155c2492639j7770545m26572O922115J299546p366747n561185J1833394L1800817
$$ plain form
43147 -11761816 19803654 24180304 -4564352 -44057860 -62942745 -43658054 6746607
43140 6746607 57580767 72519384 43050962 2640421 -8760209 6817360 12337402
43133 12337402 -7836793 -25174484 -11942133 16629124 26369535 12375758 -2009916
43126 -2009916 -4235326 -5054288 -15120455 -31259735 -47017557 -59521466 -65063489 -62238299
43118 -62238299 -58045135 -57127136 -49798633 -27589618 -3930585 3283165 4260511 22850118
43110 22850118 49405824 43697001 -4034105 -50074959 -56115262 -39785095 -37937719
43103 -37937719 -46898374 -37795721 -13968121 -7660707 -21856928 -19520031 17784190 56863681
43095 56863681 58213243 27963723 1672604 -5776492 -9352926 -21464281 -33567164
$$ packed form
43147a1761816L1565470M376650k8744656l9493508j8884885J9284691N0404661
43140F746607N0834160J4938617k9468422m0410541j1400630J5577569N520042
43133A2337402k0174195j7337691J3232351K8571257R740411j3993777j4385674
43126b009916k225410q18962j0066167j6139280j5757822j2503909n542023K825190
43118f2238299M193164R17999P328503K2209015K3659033P213750R77346J8589607
43110B2850118K6555706n708823m7731106m6040854o040303J6330167J847376
43103c7937719q960655R102653K3827600O307414j4196221K336897L7304221L9079491
43095E6863681J349562l0249520k6291119p449096l576434j2111355j2102883
$$ plain form
43088 -33567164 -32080767 -18106014 -5500930 -4267973 -9312534 -6856975 7268492 20692624
43080 20692624 22144181 19887009 29690227 47665000 52333063 35816265 15711468 10628971
43072 10628971 19800374 32598592 41759791 41383102 30743994 26814189 49505495 83481558
43064 83481558 82775726 33520822 -15990806 -17631804 8273015 5752724 -31906792 -55918864
43056 -55918864 -37052014 -997855 18695515 21371647 18348681 8123073 -7199679
43049 -7199679 -10978344 71574 2043667 -19668570 -42214813 -37017406 -10377802 11422037
43041 11422037 19978155 22275810 15936204 -4332787 -25273228 -28121712 -18148054 -16114727
43033 -16114727 -23830229 -22458699 -4049200 17688298 28907584 28653375 20490299 9545123
$$ packed form
43088c3567164J486397J3974753J2605084J232957n044561K455559J4125467J3424132
43080B0692624J451557k257172R803218J7974773M668063j6516798k0104797n082497
43072A0628971R171403J2798218R161199l76689j0639108l929805K2691306L3976063
43064H3481558p05832m9254904m9511628j640998K5904819k520291l7659516k4012072
43056e5918864J8866850L6054159J9693370K676132l022966j0225608j5322752
43049g199679l778665J1049918J972093k1712237k2546243N197407K6639604K1799839
43041A1422037Q556118K297655o339606k0268991k0940441k848484R973658K033327
43033a6114727p715502J371530J8409499K1737498J1219286k54209q163076j0945176
$$ plain form
43025 9545123 7278651 20735126 37349911 38163516 24397003 11819034 1864393 -17622930
43017 -17622930 -42541461 -50402737 -34564966 -15242295 -6340340 3785303 23298620
43010 23298620 31619929 6226664 -38278561 -61026571 -41167224 3116785 39596685
43003 39596685 52301276 47362179 40294966 40764283 45042135 42136691 27999668 10596435
42995 10596435 56895 -970208 4523624 13002488 20327577 22052029 17878989 13053299
42987 13053299 13337606 19829677 26846380 23104383 1465394 -27044235 -38380695 -25486132
42979 -25486132 -13288800 -27460293 -56624646 -66928328 -48533947 -21945361 -301181
42972 -301181 23745918 49001759 57406840 48223826 48127506 66321136 69839898 32787064
$$ packed form
43025I545123k266472J3456475J6614785Q13605j3766513j2577969r954641j9487323
43017a7622930k4918531p861276J5837771J9322671Q901955J0125643J9513317
43010B3298620Q321309k5393265m4505225k2748010J9859347M4284009L6479900
43003C9596685J2704591m939097p067213M69317M277852k905444j4137023j7403233
42995A0596435j0539540j027103N493832Q478864P325089J724452m173040m825690
42987A3053299K84307O492071P016703l741997k1638989k8509629j1336460J2894563
42979b5486132J2197332j4171493k9164353j0303682J8394381K6588586K1644180
42972c01181K4047099K5255841Q405081r183014r6320J8193630L518762l7052834
$$ plain form
42964 32787064 -14689283 -23443181 3806721 18703075 -150890 -20478373 -8850775
42957 -8850775 24293408 47085928 48328861 38920425 28138601 17270863 8451048 4767059
42949 4767059 4638842 5092589 7413095 13393071 20238017 24710260 27387839 26600737 13513422
42940 13513422 -16810303 -50102486 -59380652 -33634243 4271637 16827761 -9179192
42933 -9179192 -48521101 -65303682 -49655342 -22076286 -6817259 -9239058 -17139829
42926 -17139829 -15869285 -2153889 11023100 5651612 -18810125 -39968178 -39992243 -31508987
42918 -31508987 -39509431 -61854017 -69195608 -45683445 -8328859 18711128 27994777
42911 27994777 21647150 4567584 -5682474 12197116 49125891 63797972 32987041
$$ packed form
42964C2787064m7476347q753898K7249902J4896354j8853965k0327483J1627598
42957h850775L3144183K2792520J242933r408436j0781824j0867738q819815l683989
42949D767059j28217M53747K320506N979976O844946M472243K677579p87102j3087315
42940A3513422l0323725l3292183r278166K5746409L7905880J2556124k6006953
42933i179192l9341909j6782581J5648340K7579056J5259027k421799p900771
42926a7139829J270544J3715396J3176989n371488k4461737k1158053k4065Q483256
42918c1508987q000444k2344586p341591K3512163L7354586K7039987R283649
42911B7994777o347627j7079566j0250058J7879590L6928775J4672081l0810931
$$ plain form
42904 32987041 -18048585 -53968477 -72898568 -86373270 -82056438 -44249731 3855046
42897 3855046 19661755 -1219052 -23466228 -27168062 -27989415 -38332153 -44542958 -34600736
42889 -34600736 -18446953 -6511355 6485530 21205264 20498664 -4721762 -33512014
42882 -33512014 -37858869 -17207884 5053667 11613026 5209818 -1279677 1479033 11741547
42874 11741547 17115753 7120690 -12189705 -23280601 -18741525 -9266660 -8104460 -17043054
42866 -17043054 -30270781 -42090342 -46908938 -40143104 -23672127 -5729232 5293834
42859 5293834 3623460 -11661002 -29387459 -28745262 -1247197 35264592 56320678 56698003
42851 56698003 43719976 17972340 -17694728 -41074056 -30642236 2106346 27574669
$$ packed form
42904C2987041n1035626l5919892j8930091j3474702M316832L7806707M8104777
42897C855046J5806709k0880807k2247176l701834q21353j0342738o210805R942222
42889c4600736J6153783J1935598J2996885J4719734p06600k5220426k8790252
42882c3512014m346855K0650985K2261551O559359o403208o489495K758710J0262514
42874A1741547N374206r995063j9310395j1090896M539076R474865J162200q938594
42866a7043054j3227727j1819561m818596O765834J6470977J7942895J1023066
42859E293834j670374j5284462j7726457O42197K7498065L6511789K1056086L77325
42851E6698003j2978027k5747636l5667068k3379328J0431820L2748582K5468323
$$ plain form
42844 27574669 39795760 52168289 57391507 32742371 -10777805 -28631602 -6892152
42837 -6892152 13980991 -163296 -30162473 -42393451 -39571424 -41480538 -44459517 -34974980
42829 -34974980 -20869844 -14561942 -4159505 24106402 51052748 47706197 20881172
42822 20881172 1442197 -2017329 -3936840 -7241047 -4505602 -5020159 -21980264 -38255682
42814 -38255682 -25976412 1645068 2217031 -28074854 -45147686 -28197086 -13611969
42807 -13611969 -33571622 -61895669 -56269263 -25292874 -13185938 -32449928 -50058578
42800 -50058578 -38343885 -8529617 11910159 13310794 5963719 402775 -5144552 -19407119
42792 -19407119 -43202130 -63543482 -67920178 -60886626 -54952937 -47362224 -24751664 5556818
$$ packed form
42844B7574669J2221091J2372529N223218k4649136m3520176j7853797K1739450
42837f892152K0873143j4144287k9999177j2230978K822027j909114k978979R484537
42829c4974980J4105136O307902J0402437K8265907K6946346l346551k6825025
42822B0881172j9438975l459526j919511l304207K735445n14557j6960105j6275418
42814c8255682J2279270K7621480N71963l0291885j7072832J6950600J4585117
42807a3611969j9959653k8324047N626406L0976389J2106936j9263990j7608650
42800e0058578J1714693K9814268K0439776J400635p347075n560944n547327j4262567
42792a9407119k3795011k0341352m376696P033552N933689P590713K2610560L0308482
$$ plain form
42784 5556818 12873742 -13702735 -40098234 -27637018 14961691 45403909 45956463 39330605
42776 39330605 45919507 54491469 47663346 33578258 31417040 37000570 26016731 -7888417
42768 -7888417 -37471354 -34204963 -5170030 16194516 12523275 -488590 -3940578 -5515163
42760 -5515163 -23560041 -51656087 -62218401 -46066136 -25584807 -20901220 -25075828
42753 -25075828 -26751117 -35345823 -59788260 -78170367 -60704180 -18519180 3569282
42746 3569282 -11449158 -29337815 -15924336 15924269 31927130 27162704 23287363
42739 23287363 27597242 25431765 11053813 -2076563 -6688648 -13295398 -27230821 -34366430
42731 -34366430 -22441401 -949930 14096869 22377909 31043294 35293724 26027415 11314567
$$ packed form
42784E556818P316924k6576477k6395499J2461216M2598709L0442218N52554o625858
42776C9330605O588902Q571962o828123j4085088k161218N583530j0983839l3905148
42768g888417k9582937L266391K9034933K1364546l671241j3011865l451988j574585
42760e515163j8044878k8096046j0562314J6152265K0481329M683587m174608
42753b5075828j675289q594706k4442437j8382107J7466187M2185000K2088462
42746C569282j5018440j7888657J3413479L1848605J6002861m764426l875341
42739B3287363M309879k165477j4377952j3130376m612085o606750j3935423p135609
42731c4366430J1925029K1491471J5046799Q281040Q665385M250430r266309j4712848
$$ plain form
42723 11314567 10094994 23379334 29657220 14985981 -6537010 -11416251 3710414
42716 3710414 21062768 24772809 15748117 5838245 4807003 12782544 20038732 14226063
42708 14226063 -7388041 -32143388 -42056295 -30312185 -5073812 21703463 43300453
42701 43300453 55655438 54858021 44078574 36462939 40150855 42933493 25408292 -8193295
42693 -8193295 -27289502 -11912474 20473574 38562801 37239396 36013902 43917980 48508354
42685 48508354 40941878 29586364 21588535 11218390 -2489085 -5356436 9064139
42678 9064139 21581544 11440076 -11863978 -20699210 -7346294 9650199 14974686
42671 14974686 13483237 15571919 21551421 25654359 24636538 18284766 9405769 5086524
$$ packed form
42723A1314567j219573J3284340O277886j4671239k1522991m879241J5126665
42716C710414J7352354L710041r024692r909872j031242P975541P256188n812669
42708A4226063k1614104k4755347r912907J1744110K5238373K6777275K1596990
42701D3300453J2354985p97417j0779447p615635L687916K782638j7525201l3601587
42693h193295j9096207J5377028L2386048J8089227j323405j225494P904078M590374
42685D8508354p566476j1355514p997829j0370145j3707475k867351J4420575
42678I064139J2517405j0141468k3304054q835232J3352916J6996493N324487
42671A4974686j491449K088682N979502M102938j017821o351772q878997m319245
$$ plain form
42663 5086524 10065315 17795031 16068727 2900374 -10489743 -14172263 -10562336 -8346611
42655 -8346611 -9316857 -4657720 13932514 38801973 47944459 30613257 6348751 3074587
42647 3074587 17986225 21269606 1577522 -18382951 -21089337 -19141559 -23158068 -16655545
42639 -16655545 7965091 17437769 -18300431 -70313557 -83847077 -54919095 -26829761
42632 -26829761 -17669756 -3514728 23970096 37269198 24128264 9881182 8900730
42625 8900730 -1110164 -31587577 -51611985 -34440513 -726244 16093919 16734633
42618 16734633 16859177 10990937 -8777073 -23913645 -17548562 -10492398 -29970260 -59308829
42610 -59308829 -59519274 -29250981 -2256075 7958744 19624688 39470144 47553935
$$ packed form
42663E086524M978791P729716j726304j3168353j3390117l682520L609927K215725
42655h346611r70246M659137J8590234K4869459R142486j7331202k4264506l274164
42647C074587J4911638L283381j9692084j9960473k706386J947778m016509O502523
42639a6655545K4620636R472678l5738200n2013126j3533520K8927982K8089334
42632b6829761R160005J4155028K7484824J3299102j3140934j4247082r80452
42625H900730j0010894l0477413k0024408J7171472L3714269J6820163O40714
42618A6734633J24544n868240j9768010j5136572O365083P056164j9477862k9338569
42610e9308829k10445L0268293K6994906J0214819J1665944J9845456Q083791
$$ plain form
42603 47553935 32237359 7540869 -13756347 -37052602 -65752752 -86780932 -87139351
42596 -87139351 -68760817 -40130390 -8000179 17849205 26442877 18127894 4961674
42589 4961674 -3742938 -7646036 -9254323 -11907195 -20245013 -31512658 -31632050 -12547214
42581 -12547214 12453504 24101630 20592476 11268470 -2996446 -23311826 -35269195
42574 -35269195 -22851698 2296319 9735714 -9152621 -30427287 -31384794 -16240025
42567 -16240025 -3083347 -2327851 -14549140 -34831172 -50612304 -45451499 -14463080
42560 -14463080 26220167 49252108 37616463 1407959 -26755393 -22037240 5275582
42553 5275582 23915460 22497966 17209295 17087551 9866839 -7001253 -12832251 -567204
$$ packed form
42603D7553935j5316576k4696490k1297216k3296255k8700150k1028180l58419
42596h7139351J8378534K8630427L2130211K5849384Q593672q314983j3166220
42589D961674q704612l903098j608287k652872q337818j1267645j19392J9084836
42581a2547214K5000718J1648126l509154r324006j4264916k0315380j1957369
42574c5269195J2417497K5148017P439395j8888335k1274666r57507J5144769
42567a6240025J3156678P55496j2221289k0282032j5781132N160805L0988419
42560a4463080M0683247K3031941j1635645l6208504k8163352M718153K7312822
42553E275582J8639878j417494n288671j21744p220712j6868092n830998J2265047
$$ plain form
42545 -567204 4363132 -12011471 -21080937 2091553 31813438 32186425 17121643 21653373
42537 21653373 36607976 28034144 5655461 9759121 36529893 40906845 15388834
42530 15388834 320888 6615720 -4205252 -43705809 -66290224 -44215984 -12417987
42523 -12417987 -4276521 -271916 18995178 24239093 -7825947 -38877047 -24620747
42516 -24620747 11533337 18414111 -93881 -2517357 13290243 13190372 -7053234 -19482357
42508 -19482357 -21690757 -38545265 -65880169 -68065833 -38783937 -13611049 -11158613
42501 -11158613 -8569035 9778388 22793614 11612677 -8802007 -18311986 -21298697
42494 -21298697 -27056746 -26911851 -11597609 9424821 23167502 29216626 28655413 18851800
$$ packed form
42545e67204M930336j6374603r069466K3172490K9721885L72987j5064782M531730
42537B1653373J4954603q573832k2378683M103660K6770772M376952k5518011
42530A5388834j5067946O294832j0820972l9500557k2584415K2074240L1797997
42523a2417987Q141466M004605J9267094N243915l2065040l1051100J4256300
42516b4620747L6154084O880774j8507992k423476J5807600r9871k0243606j2429123
42508a9482357k208400j6854508k7334904k185664K9281896K5172888K452436
42501a1158613K589578J8347423J3015226j1180937k0414684r509979k986711
42494b1298697n758049J44895J5314242K1022430J3742681O049124n61213r803613
$$ plain form
42486 18851800 11288268 28441371 65443438 80870667 49538048 2725592 -12029355
42479 -12029355 5390803 15278136 -446520 -17443213 -9716576 18015414 45395948
42472 45395948 60010204 55648505 27182353 -17307242 -51942081 -57305126 -43710605
42465 -43710605 -35986033 -38474397 -31328700 -3767527 25766383 33097487 20018554 7202691
42457 7202691 2022737 -7389524 -25426812 -37092126 -32096306 -23733389 -28867067 -41292722
42449 -41292722 -42652535 -32122900 -25963666 -30875937 -37792038 -43160803 -56094330 -77515114
42441 -77515114 -89814574 -79030219 -55707614 -41751429 -44101819 -52022207 -54281016
42434 -54281016 -47933388 -33721984 -13762382 6249402 20240828 27216375 28148522 20224815
$$ packed form
42486A8851800p563532J7153103L7002067J5427229l1332619m6812456j4754947
42479a2029355J7420158R887333j5724656j6996693P726637K7731990K7380534
42472D5395948J4614256m361699k8466152m4489595l4634839n363045J3594521
42465d3710605P724572k488364P145697K7561173K9533910P331104j3078933j2815863
42457G202691n179954r412261j8037288j1665314M995820Q362917n133678j2425655
42449d1292722j359813J0529635O159234m912271o916101n368765j2933527k1420784
42441g7515114j2299460J0784355K3322605J3956185k350390p920388k258809
42434e4281016O347628J4211404J9959602K0011784J3991426O975547R32147p923707
$$ plain form
42426 20224815 2481191 -14429362 -15408431 -1455865 6872966 -5835263 -28197128
42419 -28197128 -34666416 -17066415 6490938 14699941 5489265 -7920778 -14586667 -13332713
42411 -13332713 -9485017 -11878692 -28074032 -53198722 -66209212 -47881512 -4171709
42404 -4171709 35982864 47971872 30678168 -1141641 -33779955 -59604726 -73242998
42397 -73242998 -71082873 -54142197 -28603417 -3744935 12134284 17848631 20578537
42390 20578537 25891761 28129992 18887288 4856290 5480173 26922541 48079772 43114975
42382 43114975 14256594 -8220629 -214171 29245740 49647396 44099651 26245666
42375 26245666 20206407 30101691 37985881 29893522 11650555 -4370420 -14163436 -15082660
$$ packed form
42426B0224815j7743624j6910553r79069J3952566Q328831j2708229k2361865
42419b8197128o469288J7600001K3557353Q209003r210676j3410043o665889J253954
42411a3332713L847696k393675j6195340k5124690j3010490J8327700M3709803
42404d171709M0154573J1989008j7293704l1819809l2638314k5824771j3638272
42397g3242998K160125J6940676K5538780K4858482J5879219N714347K729906
42390B0578537N313224K238231r242704j4030998O23883K1442368K1157231m964797
42382D3114975k8858381k2477223Q006458K9459911K0401656n547745j7853985
42375B6245666o039259R895284P884190q092359j8242967j6020975r793016r19224
$$ plain form
42367 -15082660 1022811 31057994 48187382 28370737 -14562851 -42524216 -41199229
42360 -41199229 -31606391 -31777476 -32818376 -22006851 -5415926 6658074 16283645 23816778
42352 23816778 16346921 -9948564 -31667398 -25346077 -2087698 8308722 549457
42345 549457 -3771778 4911691 8400909 -9113580 -34295024 -40013040 -18813196 7704674
42337 7704674 11289899 -12506058 -35723770 -25614610 15339529 47589468 42298922
42330 42298922 18133396 12380407 25965694 24826392 -4299995 -30519990 -24373356
42323 -24373356 -1627309 740333 -22588256 -41408119 -33936318 -11371581 3916153
42316 3916153 5466633 518474 -5052478 -9421109 -10957716 -10962874 -15235457 -26276696
$$ packed form
42367a5082660J6105471L0035183J7129388j9816645m2933588k7961365J324987
42360d1199229R592838j71085j040900J0811525J6590925J2074000R625571P533133
42352B3816778p469857k6295485k1718834O321321K3258379J0396420p759265
42345E49457m321235Q683469L489218j7514489k5181444n718016K1199844K6517870
42337G704674L585225k3795957k3217712J0109160M0954139L2249939n290546
42330D2298922k4165526n752989J3585287j139302k9126387k6219995O146634
42323b4373356K2746047K367642k3328589j8819863P471801K2564737J5287734
42316C916153J550480m948159n570952m368631j536607n158m272583j1041239
$$ plain form
42308 -26276696 -38946788 -48887389 -57522991 -62071515 -51453402 -24717650 -3665912
42301 -3665912 -8504863 -26357688 -26112586 -3753249 12139595 4683311 -8882161 -10934744
42293 -10934744 -12372135 -27853407 -45794876 -48901082 -45698095 -51577534 -52769963 -24067401
42285 -24067401 23563598 48045889 30678869 -4192757 -26745199 -30385392 -19315413
42278 -19315413 2541487 21423056 19226196 -180042 -12531554 -8668537 -4371832
42271 -4371832 -7191454 -1273047 21287866 39463036 31016812 1908601 -26380309 -40944621
42263 -40944621 -37841919 -19143541 -1285924 -4387728 -21144389 -20432115 4756381 20691240
42255 20691240 2859955 -25473625 -29561129 -13350242 -3896447 -4890713 1833855 19251835
$$ packed form
42308b6276696j2670092r940601q635602m548524J0618113K6735752K1051738
42301c665912m838951j7852825K45102K2359337J5892844p456284j3565472k052583
42293a0934744j437391j5481272j7941469l106206L202987n879439j192429K8702562
42285b4067401M7630999K4482291j7367020l4871626k2552442l640193J1069979
42278a9315413K1856900J8881569k196860j9406238j2351512L863017M296705
42271d371832k819622N918407K2560913J8175170q446224k9108211k8288910j4564312
42263d0944621L102702J8698378J7857617l101804j6756661P12274K5188496J5934859
42255B0691240j7831285k8333580m087504J6210887R453795r94266O724568J7417980
$$ plain form
42247 19251835 29505935 21836531 4734169 -6918216 -3437043 13315719 25939584
42240 25939584 17518953 -853148 381461 23342129 35429266 22389073 13351642
42233 13351642 29247968 43794040 29729186 8030741 8120294 11183130 -15202106 -51307951
42225 -51307951 -52408559 -25239831 -15874282 -29300015 -25068750 5216427 20387907
42218 20387907 1853807 -16956609 -12843289 -8553472 -20594986 -23701519 -606911
42211 -606911 18746735 7259688 -7879701 12262854 52608594 67182764 50388873
42204 50388873 38758156 47329438 47641404 16562774 -26230858 -45433063 -35128976
42197 -35128976 -19128841 -14206746 -10480398 5924550 22897702 14382237 -15318982
$$ packed form
42247A9251835J0254100p669404j7102362j1652385L481173J6752762J2623865
42240B5939584q420631j8372101J234609K2960668J2087137j3040193r037431
42233A3351642J5896326J4546072j4064854k1698445Q9553L062836k6385236l6105845
42225e1307951j100608K7168728R365549j3425733M231265L0285177J5171480
42218B0387907j8534100j8810416M113320M289817j2041514l106533K3094608
42211f06911J9353646j1487047j5139389K0142555M0345740J4574170j6793891
42204E0388873j1630717Q571282L11966l1078630m2793632j9202205J0304087
42197c5128976J6000135M922095L726348J6404948J6973152q515465k9701219
$$ plain form
42190 -15318982 -23549057 15080184 63508064 62915859 10587145 -36266690 -35172620 -4197688
42182 -4197688 13902457 3036046 -22600693 -40772270 -34302333 -3389094 24804101
42175 24804101 20012181 -9530790 -23484923 -6224654 11322185 1504906 -17712011
42168 -17712011 -14083975 7693475 14863626 -4407927 -26722304 -26497369 -6442923 7588522
42160 7588522 -3249604 -26303197 -28493750 -21961 24711322 10671873 -23860181
42153 -23860181 -29258889 2688563 26935010 12414939 -19191420 -36143645 -38478785
42146 -38478785 -36035825 -21966268 4075812 17949020 6367036 -6526680 2660074
42139 2660074 17631850 12710340 -2565829 -3307314 7424992 10798702 10047504 19954715
$$ packed form
42190a5318982q230075L8629241M8427880n92205n2328714m6853835J094070L0974932
42182d197688J8100145j0866411k5636739j8171577O469937L0913239K8193195
42175B4804101m791920k9542971j3954133J7260269J7546839r817279j9216917
42168a7712011L628036K1777450P170151j9271553k2314377K24935K0054446J4031445
42160G588522j0838126k3053593k190553K8471789K4733283j4039449l4532054
42153b3860181n398708L1947452K4246447j4520071l1606359j6952225k335140
42146c8478785K442960J4069557K6042080J3873208j1581984j2893716R186754
42139B660074J4971776m921510j5276169p41485J0732306L373710p51198R907211
$$ plain form
42131 19954715 32505527 28418225 11964329 1423026 -3884917 -14510363 -21186666
42124 -21186666 -9082524 8994079 9503090 -1484257 -2231709 -143011 -20446125 -54655600
42116 -54655600 -65038950 -43027346 -20075510 -13175404 -1569713 29122794 57590204
42109 57590204 59651436 40363788 16916712 -4765659 -22681707 -32315680 -38769597
42102 -38769597 -51414588 -59349148 -41784901 -11493157 -11776961 -52810149 -86873862
42095 -86873862 -72561820 -31783262 -11092510 -13179515 -5730383 18259169 31034263
42088 31034263 17946746 -1269896 -5164198 1810341 3081237 -6280078 -17241243 -17675349
42080 -17675349 -2554042 18986059 28559917 18614786 2742383 -3136137 -1449568 -1717708
$$ packed form
42131A9954715J2550812m087302j6453896j0541303n307943j0625446o676303
42124b1186666J2104142J8076603N09011j0987347p47452K088698k0303114l4209475
42116e4655600j0383350K2011604K2951836O900106J1605691L0692507K8467410
42109E7590204K061232j9287648k3447076k1682371j7916048r633973o453917
42102c8769597j2644991p934560J7564247L0291744k83804m1033188l4063713
42095h6873862J4312042M0778558K0690752k087005P449132K3989552J2775094
42088C1034263j3087517j9216642l894302O974539J270896r361315j0961165m34106
42080a7675349J5121307K1540101R573858r945131j5872403n878520J686569k68140
$$ plain form
42072 -1717708 1386101 18583995 40211108 44006881 29822836 22325143 32362013 39493864
42064 39493864 26482308 9899324 15229426 35478581 40069905 20216370 -117378
42057 -117378 -1791893 4669461 2625723 -2002729 6413034 23480142 28740671 15917861
42049 15917861 -45337 -7906450 -14535854 -28196430 -42296352 -45920663 -40303530 -33883474
42041 -33883474 -27646392 -16102786 663111 15111442 21321403 20260868 17815296 20970700
42033 20970700 31860738 42675687 43098005 36417404 38304529 51988053 55670667 28563703
42025 28563703 -16345146 -40603355 -21086126 28524741 76100728 99575045 96322007
42018 96322007 75436816 47031356 16710541 -11418625 -28996060 -28464576 -15847766
$$ packed form
42072a717708L103809J7197894K1627113L795773j4184045p497693J0036870P131851
42064C9493864j3011556j6582984N330102K0249155M591324j9853535k0333748
42057a17378j674515O461354k043738m628452Q415763J7067108N260529j2822810
42049A5917861j5963198p861113o629404j3660576j4099922l624311N617133O420056
42041c3883474O237082J1543606J6765897J4448331O209961j060535k445572L155404
42033B0970700J0890038J0814949M22318o680601J887125J3683524L682614k7106964
42025B8563703m4908849k4258209J9517229M9610867M7575987K3474317l253038
42018I6322007k0885191k8405460l0320815k8129166j7577435N31484J2616810
$$ plain form
42011 -15847766 -7468990 -8248307 -6201855 3287207 5425880 -5852903 -6473970 24811349
42003 24811349 65219738 72676392 46343273 26140816 29963235 31001300 10135026
41996 10135026 -8106523 3505347 29177466 36249955 24749895 18223679 21433526
41989 21433526 21579385 21071697 32742363 45858604 33307343 -3238039 -28816762 -24825951
41981 -24825951 -12172552 -11710456 -11629414 5364296 27794198 34633305 30381693 31651290
41973 31651290 30861184 6412138 -33418468 -50078526 -26469193 8855018 23552206
41966 23552206 23753157 33151317 47705034 41148943 11740674 -6971909 7641078 33293038
41958 33293038 33693949 9723466 -3710395 11564286 33912109 36489691 23223242
$$ packed form
42011a5847766Q378776p79317K046452R489062K138673j1278783o21067L1285319
42003B4811349M0408389P456654k6333119k0202457L822419J038065k0866274
41996A0135026j8241549J1611870K5672119P072489j1500060o526216L209847
41989B1433526J45859n07688J1670666J3116241j2551261l6545382k5578723L990811
41981b4825951J2653399M62096Q1042J6993710K2429902O839107m251612J269597
41973C1651290p90106k4449046l9830606j6660058K3609333L5324211J4697188
41966B3552206K00951R398160J4553717o556091k9408269j8712583J4612987K5651960
41958C3293038M00911k3970483j3433861J5274681K2347823K577582j3266449
$$ plain form
41951 23223242 14567496 13777748 10311472 8012492 21430114 42047594 37570226 -1464728
41943 -1464728 -38752899 -37157069 -8808177 5560294 -4249149 -9715796 8027122 32598346
41935 32598346 42398981 40264583 40339433 44754931 47066816 44239624 33076767 7824881
41927 7824881 -27313449 -55372722 -66283377 -66739265 -62219990 -46292322 -19966464 -3234099
41919 -3234099 -9917208 -26497223 -34165731 -36361563 -43958843 -49508954 -42026564 -33933790
41911 -33933790 -43654490 -60132728 -55218126 -26231661 3528905 21648921 32112864
41904 32112864 29306823 5114947 -17412402 -687920 46866336 69246369 39926180
41897 39926180 555446 -2431312 17126304 17005190 -6232269 -22121788 -20175059 -18504809
$$ packed form
41951B3223242q655746p89748l466276k298980J3417622K0617480m477368l9034954
41943a464728l7288171J595830K8348892J4368471r809443n466647J7742918K4571224
41935C2598346R800635k134398P4850M415498K311885k827192j1162857k5251886
41927G824881l5138330k8059273j0910655m55888M519275J5927668K6325858J6732365
41919c234099o683109j6580015p668508k195832p597280n550111P482390Q092774
41911c3933790r720700j6478238M914602K8986465K9760566J8120016J0463943
41904C2112864k806041k4191876k2527349J6724482M7554256K2380033k9320189
41897C9926180l9370734k986758J9557616j21114k3237459j5889519J946729J670250
$$ plain form
41889 -18504809 -26009771 -31144024 -27209462 -20311751 -12138229 679901 10403920 4826481
41881 4826481 -8701598 -7523170 14737803 38844557 45061194 31781577 7401564
41874 7401564 -20188820 -41984610 -48991533 -40069758 -21439242 988868 21002805
41867 21002805 28315168 17295235 -2764452 -16861448 -20898859 -19177190 -10900350 7739287
41859 7739287 31896823 51269309 61332642 60271755 42492332 10956675 -11258232
41852 -11258232 -2075446 29045022 50578806 47775123 33454678 21698993 12324927
41845 12324927 3354248 -2582079 -8395127 -18488860 -20925632 2245531 39341934 50491009
41837 50491009 19593338 -20067910 -32565289 -28005141 -35838560 -49171205 -36318285
$$ packed form
41889a8504809p504962n134253L934562O897711Q173522J2818130R724019n577439
41881D826481j3528079J178428K2260973K4106754O216637j3279617k4380013
41874G401564k7590384k1795790p006923Q921775J8630516K2428110K0013937
41867B1002805P312363j1019933k0059687j4096996m037411J721669Q276840J8639637
41859G739287K4157536J9372486J0063333j060887j7779423l1535657k2214907
41852a1258232R182786L1120468K1533784k803683j4320445j1755685r374066
41845A2324927q970679n936327n813048j0093733k436772K3171163L7096403J1149075
41837E0491009l0897671l9661248j2497379M560148p833419j3332645J2852920
$$ plain form
41830 -36318285 -2476990 6354261 -24879377 -46029984 -10867752 48309039 59695881
41823 59695881 15417055 -14015777 20066448 76146733 85716659 50193747 27639227
41816 27639227 38537919 40095415 2520211 -39605993 -39766423 -7299602 13064994
41809 13064994 6730703 -4287027 -8029105 -14888821 -23531192 -13691284 15090216 29569783
41801 29569783 7585915 -25919726 -31021944 -6373783 14677490 14713348 11756972 24157634
41793 24157634 40374257 38447011 19835488 4369060 -987151 -6891838 -15726187 -13838075
41785 -13838075 2289933 12738057 1743208 -17468504 -22980112 -15636904 -9773227
41778 -9773227 -4639446 9914389 27368346 31914391 28071034 34386007 48950728 51418584
$$ packed form
41830c6318285L3841295Q831251l1233638k1150607L5162232N9176791J1386842
41823E9695881m4278826k9432832L4082225N6080285R569926l5522912k2554520
41816B7639227J0898692J557496l7575204m2126204j60430L2466821K0364596
41809A3064994o334291j1017730l742078o859716q642371R839908K8781500J4479567
41801B9569783k1983868l3505641n102218K4648161K1051273L5858k956376J2400662
41793B4157634J6216623j927246j8611523j5466428n356211n904687q834349J888112
41785a3838075J6128008J0448124j0994849j9211712n511608P343208N863677
41778i773227N133781J4553835J7453957M546045l843357O314973J4564721K467856
$$ plain form
41770 51418584 40348971 35539989 38542084 26624775 -3557507 -22438575 -13458356
41763 -13458356 1758035 2750833 832679 8590009 12981220 5081195 3142359 15138057
41755 15138057 11076466 -29667554 -71440558 -65179124 -17882919 21898406 30684237
41748 30684237 21349822 4331750 -17978583 -28684129 -11835043 15232658 23389359
41741 23389359 17445885 21829305 31264066 19794253 -7770807 -18942877 -5034491
41734 -5034491 14043185 31807351 55080361 66123929 38374676 -7566909 -18888443
41727 -18888443 10273937 30026597 17181264 7816557 26450709 41266808 22215182
41720 22215182 -8013627 -19642264 -27502464 -53528275 -74603243 -56024032 -12314488
$$ packed form
41770E1418584j1069613m808982L002095j1917309l0182282j8881068Q980219
41763a3458356J5216391R92798j918154P757330M391211p900025j938836J1995698
41755A5138057m061591m0744020m1773004O261434M7296205L9781325Q785831
41748C0684237r334415j7018072k2310333j0705546J6849086K7067701Q156701
41741B3389359n943474M383420R434761j1469813k7565060j1172070J3908386
41734e034491J9077676J7764166K3273010J1043568k7749253m5941585j1321534
41727a8888443K9162380J9752660j2845333r364707J8634152J4816099j9051626
41720B2215182l0228809j1628637p860200k6025811k1074968J8579211M3709544
$$ plain form
41713 -12314488 11126170 2070838 -12175166 -11991848 -4733261 -2923316 -10268966 -24549205
41705 -24549205 -35427920 -28558290 -7496423 2499230 -11482352 -28861811 -25493689
41698 -25493689 -6315676 10799041 24845939 43621377 62087105 70257061 69208044
41691 69208044 61662203 42280811 13770847 -6092717 -11405913 -21523983 -47387787
41684 -47387787 -66132062 -53445931 -22020496 -2142890 -736606 -4873206 -9733953
41677 -9733953 -16644659 -17257259 -5436666 7363362 11714216 20625931 45910515 69291305
41669 69291305 64455881 36051315 10439187 -1399003 -6333246 -6089130 1343489 6475152
41661 6475152 202459 -6615059 1679323 19403501 29711829 30228040 27992254 22316925
$$ packed form
41713a2314488K3440658r055332j4246004J83318P258587J809945p345650j4280239
41705b4549205j0878715O869630K1061867R995653j3981582j7379459L368122
41698b5493689J9178013J7114717J4046898J8775438J8465728Q169956j049017
41691F9208044p545841j9381392k8509964j9863564n313196j0118070k5863804
41684d7387787j8744275J2686131L1425435J9877606J406284m136600m860747
41677i733953o910706o12600J1820593J2800028M350854Q911715K5284584K3380790
41669F9291305m835424k8404566k5612128j1838190m934243K44116P432619N131663
41661F475152o272693o817518Q294382J7724178J0308328N16211k235786n675329
$$ plain form
41653 22316925 14341418 17751995 35919311 45700582 30615042 11347759 13208133 23773980
41645 23773980 19193331 12701740 31843764 60221564 52529984 6368570 -28839027
41638 -28839027 -21029963 8724400 28867968 36331475 39037289 33456613 17164998 -95061
41630 -95061 -10704123 -15843575 -13074124 1400884 15635719 10948797 -9042980 -21686329
41622 -21686329 -18627375 -11503470 -5448410 4752615 11889604 1036594 -19337222 -22222691
41614 -22222691 -3866230 9888821 6123987 3076950 16226626 34415360 40357179
41607 40357179 30755596 9654410 -13450655 -16993922 10904770 42234418 36246003
41600 36246003 1134104 -11852036 15074837 39980399 27675203 -2848017 -21164117
$$ packed form
41653B2316925p975507L410577J8167316R781271j5085540j9267283J860374J0565847
41645B3773980m580649o491591J9142024K8377800p691580m6161414l5207597
41638b8839027P809064K9754363K0143568P463507K705814n580676j6291615j7260059
41630i5061j0609062n139452K769451J4475008J4234835m686922j9991777j2643349
41622b1686329L058954P123905O055060J0201025P136989j0853010k0373816k885469
41614b2222691J8356461J3755051l764834l047037J3149676J8188734N941819
41607D0357179r601583k1101186k3105065l543267K7898692L1329648n988415
41600C6246003l5111899j2986140K6926873K4905562j2305196l0523220j8316100
$$ plain form
41593 -21164117 -31383038 -43688990 -40362240 -9696815 18412480 13181501 -5380053
41586 -5380053 2506153 33633607 52482541 48867876 41194670 32576132 9014031 -20755426
41578 -20755426 -26971629 -6802855 6225523 -8272539 -28553828 -24290467 4497825
41571 4497825 35827632 55527481 64881956 68843532 67592290 57304667 37500347 19623098
41563 19623098 21700544 46373257 71481913 73250698 51862891 23360716 -3202230
41556 -3202230 -24719335 -30542821 -12258822 16025558 28041567 17756741 5055938
41549 5055938 7283937 19356687 24459228 13364075 -7958740 -22177752 -15528925 3337077
41541 3337077 7910908 -11694899 -30495185 -21285153 6571214 22750112 19170227 9873389
$$ packed form
41593b1164117j0218921j2305952L326750L0665425K8109295n230979j8561554
41586e380053P886206L1127454J8848934l614665p673206q618538k3562101k9769457
41578b0755426o216203K0168774J3028378j4498062k0281289M263361K8788292
41571D497825L1329807J9699849R354475L961576j251242j0287623j9804320j7877249
41563A9623098K077446K4672713K5108656J768785k1387807k8502175k6562946
41556c202230k1517105n823486J8283999K8284380J2016009j0284826j2700803
41549E055938K227999J2072750N102541j1095153k1322815j4219012O648827J8866002
41541C337077M573831j9605807j8800286R210032K7856367J6178898l579885r296838
$$ plain form
41533 9873389 -3608371 -30869113 -56482863 -45752410 -20867 30686463 13762817
41526 13762817 -17526651 -12471420 22533295 35728951 7513693 -22244553 -10848241
41519 -10848241 32688752 64004795 55940038 19467559 -17341904 -35979093 -35392156
41512 -35392156 -25111432 -15809354 -14192176 -22032348 -34769736 -40358430 -27121964 381826
41504 381826 18496344 7566790 -23240004 -43963309 -37022979 -12217065 12412387
41497 12412387 30975029 44167465 46924009 36252359 24695327 29143195 45754980
41490 45754980 50771304 31158820 2866503 -8360033 4439125 27366087 44107449
41483 44107449 46732734 33586528 8433123 -17781805 -32580139 -31346734 -17368541
$$ packed form
41533I873389j3481760k7260742k5613750J0730453M5731543L0707330j6923646
41526A3762817l1289468N055231L5004715J3195656k8215258k9758246J1396312
41519a0848241M3536993L1316043q064757l6472479l6809463j8637189N86937
41512c5392156J0280724R302078J617178p840172j2737388n588694J3236466K7503790
41504C81826J8114518j0929554l0806794k0723305O940330K4805914K4629452
41497A2412387J8562642J3192436K756544j0671650j1557032M447868J6611785
41490D5754980N016324j9612484k8292317j1226536J2799158K2926962J6741362
41483D4107449K625285j3146206k5153405k6214928j4798334J233405J3978193
$$ plain form
41476 -17368541 4836379 29224927 43719360 37087260 13671132 -7597385 -14640962
41469 -14640962 -15917234 -25250195 -38589064 -38058434 -20435284 -8715485 -24892694 -57787289
41461 -57787289 -72875873 -55302685 -27448887 -15708352 -15219861 -4069389 18618634
41454 18618634 32393498 30276834 28014037 34167122 36930720 31533848 35144403 56201586
41446 56201586 70999034 55033091 21675582 3637610 7752839 15150913 17140938
41439 17140938 21323509 26304970 19984964 3345130 -10238787 -18472154 -26023594 -20259057
41431 -20259057 14854655 58951526 67864328 35628586 5966831 7730106 18609221
41424 18609221 13925577 9330980 21909373 26739990 -3365847 -42664074 -46977336 -25129755
$$ packed form
41476a7368541K2204920K4388548J4494433o632100k3416128k1268517p043577
41469a4640962j276272r332961j3338869N30630J7623150J1719799j6177209l2894595
41461e7787289j5088584J7573188K7853798J1740535M88491J1150472K2688023
41454A8618634J3774864k116664k262797O153085K763598n396872L610555K1057183
41446E6201586J4797448j5965943l3357509j8037972M115229P398074J990025
41439A7140938M182571M981461o320006j6639834j3583917q233367p551440N764537
41431b0259057L5113712M4096871Q912802l2235742k9661755J763275J0879115
41424A8609221m683644m594597J2578393M830617l0105837l9298227m313262K1847581
$$ plain form
41416 -25129755 -22238218 -40437246 -34217482 9914674 45961621 40322286 21931703
41409 21931703 30538643 54500297 57593898 39633967 29025677 30791364 22951759 215443
41401 215443 -15262305 -10698864 -668740 -473038 -5348153 -5664486 -2989924 -413276
41393 -413276 6320841 16568530 18322152 6582300 -4478359 -1643756 6099262 2530747
41385 2530747 -8416011 -9279696 1456553 7090665 398108 -6776232 -6747107 -9416690
41377 -9416690 -22385471 -33888535 -29170493 -12229510 2538558 10886790 16448267 15796531
41369 15796531 2267890 -18557862 -31809061 -31001268 -22079175 -12864423 -8996539 -15091878
41361 -15091878 -26987329 -28092576 -8436557 17208650 26463627 19853204 15561493 18644938
$$ packed form
41416b5129755K891537j8199028O219764M4132156L6046947n639335j8390583
41409B1931703Q606940K3961654L093601j7959931j0608290J765687p839605k2736316
41401B15443j5477748M563441J0030124J95702m875115l16333K674562K576648
41393d13276O734117J0247689J753622j1739852j1060659K834603P743018l568515
41385B530747j0946758q63685J0736249N634112o692557p174340K9125k669583
41377i416690j2968781j1503064M718042J6940983J4768068Q348232N561477o51736
41369A5796531j3528641k0825752j3251199Q07793Q922093R214752L867884o095339
41361a5091878j1895451j105247J9656019K5645207R254977o610423m291711L083445
$$ plain form
41353 18644938 19014061 18243255 30301365 50954884 55350938 36625840 19111659 18268404
41345 18268404 15574455 -4739184 -19766028 11805 38750847 50136775 20476195
41338 20476195 -13649273 -14913011 11390031 31778946 26045291 4476819 -8877807
41331 -8877807 -3521956 7379488 6423063 -1456580 4687149 26549443 38977730 30256106
41323 30256106 26800757 53483529 87914775 87568404 53368737 29424117 38722918 55740079
41315 55740079 52954107 40828842 42386332 54068564 56097703 45356956 34214159
41308 34214159 26322168 15809268 6152196 9241818 24159521 33296360 24905883 8047910
41300 8047910 -1713488 -3252472 -6889785 -13761621 -10788726 8066224 26260559 24845356
$$ packed form
41353A8644938L69123p70806J2058110K0653519M396054j8725098j7514181q43255
41345A8268404k693949k0313639j5026844J9777833L8739042J1385928k9660580
41338B0476195l4125468j263738K6303042K0388915n733655k1568472j3354626
41331h877807N355851J0901444r56425p879643O143729K1862294J2428287q721624
41323C0256106l455349K6682772L4431246l46371l4199667k3944620R298801J7017161
41315E5740079k785972j2125265J557490J1682232K029139j0740747j1142797
41308C4214159p891991j0512900r657072L089622J4917703R136839q390477j6857973
41300H047910r761398j538984l637313o871836K972895J8854950J8194335j415203
$$ plain form
41292 24845356 13798817 22672409 54982931 74457367 52303551 9284037 -11984564
41285 -11984564 -2576524 12578121 20548264 32431932 49349622 51555123 32314320
41278 32314320 13400135 12301844 19166923 21959706 29360690 47785760 57387257 36586459
41270 36586459 -3580589 -33003738 -38614697 -25604002 3024346 40867111 62884056
41263 62884056 48161209 15989098 8306769 32607121 51822564 39644687 17236205
41256 17236205 18197036 39863364 52397206 43276810 28937863 25912487 31303292 35467547
41248 35467547 38136823 43141235 46770630 43373387 39984227 51855470 77244915 88187852
41240 88187852 61526882 14631456 -9808372 2083091 19028976 14065207 5669950
$$ packed form
41292B4845356j1046539Q873592L2310522J9474436k2153816m3019514k1268601
41285a1984564R408040J5154645P970143J1883668J6917690K205501j9240803
41278C2314320j8914185j098291O865079K792783P400984J8425070R601497k0800798
41270C6586459m0167048k9423149n610959J3010695K8628348L7842765K2016945
41263F2884056j4722847l2172111p682329K4300352J9215443j2177877k2408482
41256A7236205R60831K1666328J2533842r120396j4338947l025376N390805M164255
41248C5467547K669276N004412L629395l397243l389160J1871243K5389445J0942937
41240H8187852k6660970m6895426k4439828J1891463J6945885m963769q395257
$$ plain form
41233 5669950 24222742 55983715 58124835 26304760 7500699 33817680 77460010
41226 77460010 92986591 78382704 66300763 71049327 75789810 68432867 61876024 71745767
41218 71745767 92536957 105895678 103858636 96290696 97281087 106582208 106398506 81790908
41210 81790908 43692573 20130643 20283783 22297242 7753339 -7643773 2483196
41203 2483196 31645686 45844731 31199266 11460549 11955154 27654128 39098219
41196 39098219 43911698 55925520 79570299 99762746 98987781 77893373 56031203
41189 56031203 52164494 64392108 73167176 65466598 49583133 41842815 47541445 62273299
41181 62273299 80430532 90066863 73238550 32321254 4871849 23805151 67143268
$$ packed form
41233E669950J8552792L1760973K141120l1820075j8804061K6316981M3642330
41226G7460010J5526581j4603887j2081941M748564M740483p356943o556843R869743
41218G1745767K0791190J3358721k037042p567940R90391R301121j83702k4607598
41210H1790908l8098335k3561930J53140K013459j4543903j5397112J0126969
41203B483196K9162490J4199045j4645465j9738717M94605J5698974J1444091
41196C9098219M813479J2013822K3644779K0192447p74965k1094408k1862170
41189E6031203l866709J2227614Q775068p700578j5883465p740318N698630J4731854
41181F2273299J8157233R636331j6828313m0917296k7449405J8933302M3338117
$$ plain form
41174 67143268 79920272 48797746 19682313 29795145 57627803 61991611 40686315
41167 40686315 21909218 19792746 29158054 47965812 73293629 86130557 71587223
41160 71587223 47685101 44603223 60461049 67740832 60141850 59904520 76094610 88819693
41152 88819693 84245973 75700155 76206981 75503108 61527616 44521034 40808770 47020961
41144 47020961 48810409 45718384 50617631 69167114 92803308 110313097 118238328 121223597
41136 121223597 125948802 132564717 132756739 121783672 109017032 105987859 107194144 98142436
41128 98142436 82136915 80619704 102353419 130167518 146040000 153005504 162606390
41121 162606390 175422442 185222145 190237214 189578802 179119992 160656807 145159760
$$ packed form
41174F7143268J2777004l1122526k9115433J0112832K7832658M363808k1305296
41167D0686315j8777097k116472R365308J8807758K5327817J2836928j4543334
41160G1587223k3902122l081878J5857826P279783p598982k37330J6190090J2725083
41152H8819693m573720q545818N06826p03873j3975492j7006582l712264O212191
41144D7020961J789448l092025M899247J8549483K3636194J7509789P925231K985269
41136A21223597M725205O615915J92022j0973067j2766640l029173J206285r051708
41128I8142436j6005521j517211K1733715K7814099J5872482O965504R600886
41121A62606390J2816052R799703N015069o58412j0458810j8463185j5497047
$$ plain form
41114 145159760 138539149 134532556 128624227 126341119 130318001 134248670 139310024 159459967
41106 159459967 196197672 224325569 221860138 202329986 196800099 211366245 223433640
41099 223433640 217531372 205382593 207178786 225721991 244010868 244411058 230355827
41092 230355827 227699236 255454110 296032503 312325057 298914090 292402082 317454367
41085 317454367 348927041 352323696 339060559 346536001 376914271 396281235 392360764
41078 392360764 391576100 409168817 420333214 402348787 377681709 386920863 431875518
41071 431875518 471197961 470497500 438794879 412535174 414861164 436526382 453216255
41064 453216255 455126865 453950469 461662357 472856775 475223466 468789711 463616054 464453567
$$ packed form
41114A45159760o620611m006593n908329k283108L976882L930669N061354K0149943
41106A59459967L6737705K8127897k465431j9530152n529887J4566146J2067395
41099B23433640n902268j2148779J796193J8543205J8288877M00190j4055231
41092B30355827k656591K7754874M0578393J6292554j3410967o512008K5052285
41085C17454367L1472674L396655j3263137P475442L0378270J9366964l920471
41078C92360764p84664J7592717J1164397j7984427k4667078R239154M4954655
41071D31875518L9322443p00461l1702621k6259705K325990K1665218J6689873
41064D53216255J910610j176396P711888J1194418K366691o433755n173657Q37513
$$ plain form
41056 464453567 469554953 479031963 491203975 496297260 489013957 482474016 492696090 513358741
41048 513358741 524558941 522262628 516417674 502578683 464515462 410888299 380001876
41041 380001876 392963998 424280203 435391438 418919697 392857351 368579100 345916961
41034 345916961 328479488 322400308 324607493 327951419 332840846 340836085 344432173 338061611
41026 338061611 331860368 337704043 347411755 343776832 330431036 329607043 347089599 359782843
41018 359782843 348208622 325875328 321492368 340476402 361164900 368691594 375214213
41011 375214213 396656855 421563008 422336376 397271238 380286974 396863033 426627650
41004 426627650 429326277 397691220 360161576 335752628 315999096 296528897 294627718
$$ packed form
41056D64453567N101386R477010J2172012N093285p283303o539941J0222074K0662651
41048E13358741J1200200k296313n844954j3838991l8063221n3627163l0886423
41041C80001876J2962122L1316205J1111235j6471741k6062346k4278251k2662139
41034C45916961j7437473o079180K207185L343926M889427P995239L596088o370562
41026C38061611o201243N843675R707712l634923j3345796q23993J7482556J2693244
41018C59782843j1574221k2333294m382960J8984034K0688498P526694O522619
41011C75214213K1442642K4906153P73368k5065138j6984264J6576059K9764617
41004D26627650K698627l1635057l7529644k4408948j9753532j9470199j901179
$$ plain form
40997 294627718 317625520 339038729 331366793 306793218 298828543 312779611 321748794
40990 321748794 310164606 296221495 305059965 336448014 365684621 367016638 334744062
40983 334744062 289887197 264074561 267290668 275953468 264001002 237952765 224231929
40976 224231929 228799282 232598677 225164785 216213690 209262232 191357178 161555380 145010384
40968 145010384 159800949 188079585 200843325 196898109 194536090 195395921 183003547
40961 183003547 154600446 129929730 124854338 135779173 154667244 180527048 207719535
40954 207719535 219620017 207264441 184749112 173394681 175157085 172143022 151081283
40947 151081283 120313745 100701400 102361281 111992065 106215886 80615876 60341396
$$ packed form
40997B94627718K2997802K1413209p671936k4573575p964675J3951068Q969183
40990C21748794j1584188j3943111Q838470L1388049K9236607J332017l2272576
40983C34744062m4856865k5812636L216107Q662800j1952466k6048237j3720836
40976B24231929M567353L799395p433892q951095o951458j7905054k9801798j6544996
40968A45010384J4790565K8278636J2763740l945216k362019Q59831j2392374
40961A83003547k8403101k4670716n075392J0924835J8888071K5859804K7192487
40954B07719535J1900482j2355576k2515329j1354431J762404l014063k1061739
40947A51081283l0767538j9612345J659881R630784n776179k5600010k0274480
$$ plain form
40940 60341396 72188881 108702136 133965945 127053748 103979597 90130237 88171035
40933 88171035 86312254 82869154 82965453 80761496 67740411 54720681 61991188 85848960
40925 85848960 97576165 81983241 56619470 43919215 43807499 46249491 52843566 68575625
40917 68575625 84247190 84422152 65786448 35802501 4177870 -11690807 10458747
40910 10458747 66813269 111707609 101930800 53100637 22695916 35687467 57652680
40903 57652680 49787556 19685130 -105878 1379599 12321283 26251582 45350163
40896 45350163 64064589 72701153 73974759 77090496 78791836 69296659 55187645 56196358
40888 56196358 76618533 97672828 102456473 91930635 71099463 38068415 -1301853
$$ packed form
40940F0341396J1847485L6513255K5263809o912197k3074151j3849360j959202
40933H8171035j858781l443100R6299k203957j3021085j3019730P270507K3857772
40925H5848960J1727205j5592924k5363771j2700255j11716K441992O594075J5732059
40917F8575625J5671565J74962j8635704k9983947l1624631j5868677K2149554
40910A0458747N6354522M4894340r776809m8830163l0404721J2991551K1965213
40903E7652680p865124l0102426j9791008J485477J0941684J3930299J9098581
40896D5350163J8714426Q636564J273606L115737J701340r495177j4109014J008713
40888E6196358K0422175K1054295M783645j0525838k0831172l3031048l9370268
$$ plain form
40881 -1301853 -22946302 -6666543 36231440 71396576 76439137 57549240 33434041
40874 33434041 14889094 2781408 -4195980 -6849542 -6094984 -887995 11477048 28108758
40866 28108758 36543583 25673639 1460174 -16066935 -15890944 -9196513 -11949134 -20537402
40858 -20537402 -17894286 -2489654 5582367 -6157979 -22886340 -24258521 -12548967
40851 -12548967 -1501268 12402466 42594099 78066747 84194534 48106293 1811682
40844 1811682 -14343053 4767523 35929101 60826909 72802678 64588975 35182968
40837 35182968 3841136 -6762904 -28248 3729547 3426994 17324697 44638334 57973718
40829 57973718 45816893 33009003 39360856 45024829 25600066 585777 9299595
$$ packed form
40881a301853k1644449J6279759M2897983L5165136N042561j8889897k4115199
40874C3434041j8544947j2107686o977388k653562P54558N206989J2365043J6631710
40866B8108758Q434825j0869944k4213465j7527109J75991O694431k752621q588268
40858b0537402K643116J5404632Q072021j1740346j6728361j372181J1709554
40851a2548967J1047699J3903734L0191633L5472648O127787l6088241m6294611
40844A811682j6154735J9110576L1161578K4897808J1975769q213703k9406007
40837C5182968l1341832j0604040O734656L757795l02553J3897703K7313637J3335384
40829E7973718j2156825j2807890O351853N663973j9424763k5014289Q713818
$$ plain form
40822 9299595 47033066 64975924 38561606 354989 -9609660 3076579 6233203
40815 6233203 -6685634 -11060557 8294807 35013933 43758877 29828641 9099866
40808 9099866 -3665807 -8501770 -13117929 -18340386 -16820197 -6390958 3865776 7359397
40800 7359397 11654176 24512487 34560857 23470490 -3523865 -19367480 -12030656
40793 -12030656 868151 3429576 5870743 20810734 33963665 23088209 -4269436
40786 -4269436 -18857073 -12965988 -9323435 -22378988 -34952475 -25430947 -274390 16397789
40778 16397789 14891619 5680573 -1305221 -6948409 -11810776 -8731378 6483401 24518006
40770 24518006 30586240 20134428 392317 -20781444 -38841675 -46057015 -33613751
$$ packed form
40822I299595L7733471J7942858k6414318l8206617r964649J2686239L156624
40815F233203j2918837m374923J9355364K6719126Q744944j3930236k0728775
40808I099866j2765673m835963m616159n222457J520189J0429239J0256734L493621
40800G359397M294779J2858311J0048370j1090367k6994355j5843615P336824
40793a2030656J2898807K561425K441167J4939991J3152931j0875456k7357645
40786d269436j4587637N891085L642553j3055553j2573487R521528K5156557J6672179
40778A6397789j506170r211046o985794n643188m862367L079398J5214779J8034605
40770B4518006O068234j0451812j9742111k1173761j8060231p215340J2443264
$$ plain form
40763 -33613751 -6534505 14328432 15792773 9273843 11415076 17024703 10768823 -84429
40755 -84429 8612258 36081033 48921330 28292311 49409 -1295272 21727328 42407647
40747 42407647 50866780 55042594 53383870 37615331 17442745 11519520 13763561 -605022
40739 -605022 -30448963 -41053979 -13639681 24252889 35868192 21618696 7211898
40732 7211898 1254114 -9935435 -30949954 -44743092 -36092679 -12307714 7525241
40725 7525241 16583641 24986046 39850482 47267984 24580138 -24971234 -61278095 -46778856
40717 -46778856 6618368 48699340 51443134 37582586 39004690 48109229 32798927
40710 32798927 -10957239 -48261070 -49715612 -25533446 -5325822 923066 5825027
$$ packed form
40763c3613751K7079246K0862937J464341o518930K141233N609627o255880j0853252
40755h4429Q696687K7468775J2840297k0629019k8242902j344681K3022600K0680319
40747D2407647Q459133M175814j658724j5768539k0172586n923225K244041j4368583
40739f05022k9843941j0605016K7414298L7892570J1615303j4249496j4406798
40732G211898n957784j1189549k1014519j3793138Q650413K3784965J9832955
40725G525241R058400Q402405J4864436P417502k2687846m9551372l6306861J4499239
40717d6778856N3397224M2080972K743794j3860548J422104R104539j5310302
40710C2798927m3756166l7303831j454542K4182166K0207624O248888M901961
$$ plain form
40703 5825027 15050106 13958098 -9477295 -40741958 -51590077 -34328936 -10263962
40696 -10263962 -1059017 -3805892 -2029312 8878746 19207843 22416330 22621110 25986281
40688 25986281 34328481 46083377 55433146 53207241 37594666 20734447 15325355 19297997
40680 19297997 24289357 31686915 44081577 47779422 27005832 -5159561 -15765515
40673 -15765515 1930052 16417054 3720969 -18337396 -19396223 -463603 13812737
40666 13812737 13085673 7143056 1960763 -4559033 -4778663 15538467 50542880 71417151
40658 71417151 60800922 35705840 24509094 31884859 40154826 38619800 34355311 32126845
40650 32126845 20544071 -8697377 -36181420 -29025217 14685300 51471476 37595602
$$ packed form
40703E825027R225079j092008k3435393l1264663j0848119J7261141K4064974
40696a0263962R204945k746875J776580J0908058J0329097L208487K04780L365171
40688B5986281Q342200J1754896R349769k225905j5612575j6860219n409092L972642
40680A9297997M991360P397558J2394662L697845k0773590l2165393j0605954
40673a5765515J7695567J4487002j2696085k2058365j058827J8932620J4276340
40666A3812737p27064n942617n182293o519796k19630K0317130L5004413K0874271
40658G1417151j0616229k5095082j1196746P375765Q269967j535026m264489k228466
40650C2126845j1582774k9241448k7484043P156203M3710517L6786176j3875874
$$ plain form
40643 37595602 -17793749 -61264317 -57011905 -23882890 -4623520 -13365753 -27835679
40636 -27835679 -26217718 -13101743 -3577798 4302180 24747626 52770308 56553220 16624319
40628 16624319 -37477545 -53856847 -23559594 6874956 655514 -17390113 835208
40621 835208 55275709 98149927 98343360 70856280 41273014 15656690 -4200069 -6509372
40613 -6509372 11459226 30830792 34154873 25888613 18437596 14357034 13549027 20405326
40605 20405326 31115469 30947797 17112187 6986662 10169538 11303489 -2925427 -18731277
40597 -18731277 -17380499 -5897547 -3174304 -8714261 -8510201 -1652501 2296366 4693191
40589 4693191 14102966 27171424 34069457 37041940 42998526 44511643 31150987 14489102
$$ packed form
40643C7595602n5389351m3470568M252412L3129015J9259370q742233j4469926
40636b7835679J617961J3115975R523945P879978K0445446K8022682L782912l9928901
40628A6624319n4101864j6379302L0297253L0434550o219442j8045627J8225321
40621H35208N4440501M2874218J93433k7487080k9583266k5616324j9856759k309303
40613f509372J7968598J9371566L324081q266260p451017m080562q08007O856299
40605B0405326J0710143j67672j3835610j0125525L182876J133951j4228916j5805850
40597a8731277J350778J1482952K723243n539957K04060O857700L948867K396825
40589D693191R409775J3068458O898033K972483N956586J513117j3360656j6661885
$$ plain form
40581 14489102 16633637 35349224 45955225 40031244 36993323 49766444 61264743
40574 61264743 48188829 14352216 -12655511 -12368711 8401889 24229767 17960274
40567 17960274 -1251317 -11765426 -10944902 -18227842 -40204043 -52894992 -36450433
40560 -36450433 -9065986 -506901 -5517973 4916412 33230470 50829256 43961140
40553 43961140 30010257 22975360 16075013 8047504 13208754 29909844 30576210 4579332
40545 4579332 -16637640 -3550110 25072534 30512882 12725448 6119945 23000161
40538 23000161 35558114 19303734 -13264764 -33834971 -33573800 -23656571 -13550974
40531 -13550974 -4084477 2953813 2293004 -5251657 -9369026 -2734329 6110245 123898
$$ packed form
40581A4489102K144535J8715587J0606001n923981l037921J2773121J1498299
40574F1264743j3075914l3836613k7007727K86800K0770600J5827878o269493
40567A7960274j9211591j0514109Q20524p282940k1976201j2690949J6444559
40560c6450433K7384447Q559085n011072J0434385K8314058J7598786o868116
40553D3961140j3950883p034897o900347q027509N161250J6701090O66366k5996878
40545D579332k1216972J3087530K8622644N440348j7787434o605503J6880216
40538B3000161J2557953j6254380l2568498k0570207K61171R917229J0105597
40531a3550974R466497P038290o60809p544661m117369O634697Q844574n986347
$$ plain form
40523 123898 -23307317 -43599865 -38764116 -12731745 9119325 12445889 10911354 24686564
40515 24686564 50542189 64042665 50041197 21530897 4270969 8250511 21300202
40508 21300202 29446487 33228988 37563374 35425179 17496723 -4650887 -5593296 16943932
40500 16943932 31453755 12646098 -23595932 -42161227 -32423442 -10595539 9725366
40493 9725366 25647492 31691974 24899339 20184078 34426085 55831284 55842686 32698154
40485 32698154 14200445 12827114 9788532 -6136810 -16765675 -9507629 -4307532 -20520703
40477 -20520703 -40075809 -32378823 -818622 23083520 22184076 5972039 -11594101
40470 -11594101 -22913756 -20789110 -3398557 17564469 30527163 39666446 50773909
$$ packed form
40523A23898k3431215k0292548M835749K6032371K1851070L326564j534535J3775210
40515B4686564K5855625J3500476j4001468k8510300j7259928L979542J3049691
40508B1300202Q146285L782501M334386k138195j7928456k2147610r42409K2537228
40500A6943932J4509823j8807657l6242030j8565295R737785K1827903K0320905
40493I725366J5922126O044482o792635m715261J4242007K1405199J1402k3144532
40485C2698154j8497709j373331l038582j5925342j0628865P258046N200097j6213171
40477b0520703j9555106P696986L1560201K3902142q99444j6212037j7566140
40470a1594101j1319655K124646J7390553K0963026J2962694R139283J1107463
$$ plain form
40463 50773909 52850497 36504272 20570945 31177797 57965984 62682258 34900075
40456 34900075 8248915 10306735 23820136 15607121 -15615956 -40683696 -38781297
40449 -38781297 -17660411 243791 -105699 -16053372 -32327007 -37605122 -35372414 -32147065
40441 -32147065 -20302128 10497342 44781829 47259107 7981580 -37902112 -51246006
40434 -51246006 -34512208 -18580769 -17536550 -19646899 -16442520 -15241372 -19944730 -20341174
40426 -20341174 -9019650 4822242 7253250 -3230677 -16913858 -24459211 -21692083
40419 -21692083 -8318455 11940906 31482110 42154391 38803097 21716594 -956633
40412 -956633 -15377861 -12365048 3741035 19489104 24522735 17451250 3889590 -7035008
$$ packed form
40463E0773909K076588j6346225j5933327J0606852K6788187M716274k7782183
40456C4900075k6651160K057820J3513401q213015l1223077k5067740J902399
40449c8781297K1120886J7904202l49490j5947673j6273635n278115K232708L225349
40441c2147065J1844937L0799470L4284487K477278l9277527m5883692j3343894
40434e1246006J6733798J5931439J044219k110349L204379J201148m703358l96444
40426b0341174J1321524J3841892K431008j0483927j3683181p545353K767128
40419b1692083J3373628K0259361J9541204J0672281l351294j7086503k2673227
40412i56633j4421228L012813J6106083J5748069N033631p071485j3561660j0924598
$$ plain form
40404 -7035008 -8690508 -4170017 -2190660 -2068969 6751883 22585737 23651554 -1403378
40396 -1403378 -28295027 -26354404 -4993870 -1939634 -26534996 -46938931 -40180757 -22375225
40388 -22375225 -14815707 -10158390 6376008 26683886 35087794 35378122 39311666 44460376
40380 44460376 45408329 49574683 58860116 55083705 30933435 14955890 31728323 55190162
40372 55190162 42578094 2760080 -14786216 5475025 29074152 32791147 34149728
40365 34149728 48477597 60726283 57137570 46583868 33138170 4565906 -33404755
40358 -33404755 -48804195 -30932948 -9922542 -6038888 2139398 30888316 52249501
40351 52249501 39013063 14662495 15403354 29631645 21569885 -4934292 -14191076 1781812
$$ packed form
40404g035008j655500M520491J979357J21691Q820852J5833854J065817k5054932
40396a403378k6891649J940623K1360534L054236k4595362k0403935O758174J7805532
40388b2375225P559518M657317J6534398K0307878Q403908K90328L933544N148710
40380D4460376R47953M166354R285433l776411k4150270j5977545J6772433K3461839
40372E5190162j2612068l9818014j7546296K0261241K3599127L716995J358581
40365C4149728J4327869J2248686l588713j0553702j3445698k8572264l7970661
40358c3404755j5399440J7871247K1010406L883654Q178286K8748918K1361185
40351E2249501j3236438k4350568P40859J4228291q061760k6504177r256784J5972888
$$ plain form
40343 1781812 16817219 16811587 10595281 -243254 -21447546 -38369734 -28034337 258689
40335 258689 13707501 6955299 7064612 23744096 32327543 16102018 -7605152 -16465017
40327 -16465017 -11807906 -6802954 -7275453 -11963217 -13796128 386543 31537602 53311604
40319 53311604 40418245 8487030 -3023531 15434145 38746500 53048109 68355187
40312 68355187 83146617 77452773 51079647 30362569 24290885 11167432 -16488327
40305 -16488327 -32016983 -19329392 -1804855 -2968010 -10166051 -2782518 11901888
40298 11901888 17353896 16829606 17683832 10388789 -10252489 -25271030 -20509205 -14705097
40290 -14705097 -29097090 -46892976 -35318102 3046471 31332414 25665999 -2788701
$$ packed form
40343A781812J5035407n632o216306j0838535k1204292j6922188J0335397K8293026
40335B58689J3448812o752202J09313J6679484Q583447j6225525k3707170q859865
40327a6465017M657111N004952m72499m687764j832911J4182671L1151059K1774002
40319E3311604j2893359l1931215j1510561J8457676K3312355J4301609J5307078
40312F8355187J4791430n693844k6373126k0717078o071684j3123453k7655759
40305a6488327j5528656J2687591J7524537j163155p198041P383533J4684406
40298A1901888N452008n24290Q54226p295043k0641278j5018541M761825N804108
40290a4705097j4391993j7795886J1574874L8364573K8285943n666415k8454700
$$ plain form
40283 -2788701 -28775056 -35898762 -22804337 -2795651 6563649 3625334 3748265 13035640
40275 13035640 16964105 5692754 -8110592 -10533074 -6578860 -4552113 -856182 3859816
40267 3859816 -3319725 -20300814 -19758495 9442663 34591929 21812695 -14415955 -35447662
40259 -35447662 -33330041 -27389388 -21507830 -2485961 26342581 44149209 42843350 32001605
40251 32001605 19782135 12518318 21342848 42550512 46382426 16816314 -13644013
40244 -13644013 -6376267 21814961 25313123 7366973 16935521 65881462 104492357
40237 104492357 94662539 58785063 33931541 20444307 4020257 -6828775 2204375
40230 2204375 21810327 36134720 49565781 69824260 82056343 67618435 36567526
$$ packed form
40283b788701k5986355p123706J3094425K0008686R359300k938315J22931R287375
40275A3035640L928465j1271351j3803346k422482L954214K026747L695931M715998
40267C859816p179541j6981089N42319K9201158K5149266j2779234l6228650k1031707
40259c5447662K117621N940653N881558J9021869K8828542J7806628j305859j0841745
40251C2001605j2219470p263817Q824530K1207664L831914k9566112l0460327
40244a3644013P267746K8191228L498162j7946150R568548M8945941L8610895
40237A04492357r829818l5877476k4853522j3487234j6424050j0849032R033150
40230B204375J9605952J4324393J3431061K0258479J2232083j4437908l1050909
$$ plain form
40223 36567526 15610662 11747795 11129547 8243931 12760772 26364900 31575855 10888297
40215 10888297 -30593055 -66223775 -71393137 -47750992 -21954538 -14576465 -15069552 -269382
40207 -269382 26445717 35635269 15296298 -8941296 -9401940 6848932 13751205 4510734
40199 4510734 -5828783 -7768951 -6381344 -4055530 7156365 29836599 49200534 45545697
40191 45545697 16195295 -19674841 -38785466 -34807915 -20181996 -8050728 1974848
40184 1974848 16093145 29939090 29121148 6762558 -25501918 -46026765 -41476604 -19130604
40176 -19130604 -2046089 -6311844 -21483510 -22823383 -5755405 6339714 -3477552
40169 -3477552 -21078959 -26001848 -23479002 -29518849 -38121638 -32037011 -18519780 -22475101
$$ packed form
40223C6567526k0956864l862867o18248k885616M516841J3604128N210955k0687558
40215A0888297m1481352l5630720n169362K3642145K5796454P378073m93087J4800170
40207b69382K6715099R189552k0338971k4237594m60644J6250872O902273r240471
40199D510734j0339517j940168J387607K325814J1211895K2680234J9363935l654837
40191D5545697k9350402l5870136j9110625L977551J4625919J2131268J0025576
40184A974848J4118297J3845945q17942k2358590l2264476k0524847M550161K2346000
40176a9130604J7084515m265755j5171666j339873J7067978J2095119r817266
40169c477552j7601407m922889K522846o039847q602789O084627J3517231l955321
$$ plain form
40161 -22475101 -44113528 -54677718 -39976698 -19209895 -11163212 -9030413 -2303713
40154 -2303713 1001802 -7977740 -17652875 -11277116 8546961 26210344 34422403 36543798
40146 36543798 36247789 35812751 37493922 38447102 31624683 17315076 5123557 479463
40138 479463 -510963 82469 5608372 14174346 18573510 19887173 24728331 25379038 3008422
40129 3008422 -40781252 -75000233 -73571273 -42852136 -5503782 25054419 42765442
40122 42765442 41253912 25075889 14391413 22134654 37256298 42770106 37502978 28349629
40114 28349629 16516839 5378327 6034309 18899925 24840308 11880164 -4196564
40107 -4196564 -4932927 -149671 -11079439 -33240460 -39990338 -18394286 17272743 43203393
$$ packed form
40161b2475101k1638427j0564190J4701020K0766803Q046683K132799O726700
40154b303713L305515q979542r675135O375759J9824077J7663383Q212059K121395
40146C6543798k96009m35038J681171R53180o822419j4309607j2191519m644094
40138D79463r90426N93432N525903Q565974M399164J313663M841158O50707k2370616
40129C008422m3789674l4218981J428960L0719137L7348354L0558201J7711023
40122D2765442j511530j6178023j0684476P743241J5121644N513808n267128r153349
40114B8349629j1832790j1138512O55982J2865616N940383j2960144j6076728
40107d196564p36363M783256j0929768k2161021o749878K1596052L5667029K5930650
$$ plain form
40099 43203393 42799846 15016021 -18327304 -24923227 921588 26308110 23300959 7352359
40091 7352359 7465130 16867956 8760757 -11817267 -14878505 -1274986 -6009075 -37898220
40083 -37898220 -59722051 -45776800 -19714096 -10666603 -6923560 14073111 37160701
40076 37160701 30643796 801288 -15646991 -9649445 -11062893 -34497399 -48976305
40069 -48976305 -21526043 31619097 62353168 50307158 22527249 13187922 22922284
40062 22922284 27862879 17255165 5959625 9281082 19597576 17982745 2539706
40055 2539706 -8288108 -2505387 7189559 517936 -21477746 -36541984 -30690148 -15835127
40047 -15835127 -10293709 -10029113 5615158 38346265 58049593 38857724 -1581243
$$ packed form
40099D3203393m03547k7783825l3343325o595923K5844815K5386522l007151j5948600
40091G352359J12771R402826q107199k0578024l061238J3603519m734089l1889145
40083c7898220k1823831J3945251K6062704R047493L743043K0996671K3087590
40076C7160701o516905k9842508j6448279N997546j413448k3434506j4478906
40069d8976305K7450262N3145140L0734071j2046010k7779909r339327R734362
40062B2922284M940595j0607714j1295540L321457J0316494j614831j5443039
40055B539706j0827814N782721R694946o671623k1995682j5064238N851836J4855021
40047a5835127N541418K64596J5644271L2731107J9703328j9191869m0438967
$$ plain form
40040 -1581243 -18690021 2529239 27111312 15447543 -26593777 -58143350 -54795378
40033 -54795378 -31370254 -14539087 -10375333 -6826745 2189843 7637296 998951 -9221811
40025 -9221811 -5404591 13187903 21667700 -1954362 -42597589 -57738377 -25890683
40018 -25890683 27437539 59679648 55773461 34626496 23502737 37628071 73862716
40011 73862716 109628763 116437514 89892856 59304111 52420503 59552264 52055921 28152108
40003 28152108 14407902 22963131 34503328 29239905 10007332 -14248836 -44031480
39996 -44031480 -75115491 -90109968 -81254447 -65274036 -58688174 -53409422 -35336580
39989 -35336580 -13255359 -6984806 -15806475 -21258551 -15893209 -7214676 3161995 20103939
$$ packed form
40040a581243j7108778K1219260K4582073j1663769m2041320l1549573L347972
40033e4795378K3425124J6831167M163754L548588R016588N447453o638345j0220762
40025i221811L817220J8592494Q479797k3622062m0643227j5140788L1847694
40018b5890683N3328222L2242109l906187k1146965j1123759J4125334L6234645
40011G3862716L5766047O808751k6544658l0588745o883608P131761p496343k3903813
40003B8152108j3744206Q555229J1540197n263423j9232573k4256168k9782644
39996d4031480l1084011j4994477Q855521J5980411O585862N278752J8072842
39989c5336580K2081221O270553q821669n452076N365342Q678533J0376671J6941944
$$ plain form
39981 20103939 34082601 24650369 -7735082 -34295461 -33340239 -16781852 -9498087 -15823821
39973 -15823821 -20026751 -10769827 7778458 23467956 24819577 7769140 -17197576
39966 -17197576 -30010871 -21666575 -5023261 2359418 -55381 631180 11788845 28551001
39958 28551001 39921247 33925212 5988267 -27464938 -35409423 -8356569 21734195
39951 21734195 18063000 -11696567 -27130075 -12610031 5918430 5157769 -5505434
39944 -5505434 -10343429 -14693910 -26170127 -32415815 -22569599 -12983216 -23746810 -41783454
39936 -41783454 -37077644 -10017565 7252335 -2092925 -18169216 -16380825 2117406
39929 2117406 21779471 36292585 48503041 58300033 62088921 59526172 54680322 52460809
$$ packed form
39981B0103939J3978662r432232l2385451k6560379R55222J6558387P283765o325734
39973a5823821m202930R256924J8548285J5689498J351621j7050437k4966716
39966a7197576j2813295Q344296J6643314P382679k414799O86561J1157665J6762156
39958B8551001J1370246n996035k7936945l3453205p944485K7052854L0090764
39951B1734195l671195k9759567j5433508J4520044J8528461p60661j0663203
39944e505434m837995m350481j1476217o245688R846216R586383j0763594j8036644
39936d1783454M705810K7060079J7269900r345260j6076291J788391J8498231
39929B117406J9662065J4513114J2210456R796992L788888k562749m845850k219513
$$ plain form
39921 52460809 53161819 47213062 22107426 -16708640 -40804825 -29592886 804864
39914 804864 17474134 13131906 6618092 6258458 1583308 -6803642 -998044 20172598
39906 20172598 30532989 16331158 497800 6936019 23540824 24709350 11707279
39899 11707279 3954188 4554936 2538532 -933650 2678846 5639101 -4588705 -13900195
39891 -13900195 4582133 41369748 50658115 14480487 -24060163 -16640315 23000178
39884 23000178 39244600 12245315 -19004692 -15747880 9214979 16893401 -2366353
39877 -2366353 -24233510 -31834311 -33428729 -36638089 -32491575 -17538367 -8784854 -16984764
39869 -16984764 -23050447 -6254572 16830577 12288207 -17250083 -32364988 -14606880
$$ packed form
39921E2460809P01010n948757k5105636l8816066k4096185J1211939L0397750
39914H04864J6669270m342228o513814l59634m675150q386950N805598K1170642
39906B0172598J0360391j4201831j5833358O438219J6604805J168526j3002071
39899A1707279p753091O00748k016404l472182L612496K960255j0227806r311490
39891a3900195J8482328L6787615R288367l6177628l8540650P419848L9640493
39884B3000178J6244422k6999285l1250007L256812K4962859P678422j9259754
39877b366353k1867157p600801j594418l209360M146514J4953208Q753513q199910
39869a6984764o065683J6795875K3085149m542370k9538290j5114905J7758108
$$ plain form
39862 -14606880 8686823 9668586 -339614 3666486 19814786 29002716 27991296 27460437
39854 27460437 28315545 24362355 21256217 29246470 40901166 38437695 22551209 12921824
39846 12921824 17553239 21153015 10649494 -4074831 -5928001 2992344 4018955 -10402259
39838 -10402259 -22831815 -11567977 19580759 43930390 46560384 41662120 44946391
39831 44946391 44992482 23590907 -7193464 -18344354 -10067341 -10245840 -24142907 -23971596
39823 -23971596 161939 18840482 13185076 7429147 22824790 34549336 11817937
39816 11817937 -27778077 -45514956 -40504830 -37897659 -36864813 -18264924 7408030
39809 7408030 9680373 -7758638 -10588356 6473306 9800199 -15815845 -42633833 -44450251
$$ packed form
39862a4606880K3293703R81763j0008200M006100J6148300R187930j011420n30859
39854B7460437Q55108l953190l106138P990253J1654696k463471j5886486r629385
39846A2921824M631415L599776j0503521j4724325j853170Q920345J026611j4421214
39838a0402259j2429556J1263838L1148736K4349631K629994m898264L284271
39831D4946391M6091k1401575l0784371j1150890Q277013j78499j3897067J71311
39823b3971596K4133535J8678543n655406n755929J5395643J1724546k2731399
39816A1817937l9596014j7736879N010126K607171J032846J8599889K5672954
39809G408030K272343j7439011k829718J7061662L326893k5616044k6817988j816418
$$ plain form
39801 -44450251 -28794868 -13583723 -5489641 -10702685 -32813285 -51043619 -36498772
39794 -36498772 -269826 12144049 -13163932 -36985455 -27235021 -990028 13947178
39787 13947178 20212269 28161669 28646126 17941443 17111206 35273418 43909791 21035339
39779 21035339 -7551354 -7411284 9998107 11607721 -119745 2881723 22718729 37308539
39771 37308539 43979173 58682968 76302955 72941621 48164205 26952869 16737005
39764 16737005 -964692 -30150249 -47387481 -40986776 -32189104 -41512111 -57894095
39757 -57894095 -57850268 -38463042 -17238246 -10397390 -20167592 -34544356 -36053313 -19868195
39749 -19868195 -1536598 4790552 8277363 22171733 31186096 8543392 -34241737
$$ packed form
39801d4450251J5655383J5211145Q094082n213044k2110600j8230334J4544847
39794c6498772L6228946J2413875k5307981k3821523R750434K6244993J4937206
39787A3947178O265091P949400M84457j0704683q30237J8162212Q636373k2874452
39779B1035339k8586693J40070J7409391J609614j1727466L001468J9837006J4589810
39771C7308539O670634J4703795J7619987l361334k4777416k1211336j0215864
39764A6737005j7701697k9185557j7237232O400705Q797672r323007j6381984
39757e7894095M3827J9387226K1224796O840856r770202j4376764j508957J6185118
39749a9868195J8331597O327150L486811J3894370R014363k2642704m2785129
$$ plain form
39742 -34241737 -49694029 -18316898 21372033 25632423 925907 -18155176 -23405254
39735 -23405254 -32763286 -47506045 -45187041 -17764810 11823198 21322997 17157163 17871271
39727 17871271 23713923 18712699 -2240307 -23055587 -25871843 -12448009 -1060319
39720 -1060319 -4799063 -17168695 -20416755 -7038799 9527415 9109501 -9685951 -24013645
39712 -24013645 -13391451 12358599 24123426 13764682 6945628 25270558 51232565
39705 51232565 50997606 22928096 -2206960 -7741496 -9145216 -18691976 -21437788 -4012427
39697 -4012427 15986628 12989263 -9267566 -26699461 -29792090 -26330878 -18798728 -4986081
39689 -4986081 3779455 -8088937 -32403153 -43338896 -35130348 -29918089 -41421253 -53699419
$$ packed form
39742c4241737j5452292L1377131L9688931M260390k4706516j9081083n250078
39735b3405254r358032j4742759K319004K7422231K9588008R499799m165834P14108
39727A7871271N842652n001224k0953006k0815280k816256J3423834J1387690
39720a060319l738744j2369632l248060J3377956J6566214m17914j8795452j4327694
39712b4013645J0622194K5750050J1764827j0358744o819054J8324930K5962007
39705E1232565k34959k8069510k5135056n534536j403720r546760k745812J7425361
39697d012427J9999055k997365k2256829j7431895l092629L461212P532150J3812647
39689d986081Q765536j1868392k4314216j0935743Q208548N212259j1503164j2278166
$$ plain form
39681 -53699419 -47347996 -27498142 -11413416 -2950473 5040091 13058961 15464203 13395314
39673 13395314 13542003 15641833 11584738 -3268089 -25811575 -52348169 -82513972 -112761556
39665 -112761556 -129977588 -117533146 -71667255 -11790198 30403709 36779718 16737929
39658 16737929 -6806541 -21340154 -29418816 -33843578 -29001219 -10433044 13821966
39651 13821966 28001995 24298109 10079275 -1999694 -8288629 -13906679 -19661728 -19502227
39643 -19502227 -15843735 -23823714 -46155628 -56457224 -31673667 6294202 13577295
39636 13577295 -10391654 -19451290 5542522 22800074 -2759437 -38426235 -34090275
39629 -34090275 -3805205 -2135616 -34356110 -50217632 -27755150 -4183744 -8525733
$$ packed form
39681e3699419O351423J9849854J6084726Q462943P990564Q018870K405242k068889
39673A3395314J46689K099830m057095j4852827k2543486k6536594l0165803l0247584
39665a12761556j7216032J2444442M5865891N9877057M2193907O376009k0041789
39658A6737929k3544470j4533613q078662m424762M842359J8568175K4255010
39651A3821966J4180029l703886j4218834j2078969o288935n618050n755049J59501
39643a9502227L658492p979979k2331914j0301596K4783557L7967869P283093
39636A3577295k3968949r059636K4993812J7257552k5559511l5666798M335960
39629c4090275L0285070J669589l2220494j5861522K2462482K3571406m341989
$$ plain form
39622 -8525733 -17403339 -4380868 12717684 9631548 5491795 32512624 76720785 91030916
39614 91030916 60319801 18211263 -1719542 -3367190 -10308756 -29839872 -44877230
39607 -44877230 -35854979 -6561509 14169164 3407134 -24469860 -31198479 -2477759
39600 -2477759 34177353 46026632 32055087 14094822 9017344 21522255 46553843
39593 46553843 64506629 51315934 9832168 -24694919 -27679363 -18205079 -30292703
39586 -30292703 -65968672 -97263781 -101950337 -77550898 -33959013 6278278 15151678
39579 15151678 -8444676 -26985245 -11305029 15447451 12941869 -10652386 -9324998
39572 -9324998 28004283 59830854 56078618 39252466 42659795 59394488 58144942 30697637
$$ packed form
39622h525733q877606J3022471J7098552l086136m139753K7020829M4208161J4310131
39614I1030916l0711115m2108538j9930805j647648o941566j9531116j5037358
39607d4877230R022251K9293470K0730673j0762030k7876994o728619K8720720
39600b477759L6655112J1849279j3971545j7960265n077478J2504911K5031588
39593D6553843J7952786j3190695m1483766l4527087k984444R474284j2087624
39586c0292703l5675969l1295109m686556K4399439M3591885M0237291Q873400
39579A5151678k3596354j8540569J5680216K6752480k505582k3594255J327388
39572i324998L7329281L1826571l752236j6826152L407329J6734693j249546k7447305
$$ plain form
39564 30697637 406449 -8228768 6210351 23151058 19285503 -6955525 -31134345
39557 -31134345 -33363575 -26040770 -32055349 -44086381 -35840236 -10560959 -47216 -9554865
39549 -9554865 -6333562 20554853 33200783 6738496 -22145997 -9891106 22294879
39542 22294879 21760888 -10095893 -21364818 5822434 29244775 15384338 -13431837
39535 -13431837 -21068054 -9092682 -804122 -1450829 -1276605 123704 -3018134 -7084102
39527 -7084102 -6391040 -5848558 -9862921 -10153656 -1959601 -587837 -20809517 -47814594
39519 -47814594 -51733150 -28723266 -5638194 -1713941 -6016773 -51073 13963552 19054806
39511 19054806 8690451 -4647468 -3575643 16363295 40936198 48487515 31405632
$$ packed form
39564C0697637l0291188q635217J4439119J6940707l865555k6241028k4178820
39557c1134345k229230P322805o014579j2031032Q246145K5279277J0513743r507649
39549i554865L221303K6888415J2645930k6462287k8884493J2254891L2185985
39542B2294879n33991l1856781j1268925K7187252K3422341j3860437k8816175
39535a3431837p636217J1975372Q288560o46707J74224J400309l141838m065968
39527g084102O93062N42482m014363k90735Q194055J371764k0221680k7005077
39519d7814594l918556K3009884K3085072L924253m302832N965700J4014625N091254
39511A9054806j0364355j3337919J071825J9938938K4572903P551317j7081883
$$ plain form
39504 31405632 6087139 -5233237 -2601255 -8617376 -36971509 -70614014 -80150035
39497 -80150035 -59305610 -32826346 -28474941 -46828165 -61813934 -50221259 -17884089
39490 -17884089 7708944 11583221 9399860 22646522 43584691 43172669 14633578 -12461185
39482 -12461185 -12375628 1842062 2324728 -9471608 -8851998 7860736 15295944 844815
39474 844815 -13059460 -3031753 20541746 32487077 30359453 29210886 29106969 16014830
39466 16014830 -5515689 -8895491 15527161 40736307 37812755 13760699 -3690231
39459 -3690231 -6338469 -7902251 -12652242 -8015252 7873428 15435256 2024691 -17699738
39451 -17699738 -24720306 -23661115 -29380151 -37346504 -30086066 -7884357 9962443 13645229
$$ packed form
39504C1405632k5318493j1320376K631982o016121k8354133l3642505r536021
39497h0150035K0844425K6479264M351405j8353224j4985769J1592675L2337170
39490a7884089K5593033L874277k183361J3246662K0938169m12022k8539091k7094763
39482a2461185Q5557J4217690M82666j1796336O19610J6712734P435208j4451129
39474H44815j3904275J0027707K3573499J1945331k127624j148567j03917j3092139
39466A6014830k1530519l379802K4422652K5209146k923552k4052056j7450930
39459c690231k648238j563782m749991M636990J5888680P561828j3410565j9724429
39451a7699738p020568J059191n719036p966353P260438K2201709J7846800L682786
$$ plain form
39443 13645229 10092155 1175383 -19120395 -39408111 -31342142 8773380 43179061
39436 43179061 38802751 10808292 -3676462 1663838 3985144 -6647560 -18645345
39429 -18645345 -27120200 -39201616 -50623489 -46084611 -26940200 -12968565 -13069411 -18957019
39421 -18957019 -29110599 -49394222 -66280590 -54042632 -19401254 -4325435 -27481980
39414 -27481980 -55719488 -54697221 -35649073 -25667793 -22504057 -12284163 -6411309 -22130669
39406 -22130669 -43825164 -42346625 -21424473 -8730162 -10780578 -13069341 -16021638 -31252270
39398 -31252270 -46385940 -34278582 1093918 25461470 23921054 13655836 4882716
39391 4882716 -10954247 -27770328 -22346533 1225012 5843214 -20176274 -36991649
$$ packed form
39443A3645229l553074q916772k0295778k0287716Q065969M0115522L4405681
39436D3179061m376310k7994459j4484754N340300K321306j0632704j1997785
39429a8645345q474855j2081416j1421873M538878J9144411J3971635j00846n887608
39421a8957019j0153580k0283623j6886368J2237958L4641378J5075819k3156545
39414b7481980k8237508J022267J9048148R981280L163736J0219894N872854j5719360
39406b2130669k1694495J478539K0922152J2694311k050416k288763k952297j5230632
39398c1252270j5133670J2107358L5372500K4367552j540416j0265218q773120
39391D882716j5836963j6816081N423795K3571545M618202k6019488j6815375
$$ plain form
39384 -36991649 -10406645 37756949 63972654 59757334 45911274 34705994 27589366
39377 27589366 30646410 42974099 45192592 25556586 2244613 -4545589 -5112055 -18199308
39369 -18199308 -34117028 -30818994 -13318535 -5065490 -9465179 -10851753 -6112264 -4755339
39361 -4755339 -3888459 5602580 12440164 -3232797 -32696523 -44766151 -30108845 -9364140
39353 -9364140 4057687 16954543 28000113 20942270 -2729245 -15670723 -4778182
39346 -4778182 7562096 -347785 -16291520 -17428059 -6941529 -4387778 -12291763 -14802026
39338 -14802026 -4222656 8711822 10314948 -380308 -10643117 -5557214 14541760
39331 14541760 28505235 16785673 -10871201 -25163740 -15977831 -2441284 86249
$$ packed form
39384c6991649K6585004M8163594K6215705m215320j3846060j1205280p116628
39377B7589366L057044J2327689K218493j9636006k3311973o790202n66466j3087253
39369a8199308j5917720L298034J7500459Q253045m399689j386574M739489J356925
39361d755339Q66880R491039O837584j5672961k9463726j2069628J4657306K0744705
39353i364140J3421827J2896856J1045570p057843k3671515j2941478J0892541
39346d778182J2340278p909881j5943735j136539J0486530K553751p903985k510263
39338a4802026J0579370J2934478J603126j0695256j0262809N085903K0098974
39331A4541760J3963475j1719562k7656874j4292539R185909J3536547K527533
$$ plain form
39324 86249 267540 7436838 11229096 2180245 -6540164 890207 16517245 24766302
39316 24766302 31358213 49031637 63558980 46101810 357176 -33466011 -31350062
39309 -31350062 -15936505 -18624553 -32641440 -27000521 4228748 32790608 37058644
39302 37058644 29078024 30471531 38141171 32561728 13564370 4851601 16007721 20221272
39294 20221272 -10592343 -58345170 -72657934 -36489847 6485781 6671441 -26048001
39287 -26048001 -36914530 -1915099 39176576 35930092 -8296612 -46265298 -50239202
39280 -50239202 -38704945 -38018833 -44729148 -41755098 -31424468 -27475420 -25149958 -8042283
39272 -8042283 17785193 26830171 15800758 11040783 23236433 27344595 7287364 -11887649
$$ packed form
39324H6249J81291P169298L792258r048851q720409P430371J5627038Q249057
39316B4766302O591911J7673424J4527343j7457170m5744634l3823187K115949
39309c1350062J5413557k688048j4016887N640919L1229269K8561860M268036
39302C7058644p980620J393507P669640n579443j8997358q712769J1156120M213551
39294B0221272l0813615m7752827j4312764L6168087M2975628J85660l2719442
39287b6048001j0866529L4999431M1091675l246484m4226704l7968686l973904
39280e0239202J1534257O86112o710315K974050J0330630L949048K325462J7107675
39272h042283K5827476R044978j1029413m759975J2195650M108162k0057231j9175013
$$ plain form
39264 -11887649 -6028399 3634229 -11886171 -30451870 -8121799 43705027 66387623
39257 66387623 42149633 18220243 27725255 40161492 19297110 -15427973 -23692283
39250 -23692283 -6609993 6415538 8684122 13992754 21561642 22093722 25172732 42715821
39242 42715821 56583093 42315638 17229651 22185395 56317927 72815597 46398636
39235 46398636 4941484 -17790667 -22522979 -20256629 -4690932 24092842 37351070
39228 37351070 12532279 -26605377 -37138189 -14969470 5100688 3707357 106538
39221 106538 15292605 39052969 47865724 36938659 17956971 -1608694 -17426622
39214 -17426622 -15019101 17459828 60354195 70726836 33725431 -11213039 -14862737
$$ packed form
39264a1887649N859250R662628j5520400j8565699K2330071N1826826K2682596
39257F6387623k4237990k3929390R505012J2436237k0864382l4725083q264310
39250b3692283J7082290J3025531K268584N308632P568888N32080L079010J7543089
39242D2715821J3867272j4267455k5085987M955744L4132532J6497670k6416961
39235D6398636m1457152k2732151m732312K266350J5565697K8783774J3258228
39228C7351070k4818791l9137656j0532812K2168719K0070158j393331l600819
39221A06538J5186067K3760364Q812755j0927065j8981688j9565665j5817928
39214a7426622K407521L2478929M2894367J0372641l7001405m4938470l649698
$$ plain form
39207 -14862737 21621974 52947047 50121338 29003405 17259902 19630753 25574044
39200 25574044 28371266 23134251 5310779 -14434289 -12776883 12562558 30853087
39193 30853087 19715259 -768468 -167186 13386135 7810006 -20088482 -40408086
39186 -40408086 -35155301 -14543333 11553050 44019802 70274320 63738408 22463020
39179 22463020 -18142609 -27267297 -11966909 5251051 18489857 29084376 25521249
39172 25521249 -1001361 -32082357 -38452236 -17772257 3631182 5888329 -4989934
39165 -4989934 -14277418 -18430754 -20363684 -16543575 -1605194 16024547 15737673 -9471427
39157 -9471427 -35023396 -27291041 13027016 45413214 37167996 2301713 -22401978
$$ packed form
39207a4862737L6484711L1325073k825709k1117933j1743503K370851N943291
39200B5574044K797222n237015j7823472j9745068J657406K5339441J8290529
39193C0853087j1137828k0483727O01282J3553321n576129k7898488k0319604
39186d0408086N252785K0611968K6096383L2466752K6254518o535912m1275388
39179B2463020m0605629r124688J5300388J7217960J3238806J0594519l563127
39172B5521249k6522610l1080996o369879K0679979K1403439K257147j0878263
39165d989934r287484m153336j932930L820109J4938381J7629741k86874k5209100
39157i471427k5551969P732355M0318057L2386198q245218l4866283k4703691
$$ plain form
39150 -22401978 -26786604 -29757765 -39887948 -42096241 -26899250 -7789038 37706 -280355
39142 -280355 2227892 10623482 22017642 31757958 30788768 13049897 -11128975 -24644065
39134 -24644065 -28273384 -36529506 -47254204 -40157038 -12406217 10791799 13017770 8801410
39126 8801410 14849630 25093211 32198749 46764159 70164204 72679247 31110836 -27452328
39118 -27452328 -52874522 -34862893 -8135778 176994 -2304050 601618 8295376 11961732
39110 11961732 9802419 6602361 8482599 18528448 29505605 27601621 14071570 11364003
39102 11364003 31292246 50392047 40066332 10390294 -4319350 2992007 7161850
39095 7161850 -2774514 -6098490 11571538 32390400 33988149 21468112 15264921 21700992
$$ packed form
39150b2401978m384626k971161j0130183k208293J5196991J9110212P826744l18061
39142b80355K508247Q395590J1394160R740316r69190j7738871k4178872j3515090
39134b4644065l629319q256122j0724698P097166K7750821K3198016K225971m216360
39126H801410O048220J0243581P105538J4565410K3400045K515043m1568411n8563164
39118b7452328k5422194J8011629K6727115Q312772k481044K905668P693758L666356
39110A1961732k159313l200058J880238J0045849J0977157j903984j3530051k707567
39102A1364003J9928243J9099801j0325715k9676038j4709644P311357M169843
39095G161850r936364l323976J7670028K0818862J597749j2520037o203191O436071
$$ plain form
39087 21700992 29718559 27331671 12373230 -4718270 -5396293 17739027 44336160 45132850
39079 45132850 21229985 5854309 19131735 39775165 34613572 2278151 -26444864
39072 -26444864 -23450743 11205117 50975645 63384020 37851467 -1495946 -19825577
39065 -19825577 -10973221 -664372 -9065235 -27842967 -39696937 -40537858 -32122829 -12477138
39057 -12477138 11871996 21567929 9314233 -5434827 -4149542 1945901 -9703292
39050 -9703292 -36724043 -54901044 -50329807 -29448370 -3955554 14741946 12615733
39043 12615733 -13251088 -40165560 -39575367 -11504269 17813309 30184697 28489439
39036 28489439 19008154 4672991 -2715247 11186486 37539734 47202137 28298299
$$ packed form
39087B1700992Q017567k386888j4958441j7091500o78023K3135320K6597133P96690
39079D5132850k3902865j5375676J3277426K0643430n161593l2335421k8723015
39072b6444864K994121L4655860L9770528J2408375k5532553l9347413j8329631
39065a9825577Q852356J0308849q400863j8777732j1853970q40921Q415029J9645691
39057a2477138K4349134R695933j2253696j4749060J285285O095443j1649193
39050i703292k7020751j8177001M571237K0881437K5492816J8697500k126213
39043A2615733k5866821k6914472N90193K8071098K9317578J2371388j695258
39036B8489439r481285j4335163p388238J3901733K6353248R662403j8903838
$$ plain form
39029 28298299 226906 -18874998 -34979110 -54036535 -59438969 -37514285 -8280072
39022 -8280072 -2662602 -18340312 -26649190 -19330799 -17756351 -31100147 -35371207 -9965622
39014 -9965622 26261118 36574726 13069046 -18107455 -33540447 -35641915 -37220329
39007 -37220329 -39254822 -33086002 -17250873 -3027402 -3207681 -18500664 -35191253 -36567722
38999 -36567722 -19443221 116595 1699512 -15749693 -28835985 -14728956 19147870
38992 19147870 39096476 24480852 -4286509 -9479757 14035359 30175545 11333850
38985 11333850 -20480464 -22329169 8985475 32176239 19915319 -6245443 -13459150
38978 -13459150 -5607723 -9566179 -28910645 -40238061 -30743774 -12674432 37835
$$ packed form
39029B8298299k8071393j9101904j6104112j9057425n402434K1924684K9234213
39022h280072N617470j5677710q308878P318391J574448j3343796m271060K5405585
39014i965622L6226740J0313608k3505680l1176501j5432992k101468j578414
39007c7220329k034493O168820J5835129J4223471j80279j5292983j6690589j376469
38999c6567722J7124501J9559816J582917j7449205j3086292J4107029L3876826
38992A9147870J9948606j4615624k8767361n193248K3515116J6140186j8841695
38985A1333850l1814314j848705L1314644K3190764j2260920k6160762p213707
38978a3459150P851427l958456j9344466j1327416R494287J8069342J2712267
$$ plain form
38971 37835 4957683 -1106051 -21274439 -39004275 -26931267 11153168 32894361 11923390
38963 11923390 -22128694 -23867102 4068566 18502818 -112635 -23234127 -17640657
38956 -17640657 13236105 41243712 47873964 35670397 18189454 9003769 13487056
38949 13487056 24563045 30114122 25569063 15002640 4112550 362934 13006324
38942 13006324 38875366 54674577 42783092 20497662 19045939 33886734 27074717
38935 27074717 -11534803 -39088093 -18697332 23445605 32317745 -980920 -34609564
38928 -34609564 -39717124 -30460458 -24991699 -13502511 14519442 37054128 22624986
38921 22624986 -22226216 -54112817 -43979173 -9806743 8371847 -5030201 -28566405
$$ packed form
38971C7835M919848o063734k0168388j7729836J2073008L8084435K1741193k0970971
38963A1923390l4052084j738408K7935668J4434252j8615453k3121492N593470
38956a7640657L0876762K8007607O630252j2203567j7480943r185685M483287
38949A3487056J1075989N551077m545059j0566423j0890090l749616J2643390
38942A3006324K5869042J5799211j1891485k2285430j451723J4840795o812017
38935B7074717l8609520k7553290K0390761M2142937Q872140l3298665l3628644
38928c4609564n107560R256666N468759J1489188K8021953K2534686j4429142
38921B2624986m4851202l1886601J0133644L4172430J8178590j3402048k3536204
$$ plain form
38914 -28566405 -32591168 -11077756 17132016 32134552 31036425 23025156 14887262 7887980
38906 7887980 4691804 9366783 18571278 21237906 12767843 3843491 7353421 19367089
38898 19367089 22334519 8236125 -10282377 -15920996 -5851110 11673671 31387623
38891 31387623 49466704 53340627 31940098 291268 -5028322 31379917 78415182
38884 78415182 92951225 70855222 43552083 29741862 17846124 691056 -2645109
38877 -2645109 20496105 43288517 28599960 -15462881 -38539320 -12036666 33255494
38870 33255494 46153245 15155924 -26854891 -47586330 -44671383 -31061004 -11624419
38863 -11624419 14702334 40573366 52587585 46735495 31800000 17520499 8169113
$$ packed form
38914b8566405m024763K1513412K8209772J5002536j098127q011269q137894o999282
38906G887980l196176M674979R204495K666628q470063q924352L509930J2013668
38898A9367089K967430j4098394j8518502n638619J0069886J7524781J9713952
38891C1387623J8079081L873923k1400529l1648830n319590L6408239M7035265
38884G8415182J4536043k2096003k7303139j3810221j1895738j7155068l336165
38877b645109K3141214K2792412j4688557m4062841k3076439K6502654M5292160
38870C3255494J2897751l0997321m2010815k0731439K914947J3610379J9436585
38863a1624419K6326753K5871032J2014219n852090j4935495j4279501r351386
$$ plain form
38856 8169113 7674024 19207122 35216131 39512610 27769595 15893536 16935778 19691189
38848 19691189 6777184 -13086135 -13616949 7094004 17485289 -3999479 -36688082
38841 -36688082 -46006334 -29593904 -14362566 -15556839 -21781475 -20862692 -18514410 -22379522
38833 -22379522 -23310692 -6873143 22300935 40251036 29553631 -688905 -23789831
38826 -23789831 -22714092 -6021553 4192366 -1807759 -11759537 -8372183 9718603 28593881
38818 28593881 36784965 35794883 33941741 35999827 40326154 42196059 38321983 29717253
38810 29717253 19572306 7085512 -12517743 -36488594 -46910956 -25463463 20761616
38803 20761616 57320523 55095973 22027268 -5830970 -4671924 14101142 24491829
$$ packed form
38856H169113m95089J1533098J6009009M296479j1743015j1876059J042242K755411
38848A9691189j2914005j9863319n30814K0710953J0391285k1484768l2688603
38841c6688082r318252J6412430J5231338j194273o224636R18783K348282l865112
38833b2379522r31170J6437549K9174078J7950101j0697405l0242536k3100926
38826b3789831J075739J6692539J0213919o000125r951778L387354J8090786J8875278
38818B8593881Q191084r90082j853142K058086M326327J869905l874076q604730
38810B9717253j0144947j2486794j9603255k3970851j0422362K1447493M6225079
38803B0761616L6558907k224550l3068705k7858238J159046J8773066J0390687
$$ plain form
38796 24491829 20439743 18944955 30937211 42589020 33278239 4616171 -19211323
38789 -19211323 -19275290 -1958396 10304980 2908236 -17877830 -32064188 -25103463 -1563722
38781 -1563722 21474860 34585635 42708792 48899378 43939981 24416304 10259709 23676677
38773 23676677 54120317 67017683 49618394 25054343 14652076 11270986 2694529
$$ packed form
38796B4491829m052086j494788J1992256J1651809r310781k8662068k3827494
38789a9211323o3967J7316894J2263376p396744k0786066j4186358O960725K3539741
38781a563722K3038582J3110775Q123157O190586m959397j9523677j4156595J3416968
38773B3676677L0443640J2897366j7399289k4564051j0402267l381090q576457
$$ [...]
##END NTUPLES=NMR SPECTRUM
##END=
