##TITLE=31Pdec_5DPAA1312
 CDCl3, 24 sc
 14.12.2021
##JCAMPDX= 6.0         $$ Bruker NMR JCAMP-DX V2.0
##DATA TYPE= NMR SPECTRUM
##DATA CLASS= NTUPLES
##ORIGIN= UXNMR, Bruker Analytische Messtechnik GmbH
##OWNER= root
$$ XWIN-NMR		Version 3.5
$$ Tue Dec 14 12:27:26 2021 Russian Standard Time (UT+4h)  she@DPX200
##.OBSERVE FREQUENCY= 81.013821
##.OBSERVE NUCLEUS= ^31P
##.ACQUISITION MODE= SIMULTANEOUS
##.ACQUISITION SCHEME= undefined
##.AVERAGES= 24
##.DIGITISER RES= 16
##SPECTROMETER/DATA SYSTEM= spect
##.PULSE SEQUENCE= zgpg30
##.SOLVENT NAME= CDCl3
##.SHIFT REFERENCE= (INTERNAL, CDCl3, 0, 248.564)
##AUDIT TRAIL= $$ (NUMBER, WHEN, WHO, WHERE, WHAT)
$$ ##TITLE= Audit trail, XWIN-NMR		Version 3.5
$$ ##JCAMPDX= 5.01
$$ ##ORIGIN= Bruker BioSpin GmbH
$$ ##OWNER= she
$$ F:/spectra/data/she/nmr/P31/1/pdata/1/auditp.txt
$$ ##AUDIT TRAIL=  $$ (NUMBER, WHEN, WHO, WHERE, WHAT)
(   1,<2021-12-14 12:26:15.54 +0400>,<she>,<DPX200>,
      <created by zg, POWCHK disabled, PULCHK disabled
       configuration hash MD5:
       00 E9 B6 7A A2 85 ED C7 34 08 36 98 17 FE 4E 26
       data hash MD5: 32K
       76 A8 EB 59 9C B6 54 CC 2F 88 24 94 42 F3 F3 23>)
(   2,<2021-12-14 12:26:18.60 +0400>,<she>,<DPX200>,
      <Start of raw data processing
       efp BC_mod = 2 LB = 1 FT_mod = 6 PKNL = 1 PHC0 = -9021.394 PHC1 = -264.13 SI = 64K 
       data hash MD5: 64K
       40 EF 82 65 C8 F9 93 B5 2F E7 5B 23 CC 80 81 24>)
(   3,<2021-12-14 12:26:38.10 +0400>,<she>,<DPX200>,
      <pk PHC0 = -6.301833 PHC1 = 0 
       data hash MD5: 64K
       95 6B 04 7A ED 04 C1 A2 63 51 A8 99 67 E0 23 76>)
(   4,<2021-12-14 12:26:58.17 +0400>,<she>,<DPX200>,
      <abs ABSG = 5 
       data hash MD5: 64K
       82 65 BD BF B2 32 B2 11 28 98 08 0F 09 95 57 37>)
$$ ##END=
$$ 
$$ hash MD5
$$ 25 7E D2 10 92 52 39 85 FB 51 70 79 09 BA 71 61
##$RELAX= 
##$RELAX= 
##$RELAX= 
##$RELAX= 
##$RELAX= 
##$RELAX= 
##$RELAX= 
##$RELAX= 
$$ Bruker specific parameters
$$ --------------------------
##$DU= <F:/spectra>
##$EXPNO= 1
##$NAME= <P31>
##$PROCNO= 1
##$TYPE= <nmr>
##$USER= <she>
##$AMP= (0..31)
100 100 100 100 100 100 100 100 100 100 100 100 100 100 100 100 100 100 
100 100 100 100 100 100 100 100 100 100 100 100 100 100 
##$AQSEQ= 0
##$AQ_mod= 1
##$AUNM= <au_zg>
##$AUTOPOS= <>
##$BF1= 81.014009
##$BF2= 200.13
##$BF3= 200.13
##$BF4= 200.13
##$BF5= 200.13
##$BF6= 200.13
##$BF7= 200.13
##$BF8= 200.13
##$BYTORDA= 1
##$CFDGTYP= 0
##$CFRGTYP= 5
##$CHEMSTR= <none>
##$CNST= (0..31)
1 1 145 1 1 1 1 1 1 1 1 1 1 1 1 1 1 1 1 1 1 1 1 1 1 1 1 1 1 1 1 1 
##$CPDPRG= <waltz16>
##$CPDPRG1= <>
##$CPDPRG2= <waltz16>
##$CPDPRG3= <>
##$CPDPRG4= <mlev>
##$CPDPRG5= <mlev>
##$CPDPRG6= <mlev>
##$CPDPRG7= <mlev>
##$CPDPRG8= <mlev>
##$CPDPRGB= <>
##$CPDPRGT= <>
##$D= (0..31)
0 1 0 0 0 0 0 0 0 0 0 0.03 2e-05 3e-06 0 0 0 0 0 0 0 0 0 0 0 0 0 0 0 0 
0 0 
##$DATE= 1639470374
##$DBL= (0..7)
120 120 120 11 120 120 24 19 
##$DBP= (0..7)
150 150 150 150 150 150 150 150 
##$DBP07= 0
##$DBPNAM0= <>
##$DBPNAM1= <>
##$DBPNAM2= <>
$$ [...]
##$SUBNAM3= <"">
##$SUBNAM4= <"">
##$SUBNAM5= <"">
##$SUBNAM6= <"">
##$SUBNAM7= <"">
##$SUBNAM8= <"">
##$SUBNAM9= <"">
##$SW= 501.771253377433
##$SWIBOX= (0..15)
0 1 3 0 0 0 0 0 0 0 0 0 0 0 0 0 
##$SW_h= 40650.406504065
##$TD= 32768
##$TD0= 1
##$TE= 0
##$TE2= 300
##$TE3= 300
##$TEG= 300
##$TL= (0..7)
0 120 53 12 22 120 120 120 
##$TP= (0..7)
150 150 150 150 150 150 150 150 
##$TP07= 0
##$TPNAME0= <>
##$TPNAME1= <>
##$TPNAME2= <>
##$TPNAME3= <>
##$TPNAME4= <>
##$TPNAME5= <>
##$TPNAME6= <>
##$TPNAME7= <>
##$TPOAL= (0..7)
0.5 0.5 0.5 0.5 0.5 0.5 0.5 0.5 
##$TPOFFS= (0..7)
0 0 0 0 0 0 0 0 
##$TUNHIN= 0
##$TUNHOUT= 0
##$TUNXOUT= 0
##$USERA1= <user>
##$USERA2= <user>
##$USERA3= <user>
##$USERA4= <user>
##$USERA5= <user>
##$V9= 5
##$VALIST= <valist>
##$VCLIST= <CCCCCCCCCCCCCCC>
##$VD= 0
##$VDLIST= <DDDDDDDDDDDDDDD>
##$VPLIST= <PPPPPPPPPPPPPPP>
##$VTLIST= <TTTTTTTTTTTTTTT>
##$WBST= 1024
##$WBSW= 4
##$XGAIN= (0..3)
0 0 0 0 
##$XL= 0
##$YL= 0
##$YMAX_a= 6723
##$YMIN_a= -7440
##$ZGOPTNS= <>
##$ZL1= 120
##$ZL2= 120
##$ZL3= 120
##$ZL4= 120
##$ABSF1= 248.5645
##$ABSF2= -253.2056
##$ABSG= 5
##$ABSL= 3
##$ALPHA= 0
##$AQORDER= 0
##$ASSFAC= 0
##$ASSFACI= 0
##$ASSFACX= 0
##$ASSWID= 0
##$AUNMP= <proc_1d>
##$AZFE= 0.1
##$AZFW= 0.5
##$BCFW= 0
##$BC_mod= 2
##$BYTORDP= 0
##$COROFFS= 0
##$CY= -3
##$DATMOD= 1
##$DC= 0
##$DFILT= <>
##$DTYPP= 0
##$F1P= 0
##$F2P= 0
##$FCOR= 1
##$FTSIZE= 65536
##$FT_mod= 6
##$GAMMA= 0
##$GB= 0
##$INTBC= 1
##$INTSCL= 5.30512e-09
##$ISEN= 30
##$LB= 1
##$LEV0= 0
##$LPBIN= 0
##$MAXI= 10000
##$MC2= 0
##$MEAN= 0
##$ME_mod= 0
##$MI= 50
##$NCOEF= 0
##$NC_proc= -8
##$NLEV= 6
##$NOISF1= 182.463
##$NOISF2= 159.3651
##$NSP= 0
##$NTH_PI= 0
##$NZP= 0
##$OFFSET= 248.5645
##$PC= 4
##$PHC0= -9027.695
##$PHC1= -264.13
##$PH_mod= 1
##$PKNL= yes
##$PPARMOD= 0
##$PSCAL= 0
##$PSIGN= 0
##$REVERSE= no
##$SF= 81.014009
##$SI= 65536
##$SIGF1= 159.3651
##$SIGF2= -187.1042
##$SINO= 113.3802
##$SIOLD= 16384
##$SREGLST= <1H.CDCl3>
##$SSB= 0
##$STSI= 65536
##$STSR= 0
##$SW_p= 40650.406504065
##$SYMM= 0
##$S_DEV= 0
##$TDeff= 32768
##$TDoff= 0
##$TI= <>
##$TILT= no
##$TM1= 0
##$TM2= 0
##$TOPLEV= 0
##$USERP1= <user>
##$USERP2= <user>
##$USERP3= <user>
##$USERP4= <user>
##$USERP5= <user>
##$WDW= 1
##$XDIM= 65536
##$YMAX_p= 374678328
##$YMIN_p= -206657277
$$ End of Bruker specific parameters
$$ ---------------------------------
##NTUPLES= NMR SPECTRUM
##VAR_NAME=  FREQUENCY,     SPECTRUM/REAL,   SPECTRUM/IMAG
##SYMBOL=    X,             R,               I
##VAR_TYPE=  INDEPENDENT,   DEPENDENT,       DEPENDENT
##VAR_FORM=  AFFN,          ASDF,            ASDF
##VAR_DIM=   65536,         65536,           65536
##UNITS=     HZ,            ARBITRARY UNITS, ARBITRARY UNITS
##FACTOR=    0.620285442955139, 1,           1
##FIRST=     20137.2065510759, 0,            0
##LAST=      -20513.1999529892, 0,           0
##MIN=       -20513.1999529892, -206657277,  0
##MAX=       20137.2065510759, 374678328,    0
$$ Real data points
##PAGE= N=1
##DATA TABLE= (X++(R..R)), XYDATA
$$ [...]
$$ plain form
39929 225361 -2422542 -1279486 -398305 -1965306 -2701614 -994860 -719947 -3897440 -5526367
39920 -5526367 -1130638 5084693 5722275 837164 -3113522 -3141704 -2169217 -2101515 -960242
39911 -960242 1648946 1861154 -2516149 -7235215 -6668951 -1881465 -15891 -5620350 -15149836
39902 -15149836 -21082881 -20107747 -15778082 -13310317 -13428179 -12656002 -8885979 -4399337
39894 -4399337 -2568066 -3278512 -3268585 -352885 4134236 7102322 7097003 5804813 6239130
39885 6239130 9113721 11422145 9777424 4924767 1091769 548040 1043306 -258059
39877 -258059 -2465284 -2466135 692586 4873413 7448565 7277072 4858652 1869805 -104472
39868 -104472 -1237017 -2842376 -4602137 -4390337 -1960539 -379315 -1828164 -4223272
$$ packed form
39929B25361k647903J143056Q81181j567001p36308J706754K74913l177493j628927
39920e526367M395729O215331O37582m885111l950686k8182R72487O7702J141273
39911i60242K609188K12208m377303m719066N66264M787486J865574n604459r529486
39902a5149836n933045R75134M329665K467765j17862P72177L770023M486642
39894d399337J831271p10446R927K915700M487121K968086n319j292190M34317
39885F239130K874591K308424j644721m852657l832998n43729M95266j301365
39877b58059k207225q51L158721M180827K575152j71493k418420k988847j974277
39868a04472j132545j605359j759761K11800K429798J581224j448849k395108
$$ plain form
39860 -4223272 -4462418 -2946413 -1950874 -1401407 188126 1879280 1267655 -1298740 -3156838
39851 -3156838 -3768753 -5072137 -7271168 -7984778 -6342478 -4606303 -4594284 -5254549 -4914395
39842 -4914395 -3618986 -2333448 -1836277 -2841780 -5128842 -6535213 -5338413 -3498436
39834 -3498436 -4415592 -7362190 -7759928 -3676991 1641258 4821288 6267245 7594103
39826 7594103 8812266 9871946 11528436 12709737 10518525 5051342 710051 301545
39818 301545 1440523 1457398 1779966 3821174 4591990 1321839 -2630134 -1918093 2769336
39809 2769336 6192427 6537713 6350054 6440889 4832384 2003955 1495897 4073025 6225119
39800 6225119 5951469 5382586 5812434 4753552 773256 -2558165 -1091274 3931965 7558390
$$ packed form
39860d223272k39146J516005R95539N49467J589533J691154o11625k566395j858098
39851c156838o11915j303384k199031p13610J642300J736175J2019o60265L40154
39842d914395J295409J285538M97171j005503k287062j406371J196800J839977
39834c498436r17156k946598l97738M082937N318249L180030J445957J326858
39826G594103J218163J059680J656490J181301k191212n467183m341291m08506
39818C01545J138978J6875L22568K041208P70816l270151l951973P12041M687429
39809B769336L423091L45286j87659R0835j608505k828429n08058K577128K152094
39800F225119k73650n68883M29848j058882l980296l331421J466891N023239L626425
$$ plain form
39791 7558390 7276346 4818331 2882887 2419385 2774191 2954055 2807990 3305728 4855581
39782 4855581 5566943 3132909 -1275283 -3431405 -1353171 2140027 3468273 2616330
39774 2616330 1769570 1794040 2191219 2864527 3692978 3610003 2209031 1134910 1778056
39765 1778056 2662518 1447006 -1322390 -3056242 -3344343 -4493800 -7273080 -8610173
39757 -8610173 -5120215 2252851 8562868 9585105 5489123 7689 -3334470 -3831580
39749 -3831580 -2805754 -1198829 1128352 3980547 6023325 5989139 3975003 1090053
39741 1090053 -1506166 -2829073 -2217039 -33667 2240817 3258735 2929504 2016629 952825
39732 952825 -665824 -3449879 -6846366 -8417262 -5749443 -96952 3354882 1018485
$$ packed form
39791G558390k82044k458015j935444m63502L54806J79864j46065M97738J549853
39782D855581P11362k434034m408192k156122K078234L493198J328246q51943
39774B616330q46760K4470L97179O73308Q28451q2975j400972j074121O43146
39765A778056Q84462j215512k769396j733852k88101j149457k779280j337093
39757h610173L489958P373066O310017J022237m095982n481434l342159m97110
39749c831580J025826J606925K327181K852195K042778l4186k014136k884950
39741A090053k596219j322907O12034K183372K274484J017918l29231r12875j063804
39732I52825j618649k784055l396487j570896K667819N652491L451834k336397
$$ plain form
39724 1018485 -4250050 -6585745 -4835578 -3275629 -4302862 -4724437 -1443813 2894784
39716 2894784 3445155 134501 -2531445 -1681331 992493 2242025 851227 -1743050
39708 -1743050 -2914731 -1318175 1254675 1790784 648769 1718620 6124467 8841951
39700 8841951 5110879 -2188644 -6134379 -5325208 -4561029 -6052831 -5742783 -571331 5197664
39691 5197664 4675062 -2744037 -10358810 -11444289 -5646441 1567763 4631362 3000424
39683 3000424 760302 1105093 2321387 596954 -4300460 -8508696 -8878487 -5944724
39675 -5944724 -2236979 -40868 -799898 -4086119 -6785856 -5726544 -1510795 2385197
39667 2385197 4093256 4249743 2966195 -237386 -3246417 -2533377 1163551 2655676
$$ packed form
39724A018485n268535k335695J750167J559949j027233m21575L280624M338597
39716B894784N50371l310654k665946Q50114K673824J249532j390798k594277
39708a743050j171681J596556K572850N36109j142015J069851M405847K717484
39700H841951l731072p299523l945735Q09171P64179j491802L10048N171452N768995
39691E197664n22602p419099p614773j085479N797848P214204L063599j630938
39683C000424k240122L44791J216294j724433m897414m208236l69791K933763
39675e944724L707745K196111p59030l286221k699737J059312M215749L895992
39667B385197J708059J56487j283548l203581l009031P13040L696928J492125
$$ plain form
39659 2655676 -167253 -2801253 -960327 2830801 3140329 -663069 -4423305 -5009750
39651 -5009750 -2581872 1548724 5991695 8962651 9468989 8262641 6170909 3024959
39643 3024959 -367336 -1604157 -39514 1780139 2111817 2385334 3156386 1663658 -2789358
39634 -2789358 -5071219 -1148650 4522893 4853970 987992 186375 4112142 7021244
39626 7021244 5908921 4506205 5286717 5093645 2150631 712417 4053660 8125194
39618 8125194 7367258 2836501 -618032 -2072336 -4057992 -6577550 -6923957 -4466756
39610 -4466756 -1074977 2445884 6007838 7022538 2429475 -5484212 -9862386 -7676898
39602 -7676898 -3793546 -4230778 -7988655 -8734067 -3566298 3052199 4871908 1390089
$$ packed form
39659B655676k822929k634000J840926L791128L09528l803398l760236n86445
39651e009750K427878M130596M442971K970956N06338j206348k091732l145950
39643C024959l392295j236821J564643J819653L31678K73517P71052j492728m453016
39634b789358k281861L922569N671543L31077l865978q01617L925767K909102
39626G021244j112323j402716P80512j93072k943014j438214L341243M071534
39618H125194p57936m530757l454533j454304j985656k519558l46407K457201
39610d466756L391779L520861L561954J014700m593063p913687m378174K185488
39602g676898L883352m37232l757877p45412N167769O618497J819709l481819
$$ plain form
39594 1390089 -1900561 -387990 4238748 6369581 3325020 -1756908 -3967961 -2137358
39586 -2137358 501873 371355 -2666940 -5542458 -5507831 -3053593 -1008058 -1092529 -2478793
39577 -2478793 -3837763 -4972633 -5443255 -3731837 80555 2533179 508021 -4342035
39569 -4342035 -7751283 -8329458 -7542597 -5369954 -591345 4591937 5343303 1125753 -2646653
39560 -2646653 -2077256 144262 -173529 -2320440 -2905625 -1769154 -1836963 -4364475 -7334633
39551 -7334633 -8003745 -5314020 -727587 2380265 1798067 -462152 -579343 1276548 1211278
39542 1211278 -1465577 -2347934 841699 4143435 3863749 2340020 2820150 3167467 184473
39533 184473 -3607936 -3813479 -1947163 -2752892 -5721191 -6122350 -3383202 -1542018 -1596289
$$ packed form
39594A390089l290650J512571M626738K130833l044561n081928k211053J830603
39586b137358K639231j30518l038295k875518L4627K454238K045535q4471j386264
39577b478793j358970j134870m70622J711418L812392K452624k025158m850056
39569d342035l409248n78175P86861K172643M778609N183282P51366m217550l772406
39560b646653N69397K221518l17791k146911n85185J136471o7809k527512k970158
39551g334633o69112K689725M586433L107852n82198k260219j17191J855891o5270
39542A211278k676855q82357L189633L301736k79686j523729M80130L47317k982994
39533A84473l792409k05543J866316q05729k968299m01159K739148J841184n4271
$$ plain form
39524 -1596289 -115911 3908818 6971590 6784312 4620170 1206551 -4099932 -9159966
39516 -9159966 -9914475 -6823468 -4864901 -5572967 -4791675 -301305 4138544 5029672 4072080
39507 4072080 3941489 4072232 3544963 3327456 2816474 -613860 -5408762 -4962703 2597812
39498 2597812 9182687 6858731 -1209418 -5939355 -4805493 -2600853 -2278081 -1922697
39490 -1922697 -84697 1830403 2700805 2741467 1524049 -1259793 -3628595 -3563104 -2622225
39481 -2622225 -3715194 -6296325 -7460870 -6644237 -5423055 -4037765 -2215303 -1781029
39473 -1781029 -3663677 -4003676 890479 6776470 5547982 -2602066 -8287127 -6101311
39465 -6101311 -1799631 -2916565 -8268322 -11529379 -10709719 -8715787 -7296612 -5558424
$$ packed form
39524a596289J480378M024729L062772j87278k164142l413619n306483n060034
39516i159966p54509L091007J958567p08066P81292M490370M439849Q91128r57592
39507D072080j30591J30743n27269k17507n10982l430334m794902M46059P560515
39498B597812O584875k323956q068149m729937J133862K204640L22772L55384
39490a922697J838000J915100Q70402M0662j217418k783842k368802O5491R40879
39481b622225j092969k581131j164545Q16633J221182J385290J822462M34274
39473a781029j882648l39999M894155N885991j228488q150048n685061K185816
39465f101311M301680j116934n351757l261057Q19660J993932J419175J738188
$$ plain form
39457 -5558424 -3167943 -939099 961145 2324134 1666946 -1288495 -3382874 -1754684
39449 -1754684 1382120 1649959 -407900 323552 5382629 9361683 7026774 610867
39441 610867 -3123938 -1352754 2401567 3615231 1565526 -1469957 -3330541 -3314273 -2097767
39432 -2097767 -1323276 -2013841 -2764718 -1194346 1963161 2588717 -1092884 -4986148 -4537335
39423 -4537335 -1683827 -1928500 -5494058 -6985243 -4406466 -2290546 -3391375 -3502400
39415 -3502400 859087 4965049 2516960 -3818054 -5829117 -1909356 1746724 1715371
39407 1715371 1437676 3516313 5269229 4730787 4623458 6596850 7050797 3137599 -1660899
39398 -1660899 -2703498 -1047965 -187429 457505 2986107 4790867 1702804 -3754207
$$ packed form
39457e558424K390481K228844J900244J362989o57188k955441k094379J628190
39449a754684L136804K67839k057859P31452N059077L979054k334909o415907
39441F10867l734805J771184L754321J213664k049705l035483j860584J6268J216506
39432b097767P74491o90565p50877J570372L157507O25556l681601l893264M48813
39423d537335K853508k44673l565558j491185K578777K115920j100829j11025
39415c502400M361487M105962k448089o335014k011063L919761L656080l1353
39407A715371k77695K078637J752916n38442j07329J973392M53947l913198m798498
39398a660899j042599J655533Q60536O44934K528602J804760l088063n457011
$$ plain form
39390 -3754207 -4252074 1444404 5766210 2723165 -4085354 -6824376 -2987647 3558669
39382 3558669 8197069 8856670 5640650 607515 -2796623 -2822850 -1695459 -2687818 -5236389
39373 -5236389 -5281820 -835772 4899316 7153095 5042893 1901083 660668 712467 35459
39364 35459 -1084514 -483552 2002514 3581271 2603824 1453883 3066325 6080863 6597136
39355 6597136 4178229 2424749 3003866 2997795 112696 -3007618 -2806089 -510728 14300
39346 14300 -1625985 -2697555 -2934942 -5026917 -9019730 -10831172 -8058134 -3522558 -1001196
39337 -1001196 -722823 -1217436 -2216769 -3050236 -1547555 2109530 3641234 767688 -2068467
39328 -2068467 -118502 3252389 1024038 -5982963 -9452730 -5898487 -1237035 -950394
$$ packed form
39390c754207m97867N696478M321806l043045o808519k739022L836729O546316
39382C558669M638400O59601l216020n033135l404138k6227J127391r92359k548571
39373e236389m5431M446048N735088K253779k110202l141810j240415N1799o77008
39364C5459j119973O00962K486066J578757r77447j149941J612442L014538N16273
39355F597136k418907j753480N79117o071k885099l120314K01529K295361N25028
39346A4300j640285j071570k37387k091975l992813j811442K773038M535576K521362
39337a001196K78373m94613r99333q33467J502681L657085J531704k873546k836155
39328b068467J949965L370891k228351p007001l469767L554243M661452K86641
$$ plain form
39320 -950394 -2780917 -2916350 -3076693 -6226906 -10053140 -10474839 -8308914 -6946497 -6131630
39311 -6131630 -3591015 -614103 -156259 -831723 1220021 5023626 5201811 183509 -5225104
39302 -5225104 -6452105 -3877604 5750 3853023 6521211 6581494 4413912 2213653
39294 2213653 1175009 990261 1789621 3552858 4364166 3032366 2495754 5938666 10412182
39285 10412182 10160298 6019268 4584364 7183217 7466815 2502289 -1763014 -545024
39277 -545024 1753080 -307586 -3407146 -1419894 3438004 3732287 -1391689 -5410696
39269 -5410696 -4403523 -795816 2557226 5508621 7400641 6517205 3801431 2447275
39261 2447275 2972152 2730055 610287 -1808461 -3790782 -5877330 -6788918 -4408274 -155604
$$ packed form
39320i50394j830523j35433j60343l150213l826234m21699K165925J362417Q14867
39311f131630K540615K976912M57844o75464K051744L803605J78185n018302n408613
39302e225104j227001K574501L883354L847273K668188O0283k167582k200259
39294B213653j038644j84748P99360J763237Q11308j331800n36612L442912M473516
39285A0412182k51884m141030j434904K598853K83598m964526m265303J217990
39277e45024K298104k060666l099560J987252M857898K94283n123976m019007
39269e410696J007173L607707L353042K951395J892020q83436k715774j354156
39261B447275N24877k42097k119768k418748j982321k086548r11588K380644M252670
$$ plain form
39252 -155604 2060336 1616287 1384796 1879861 273650 -3773594 -6424590 -5463963 -3175595
39243 -3175595 -1819849 -925941 -815129 -3660981 -8426024 -9713799 -5096706 668645
39235 668645 2282545 735714 -287971 -841746 -2878561 -5142813 -4991281 -3318170 -2965061
39226 -2965061 -3663012 -2879519 -520882 1300355 2195848 3314742 4162084 3425957 2127295
39217 2127295 2119713 2246760 -25601 -3733561 -5267570 -3821718 -1984808 -1079307 -6428
39208 -6428 1349934 1878115 2446321 4698516 6409684 3491269 -2184661 -2900219 4247620
39199 4247620 12259256 13676840 10403131 9272618 11593926 12873165 10875396 8193402
39191 8193402 7264065 7646167 8408887 9265160 9171008 7385751 5943878 7354500 9670333
$$ packed form
39252a55604K215940m44049k31491M95065j606211m047244k650996R60627K288368
39243c175595J355746Q93908J10812k845852m765043j287775M617093N765351
39235F68645J613900j546831j023685n53775k036815k264252J51532J673111L53109
39226b965061o97951P83493K358637J821237Q95493J118894Q47342p36127j298662
39217B127295p582J27047k272361l707960j534009J445852J836910R05501J072879
39208f428J356362N28181N68206K252195J711168k918415n675930p15558P147839
39199D247620Q011636J417584l273709j130513K321308J279239j997769k681994
39191H193402r29337L82102P62720Q56273r4152j785257j441873J410622K315833
$$ plain form
39182 9670333 7913763 1293077 -4969213 -6517667 -4838410 -3257923 -1536856 2278860
39174 2278860 6927179 8520791 5482926 391304 -2813801 -1864322 2714391 7663370
39166 7663370 8896250 5289957 250903 -2012075 -1187655 -201168 -620784 -1058982 -201808
39157 -201808 920592 728036 -327766 -281341 1772690 4582728 6278207 6559161 6935450
39148 6935450 8572798 10370704 10078217 7178548 3423118 429072 -1573668 -2209198
39140 -2209198 -492579 2697524 3932542 1372999 -1958226 -1654199 2386510 6363980
39132 6363980 7693262 6752179 4251717 409839 -3075378 -3654167 -1432488 707051
39124 707051 1271355 1743341 3237737 4479752 4273710 3241823 1871167 -343289 -2400062
$$ packed form
39182I670333j756570o620686o262290j548454J679257J580487J721067L815716
39174B278860M648319J593612l037865n091622l205105R49479M578713M948979
39166G663370J232880l606293n039054k262978Q24420R86487m19616m38198Q57174
39157b01808J122400j92556j055802M6425K054031K810038J695479K80954L76289
39148F935450J637348J797906k92487k899669l755430k994046k002740o35530
39140b209198J716619L190103J235018k559543l331225L04027M040709L977470
39132F363980J329282r41083k500462l841878l485217n78789K221679K139539
39124G07051N64304M71986J494396J242015k06042j031887j370656k214456k056773
$$ plain form
39115 -2400062 -1531126 2519971 5841609 5467721 3586022 3813351 5535914 5277729 2184219
39106 2184219 -1218057 -2943663 -3250464 -2799653 -1631277 121982 2240489 4644631
39098 4644631 6290650 5119081 863680 -3477036 -4937019 -3952636 -2588210 -1348329
39090 -1348329 -116465 -75137 -1677094 -2815645 -2420054 -3456245 -7878056 -10860387 -6130903
39081 -6130903 3686906 8668301 4502549 -2356057 -4459447 -2393118 -809596 -718271
39073 -718271 -369701 -171643 -1586491 -2985624 -1262546 3007863 5787765 5019765 2937313
39064 2937313 2511816 3753471 4296946 2531888 -450106 -1876368 -344007 2500013
39056 2500013 4167490 4619835 5593480 6982739 6454317 3188453 -491012 -2183611 -1907936
$$ packed form
39115b400062Q68936M051097L321638l73888j881699K27329J722563k58185l093510
39106B184219l402276j725606l06801M50811J168376J753259K118507K404142
39098D644631J646019j171569m255401m340716j459983R84383J364426J239881
39090a348329J231864M1328j601957j138551L95591j036191m421811k982331M729484
39081f130903R817809M981395m165752o858606k103390K066329J583522R1325
39073g18271L48570J98058j414848j399133J723078M270409K779902p68000k082452
39064B937313m25497J241655N43475j765058k981994j426262J532361K844020
39056B500013J667477M52345R73645J389259n28422l265864l679465j692599K75675
$$ plain form
39047 -1907936 -691975 903843 1830945 739692 -1474573 -1836029 436716 2348314
39039 2348314 1567729 -146482 -99398 1159614 1237665 -488358 -2978061 -5493110 -7375164
39030 -7375164 -7641992 -6675956 -6323038 -6629244 -5058221 -932061 2401565 2384867 992838
39021 992838 610534 -260807 -3159130 -5044366 -2762128 591943 -251654 -4022265 -4614990
39012 -4614990 -784236 2344955 1798139 514356 1237754 2304571 1611245 108031 -775842
39003 -775842 -1259666 -1154733 462246 2302740 1773931 -145165 164877 1888263 -406626
38994 -406626 -7328852 -11473864 -8063711 -2934806 -3901229 -8769276 -9232007 -3895147 498641
38985 498641 205988 -863798 825100 2334333 -436861 -5811918 -8771684 -8050855 -7063098
$$ packed form
39047a907936J215961J595818R27102j091253k214265l61456K272745J911598
39039B348314p80585j714211M7084J259012P8051j726023k489703k515049j882054
39030g375164k66828R66036L52918l06206J571023M126160L333626j6698j392029
39021I92838l82304q71341k898323j885236K282238L354071q43597l770611n92725
39012d614990L830754L129191n46816j283783P23398J066817o93326j503214q83873
39003g75842m83824J04933J616979J840494n28809j919096L10042J723386k294889
38994d06626o922226m145012L410153N128905r66423m868047m62731N336860M393788
38985D98641k92653j069786J688898J509233k771194n375057k959766P20829R87757
$$ plain form
38976 -7063098 -8231883 -9288520 -6301449 725185 6816305 7344747 3619644 1488040
38968 1488040 4281822 9207563 11455462 9536056 5173941 509550 -2331172 -1338151
38960 -1338151 2590671 4794491 2206368 -1914561 -2313599 573227 1818626 252788
38952 252788 167478 3853903 7569072 7259439 4165233 1865358 1072796 468921 -17903
38943 -17903 -77105 -985140 -3271952 -4090674 -564526 5215270 8144260 6705449 4227209
38934 4227209 3548206 3897140 3763453 3494409 3454546 2367099 -327297 -2423545 -1750587
38925 -1750587 85257 -695175 -4836812 -8597221 -8067441 -3519991 1270283 3065270
38917 3065270 1751285 -369770 -797596 1521234 5676030 9321110 10245898 8216784
$$ packed form
38976g063098j168785j056637K987071P026634O091120N28442l725103k131604
38968A488040K793782M925741K247899j919406m362115m664391k840722R93021
38960a338151L928822K203820k588123m120929l99038K886826J245399j565838
38952B52788q5310L686425L715169l09633l094206k299875p92562o03875m86824
38943a7903n9202r08035k286812q18722L526148N779796K928990j438811k478240
38934D227209o79003L48934j33687k69044l9863j087447k694396k096248O72958
38925a750587J835844p80432m141637l760409N29780M547450M790274J794987
38917C065270j313985k121055m27826K318830M154796L645080R24788k029114
$$ plain form
38909 8216784 5287211 3807205 4243863 5564950 7352850 9964242 12248243 11288027
38901 11288027 6346224 1611829 2111534 7106497 10573168 8863064 4740450 2302640
38893 2302640 1241131 -754059 -2497846 -809647 3232153 4380840 655614 -3467030
38885 -3467030 -3512727 -1312742 -1752874 -5502438 -8594442 -8261742 -5727584 -3268217 -1717314
38876 -1717314 -1602150 -3818560 -7414933 -8658442 -4614074 2905591 8754463 9839448
38868 9839448 7723121 5618670 4373026 2771827 892926 755024 2838474 4057804
38860 4057804 1302512 -4079773 -7774511 -7931415 -6314715 -4258670 -1215307 1701239
38852 1701239 965603 -3836132 -7349804 -5214261 -708927 80771 -2250035 -1641503 3040327
$$ packed form
38909H216784k929573j480006M36658J321087J787900K611392K284001r60216
38901A1288027m941803m734395M99705M994963L466671j710104m122614k437810
38893B302640j061509j995190j743787J688199M041800J148687l725226m122644
38885c467030m5697K199985m40132l749564l092004L32700K534158K459367J550903
38876a717314J15164k216410l596373j243509M044368P519665N848872J084985
38868I839448k116327k104451j245644j601199j878901j37902K083450J219330
38860D057804k755292n382285l694738j56904J616700K056045L043363K916546
38852A701239p35636m801735l513672K135543M505334P89698k330806O08532M681830
$$ plain form
38843 3040327 5204972 222106 -7303482 -9502859 -5165096 -47745 719666 -2783528
38835 -2783528 -7189679 -9403765 -8345324 -5029934 -1265848 2023022 4522208 4910330
38827 4910330 1670143 -3935648 -8093117 -8743326 -7366109 -5381129 -1739900 3848709
38819 3848709 8216599 8376768 5894108 4384095 4069584 2184091 -2044188 -6172453
38811 -6172453 -8145128 -8146517 -6639321 -3201270 1927219 6908341 9627391 9164315 6225836
38802 6225836 2975596 1671953 2474429 3644801 4737787 7546420 12276949 15321593
38794 15321593 13661134 9446515 6907108 6468146 5674139 4331638 4186222 4410756 2464318
38785 2464318 -572015 -665014 2415383 4165146 2727018 2135009 5620719 10205245 11386434
$$ packed form
38843C040327K164645m982866p525588k199377M337763N117351P67411l503194
38835b783528m406151k214086J058441L315390L764086L288870K499186L88122
38827D910330l240187n605791m157469o50209J377217J984980L641229N588609
38819C848709M367890J60169k482660j510013l14511j885493m228279m128265
38811f172453j972675j389J507196L438051N128489M981122K719050m63076k938479
38802F225836l250240j303643Q02476J170372J092986K808633M730529L044644
38794A5321593j660459m214619k539407m38962p94007j342501j45416K24534j946438
38785B464318l036333r2999L080397J749763j438128n92009L485710M584526J181189
$$ plain form
38776 11386434 9638465 8431711 8375016 7241182 4374458 1716242 1079640 2623970
38768 2623970 5211354 6728578 5414398 2268221 397982 704317 593155 -1484871
38760 -1484871 -3270779 -2842494 -2293729 -3921749 -5671180 -4601167 -2590882 -3656771
38752 -3656771 -6928914 -7569748 -4421313 -1544270 -1474135 -1877808 -475727 1140625 900586
38743 900586 -207935 -618927 -1094985 -2154182 -1217996 3859590 9680386 9703681 2304249
38734 2304249 -6401856 -9190508 -5704676 -2272818 -4171648 -9603271 -12356060 -9715131
38726 -9715131 -5604198 -4883631 -6652358 -6008269 -1586234 2420013 2677780 1514501 2722242
38717 2722242 5312151 5370747 3037842 3122376 7775964 12434075 11607612 6113348 1306433
$$ packed form
38776A1386434j747969j206754n6695j133834k866724k658216o36602J544330
38768B623970K587384J517224j314180l146177j870239L06335j11162k078026
38760a484871j785908M28285N48765j628020j749431J070013K010285j065889
38752c656771l272143o40834L148435K877043P0135m03673J402081J616352k40039
38743I00586j108521m10992m76058j059197R36186N077586N820796K3295p399432
38734B304249q706105k788652L485832L431858j898830n431623k752789K640929
38726i715131M110933P20567j768727O44089M422035M006247K57767j163279J207741
38717B722242K589909N8596k332905Q4534M653588M658111q26463n494264m806915
$$ plain form
38708 1306433 -274793 -652551 -1365375 -1196573 -33615 -480620 -2838008 -2383008 4124013
38699 4124013 12082973 14350774 11035884 8061668 6916089 3125897 -3940768 -7546040
38691 -7546040 -3572339 2645605 4600733 3980767 5487059 7256904 4362738 -1214395
38683 -1214395 -2695086 507690 2211078 51208 -1466870 135647 1262698 -247735
38675 -247735 -838349 1829368 4118960 3105184 2392905 6063956 11342885 12732322 9899100
38666 9899100 6156803 2314915 -2232355 -4772532 -1893922 4070718 6790791 4116042
38658 4116042 -21748 -1807244 -1368185 -250110 894454 1461457 1037270 909363 2678177
38649 2678177 5284040 6131115 4946568 3650207 2834344 1701957 1180158 3177014 6314563
$$ packed form
38708A306433j581226l77758p12824J68802J162958m47005k357388M55000O507021
38699D124013P958960K267801l314890k974216j145579l790192p066665l605272
38691g546040L973701O217944J955128o19966J506292J769845k894166n577133
38683a214395j480691L202776J703388k159870j518078J602517J127051j510433
38675b47735n90614K667717K289592j013776p12279L671051N278929J389437k833222
38666I899100l742297l841888m547270k540177K878610N964640K720073k674749
38658D116042m137790j785496M39059J118075J144564N67003m24187j27907J768814
38649B678177K605863Q47075j184547j296361q15863j132387n21799J996856L137549
$$ plain form
38640 6314563 6395573 2437752 -1244973 -867122 1707908 1914450 -1254085 -4134975 -2931928
38631 -2931928 1979409 6321238 6371917 3155811 1176675 2485981 4056367 2655347
38623 2655347 -233552 -1435007 -1772488 -4337634 -8216792 -8890836 -5030834 -332535
38615 -332535 2054994 2672440 2684284 2207276 2733762 6401125 11080934 11001867 4849662
38606 4849662 -1127133 -1189366 2577649 4362475 2560280 -27597 -965791 531791 4513471
38597 4513471 8796045 8876782 3139192 -3722208 -6044296 -4145034 -2433558 -2605725 -2857774
38588 -2857774 -2425433 -2466364 -2888877 -2184250 -364893 1095686 2000061 3220483 4230160
38579 4230160 3696849 2093728 1133604 1316748 2450345 5209079 9174477 10882374 7593985
$$ packed form
38640F314563Q1010l957821l682725L77851K575030K06542l168535k880890J203047
38631b931928M911337M341829N0679l216106j979136J309306J570386j401020
38623B655347k888899j201455l37481k565146l879158o74044L860002M698299
38615c32535K387529O17446J1844m77008N26486L667363M679809p9067o152205
38606D849662n976795o2233L767015J784826j802195k587877r38194J497582L981680
38597D513471M282574Q0737n737590o861400k322088J899262J711476j72167k52049
38588b857774M32341m0931m22513P04627J819357J460579R04375J220422J009677
38579D230160n33311j603121r60124J83144J133597K758734L965398J707897l288389
$$ plain form
38570 7593985 1993980 -693633 553126 2499112 3270546 3606772 3253207 1036282 -1565496
38561 -1565496 -1875227 -1161387 -3055186 -6402518 -5714632 -289759 3397060 1401554 -1454152
38552 -1454152 580517 4953904 4944342 -73389 -4328117 -4411800 -3030179 -3513615 -4614816
38543 -4614816 -2583367 3296330 8831598 8970670 3737959 -1013506 -312338 3745973
38535 3745973 5454833 3967141 3534169 5208756 4531096 -58682 -2704252 1223180
38527 1223180 6851999 6266235 30019 -4283491 -3315775 -930669 -264677 593627 3406832
38518 3406832 5750309 4961375 2469269 1380347 2039217 2359627 1229261 -178029 73768
38509 73768 2537806 5264378 5071245 972123 -4132984 -6463940 -5363415 -2861858 -371000
$$ packed form
38570G593985n600005k687613J246759J945986P71434L36226l53565k216925k601778
38561a565496l09731P13840j893799l347332O87886N424873L686819j995506k855706
38552a454152K034669M373387r562n017731m254728q3683J381621m83436j101201
38543d614816K031449N879697N535268J39072n232711m751465P01168M058311
38535C745973J708860j487692m32972J674587o77660m589778k645570L927432
38527A223180N628819n85764o236216m313510R67716K385106O65992Q58304K813205
38518C406832K343477p88934k492106j088922O58870L20410j130366j407290K51797
38509G3768K464038K726572j93133m099122n105107k330956J100525K501557K490858
$$ plain form
38500 -371000 2104254 4456012 6615601 9352598 12346103 12534791 7736685 1207439
38492 1207439 -1415018 164787 401948 -3933259 -9191654 -10239680 -6901124 -2767063
38484 -2767063 -491594 -643147 -2725383 -4854827 -4531103 -2120036 -1524602 -4830548 -8306608
38475 -8306608 -6876695 -1140521 3496961 4017041 2698420 2821294 4675920 6608918
38467 6608918 7404453 6535769 4165728 2036472 2456325 5072564 6349855 3847102 -437885
38458 -437885 -2823975 -2745897 -2437625 -2665942 -1759957 923833 3522741 4580216 4649529
38449 4649529 3674153 -17581 -5621826 -7952589 -3669988 2742047 4128796 653969
38441 653969 -947706 1974330 4476427 2881055 718578 2154208 4901266 4510431
$$ packed form
38500c71000K475254K351758K159589K736997K993505J88688m798106o529246
38492A207439k622457J579805K37161m335207n258395j048026L338556M134061
38484b767063K275469j51553k082236k129444L23724K411067N95434l305946l476060
38475h306608J429913N736174M637482N20080j318621J22874J854626J932998
38467F608918P95535q68684k370041k129256M19853K616239J277291k502753m284987
38458d37885k386090P8078L08272k28317R05985K683790K598908J057475O9313
38449D649529r75376l691734n604245k330763M282601O412035J386749l474827
38441F53969j601675K922036K502097j595372k162477J435630K747058l90835
$$ plain form
38433 4510431 1549714 -651062 -1996691 -3987135 -5072150 -3434771 -1905315 -3879075
38425 -3879075 -6410750 -4198705 1044113 2716243 147668 -925888 791851 -277843
38417 -277843 -5804689 -9040285 -5370488 248827 1783120 1369931 3643982 6299512
38409 6299512 3843199 -2593094 -6541390 -5740947 -4125091 -4951155 -7113341 -7984568 -5934044
38400 -5934044 -780149 4878866 6369211 2546817 -1366012 -513044 2535258 2305097
38392 2305097 -579407 -1203762 352227 -1174237 -6668768 -9845762 -6240268 500499
38384 500499 4094532 3220519 979966 86479 1093248 3010888 3829888 2318168 215176
38375 215176 531557 3330345 5764217 6381003 6301564 6079750 5057980 4119060 4930929
$$ packed form
38433D510431k960717k200776j345629j990444j085015J637379J529456j973760
38425c879075k531675K212045N242818J672130k568575j073556J717739j069694
38417b77843n526846l235596L669797N619315J534293m13189K274051K655530
38409F299512k456313o436293l948296Q00443J615856q26064k162186q71227K050524
38400e934044N153895N659015J490345l822394l912829Q52968L048302k30161
38392B305097k884504o24355J555989j526464n494531l176994L605494O740767
38384E00499L594033q74013k240553q93487J006769J917640Q19000j511720k102992
38375B15176L16381K798788K433872O16786p9439k21814j021770r38920Q11869
$$ plain form
38366 4930929 5803537 2922713 -2973877 -6020139 -3425232 568245 1776636 2360272
38358 2360272 6052638 11110891 12820623 10420392 7014547 4489721 2659073 1858399
38350 1858399 2436959 2990195 2646106 3417834 6493448 8272409 4986078 -238894 -726317
38341 -726317 3653313 5923418 2680136 -809841 942730 5367374 6367317 3580393
38333 3580393 2078584 4349013 7201775 6774031 3226116 -203244 -524927 3044497
38325 3044497 8414883 11396803 9018893 2915818 -1967692 -2748874 -1317816 -911200
38317 -911200 -1654539 -1230087 1078345 3386113 4393019 5359102 7714867 10154975 9809502
38308 9809502 5829981 384034 -3789016 -5540558 -5041368 -2869709 -135185 1492639
$$ packed form
38366D930929Q72608k880824n896590l046262K594907L993477J208391N83636
38358B360272L692366N058253J709732k400231l405845k524826j830648q00674
38350A858399N78560N53236l44089P71728L075614J778961l286331n224972m87423
38341g26317M379630K270105l243282l489977J752571M424644R99943k786924
38333C580393j501809K270429K852762m27744l547915l429360l21683L569424
38325C044497N370386K981920k377910o103075m883510p81182J431058M06616
38317i11200p43339M24452K308432K307768J006906R66083K355765K440108l45473
38308I809502l979521n445947m173050j751542M99190K171659K734524J627824
$$ plain form
38300 1492639 1065299 -390148 -613944 1577653 4918178 6954915 6779968 5974709 6201264
38291 6201264 6548025 5018344 2622957 3250110 7951183 12136454 11557576 8997748 10536153
38282 10536153 15904469 18017221 13396002 7627757 7015925 9153095 6933130 -383349
38274 -383349 -5841162 -4507150 399600 2599708 448642 -2554493 -2747874 289283
38266 289283 4247172 6416654 5783683 3520221 1458924 553449 1373528 4828477 10445987
38257 10445987 14737333 14140014 9918693 7341394 8961683 11409393 10575569 7529185
38249 7529185 6632728 9269629 12409497 13024680 11344748 9438088 8592774 8716933 8951948
38240 8951948 8394512 7152691 6632495 7597064 8257236 6095981 1671516 -1465570 -1186211
$$ packed form
38300A492639m27340j455447k23796K191597L340525K036737j74947q05259K26555
38291F201264L46761j529681k395387O27153M701073M185271n78878k559828J538405
38282A0536153N368316K112752m621219n768245o11832K137170k219965p316479
38274c83349n457813J334012M906750K200108k151066l003135j93381L037157
38266B89283L957889K169482o32971k263462k061297r05475Q20079L454949N617510
38257A0445987M291346n97319m221321k577299J620289K447710q33824l046384
38249G529185q96457K636901L139868O15183j679932j906660q45314J24159K35015
38240H951948n57436j241821n20196R64569O60172k161255m424465l137086K79359
$$ plain form
38231 -1186211 1010064 2994354 4649457 5877061 4748446 787057 -1771869 1817333
38223 1817333 9584973 13914154 10850190 4838319 2507221 4847445 7937054 8919372
38215 8919372 8292469 7745693 8514302 11055298 14150991 15297966 14019684 13386642 15749713
38206 15749713 18536010 17589162 13481623 10527014 10086981 9373124 7209877 6142460
38198 6142460 7357788 8191508 7140121 7023561 9726967 11503784 7939042 1145154
38190 1145154 -2631394 -1218227 2074870 4398598 6076535 7263356 6504155 4122307
38182 4122307 3474411 6728784 11723874 14834504 15148467 14186393 13084853 11880018 10622832
38173 10622832 9536080 8377143 6704697 4613103 2667557 1436874 1350460 2411830
$$ packed form
38231a186211K196275J984290J655103J227604j128615l961389k558926L589202
38223A817333P767640M329181l063964o011871k331098K340224L089609R82318
38215H919372o26903n46776P68609K540996L095693J146975j278282o33042K363071
38206A5749713K786297r46848m107539k954609m40033p13857k163247j067417
38198F142460J215328Q33720j051387j16560K703406J776817l564742o793888
38190A145154l776548J413167L293097K323728J677937J186821p59201k381848
38182D122307o47896L254373M995090L110630L13963r62074j101540j204835j257186
38173A0622832j086752j158937j672446k091594j945546j230683q6414J061370
$$ plain form
38165 2411830 3721162 3946362 2765761 1444754 1625915 3739923 6580126 8090666
38157 8090666 6808648 3230134 -209770 -1068115 1058914 4511454 7149651 7735358
38149 7735358 6616245 5718712 6957488 9779160 11365164 10405293 9206978 10138512 11437340
38140 11437340 9584781 5251384 3218161 5646019 8822346 8322290 4658182 1572244
38132 1572244 897328 1795780 3648494 6679780 10022419 11708479 10976354 8928298 6733099
38123 6733099 4711977 3386527 3805363 6103146 8732572 9796594 8686640 6301163
38115 6301163 4268570 3863290 4816352 5263353 3917179 2208155 2788165 5645581 7570975
38106 7570975 6475472 4296958 3669873 3339180 51961 -5332204 -7381672 -3331062
$$ packed form
38165B411830J309332K25200j180601j321007J81161K114008K840203J510540
38157H090666j282018l578514l439904q58345K127029L452540K638197N85707
38149G735358j119113q97533J238776K821672J586004r59871j198315R31534J298828
38140A1437340j852559m333397k033223K427858L176327n00056l664108l085938
38132A572244o74916Q98452J852714L031286L342639J686060p32125k048056k195199
38123F733099k021122j325450M18836K297783K629426J064022j109954k385477
38115F301163k032593m05280R53062M47001j346174j709024N80010K857416J925394
38106G570975j095503k178514o27085l30693l287219n384165k049468M050610
$$ plain form
38098 -3331062 2161889 2305159 -3323529 -8559635 -8434817 -4290142 -716993 154604 165637
38089 165637 2339902 7501934 12959062 14542903 11054414 6331272 5266476 8183718
38081 8183718 11363229 12728578 13760819 15288612 15197910 12254466 8972796 8065684 8551967
38072 8551967 8068261 6758563 6019048 5546026 4716866 4793761 6341661 6611272 3575124
38063 3575124 647352 2499594 7456631 9580353 7892346 7427099 10289334 12002555
38055 12002555 9291927 5907844 6856564 11028795 13839792 14246907 14836549 16719648
38047 16719648 18242266 17968726 16044465 13293744 11208830 11925653 16179155 22147254
38039 22147254 27869236 33530444 39912698 46397032 52500710 59952985 71439666 88504421
$$ packed form
38098c331062N492951J43270n628688n236106J24818M144675L573149Q71597J1033
38089A65637K174265N162032N457128J583841l488489m723142j064796K917242
38081H183718L179511J365349J032241J527793r0702k943444l281670r07112M86283
38072H551967m83706j309698p39515m73022q29160P6895J547900K69611l036148
38063C575124k927772J852242M957037K123722j688007m65247K862235J713221
38055A2002555k710628l384083R48720M172231K810997M07115N89642J883099
38047A6719648J522618k73540j924261k750721k084914P16823M253502N968099
38039B2147254N721982N661208O382254O484334O103678P452275J1486681J7064755
$$ plain form
38031 88504421 111399946 138012747 161061204 170072155 160175944 137246765 111399389
38024 111399389 87819555 67276884 51981928 44608916 42646044 40051563 35159413
38017 35159413 31706834 31301667 30381123 26362571 21549760 18252849 14788679 9887982
38009 9887982 6940466 9181888 13366107 13360166 8981947 6382764 9246246 13803298 14274051
38000 14274051 10308117 6572705 6340646 8001192 8110309 6041364 4214456 4317394
37992 4317394 5179714 5185494 5163453 6910631 9595939 10192548 7881958 5647384 6303315
37983 6303315 8840724 10296590 9781448 8777369 8445996 8762603 9942204 12509635 15452831
37974 15452831 16091069 13024640 8455007 6407557 8688978 13307533 16948203 18293014
$$ packed form
38031H8504421K2895525K6612801K3048457R010951r896211k2929179k5847376
38024A11399389k3579834k0542671j5294956p373012j962872k594481m892150
38017C5159413l452579m05167r20544m018552m812811l296911l464170m900697
38009I887982k947516K241422M184219n941m378219k599183K863482M557052M70753
38000A4274051l965934l735412k32059J660546J09117k068945j826908J02938
37992D317394Q62320N780k2041J747178K685308N96609k310590k234574O55931
37983F303315K537409J455866n15142j004079l31373L16607J179601K567431K943196
37974A5452831O38238l066429m569633k047450K281421M618555L640670J344811
$$ plain form
37966 18293014 18450763 18696037 18834994 18056620 16639483 16169545 18153995 22560343 27694416
37957 27694416 32080691 37094718 46621600 62126716 79058592 92189379 105461513
37950 105461513 131070873 173592877 217736464 238641348 225474918 190438270 153849150
37943 153849150 125780775 104607409 87291067 74213916 65305457 57651357 49032228
37936 49032228 40986575 36502063 35861648 36015316 33852141 29654273 26953450 28359035
37928 28359035 31832398 32681903 29649189 26980238 29056568 34620226 38207501 36228005
37920 36228005 29793495 22459595 17191440 15036095 14794248 13952650 11192074 7730781
37912 7730781 5385832 4392535 4346079 5653090 7920353 8442000 5287330 1023573 27129
$$ packed form
37966A8293014J57749K45274J38957p78374j417137m69938J984450M406348N134073
37957B7694416M386275N014027R526882J5505116J6931876J3130787J3272134
37950A05461513K5609360M2522004M4143587K0904884j3166430l5036648l6589120
37943A53849150k8068375k1173366j7316342j3077151q908459p654100q619129
37936D9032228q045653m484512o40415J53668k163175m197868k700823J405585
37928B8359035L473363Q49505l032714k668951K076330N563658L587275j979496
37920C6228005o434510p333900n268155k155345k41847q41598k760576l461293
37912G730781k344949r93297m6456J307011K267263N21647l154670m263757r96444
$$ plain form
37903 27129 2405541 4197872 3822475 4239970 7396629 10534486 10550945 8797250 8420929
37894 8420929 9467745 10153360 10986583 13350949 14956062 11599694 4317989 344282
37886 344282 4419575 12144546 15187719 11485886 6791972 6333420 8458847 8208701 4815497
37877 4815497 2647101 4909729 9246903 11147266 9960420 8997735 10108151 11107263
37869 11107263 9722139 7621179 8172145 11459218 14120839 13822694 11516158 9093447
37861 9093447 7092516 5424906 4399962 4003139 3686536 3727818 5199735 7734300 9243153
37852 9243153 9115704 9520778 11549962 12283835 8859869 4075257 3912028 9314020 14284831
37843 14284831 13647346 9593845 8145990 11102434 14352886 13726954 10171780 8308049
$$ packed form
37903B7129K378412J792331l75397M17495L156659L137857J6459j753695l76321
37894H420929J046816O85615Q33223K364366J605113l356368p281705l973707
37886C44282M075293P724971L043173l701833m693914m58552K125427k50146l393204
37877D815497k168396K262628M337174J900363j186846r62685J110416R99112
37869A1107263j385124k100960N50966L287073K661621k98145k306536k422711
37861I093447k000931j667610j024944l96823l16603M1282J471917K534565J508853
37852I243153j27449M05074K029184P33873l423966m784612j63229N401992M970811
37843A4284831o37485m053501j447855K956444L250452o25932l555174j863731
$$ plain form
37835 8308049 10733653 14767486 15498427 11944670 8698131 10251907 15141963 17953614
37827 17953614 16034152 11157884 5331850 -731360 -4547510 -2345441 5094977 11515468
37819 11515468 13122219 13237193 15363403 16411480 12669634 8626053 11889599 20733941
37811 20733941 25151003 21231296 16461114 17892499 22231744 22180970 16989295 11393830
37803 11393830 8170608 7212442 9092340 13968533 18484614 18696133 15399181 12729884
37795 12729884 12540304 13858757 16452163 20495854 23684191 23481192 21935980 23260123
37787 23260123 26249499 24483460 15810073 6714072 4226890 7280742 9779510 9593729
37779 9593729 10201359 14222504 19222959 20885645 18126369 13760365 10997991 10453945
$$ packed form
37835H308049K425604M033833P30941l553757l246539J553776M890056K811651
37827A7953614j919462m876268n826034o063210l816150K202069P440418O420491
37819A1515468J606751J14974K126210J048077l741846m043581L263546Q844342
37811B0733941M417062l919707m770182J431385M339245n0774n191675n595465
37803A1393830l223222r58166J879898M876193M516081K11519l296952k669297
37795A2729884j89580J318453K593406M043691L188337k02999j545212J324143
37787B3260123K989376j766039q673387r096001k487182L053852K498768j85781
37779I593729O07630M021145N000455J662686k759276m366004k762374n44046
$$ plain form
37771 10453945 10766636 11280976 12725339 14925046 15681182 13656635 11069104 10977246 12557034
37762 12557034 12225183 9687866 9341952 14017989 20246359 22416214 20021790 18002734
37754 18002734 20341060 25634566 29455165 29659966 28458901 29469069 33462240 37969143
37746 37969143 41266671 45169278 52454644 63095645 75554671 90406156 108516778
37739 108516778 125440586 132356291 124970417 108364809 90864504 76246506 64381537
37732 64381537 55719316 50793425 47594196 44020641 41733781 43345342 46731595 46631363
37724 46631363 41612594 35103899 29598360 24565629 20535769 19852217 21524634 20508626
37716 20508626 15210353 11222386 13526259 18596007 19138762 14246775 9553105 8577621
$$ packed form
37771A0453945L12691N14340J444363K199707P56136k024547k587531r1858J579788
37762A2557034l31851k537317l45914M676037O228370K169855k394424k019056
37754A8002734K338326N293506L820599K04801j201065J010168L993171M506903
37746C7969143L297528L902607P285366J0641001J2459026J4851485J8110622
37739A08516778J6923808O915705p385874j6605608j7500305j4617998j1864969
37732F4381537q662221m925891l199229l573555k286860J611561L386253j00232
37724D6631363n018769o508695n505539n032731m029860o83552J672417j016008
37716B0508626n298273l987967K303873N069748N42755m891987m693670r75484
$$ plain form
37708 8577621 9419972 10046468 11420866 13942583 15512307 15615378 17518852 23252354 29215160
37699 29215160 30339497 26895642 23589347 22770484 22098746 19104032 14956666 12650937
37691 12650937 13412511 15843327 17385267 16337731 13733895 13087233 16495308 21190549
37683 21190549 22386961 19678034 17496349 18310917 19013846 16364957 12631666 12145108
37675 12145108 14597090 16096904 15614462 15764328 17500474 18724057 18758181 19612552 21448249
37666 21448249 21352958 18929546 18775632 23973477 30625575 33030861 31744380 31877700 34921309
37657 34921309 37151808 35924798 32968970 30577951 28382314 25461753 22742677 21464977
37649 21464977 21214144 21063411 21337143 22999763 26158579 29838056 32489437 32726244 30831601
$$ packed form
37708H577621Q42351O26496J374398K521717J569724J03071J903474N733502N962806
37699B9215160J124337l443855l306295q18863o71738k994714m147366k305729
37691A2650937P61574K430816J541940j047536k603836o46662L408075M695241
37683B1190549J196412k708927k181685Q14568P02929k648889l733291m86558
37675A2145108K451982J499814m82442J49866J736146J223583L4124Q54371J835697
37666B1448249r5291k423412j53914N197845O652098K405286j286481J33320L043609
37657C4921309K230499j227010k955828k391019k195637k920561k719076j277700
37649B1464977k50833j50733K73732J662620L158816L679477K651381K36807j894643
$$ plain form
37640 30831601 29549142 31756386 36930217 41250144 41580076 38296608 34295907 32612503
37632 32612503 34815837 39902996 44537026 46024283 45261936 45203786 46547673 47004739 45066423
37623 45066423 42325282 41309119 42603411 44675255 45353823 43547311 40740776 40045752
37615 40045752 42135518 43686226 42507384 42123037 46960304 54926424 61067998 67789866
37607 67789866 82894541 105041259 119713034 115257799 96627972 77090366 62171682
37600 62171682 49436555 39150642 35025819 35755634 35269660 32275577 31647302 34903037
37592 34903037 36763285 33628857 28844407 26315101 24546702 20679915 15827372 12757735
37584 12757735 12027624 13508230 17923235 23618788 25623070 21777345 16698049 15811128
$$ packed form
37640C0831601j282459K207244N173831M319927L29932l283468m000701j683404
37632C2612503K203334N087159M634030J487257p62347n8150J343887M57066j938316
37623D5066423k741141j016163J294292K071844O78568j806512k806535o95024
37615D0045752K089766J550708j178842l84347M837267P966120O141574O721868
37607F7789866J5104675K2146718J4671775m455235j8629827j9537606j4918684
37600F2171682j2735127j0285913m124823P29815m85974k994083o28275L255735
37592C4903037J860248l134428m784450k529306j768399l866787m852543l069637
37584A2757735p30111J480606M415005N695553K004282l845725n079296q86921
$$ plain form
37576 15811128 18267003 19819046 20152337 22519601 27335909 30831758 30355444 27744886
37568 27744886 26864395 29738279 35190843 40161099 42989622 45906609 52261492 60433357
37560 60433357 63804107 59236664 52520469 51991379 59164345 69306222 78816069 87387533
37552 87387533 94421214 98418465 99678823 99186622 95048062 84598500 70189916 58041396
37544 58041396 50369080 43312183 34273366 26725331 24991764 27896404 30845237 31656247
37536 31656247 31111960 29562658 26343033 22000424 18533903 17241657 17620337 18270402
37528 18270402 18258582 18114060 19644330 23626130 27734587 28825838 27674386 28648868 33220460
37519 33220460 36714595 34372672 28651379 26835038 31947520 39591364 44380856 46274962
$$ packed form
37576A5811128K455875J552043L33291K367264M816308L495849m76314k610558
37568B7744886q80491K873884N452564M970256K828523K916987O354883Q171865
37560F0433357L370750m567443o716195n29090P172966J0141877R509847Q571464
37552H7387533P033681L997251J260358m92201m138560j0449562j4408584j2148520
37544E8041396p672316p056897r038817p548035j733567K904640K948833Q11010
37536C1656247n44287j549302l219625m342609l466521j292246L78680O50065
37528A8270402j1820j44522J530270L981800M108457J091251j151452R74482M571592
37519C3220460L494135k341923n721293j816341N112482P643844M789492J894106
$$ plain form
37511 46274962 48719880 52838317 56409252 58269622 61062339 68246639 79600596 91424785
37503 91424785 101135568 110216967 122313747 140098539 165326228 200484489 247222588
37496 247222588 301321996 349744051 374678328 363652608 319070299 258808232 204810677
37489 204810677 167979819 143778676 122685178 102349831 87110390 78357083 70938145
37482 70938145 60033909 47335594 38023412 34143370 33322219 32509108 30865257 29524039
37474 29524039 29749605 31140431 31675469 30534095 30357792 34559504 42346456 48973672
37466 48973672 51444609 51195228 50321021 48435611 45015896 41638839 39223039 35715515
37458 35715515 29713130 24242820 23173248 25129317 25047828 21689874 19753429 23393884
$$ packed form
37511D6274962K444918M118437L570935J860370K792717P184300J1353957J1824189
37503I1424785R710783R081399J2096780J7784792K5227689L5158261M6738099
37496B47222588N4099408M8422055K4934277j1025720m4582309o0262067n3997555
37489B04810677l6830858k4201143k1093498k0335347j5239441q753307p418938
37482G0938145j0904236j2698315r312182l880042q21151q13111j643851j341218
37474B9524039K25566J390826N35038j141374j76303M201712P786952O627216
37466D8973672K470937k49381q74207j885410l419715l377057k415800l507524
37458C5715515o002385n470310j069572J956069q1489l357954j936445L640455
$$ plain form
37450 23393884 30541245 35449496 35287429 32527059 31458127 33697346 37346145 39812594
37442 39812594 40450836 40024325 38790227 36895470 36118584 38544485 42891429 44810591
37434 44810591 42196828 37797226 34904920 33062761 30445121 28060786 28171384 29887638
37426 29887638 29888143 27294100 25090222 26674232 32892237 41965041 50557207 55873711 58603469
37417 58603469 62538724 69465344 76670112 82147887 89139253 100880715 113636126 121813595
37409 121813595 129298279 147803738 181713174 221009836 252066858 268991399 270471312
37402 270471312 253097398 216482268 171697648 135380245 114404780 102385026 91773397
37395 91773397 82669205 77328362 72658023 63996206 53381454 48124487 51121214 56934850
$$ packed form
37450B3393884P147361M908251j62067k760370j068932K239219L648799K466449
37442C9812594O38242m26511j234098j894757p76886K425901M346944J919162
37434D4810591k613763m399602k892306j842159k617640k384335J10598J716254
37426B9887638N05k594043k203878J584010O218005R072804Q592166N316504K729758
37417E8603469L935255O926620P204768N477775O991366J1741462J2755411Q177469
37409A21813595P484684J8505459L3909436L9296662L1057022J6924541J479913
37402B70471312j7373914l6615130m4784620l6317403k0975465j2019754j0611629
37395I1773397r104192n340843m670339q661817j0614752n256967K996727N813636
$$ plain form
37387 56934850 58716239 55856569 52860748 52852586 54855462 56627987 57280373 56399451 52915250
37378 52915250 46768402 40779499 38795289 41571811 45574010 46323399 42429375 36233103
37370 36233103 31131161 28577206 27401867 25819268 23882265 23463244 25786156 29907244
37362 29907244 34064612 37375810 39381986 39403391 38118107 38743143 44265156 53588056
37354 53588056 62408968 67825325 69988197 69378741 65423951 58768028 52058869 46555240
37346 46555240 40223544 31731573 24609291 24004232 29518099 34654270 34646529 32269912 33649190
37337 33649190 39853562 45705454 47043355 46246263 48954658 57333233 68821494 80174240
37329 80174240 90001961 98265686 106821748 120372695 142482337 168990829 189208920
$$ packed form
37387E6934850J781389k859670k995821q162K002876J772525O52386q80922l484201
37378E2915250o146848n988903j984210K776522M002199P49389l894024o196272
37370C6233103n101942k553955j175339j582599j937003m19021K322912M121088
37362B9907244M157368L311198K006176K1405j285284O25036N522013R322900
37354E3588056Q820912N416357K162872o09456l954790o655923o709159n503629
37346D6555240o331696q491971p122282o05059N513867N136171p741k376617J379278
37337C3649190O204372N851892J337901p97092K708395Q378575J1488261J1352746
37329H0174240R827721Q263725Q556062J3550947K2109642K6508492K0218091
$$ plain form
37322 189208920 196029014 191486905 180130459 161887770 136428371 110396633 92885346
37315 92885346 84830266 79648300 74093559 71299243 72068754 70906985 64291796 56730159
37307 56730159 53986661 54922142 54816865 52995629 51953103 51616411 49903992 47687245
37299 47687245 48298352 52349497 56904886 59832988 61939479 64854641 69387562 75844478
37291 75844478 83881188 92394513 101117007 111149174 122141888 130763317 134543798 135583441
37283 135583441 137476301 140369780 143295754 150713139 171489421 208552401 251069185
37276 251069185 278775251 275221517 239320553 186389838 137166241 103491411 83961724
37269 83961724 72199313 65145596 61388197 56775035 47945942 38175799 33475536 33370454
$$ packed form
37322A89208920O820094m542109j1356446j8242689k5459399k6031738j7511287
37315I2885346q055080n181966n554741k794316P69511j161769o615189p561637
37307E6730159k743498R35481j05277j821236j042526l36692j712419k216747
37299D7687245O11107M051145M555389K928102K106491K915162M532921O456916
37291G5844478Q036710Q513325Q722494J0032167J0992714Q621429L780481J039643
37283A35583441J892860K893479K925974P417385K0776282L7062980M2516784
37276B51069185K7706066l553734l5900964n2930715m9223597l3674830j9529687
37269H3961724j1762411p053717l757399m613162q829093r770143m700263j05082
$$ plain form
37261 33370454 31525923 25910648 22096996 24438151 29429261 31097417 28991216 27300208
37253 27300208 28782350 32856947 38017524 43447753 49126448 55827197 64149426 73290379
37245 73290379 82502874 93323098 107334446 122528054 137203728 157860934 194967645
37238 194967645 245215776 284023552 284874678 245795833 190495342 143806602 112549535
37231 112549535 90583670 73392044 61449664 54048558 47640674 40733317 35721687
37224 35721687 34588341 35789504 36645010 36436830 35667876 34162285 31749964 29572593
37216 29572593 28753909 28497559 27313719 25458130 24108808 22757110 20094860 17330032
37208 17330032 17352602 19949108 21423682 20488558 20648807 23985573 26404239 23426456 17930567
$$ packed form
37261C3370454j844531n615275l813652K341155M991110J668156k106201j691008
37253B7300208J482142M074597N160577N430229N678695O700749Q322229R140953
37245G3290379R212495J0820224J4011348J5193608J4675674K0657206L7106711
37238A94967645N0248131L8807776Q51126l9078845n5300491m6688740l1257067
37231A12549535k1965865j7191626j1942380p401106o407884o907357n011630
37224C5721687j133346J201163Q55506k08180p68954j505591k412321k177371
37216B9572593q18684k56350j183840j855589j349322j351698k662250k764828
37208A7330032K2570K596506J474574r35124J60249L336766K418666k977783n495889
$$ plain form
37199 17930567 16817358 21418914 26764987 29836206 32614669 36388856 39324213 41878574
37191 41878574 48689313 61157860 72684999 75995435 72254919 68344795 67223207 65747601
37183 65747601 61006727 54105431 47332687 41333091 36074407 31849681 28188820 23877664
37175 23877664 19335412 17494764 20751387 27397480 32344668 32094058 28646108 27316786
37167 27316786 30258174 33905191 34630330 35066929 40987673 52078050 60307946 59275040
37159 59275040 51496548 43872400 39106905 35018837 29985943 24968157 20889835 17498924
37151 17498924 14958154 14128309 15070735 16879664 18773042 20092447 19966790 18374520
37143 18374520 16760122 16384292 17053549 18417687 20846694 23751838 25100894 24372451
$$ packed form
37199A7930567j113209M601556N346073L071219K778463L774187K935357K554361
37191D1878574O810739J2468547J1527139L310436l740516l910124j121588j475606
37183F5747601m740874o901296o772744n999596n258684m224726l660861m311156
37175B3877664m542252j840648L256623O646093M947188k50610l447950j329322
37167B7316786K941388L647017P25139M36599N920744J1090377Q229896j032906
37159E9275040p778492p624148m765495m088068n032894n017786m078322l390911
37151A7498924k540770q29845R42426J808929J893378J319405j25657j592270
37143A8374520j614398l75830O69257J364138K429007K905144J349056p28443
$$ plain form
37135 24372451 23917780 25388263 27013772 26658597 25101952 23637947 21251908 17693060
37127 17693060 16542704 20621247 26377075 27919651 25295084 23453762 23919706 23418681
37119 23418681 20914928 19960862 22720381 27042650 31211587 36558443 43324259 48871375
37111 48871375 52511740 57306111 63981574 67670722 64610941 58196279 54043548 52311302
37103 52311302 49646647 46143132 45038741 46804867 48701183 49989223 52858695 57428097
37095 57428097 59850569 57021317 50540371 44585838 41727305 41869252 43610546 45449861
37087 45449861 46854167 49333491 55800331 67693750 82518827 94708412 99526893 96519607
37079 96519607 88936493 79691079 69060111 57449510 48730372 47629418 53718102 61132653
$$ packed form
37135B4372451m54671J470483J625509l55175j556645j464005k386039l558848
37127A7693060j150356M078543N755828J542576k624567j841322M65944n01025
37119B3418681k503753r54066K759519M322269M168937N346856O765816N547116
37111D8871375L640365M794371O675463L689148l059781o414662m152731j732246
37103E2311302k664655l503515j104391J766126J896316J288040K869472M569402
37095E7428097K422472k829252o480946n954533k858533J41947J741294J839315
37087D5449861J404306K479324O466840J1893419J4825077J2189585M818481l007286
37079I6519607p583114r245414j0630968j1610601q719138j100954O088684P414551
$$ plain form
37071 61132653 65123818 65832953 64448057 59537006 50212509 40002541 33637086 31417048
37063 31417048 30222225 28896465 28919076 30384198 31318915 31395213 32707171 35726332 37616419
37054 37616419 36559687 35780686 40962665 53929804 69906089 80982229 82188934 74725478
37046 74725478 63735435 53440781 45162769 39313311 36504743 35426312 32353167 25483778
37038 25483778 18068843 14341290 13746844 12508020 9802602 8457268 9788973 11800601
37030 11800601 12910848 13550658 13257100 10297395 5784767 4282559 7973829 13441244
37022 13441244 16599478 17608287 18102473 16894672 12490230 7637609 6835572 10162929
37014 10162929 13630815 15383024 17703085 22477526 28060590 31528116 31434799 27821467
$$ packed form
37071F1132653L991165P09135j384896m911051r324497j0209968o365455k220038
37063C1417048j194823j325760K2611J465122R34717P6298J311958L019161J890087
37054C7616419j056732p79001N181979J2967139J5976285J1076140J206705p463456
37046G4725478j0990043j0294654q278012n849458k808568j078431l073145o869389
37038B5483778p414935l727553n94446j238824k705418j345334J331705K011628
37030A1800601J110247O39810k93558k959705m512628j502208L691270N467415
37022A3441244L158234J008809M94186j207801m404442m852621q02037L327357
37014A0162929L467886J752209K320061M774441N583064L467526r3317l613332
$$ plain form
37006 27821467 22281709 18720089 20915140 27632386 32525934 30795056 24252540 18307267
36998 18307267 15911892 16440379 18559229 21235040 22701599 21401960 18245047 15788651
36990 15788651 14847056 13791278 11585658 9576700 9499846 11363600 14115941 16691236
36982 16691236 17369617 14135815 7693956 2672509 3228787 7983654 11777569 12197818
36974 12197818 11604721 12394533 13383166 12311859 9304766 5912206 3027834 2021499
36966 2021499 5510213 13552756 20641236 20669365 14711338 9987308 10784689 14404670 16985702
36957 16985702 18784559 21248115 22951255 22319266 21673892 24310317 29134019 32449496
36949 32449496 34235485 38205965 45360596 51507549 52338348 47856936 40784082 33670339
$$ packed form
37006B7821467n539758l561620K195051O717246M893548j730878o542516n945273
36998A8307267k395375N28487K118850K675811J466559j299639l156913k456396
36990A5788651r41595j055778k205620k008958p6854J863754K752341K575295
36982A6691236O78381l233802o441859n021447N56278M754867L793915M20249
36974A2197818n93097P89812R88633j071307l007093l392560k884372j006335
36966B021499L488714Q042543P088480K8129n958027m724030P97381L619981K581032
36957A6985702J798857K463556J703140o31989o45374K636425M823702L315477
36949C2449496J785989L970480P154631O146953Q30799m481412p072854p113743
$$ plain form
36941 33670339 28869600 28162141 30160849 30354358 25993381 19373877 14539330 12558555
36933 12558555 12082362 12688132 14814463 17203074 17138596 13471631 7906509 3376972 2050915
36924 2050915 4144449 7618442 10023076 11551404 14543161 18689794 19472787 14354181
36916 14354181 8276227 8704682 16053743 23465879 26085260 25973159 27045619 29966692
36908 29966692 34072132 39748396 45474850 46033714 37940335 24781155 13461549 6700166
36900 6700166 2908857 1841190 5215295 11348980 14189564 10436158 4849186 5344424
36892 5344424 13596768 22840629 25220293 19885080 13095876 11130069 14469212 19306460
36884 19306460 22985987 25768784 28062253 29367106 31017475 36683962 47695587 60056139
$$ packed form
36941C3670339m800739p07459J998708J93509m360977o619504m834547j980775
36933A2558555m76193O05770K126331K388611o4478l666965n565122m529537j326057
36924B050915K093534L473993K404634J528328K991757M146633P82993n118606
36916A4354181o077954M28455P349061P412136K619381j12101J072460K921073
36908B9966692M105440N676264N726454N58864q093379j3159180j1319606o761383
36900F700166l791309j067667L374105O133685K840584l753406n586972M95238
36892E344424Q252344R243861K379664n335213o789204j965807L339143M837248
36884A9306460L679527K782797K293469J304853J650369N666487J1011625J2360552
$$ plain form
36876 60056139 68556480 71763438 70372530 63448625 50659820 36467415 26794941 21706823
36868 21706823 16348847 9441348 5411876 6637602 9012978 8121698 5265401 3852362
36860 3852362 3717673 3104837 3004313 4855967 6318979 4292003 731336 531226 4193431
36851 4193431 7295727 7231755 5929410 5330242 4601264 3091931 2068666 1830332 683326
36842 683326 -1316790 -1107468 2444089 5557128 4637196 1829286 1884698 5256202 8251606
36833 8251606 9210166 10380932 13235458 15595792 14930933 11976131 9487833 9253194 11675896
36824 11675896 16400893 21518497 23701463 21405612 17104691 14217033 12589854 9670095
36816 9670095 5746485 4398839 6570640 7844641 4561213 -16395 141351 4701386
$$ packed form
36876F0056139Q500341L206958j390908o923905j2788805j4192405r672474n088118
36868B1706823n357976o907499m029472J225726K375376q91280k856297j413039
36860C852362j34689o12836j00524J851654J463012k026976l560667k00110L662205
36851D193431L102296o3972j302345n99168p28978j509333j023265k38334j147006
36842F83326k000116K09322L551557L113039r19932k807910N5412L371504K995404
36833H251606R58560J170766K854526K360334o64859k954802k488298k34639K422702
36824A1675896M724997N117604K182966k295851m300921k887658j627179k919759
36816I670095l923610j347646K171801J274001l283428m577608J57746M560035
$$ plain form
36808 4701386 6978807 3814598 466951 2773768 8276899 9581214 4684937 -771820
36800 -771820 -1427470 1938146 5541860 7901500 9785492 11361922 12061435 12098999 11917910
36791 11917910 10840746 8322593 6127614 6981528 10573524 12842916 10610739 5909012
36783 5909012 4048859 7478955 13144981 16581221 17092090 17241817 18267881 18764963 18183865
36774 18183865 18450781 20243351 20421131 16348372 10981381 9664320 12522119 14384742
36766 14384742 12614740 10337655 10330025 10484322 8524012 7107662 9689381 14068656 15133010
36757 15133010 12364674 9327389 6654397 1637629 -4675211 -6395590 -1404909 4332579
36749 4332579 4788949 1899506 1260093 3384932 4437868 3345710 2633106 3171024 3334805
$$ packed form
36808D701386K277421l164209l347647K306817N503131J304315m896277n456757
36800g71820o55650L365616L603714K359640J883992J576430O99513L7564j81089
36791A1917910j077164k518153k194979Q53914L591996K269392k232177m701727
36783E909012j860153L430096N666026L436240N10869J49727J026064M97082n81098
36774A8183865K66916J792570J77780m072759n366991j317061K857799J862623
36766A4384742j770002k277085p630J54297j960310j416350K581719M379275J064354
36757A5133010k768336l037285k672992n016768o312840j720379M990681N737488
36749D332579M56370k889443o39413K124839J052936j092158p12604N37918J63781
$$ plain form
36740 3334805 3087446 3839071 4153249 900465 -4538352 -6726422 -4380464 -2414747 -3310446
36731 -3310446 -2609044 2720130 7282645 5012468 -398861 -554062 4532719 6720995
36723 6720995 2801200 -1155120 -182768 2723804 3593864 4366417 7770300 10802873 9404137
36714 9404137 5962982 5804057 8341759 8110091 3949935 1100240 3235690 7474851
36706 7474851 9239485 8348537 7892975 9313732 10752499 9406657 4554717 -1166743
36698 -1166743 -3577843 -1048573 3669143 6817124 7704064 7690037 6876143 5022944 4613923
36689 4613923 8686874 15297907 18354992 15310243 10400952 8581786 9691179 10719639
36681 10719639 10468357 9131283 6206881 2327681 1014980 4775256 10641401 13236860
$$ packed form
36740C334805k47359P51625L14178l252784n438817k188070K345958J965717q95699
36731c310446P01402N329174M562515k270177n411329j55201N086781K188276
36723F720995l919795l956320R72352K906572Q70060P72553L403883L032573j398736
36714I404137l441155j58925K537702k31668m160156k849695K135450M239161
36706G474851J764634q90948m55562J420757J438767j345842m851940n721460
36698a166743k411100K529270M717716L147981Q86940j4027q13894j853199m09021
36689D613923M072951O611033L057085l044749m909291j819166J109393J028460
36681A0719639k51282j337074k924402l879200j312701L760276N866145K595459
$$ plain form
36673 13236860 11651582 9862422 10702358 12982733 14757640 15737305 15462169 12566501
36665 12566501 7707447 4351905 4297445 4722895 2447522 -788281 -843976 1955688 2649580
36656 2649580 -983180 -4831625 -4389261 -1055917 856030 1249004 3911319 9393638
36648 9393638 12816394 10384959 4559246 376924 -640291 -149949 1132457 3626141
36640 3626141 6037096 5937598 3278961 546596 -757527 -1340175 -1789808 -1653058 -1230957
36631 -1230957 -1843833 -3704330 -5613102 -7026234 -8105610 -7638885 -3951158 1377120
36623 1377120 3870228 1666399 -2056735 -3601981 -2883270 -1394366 759085 3171551
36615 3171551 3249858 -507322 -4931446 -5251809 -1041494 3595610 5180247 3775203 1290694
$$ packed form
36673A3236860j585278j789160Q39936K280375J774907R79665k75136k895668
36665A2566501m859054l355542n4460M25450k275373l235803n5695K799664O93892
36656B649580l632760l848445M42364L333344J911947L92974K662315N482319
36648I393638L422756k431435n825713m182322j017215M90342J282406K493684
36640C626141K410955r9498k658637k732365j304123n82648m49633J36750M22101
36631a230957o12876j860497j908772j413132j079376M66725L687727N328278
36623A377120K493108k203829l723134j545246P18711J488904K153451K412466
36615C171551P8307l757180m424124l20363M210315M637104J584637j405044k484509
$$ plain form
36606 1290694 -690367 -1383087 -873949 139480 1447326 3426639 5490140 6103891 5283234
36597 5283234 4842489 4858638 2857184 -1285644 -3094701 240240 4483343 4030874 543266
36588 543266 114409 3273895 4537554 2029003 434743 2410194 3788459 1088938
36580 1088938 -1866168 45533 4597768 5279780 907424 -3243037 -3187024 -328710 2370517
36571 2370517 4037138 4540184 2978287 -361431 -2465487 -213508 5817252 11329688
36563 11329688 12200893 8137149 2642768 -315201 533236 3644579 6707082 8010437
36555 8010437 6709213 3516914 1047122 1574899 4041293 4970725 2780846 -626042
36547 -626042 -2888681 -3416773 -1919780 2195603 7100274 8254764 4008248 -566332
$$ packed form
36606A290694j981061o92720N09138J013429J307846J979313K063501O13751q20657
36597E283234m40745J6149k001454m142828j809057L334941M243103m52469l487608
36588E43266m28857L159486J263659k508551j594260J975451J378265k699521
36580A088938k955106J911701M552235O82012m372356m150461N6013K858314K699227
36571B370517J666621N03046j561897l339718k104056K251979O030760N512436
36563A1329688Q71205m063744n494381k957969Q48437L111343L062503J303355
36555H010437j301224l192299k469792N27777K466394R29432k189879l406888
36547f26042k262639n28092J496993M115383M904671J154490m246516m574580
$$ plain form
36539 -566332 849438 7480696 12316607 11128254 6965761 4994602 6329212 8753513
36531 8753513 10916899 13202868 15447063 16032960 13538796 8434659 3001606 -319000
36523 -319000 -846842 -19716 520718 903760 2355130 4970338 7448053 8979961 9910580
36514 9910580 10210464 8929515 6090535 3809459 4187790 6761111 9226092 10249306
36506 10249306 10366218 10309368 9760173 8169475 5957656 4269033 3861578 4635521 5983009
36497 5983009 7164272 7509705 6852195 5943473 5912968 6802928 6927136 4425031 -389745
36488 -389745 -4816457 -6276860 -4729247 -2317758 -987876 -870601 -823753 -63511 972593
36479 972593 1383264 1269887 1897008 3850065 5551572 4907139 2581354 2056154 5343157
$$ packed form
36539e66332J415770O631258M835911j188353m162493j971159J334610K424301
36531H753513K163386K285969K244195N85897k494164n104137n433053l320606
36523c19000n27842Q27126N40434L83042J451370K615208K477715J531908R30619
36514I910580K99884j280949k838980k281076L78331K573321K464981J023214
36506A0249306J16912n6850n49195j590698k211819j688623m07455P73943J347488
36497E983009J181263L45433o57510r08722l0505Q89960J24208k502105m814776
36488c89745m426712j460403J547613K411489J329882J17275M6848P60242J036104
36479I72593M10671j13377O27121J953057J701507o44433k325785n25200L287003
$$ plain form
36470 5343157 9811777 10979734 8007353 4515413 3624918 4081403 2714506 -318670
36462 -318670 -866733 4080067 11974937 16811726 15310467 9694643 4250238 903161
36454 903161 -701071 -567512 1536882 3864571 3709223 1522723 1254346 4907771 9151522
36445 9151522 9656262 6767587 3936256 2190047 -2253 -2140049 -1483050 1871186
36437 1871186 3992044 2936025 1667868 2714371 3715878 1975156 184692 2582285
36429 2582285 7272026 8223450 4810299 3400136 7773326 13376880 14329335 11811589
36421 11811589 11231726 14044575 17177348 18985786 21028646 24385022 28571187 34320497
36413 34320497 43307421 54224222 62856485 67370925 70162148 72933077 73364067 68909625
$$ packed form
36470E343157M468620J167957k972381l491940q90495M56485j366897l033176
36462c18670n48063M946800P894870M836789j501259n615824n444405l347077
36454I03161j604232J33559K104394K327689j55348k186500k68377L653425M243751
36445I151522N04740k888675k831331j746209k192300k137796O56999L354236
36437A871186K120858j056019j268157J046503J001507j740722j790464K397593
36429B582285M689741R51424l413151j410163M373190N603554R52455k517746
36421A1811589n79863K812849L132773J808438K042860L356376M186165N749310
36413C4320497Q986924J0916801Q632263M514440K791223K770929M30990m454442
$$ plain form
36405 68909625 60956022 52575658 44673250 37257146 32163957 30741931 30106644 25662160
36397 25662160 17361118 10280053 8499662 10852664 13152110 12490463 8884396 4552450
36389 4552450 2109862 2059703 1821137 -1496881 -7354850 -11958300 -11899876 -6637490 1707389
36380 1707389 9475912 13449473 13652424 13282932 14123268 13796294 10218163 6537176 7338116
36371 7338116 11286423 12725208 10216296 7753489 6933059 4471655 -185608 -1469951
36363 -1469951 3571007 8566624 5920399 -1819826 -5150270 -564240 5884958 7900588
36355 7900588 6220362 5124028 5873862 6124654 4009996 1030409 968383 5645741 11541839
36346 11541839 12463449 6948454 794018 -73136 3062531 4722935 3522262 3024601
$$ packed form
36405F8909625p953603q380364p902408p416104n093189j422026o35287m444484
36397B5662160q301042p081065j780391K353002K299446o61647l606067m331946
36389D552450k442588n0159k38566l318018n857969m603450N8424N262386Q344879
36380A707389P768523L973561K02951l69492Q40336l26974l578131l680987Q00940
36371G338116L948307J438785k508912k462807q20430k461404m657263j284343
36363a469951N040958M995617k646225p740225l330444M586030O449198K015630
36355G900588j680226j096334P49834K50792k114658k979587o2026M677358N896098
36346A1541839R21610n514995o154436q67154L135667J660404j200673m97661
$$ plain form
36338 3024601 5122961 7232890 6746218 4467055 2411061 1118164 362987 264030 675855
36329 675855 1118516 1647106 2292084 2102995 753802 257933 2376758 5095091 4998726
36320 4998726 2726779 2282340 4831412 7193754 7147187 6166268 5687382 4657108 2612078
36311 2612078 1590106 2844268 4767491 6002496 7319025 8322475 6105618 419244
36303 419244 -3116346 775853 9455678 15074080 13984404 9952323 8466379 11154502
36295 11154502 16045155 20572211 23382721 24715050 25831747 27811181 31136899 36383739
36287 36383739 43917649 52569947 60510623 68032024 76819613 85114357 86857811 78605880
36279 78605880 64885507 53088933 44695707 35594110 24258451 14954831 11799123 13237213
$$ packed form
36338C024601K098360K109929m86672k279163k055994j292897p55177r8957M11825
36329F75855M42661N28590O44978j89089j349193m95869K118825K718333r6365
36320D998726k271947m44439K549072K362342m6567r80919m78886j030274k045030
36311B612078j021972J254162J923223J235005J316529J003450k216857n686374
36303D19244l535590L892199Q679825N618402j089676m032081j485944K688123
36295A1154502M890653M527056K810510J332329J116697J979434L325718N246840
36287C6383739P533910Q652298P940676P521401Q787589Q294744J743454q251931
36279G8605880j3720373j1796574q393226r101597j1335659r303620l155708J438090
$$ plain form
36271 13237213 14366363 12568689 9006624 5802076 3470188 1084713 -1750768 -3607951
36263 -3607951 -2694096 146945 1349368 -1177600 -5091705 -6789064 -6401803 -6859931 -8323227
36254 -8323227 -7017990 -1022052 5525596 6683792 2155416 -2215932 -1735858 1603616
36246 1603616 2383328 -897837 -4305863 -4304771 -2188997 -1088169 -1114501 -497792 109264
36237 109264 -1520197 -4322065 -4146534 207696 4903053 6465170 5817225 5257599 5007268
36228 5007268 4935632 6070433 7584804 5820003 -247364 -5790705 -6240488 -3583746 -2316666
36219 -2316666 -2232444 -539576 1475889 372127 -2198337 -1018922 4009747 7743281
36211 7743281 9532664 15900073 30096789 44684552 49217358 42036564 30422822 21313806
$$ packed form
36271A3237213J129150j797674l562065l204548k331888k385475k835481j857183
36263c607951R13855K841041J202423k526968l914105j697359L87261m58128j463296
36254h323227J305237N995938O547648J158196m528376m371348M80074L339474
36246A603616P79712l281165l408026J092K115774J100828k6332O16709O07056
36237A09264j629461k801868J75531M354230M695357J562117o47945n59626k50331
36228E007268p1636J134801J514371j764801o067367n543341m49783K656742J267080
36219b316666Q4222J692868K015465j103762k570464J179415N028669L733534
36211G743281J789383O367409J4196716J4587763M532806p180794j1613742r109016
$$ plain form
36203 21313806 15558671 10213118 3478671 -2875797 -5173900 -2292371 2092508 3466469
36195 3466469 1787261 -34924 -1826771 -5668257 -9790494 -8821374 -2094285 3748772
36187 3748772 3612179 590824 3914 1389821 1324760 431719 1681485 3925220 3087513
36178 3087513 -991740 -4257172 -4934549 -5545292 -7934576 -10551810 -11680835 -11803537 -11540948
36169 -11540948 -10177023 -7504918 -4912624 -3639376 -3638599 -4488524 -5615875 -5652326 -3752860
36160 -3752860 -1582814 -1615992 -3300262 -3490888 -1139260 1149680 1135621 -85266 -535365
36151 -535365 -530489 -1485334 -3035118 -3357593 -1762148 539950 2023240 2202815 1527395
36142 1527395 644809 -92327 -567702 -436575 933634 3719584 7187228 10387844 12844522
$$ packed form
36203B1313806n755135n345553o734447o354468k298103K881529M384879J373961
36195C466469j679208j822185j791847l841486m122237R69120O727089N843057
36187C748772j36593l021355n86910J385907o5061q93041J249766K243735q37707
36178C087513m079253l265432o77377o10743k389284k617234j129025j22702K62589
36169a1540948J363925K672105K592294J273248P77q49925j127351l6451J899466
36160c752860K170046l3178j684270j90626K351628K288940j4059j220887m50099
36151e35365M876r54845j549784l22475J595445K302098J483290J79575o75420
36142A527395q82586p37136m75375J31127J370209K785950L467644L200616K456678
$$ plain form
36133 12844522 14128009 13535719 10976227 7499193 4192812 1356427 -546444 -437540
36125 -437540 1631414 3577544 3702734 2852374 2582287 2664089 2465589 3132712 5570385
36116 5570385 7679810 7047151 5272435 5473401 6079680 2280567 -5436041 -9543717 -5020503
36107 -5020503 3548294 7854762 5702432 1324789 -1519321 -2542003 -2466218 -1797281 -1848989
36098 -1848989 -3642190 -5673887 -5469161 -3188580 -945748 1204880 5179623 10115961
36090 10115961 11237778 5601121 -3243198 -8767464 -8638868 -6354093 -6186800 -8443016
36082 -8443016 -10176836 -9318065 -6911018 -5234081 -4652716 -3521136 -1291788 -135142
36074 -135142 -2067589 -5448855 -6445693 -3933286 -814631 111804 -470092 -313583 983411
$$ packed form
36133A2844522J283487n92290k559492l477034l306381k836385j902871J08904
36125d37540K068954J946130J25190q50360k70087Q1802j98500O67123K437673
36116E570385K109425o32659j774716K00966O06279l799113p716608m107676M523214
36107e020503Q568797M306468k152330m377643k844110j022682P5785O68937n1708
36098a848989j793201k031697K04726K280581K242832K150628L974743M936338
36090A0115961J121817n636657q844319n524266J28596K284775J67293k256216
36082h443016j733820Q58771K407047J676937N81365J131580K229348J156646
36074a35142j932447l381266r96838K512407L118655R26435n81896J56509J296994
$$ plain form
36065 983411 2320878 3435655 4540953 4355935 1260790 -3221809 -4656796 -771173
36057 -771173 5381271 8893174 8518789 7077242 7095954 7971164 7545769 4917289 1023544
36048 1023544 -2652827 -5266555 -6796935 -7389711 -6611215 -3855721 124131 2907309
36040 2907309 2723836 629429 -918592 -1329257 -2123731 -3976691 -5484049 -5477389 -4672914
36031 -4672914 -3914644 -2486137 196513 2448815 1881767 -1271099 -4033067 -3965872 -1563349
36022 -1563349 510852 -244251 -4298931 -9713801 -13809026 -15614582 -15994505 -15119499 -11618260
36013 -11618260 -5657049 -994689 -1158617 -4269771 -4814265 -954392 2915426 2193120
36005 2193120 -1966008 -4895074 -4826617 -4174468 -4887278 -5462527 -3633585 -43495 2527700
$$ packed form
36065I83411J337467J114777J105298j85018l095145m482599j434987L885623
36057g71173O152444L511903l74385j441547J8712Q75210m25395k628480l893745
36048A023544l676371k613728j530380n92776P78496K755494L979852K783178
36040B907309j83473k094407j548021m10665p94474j852960j507358O660Q04475
36031d672914P58270J428507K682650K252302n67048l152866k761968O7195K402523
36022a563349K074201p55103m054680n414870m095225j805556l79923Q75006L501239
36013a1618260N961211M662360j63928l111154n44494L859873L869818p22306
36005B193120m159128k929066O8457O52149p12810n75249J828942L590090K571195
$$ plain form
35996 2527700 2698644 1405707 -474052 -3342121 -7000986 -9470374 -9342615 -8075682
35988 -8075682 -7901813 -8301967 -7108185 -4848894 -4897408 -8336410 -11403747 -9880454 -4295690
35979 -4295690 865615 1831200 -1723918 -6952970 -9568394 -7091637 -1946340 252670
35971 252670 -3092009 -8675357 -11657821 -10574001 -6581055 -982395 4088398 5559541
35963 5559541 3143052 632781 508349 317525 -2043199 -3266978 -11679 4147202
35955 4147202 3820929 1412826 3774458 10203629 12282192 6655324 -186677 -2190210
35947 -2190210 -1229033 -1090778 -1041936 347431 1019768 -239364 -417378 2187348 3821633
35938 3821633 1376934 -1905358 -1816639 -50154 -407498 -2012814 -1940451 -1209000 -2220575
$$ packed form
35996B527700J70944j292937j879759k868069l658865k469388J27759J266933
35988h075682J73869m00154J193782K259291m8514l439002l067337J523293N584764
35979d295690N161305R65585l555118n229052k615424K476757N145297K199010
35971B52670l344679n583348k982464J083820L992946N598660N070793J471143
35963E559541k416489k510271j24432j90824k360724j223779L255299M158881
35955D147202l26273k408103K361632O429171K078563n626868o842001k003533
35947b190210R61177J38255M8842J389367O72337j259132j78014K604726J634285
35938C821633k444699l282292Q8719J766485l57344j605316P2363P31451j011575
$$ plain form
35929 -2220575 -3012898 -127179 4863782 7418040 6752670 5025390 1915920 -3837674
35921 -3837674 -9050789 -8787760 -4015808 -682751 -1313899 -2915854 -2903329 -1622548 829072
35912 829072 4741063 7639406 6309390 2111250 -711955 -1571948 -2908829 -3975930
35904 -3975930 -2100115 129048 -3083461 -10303857 -12785009 -7473855 -1952421 -2346731
35896 -2346731 -4192002 -1228703 3412657 2361313 -3969426 -8215806 -6864443 -3470205
35888 -3470205 -1827024 -1628429 -1136381 156191 1908720 2893888 859137 -4673179 -9940265
35879 -9940265 -10237458 -5611323 -796366 482674 -1029146 -2447843 -2625383 -2957174 -4979789
35870 -4979789 -7739263 -8396961 -6208388 -4414026 -5806880 -7769355 -5638030 -498499
$$ packed form
35929b220575p92323K885719M990961K554258o65370j727280l109470n753594
35921c837674n213115K63029M771952L333057o31148j601955J2525J280781K451620
35912H29072L911991K898343j330016m198140k823205q59993j336881j067101
35904c975930J875815K229163l212509p220396k481152N311154N521434l94310
35896b346731j845271K963299M641360j051344o330739m246380J351363L394238
35888c470205J643181J98595M92048J292572J752529R85168k034751n532316n267086
35879i940265k97193M626135M814957J279040j511820j418697j77540l31791k022615
35870d979789k759474o57698K188573J794362j392854j962475K131325N139531
$$ plain form
35862 -498499 1475875 -1671691 -4661626 -3600541 -1962307 -4008337 -7230385 -6694405
35854 -6694405 -3352371 -2160995 -3979120 -4908545 -2676689 1248432 5303254 9104050
35846 9104050 11381172 10706778 8251211 6393666 4946741 2101031 -1453312 -2973426
35838 -2973426 -1991624 -798289 -782945 -1466788 -2735899 -4575348 -4918827 -1579428 3426583
35829 3426583 5127487 1871261 -2767477 -4982531 -4607753 -3223651 -1405639 674038
35821 674038 1931860 1086272 -2105625 -6482187 -9616485 -9223643 -5767954 -2449605 -1072391
35812 -1072391 187368 2814361 4392863 2450193 -530591 -450576 1750486 1869757 -241780
35803 -241780 -871547 257682 -918072 -5275623 -7994610 -5894302 -2253366 -1463795 -3031038
$$ packed form
35862d98499J974374l147566k989935J061085J638234k046030l222048N35980
35854f694405L342034J191376j818125r29425K231856L925121M054822L800796
35846I104050K277122o74394k455567j857545j446925k845710l554343j520114
35838b973426R81802J193335J5344o83843j269111j839449l43479L339399N006011
35829C426583J700904l256226m638738k215054L74778J384102J818012K079677
35821F74038J257822q45588l191897m376562l134298L92842L455689L318349J377214
35812a072391J259759K626993J578502j942670k980784Q0015K201062J19271k111537
35803b41780o29767J129229j175754m357551k718987K100308L640936P89571j567243
$$ plain form
35794 -3031038 -3903485 -3409087 -2942943 -3262038 -4344876 -5758279 -5870325 -3390417 -467496
35785 -467496 -642762 -2849078 -2056946 2455146 4718175 843963 -4950565 -7036434 -6386206
35776 -6386206 -7003822 -8300925 -6716978 -2284355 1926793 4907020 7025284 6274812
35768 6274812 1014822 -4827549 -5359413 -1111522 2032767 2186376 3364002 7097116
35760 7097116 8802597 5301732 363802 -1039652 316880 818770 395301 1363490 3091522
35751 3091522 2540136 -699850 -4019561 -6213155 -8377695 -9874297 -7331633 109889
35743 109889 7140008 7063538 -115685 -6877520 -6312994 388155 5852404 5033133 -125867
35734 -125867 -4588663 -6275141 -6375657 -5487110 -2868310 324778 528612 -3585439 -8254022
$$ packed form
35794c031038q72447M94398M66144l19095j082838j413403j12046K479908K922921
35785d67496j75266k206316P92132M512092K263029l874212n794528k085869O50228
35776f386206o17616j297103J583947M432623M211148K980227K118264p50472
35768F274812n259990n842371n31864M247891L144289J53609J177626L733114
35760G097116J705481l500865m937930j403454J356532N01890m23469R68189J728032
35751C091522n51386l239986l319711k193594k164540j496602K542664P441522
35743A09889P030119p6470p179223o761835N64526O701149N464249q19271n159000
35734a25867m462796j686478j00516Q88547K618800L193088K03834m114051m668583
$$ plain form
35725 -8254022 -8903185 -5897191 -3323107 -2928157 -2563575 -860145 112205 -1420534 -3418123
35716 -3418123 -3013607 -1170950 -988680 -2120439 -729086 4163033 7731949 5097863
35708 5097863 -1986481 -6883823 -5848721 -1774716 -23587 -2232434 -5066834 -4431032
35700 -4431032 -114938 4123817 5064229 3658927 3082321 4008270 4109885 2297044 619718
35691 619718 823640 1723331 1799777 1777677 2176776 915116 -3197706 -6609639 -4943318
35682 -4943318 186468 2718467 472203 -2429627 -2187093 -173270 411300 -873979
35674 -873979 -2551824 -3825902 -4250818 -3149611 -1345420 -1383223 -4026677 -6337672 -5214906
35665 -5214906 -1338476 2206778 3796714 3927110 3308539 2339877 1805114 2377532 3675650
$$ packed form
35725h254022o49163L005994K574084L94950L64582J703430R72350j532739j997589
35716c418123M04516J842657J82270j131759J391353M892119L568916k634086
35708E097863p084344m897342J035102M074005J751129k208847k834400O35802
35700d431032M316094M238755R40412j405302n76606R25949J01615j812841j677326
35691F19718K03922Q99691P6446k2100L99099j261660m112822l411933J666321
35682d943318N129786K531999k246264k901830K42534K013823N84570j285279
35674h73979j677845j274078m24916J101207J804191l7803k643454k310995J122766
35665e214906L876430L545254J589936J30396o18571r68662n34763N72418J298118
$$ plain form
35656 3675650 4939761 6409471 9207244 13847654 19043390 22062157 21076035 17705016
35648 17705016 15809802 16447900 15909450 11092777 4771494 1921752 2470082 2343396 737969
35639 737969 724390 2495050 2126817 -1522046 -4582386 -4845035 -4694770 -4888339 -2014215
35630 -2014215 3975312 6409812 1638159 -3825217 -2668340 1775859 1425850 -3066719
35622 -3066719 -3911299 509613 3410030 1262506 -984675 1218270 5069488 5785730
35614 5785730 3554119 1531354 838869 833741 1450381 2372096 1878500 -1170110 -5376637
35605 -5376637 -8052074 -7432037 -3566576 1412631 4128146 2983829 87429 -1602744
35597 -1602744 -2042438 -2734697 -3093778 -1514807 859206 1026000 -1658273 -5324840 -8811891
$$ packed form
35656C675650J264111J469710K797773M640410N195736L018767r86122l371019
35648A7705016j895214O38098n38450m816673o321283k849742N48330j26686j605427
35639G37969j3579J770660l68233l648863l060340k62649J50265j93569K874124
35630b014215N989527K434500m771653n463376J156877M444199l50009m492569
35622c066719q44580M420912K900417k147524k247181K202945L851218P16242
35614E785730k231611k022765o92485n128O16640R21715m93596l048610m206527
35605e376637k675437O20037L865461M979207K715515j144317k896400j690173
35597a602744m39694o92259l59081J578971K374013J66794k684273l666567l487051
$$ plain form
35588 -8811891 -11655325 -12090087 -9148322 -5770121 -5474532 -6894620 -6272112 -4154037 -4024666
35579 -4024666 -5230341 -3850100 -532749 -314826 -3656902 -4956624 -1920211 780768
35571 780768 -121200 -1551980 -869760 -546718 -1937918 -1263781 3107562 5911121 3562482
35562 3562482 1520183 6028227 13480634 15854670 13073990 11727854 13694604 14252116
35554 14252116 10925800 6889412 5099770 5013864 5568349 6197302 4715192 -759813 -7464183
35545 -7464183 -10174996 -7890134 -4094554 -852066 2546054 5412287 5535748 3615871
35537 3615871 2703925 2659138 320743 -4044807 -5974855 -3954065 -1949693 -2759996 -4057892
35528 -4057892 -3792645 -4528729 -8627980 -13061787 -13253229 -9492330 -5790275 -4286890 -4002818
$$ packed form
35588h811891k843434m34762K941765L378201K95589j420088O22508K118075J29371
35579d024666j205675J380241L317351K17923l342076j299722L036413K700979
35571G80768r01968j430780O82220L23042j391200O74137M371343K803559k348639
35562C562482k042299M508044P452407K374036k780680j346136J966750N57512
35554A4252116l326316m036388j789642q5906N54485O28953j482110n475005o704370
35545g464183k710813K284862L795580L242488L398120K866233J23461j919877
35537C615871r11946m4787k338395m365550j930048K020790K004372q10303j297896
35528d057892K65247p36084m099251m433807j91442L760899L702055J503385K84072
$$ plain form
35519 -4002818 -3454630 -1641937 1979887 5889660 6530124 2637377 -2012135 -2940239 -640621
35510 -640621 946533 309481 -619548 -696871 -1376793 -3896849 -7302087 -9880699 -10557920
35501 -10557920 -8559268 -3834625 1523793 4173479 2778841 -886645 -4554772 -7567723
35493 -7567723 -9683523 -9732185 -7189027 -3957221 -2590908 -3042156 -2932562 -1141227 626037
35484 626037 489147 -915107 -1597645 -1068635 -557881 -817196 -1151192 -712687 332003
35475 332003 1087528 583991 -1701957 -5011060 -7258080 -7112515 -5934085 -6078168 -7389579
35466 -7389579 -7404315 -5328036 -3451786 -3670041 -4955929 -5803279 -6854018 -8845251 -9901107
35457 -9901107 -7944264 -4869380 -4969006 -8841628 -11707598 -9230377 -3356033 -464086
$$ packed form
35519d002818N48188J812693L621824L909773O40464l892747m649512r28104K299618
35510f40621J587154o37052r29029p7323o79922k520056l405238k578612o77221
35501a0557920J998652M724643N358418K649686j394638l665486l668127l012951
35493g567723k115800m8662K543158L231806J366313m51248J09594J791335J767264
35484F26037j36890j404254o82538N29010N10754k59315l33996M38505J044690
35475C32003P55525n03537k285948l309103k247020J45565J178430j44083j311411
35466g389579j4736K076279J876250k18255j285888q47350j050739j991233j055856
35457i901107J956843L074884r9626l872622k865970K477221N874344K891947
$$ plain form
35449 -464086 -3804851 -9194926 -9500678 -3298555 2824035 2144549 -3715788 -7279631 -5363841
35440 -5363841 -2327583 -2299719 -3069657 -773538 3193901 4108929 422094 -5432813 -10676854
35431 -10676854 -12973799 -9933067 -2354741 3751362 3233832 -1284579 -3370491 -2318922
35423 -2318922 -2929429 -6368099 -7997946 -5452089 -2497940 -2552899 -3947067 -4463585 -5477154
35414 -5477154 -8164220 -10008900 -8796857 -6466573 -5503039 -4876370 -2946088 -985777
35406 -985777 -219513 1222200 4335593 5495107 1405159 -4660312 -6417999 -2692956
35398 -2692956 2361256 5362374 5569058 2555704 -2844927 -6484385 -5012053 -1364064
35390 -1364064 -1049863 -3608701 -3370518 1374287 6032243 7365932 7393421 7866173 6825324
$$ packed form
35449d64086l340765n390075l05752O202123O122590o79486n860337l563843J915790
35440e363841L036258K7864p69938K296119L967439R15028l686835n854907n244041
35431a0676854k296945L040732P578326O106103n17530m518411k085912J051569
35423b318922o10507l438670j629847K545857K954149n4959j394168n16518j013569
35414e477154k687066j844680J212043K330284R63534O26669J930282J960311
35406i85777P66264J441713L113393J159514m089948o065471j757687L725043
35398b692956N054212L001118K06684l013354n400631l639458J472332L647989
35390a364064L14201k558838K38183M744805M657956J333689K7489M72752j040849
$$ plain form
35381 6825324 3520015 1404355 2604431 3897063 2042686 -934532 -1905828 -2183311
35373 -2183311 -4035062 -4991593 -1478872 3824688 4392362 -800694 -5846523 -6229354 -3585227
35364 -3585227 -1205317 390926 1431733 470341 -3250038 -7519397 -9593131 -9256577
35356 -9256577 -8014594 -7016712 -6892497 -7487855 -6573239 -1364163 6924677 12583770 11833790
35347 11833790 7594456 5142741 5016014 3785166 773545 -204019 3469945 9066586
35339 9066586 11742317 10065640 6771717 5101449 5869636 7935465 10429264 13678878
35331 13678878 17777753 21171752 22131192 21454452 21667607 23001832 22581139 18876023 14264423
35322 14264423 11017399 7628626 2560376 -893043 1640459 8098789 11516871 9307885
$$ packed form
35381F825324l305309k115660J200076J292632j854377k977218r71296k77483
35373b183311j851751r56531L512721N303560N67674n193056n045829l82831K644127
35364c585227K379910J596243J040807r61392l720379m269359k073734L36554
35356i256577J241983R97882J24215n95358R14616N209076Q288840N659093p49980
35347A1833790m239334k451715j26727j230848l011621r77564L673964N596641
35339I066586K675731j676677l293923j670268P68187K065829K493799L249614
35331A3678878M098875L393999R59440o76740K13155J334225m20693l705116m611600
35322A4264423l247024l388773n068250l453419K533502O458330L418082k208986
$$ plain form
35314 9307885 5956613 5463767 6247518 5650966 4686297 5075382 5484159 4452274 4022726
35305 4022726 6387938 9027865 7312359 972230 -5434647 -8016396 -6904150 -4736665
35297 -4736665 -4014544 -5352146 -6709151 -5341806 -1667897 748350 443098 456946 3203845
35288 3203845 6013820 5107221 1316378 -2015985 -4448318 -7358161 -9429017 -8139981
35280 -8139981 -4637132 -2394468 -1856958 -988894 -106584 -1018367 -2114117 -54510 3721231
35271 3721231 4192021 1047763 -449696 1704612 2948221 226138 -2569077 -840869
35263 -840869 3891109 7232910 7886763 6643677 3185008 -2055796 -5842246 -5845399 -4093347
35254 -4093347 -3547899 -3754348 -2934104 -1678010 -1252201 -721817 989248 2560104 2845841
$$ packed form
35314I307885l351272m92846P83751n96552r64669L89085M08777j031885m29548
35305D022726K365212K639927j715506o340129o406877k581749J112246K167485
35297d736665P22121j337602j357005J367345L673909K416247l05252J3848K746899
35288C203845K809975r06599l790843l332363k432333k909843k070856J289036
35280h139981L502849K242664N37510Q68064Q82310r11783j095750K059607L775741
35271C721231M70790l144258j497459K154308J243609k722083k795215J728208
35263h40869M731978L341801O53853j243086l458669n240804l786450l153J752052
35254d093347N45448k06449Q20244J256094M25809N30384J711065J570856K85737
$$ plain form
35245 2845841 3355587 5003348 5285804 2287149 -1389496 -2633203 -2856194 -4545506 -5609240
35236 -5609240 -2530725 2778635 4900012 2605368 -706122 -3443479 -7098764 -11171498
35228 -11171498 -12362025 -9752644 -6208776 -3722490 -1478022 791246 1692964 1258391
35220 1258391 1202159 1344969 -331165 -3415246 -4998760 -4672385 -5213349 -7148011 -7220449
35211 -7220449 -4065696 -1023110 -1022691 -2600857 -3310498 -3227414 -2614627 -145778 3468797
35202 3468797 3952154 -624147 -5508768 -4902810 460632 5202519 6547202 5691412 3926062
35193 3926062 1892380 1554782 4388095 7812583 7376488 2671028 -2250789 -4391632
35185 -4391632 -4488531 -4073739 -3243373 -2059326 -1349712 -1325635 -1572586 -2483703 -4201441
$$ packed form
35245B845841N09746J647761K82456k998655l676645j243707k22991j689312j063734
35236e609240L078515N309360K121377k294644l311490k737357l655285m072734
35228a1171498j190527K609381L543868K486286K244468K269268R01718m34573
35220A258391n6232J42810j676134l084081j583514L26375n40964j934662p2438
35211g220449L154753L042586M19j578166p09641Q3084O12787K468849L614575
35202C468797M83357m576301m884621O05958N363442M741887J344683q55790j765350
35193C926062k033682l37598K833313L424488m36095m705460m921817k140843
35185d391632r6899M14792Q30366J184047P09614K4077k46951r11117j717738
$$ plain form
35176 -4201441 -4449020 -852538 4280614 5360237 850843 -4477345 -6237132 -5574827
35168 -5574827 -5344673 -5022618 -2960929 -550139 245775 1352132 5762534 11367130 12603328
35159 12603328 8318253 3351761 1626192 2139373 2992954 4672577 6944377 6788229
35151 6788229 2956777 -584776 294476 3587903 3836167 -329566 -5140101 -7231075
35143 -7231075 -6505007 -3981872 -483483 2465533 3584965 3753840 4247273 3743790 565470
35134 565470 -2886108 -2559013 356573 318458 -3584537 -5304630 -1270026 3402491 2643993
35125 2643993 -1096855 -1012366 3120221 4647247 229717 -5485974 -6558303 -2754521
35117 -2754521 1788510 3661469 2182175 -1310102 -4372499 -5054784 -3741742 -2435544
$$ packed form
35176d201441k47579L596482N133152J079623m509394n328188j759787O62305
35168e574827K30154L22055K061689K410790P95914J106357M410402N604596J236198
35159A2603328m285075m966492j725569N13181Q53581J679623K271800j56148
35151F788229l831452l541553Q79252L293427K48264m165733m810535k090974
35143g231075P26068K523135L498389K949016J119432J68875M93433n03483l178320
35134E65470l451578L27095K915586l8115l902995j720093M034604M672517p58498
35125B643993l740848Q4489M132587J527026m417530n715691j072329L803782
35117b754521M543031J872959j479294l492277l062397o82285J313042J306198
$$ plain form
35109 -2435544 -1826041 -523846 2269652 4965908 5577354 4414633 3487198 3661322 3780115
35100 3780115 2989481 2728657 4797451 7571300 6512161 41467 -7086277 -9027536
35092 -9027536 -6130462 -3528163 -3440860 -3456189 -2488676 -2969094 -5480140 -6620367 -4931914
35083 -4931914 -3742594 -4620613 -3423598 2313949 7248368 5819912 1726809 2324542
35075 2324542 6573385 6949607 2006971 -1643435 -280934 2160844 1884463 355396
35067 355396 -775391 -3120566 -6774588 -7892431 -4548888 -286525 1296403 1170986
35059 1170986 1373482 1345594 658188 1048748 2734404 2856148 559103 -681726 976794
35050 976794 1873778 -1262130 -5566257 -6300914 -3405530 119089 2900841 4264197 2186469
$$ packed form
35109b435544O09503J302195K793498K696256O11446j162721r27435J74124J18793
35100C780115p90634k60824K068794K773849j059139o470694p127744j941259
35092i027536K897074K602299Q7303j5329R67513m80418k511046j140227J688453
35083d931914J189320q78019J197015N737547M934419j428456m093103N97733
35075B324542M248843L76222m942636l650406J362501K441778k76381j529067
35067C55396j130787k345175l654022j117843L343543M262363J582928j25417
35059A170986K02496k7888o87406L90560J685656J21744k297045j240829J658520
35050I76794Q96984l135908m304127p34657K895384L524619K781752J363356k077728
$$ plain form
35041 2186469 -3281481 -7670938 -7713710 -6295072 -7219563 -8427912 -5979528 -1801097 -942444
35032 -942444 -2957038 -2809455 375575 2174020 665239 -1034595 -1047795 -1497698 -3235239
35023 -3235239 -3447058 -1142979 -34863 -2514739 -4868522 -2703358 1620451 1649112 -3996177
35014 -3996177 -9291550 -8301221 -1971799 3997170 5964788 4797099 2535713 -204205
35006 -204205 -2505603 -1857550 2346717 5684705 3082364 -3941499 -8570072 -7802946 -5810167
34997 -5810167 -6653135 -8352444 -7104960 -3365169 -122642 1597756 1848607 -538615
34989 -538615 -5359021 -8794268 -7801429 -4371217 -1708143 839460 4714778 7313359
34981 7313359 5657649 2244489 1291318 1366191 -1800074 -6880629 -8377754 -5651415 -3376953
$$ packed form
35041B186469n467950m389457m2772J418638r24491j208349K448384M178431Q58653
35032i42444k014594J47583L185030J798445j508781j699834j3200m49903j737541
35023c235239k11819K304079J108116k479876k353783K165164M323809K8661n645289
35014c996177n295373R90329O329422N968969J967618j167689k261386k739918
35006b04205k301398O48053M204267L337988k602341p023863m628573P67126J992779
34997e810167q42968j699309J247484L739791L242527J720398K50851k387222
34989e38615m820406l435247R92839L430212K663074K547603L875318K598581
34981G313359j655710l413160r53171P4873l166265n080555j497125K726339K274462
$$ plain form
34972 -3376953 -3158883 -1988654 391003 24246 -3817296 -6658323 -6214247 -5174231 -4632779
34963 -4632779 -1724819 3387261 5090206 705789 -4740442 -6022787 -4278498 -2285597
34955 -2285597 618460 4185923 3966251 -1656205 -6269122 -3781374 2252593 4309402
34947 4309402 2103714 773848 788861 -2083223 -7649274 -10020738 -6381196 -693657
34939 -693657 2688602 3805874 4078542 3346451 1879465 1526922 2811115 3624360 2386660
34930 2386660 291373 -731830 -419232 261371 414444 -298354 -1232488 -1033013 428630
34921 428630 1197816 -104858 -1830090 -1406010 1139313 3609541 4294897 2430483 -1938535
34912 -1938535 -6182226 -5786078 -338673 3602669 132688 -7332157 -10180993 -6332348
$$ packed form
34972c376953K18070J170229K379657l66757l841542k841027M44076J040016N41452
34963d632779K907960N112080J702945m384417n446231j282345J744289J992901
34955b285597K904057L567463k19672n622456m612917K487748O033967K056809
34947D309402k205688j329866J5013k872084n566051k371464L639542N687539
34939f93657L382259J117272K72668p32091j466986l52543J284193Q13245j237700
34930B386660k095287j023203L12598O80603J53073p12798r34134J99475J461643
34921D28630P69186j302674j725232M24080K545323K470228O85356j864414m369018
34912a938535m243691L96148N447405L941342l469981p464845k848836L848645
$$ plain form
34904 -6332348 -2129282 -2583366 -5588424 -6926503 -5574911 -2252822 2316642 5513857
34896 5513857 3927324 -998274 -2823720 1277796 5862351 4782381 -301334 -3309468
34888 -3309468 -2666826 -1797540 -2389134 -2400182 -702137 840587 958771 1181123 2883307
34879 2883307 4538699 3718753 558482 -2358538 -3187532 -2748347 -2958769 -3952871 -3818893
34870 -3818893 -1739268 -235178 -2444450 -7428701 -10523340 -9106292 -5886863 -5105168
34862 -5105168 -7290017 -9624776 -10132845 -9224026 -7616644 -4964405 -1054507 2951976
$$ packed form
34904f332348M203066m54084l005058j338079J351592L322089M569464L197215
34896E513857j586533m925598j825446M101516M584555j079970n083715l008134
34888c309468O42642Q69286n91594j1048J698045J542724J18184K22352J702184
34879B883307J655392q19946l160271k917020q28994M39185k10422r94102J33978
34870c818893K079625J504090k209272m984251l094639J417048L219429P81695
34862e105168k184849k334759n08069R08819J607382K652239L909898M006483
$$ [...]
##END NTUPLES=NMR SPECTRUM
##END=
