##TITLE=31Pdec_5C2003
 CD3CN, 64 sc
 21.3.2023
##JCAMPDX= 6.0         $$ Bruker NMR JCAMP-DX V2.0
##DATA TYPE= NMR SPECTRUM
##DATA CLASS= NTUPLES
##ORIGIN= UXNMR, Bruker Analytische Messtechnik GmbH
##OWNER= root
$$ XWIN-NMR		Version 3.5
$$ Tue Mar 21 14:36:46 2023 Russian Standard Time (UT+4h)  she@DPX200
##.OBSERVE FREQUENCY= 81.013821
##.OBSERVE NUCLEUS= ^31P
##.ACQUISITION MODE= SIMULTANEOUS
##.ACQUISITION SCHEME= undefined
##.AVERAGES= 64
##.DIGITISER RES= 16
##SPECTROMETER/DATA SYSTEM= spect
##.PULSE SEQUENCE= zgpg30
##.SOLVENT NAME= CD3CN
##.SHIFT REFERENCE= (INTERNAL, CD3CN, 0, 248.564)
##AUDIT TRAIL= $$ (NUMBER, WHEN, WHO, WHERE, WHAT)
$$ ##TITLE= Audit trail, XWIN-NMR		Version 3.5
$$ ##JCAMPDX= 5.01
$$ ##ORIGIN= Bruker BioSpin GmbH
$$ ##OWNER= she
$$ F:/spectra/data/she/nmr/P31/1/pdata/1/auditp.txt
$$ ##AUDIT TRAIL=  $$ (NUMBER, WHEN, WHO, WHERE, WHAT)
(   1,<2023-03-21 14:34:27.18 +0400>,<she>,<DPX200>,
      <continue with go, POWCHK disabled, PULCHK disabled
       configuration hash MD5:
       00 E9 B6 7A A2 85 ED C7 34 08 36 98 17 FE 4E 26
       data hash MD5: 32K
       5C 2B 1D 9F 2B FC 44 BB 11 A1 64 53 AE 62 AD AD>)
(   2,<2023-03-21 14:34:30.43 +0400>,<she>,<DPX200>,
      <Start of raw data processing
       efp BC_mod = 2 LB = 1 FT_mod = 6 PKNL = 1 PHC0 = -10519.66 PHC1 = -935.734 SI = 64K 
       data hash MD5: 64K
       0B 9E AA 77 6A 76 D2 9D 34 46 E9 AC 17 E9 4D 4D>)
(   3,<2023-03-21 14:35:17.34 +0400>,<she>,<DPX200>,
      <pk PHC0 = 1514.927 PHC1 = -3005.591 
       data hash MD5: 64K
       81 34 0B 54 82 5E 3E 4A F1 9F 31 5F 01 5E C7 1A>)
$$ ##END=
$$ 
$$ hash MD5
$$ 70 A9 0A C6 F9 B3 49 15 3E 5B 0B 2B D1 28 7F 7F
##$RELAX= 
##$RELAX= 
##$RELAX= 
##$RELAX= 
##$RELAX= 
##$RELAX= 
##$RELAX= 
##$RELAX= 
##$RELAX= 
$$ Bruker specific parameters
$$ --------------------------
##$DU= <F:/spectra>
##$EXPNO= 1
##$NAME= <P31>
##$PROCNO= 1
##$TYPE= <nmr>
##$USER= <she>
##$AMP= (0..31)
100 100 100 100 100 100 100 100 100 100 100 100 100 100 100 100 100 100 
100 100 100 100 100 100 100 100 100 100 100 100 100 100 
##$AQSEQ= 0
##$AQ_mod= 1
##$AUNM= <au_zg>
##$AUTOPOS= <>
##$BF1= 81.014009
##$BF2= 200.13
##$BF3= 200.13
##$BF4= 200.13
##$BF5= 200.13
##$BF6= 200.13
##$BF7= 200.13
##$BF8= 200.13
##$BYTORDA= 1
##$CFDGTYP= 0
##$CFRGTYP= 5
##$CHEMSTR= <none>
##$CNST= (0..31)
1 1 145 1 1 1 1 1 1 1 1 1 1 1 1 1 1 1 1 1 1 1 1 1 1 1 1 1 1 1 1 1 
##$CPDPRG= <waltz16>
##$CPDPRG1= <>
##$CPDPRG2= <waltz16>
##$CPDPRG3= <>
##$CPDPRG4= <mlev>
##$CPDPRG5= <mlev>
##$CPDPRG6= <mlev>
##$CPDPRG7= <mlev>
##$CPDPRG8= <mlev>
##$CPDPRGB= <>
##$CPDPRGT= <>
##$D= (0..31)
0 1 0 0 0 0 0 0 0 0 0 0.03 2e-05 3e-06 0 0 0 0 0 0 0 0 0 0 0 0 0 0 0 0 
0 0 
##$DATE= 1679394788
##$DBL= (0..7)
120 120 120 11 120 120 24 19 
##$DBP= (0..7)
150 150 150 150 150 150 150 150 
##$DBP07= 0
##$DBPNAM0= <>
##$DBPNAM1= <>
##$DBPNAM2= <>
##$DBPNAM3= <>
##$DBPNAM4= <>
##$DBPNAM5= <>
##$DBPNAM6= <>
##$DBPNAM7= <>
##$DBPOAL= (0..7)
0.5 0.5 0.5 0.5 0.5 0.5 0.5 0.5 
##$DBPOFFS= (0..7)
$$ [...]
##$SUBNAM2= <"">
##$SUBNAM3= <"">
##$SUBNAM4= <"">
##$SUBNAM5= <"">
##$SUBNAM6= <"">
##$SUBNAM7= <"">
##$SUBNAM8= <"">
##$SUBNAM9= <"">
##$SW= 501.771253377433
##$SWIBOX= (0..15)
0 1 3 0 0 0 0 0 0 0 0 0 0 0 0 0 
##$SW_h= 40650.406504065
##$TD= 32768
##$TD0= 1
##$TE= 0
##$TE2= 300
##$TE3= 300
##$TEG= 300
##$TL= (0..7)
0 120 53 12 22 120 120 120 
##$TP= (0..7)
150 150 150 150 150 150 150 150 
##$TP07= 0
##$TPNAME0= <>
##$TPNAME1= <>
##$TPNAME2= <>
##$TPNAME3= <>
##$TPNAME4= <>
##$TPNAME5= <>
##$TPNAME6= <>
##$TPNAME7= <>
##$TPOAL= (0..7)
0.5 0.5 0.5 0.5 0.5 0.5 0.5 0.5 
##$TPOFFS= (0..7)
0 0 0 0 0 0 0 0 
##$TUNHIN= 0
##$TUNHOUT= 0
##$TUNXOUT= 0
##$USERA1= <user>
##$USERA2= <user>
##$USERA3= <user>
##$USERA4= <user>
##$USERA5= <user>
##$V9= 5
##$VALIST= <valist>
##$VCLIST= <CCCCCCCCCCCCCCC>
##$VD= 0
##$VDLIST= <DDDDDDDDDDDDDDD>
##$VPLIST= <PPPPPPPPPPPPPPP>
##$VTLIST= <TTTTTTTTTTTTTTT>
##$WBST= 1024
##$WBSW= 4
##$XGAIN= (0..3)
0 0 0 0 
##$XL= 0
##$YL= 0
##$YMAX_a= 345
##$YMIN_a= -93
##$ZGOPTNS= <>
##$ZL1= 120
##$ZL2= 120
##$ZL3= 120
##$ZL4= 120
##$ABSF1= 0
##$ABSF2= 0
##$ABSG= 0
##$ABSL= 0
##$ALPHA= 0
##$AQORDER= 0
##$ASSFAC= 0
##$ASSFACI= 0
##$ASSFACX= 0
##$ASSWID= 0
##$AUNMP= <proc_1d>
##$AZFE= 0.1
##$AZFW= 0.5
##$BCFW= 0
##$BC_mod= 2
##$BYTORDP= 0
##$COROFFS= 0
##$CY= -3
##$DATMOD= 1
##$DC= 0
##$DFILT= <>
##$DTYPP= 0
##$F1P= 0
##$F2P= 0
##$FCOR= 1
##$FTSIZE= 65536
##$FT_mod= 6
##$GAMMA= 0
##$GB= 0
##$INTBC= 1
##$INTSCL= 6.047779e-11
##$ISEN= 30
##$LB= 1
##$LEV0= 0
##$LPBIN= 0
##$MAXI= 10000
##$MC2= 0
##$MEAN= 0
##$ME_mod= 0
##$MI= 50
##$NCOEF= 0
##$NC_proc= -13
##$NLEV= 6
##$NOISF1= 182.463
##$NOISF2= 159.3651
##$NSP= 0
##$NTH_PI= 0
##$NZP= 0
##$OFFSET= 248.5645
##$PC= 4
##$PHC0= -9004.733
##$PHC1= -3941.325
##$PH_mod= 1
##$PKNL= yes
##$PPARMOD= 0
##$PSCAL= 0
##$PSIGN= 0
##$REVERSE= no
##$SF= 81.0140089999694
##$SI= 65536
##$SIGF1= 159.3651
##$SIGF2= -187.1042
##$SINO= 113.3802
##$SIOLD= 16384
##$SREGLST= <1H.CDCl3>
##$SSB= 0
##$STSI= 65536
##$STSR= 0
##$SW_p= 40650.406504065
##$SYMM= 0
##$S_DEV= 0
##$TDeff= 32768
##$TDoff= 0
##$TI= <>
##$TILT= no
##$TM1= 0
##$TM2= 0
##$TOPLEV= 0
##$USERP1= <user>
##$USERP2= <user>
##$USERP3= <user>
##$USERP4= <user>
##$USERP5= <user>
##$WDW= 1
##$XDIM= 65536
##$YMAX_p= 374474669
##$YMIN_p= -119620668
$$ End of Bruker specific parameters
$$ ---------------------------------
##NTUPLES= NMR SPECTRUM
##VAR_NAME=  FREQUENCY,     SPECTRUM/REAL,   SPECTRUM/IMAG
##SYMBOL=    X,             R,               I
##VAR_TYPE=  INDEPENDENT,   DEPENDENT,       DEPENDENT
##VAR_FORM=  AFFN,          ASDF,            ASDF
##VAR_DIM=   65536,         65536,           65536
##UNITS=     HZ,            ARBITRARY UNITS, ARBITRARY UNITS
##FACTOR=    0.620285442955139, 1,           1
##FIRST=     20137.2065510682, 0,            0
##LAST=      -20513.1999529968, 0,           0
##MIN=       -20513.1999529968, -119620668,  0
##MAX=       20137.2065510682, 374474669,    0
$$ Real data points
##PAGE= N=1
##DATA TABLE= (X++(R..R)), XYDATA
$$ [...]
12261f595709n615637k68795O951622O838670L03309n080306m593055p73674o64070
12252i497645o290054p949473M161546K0240983J7893479m270450j8186552n280501
12244i178667J4109594J0924327q005772j2419231L093267J3519413N226773o324678
12236A0945026o492592k460951l760194m376994J928940O378293K28760q515313
12228f125025p970270j252709J343632J04156J773195M526439J608650l863332
12220i855264k043084O225569Q362229n23065q094299j258375J4518470K0808142
12212B8140323R676378o405673j1170922m813246m67954l756707o703831l907343
12204E91025k609999q838022j3786178o340228P311230J0979959K787405k591546
$$ plain form
12261 -6595709 -12211346 -12480141 -5528519 1310151 1613460 -3466846 -8059901 -8833575 -9497645
12252 -9497645 -15787699 -23737172 -19575626 665357 18558836 14288386 -3898166 -9178667
12244 -9178667 4930927 15855254 7849482 -4569749 -1476482 12042931 17269704 10945026
12236 10945026 4452434 1991483 -1768711 -6145705 -4216765 2161528 2390288 -6125025
12228 -6125025 -14095295 -15348004 -14004372 -13900216 -12127021 -7600582 -5991932 -9855264
12220 -9855264 -11898348 -5672779 2689450 2166385 -5927914 -7186289 7332181 28140323
12212 28140323 37816701 31411028 20240106 15426860 14958906 11202199 4498368 591025
12204 591025 -2018974 -10856996 -24643174 -30983402 -23672172 -12692213 -9904808 -12496354
12196a2496354L244122J1440025J1365553M793949o86475k436619j606196L45498
12188A3963503l14531o488398j1750733n467134Q814798J2475903k191535j7191152
12180h149279j2766676L367528P274596n445214j3884073l827148J2121548J4901783
12172f406935N939311O82252L135529K653039m684648p167743L430162J5264944
12164A2845911J0304041j0154844k5207305j9168558K210490K0620121K2214463
12157A3664319O040419j4995519k1094541m740204J5293330J2422319j1499030
12150d908907k4834514r416146J3304251J4791327Q32790k854699N660111M841557
12142b584230r106565j2653698N959520K5147973K1667086L172761p512253n140973
$$ plain form
12196 -12496354 -9252232 2187793 13553346 18347295 17660820 15224201 13618005 13963503
12188 13963503 13648972 7160574 -4590159 -10057293 -1242495 11233408 9041873 -8149279
12180 -8149279 -20915955 -17548427 -10273831 -15719045 -29603118 -33430266 -21308718 -6406935
12172 -6406935 -467624 214628 3350157 6003196 1318548 -5849195 -2419033 12845911
12164 12845911 23149952 12995108 -12212197 -31380755 -29170265 -8550144 13664319
12157 13664319 19704738 4709219 -16385322 -21125526 -5832196 6590123 -4908907
12150 -4908907 -29743421 -39159567 -25855316 -11063989 -10231199 -13085898 -7425787 -2584230
12142 -2584230 -11690795 -24344493 -18384973 6763000 28430086 31602847 24090594 18949621
12134A8949621j260828j373245p51607K244093L665871K454049M82714l196786
12126B1213882r380329j3716960j2648904r626827p796207k935364P147674J3281137
12118a4461898O794910m783228o973270M20274N020178K675686J823546O390632
12110c093170Q802744L844388k721961m356941k390966L65825M999904R873498
12102A5323321P739752l220505j2468037r170893L043310J0274696M823839p575578
12094H769905j5081459j0919316P75576Q639364O422674J235174L639939J0278038
12086A3759895O703957r498654k0677496j2320322O087868J4603918R285752K123943
12078A0068861J25037q37421l261648l504564j190609j048576l583461m302374
$$ plain form
12134 18949621 17688793 16315548 15563941 17808034 21473905 23927954 24410668 21213882
12126 21213882 11833553 -1883407 -14532311 -24159138 -31955345 -34890709 -27743035 -14461898
12118 -14461898 -7666988 -12450216 -19423486 -19003212 -13983034 -11307348 -9483802 -3093170
12110 -3093170 5709574 9553962 6832001 2475060 84094 449919 5449823 15323321
12102 15323321 23063073 19842568 7374531 -1796362 1246948 11521644 16345483 8769905
12094 8769905 -6311554 -17230870 -16455294 -7815930 -1393256 -158082 3481857 13759895
12086 13759895 20463852 10965198 -9712298 -22032620 -15944752 -1340834 7944918 10068861
12078 10068861 10193898 9356477 6094829 2590265 1399656 351080 -3232381 -7534755
12070g534755k969828l109497k604986L024822Q416503M007376n444789m940518
12062a1155672N503363Q940249L96679l823723M328665Q580233k618518j2968428
12054b817152n503937O483168J866589j0531058o922523Q980566J1478257l158237
12046a24327j1309574k153059P942469O220825j29692m930514j2214723j6884787
12038c3583382m942137J6970536K1470883K682437j0926742j887020Q453220j225813
12030b988018j4695094p255834J1603549J5787187N041411j450034n17971l425876
12022B099320q738978o019247P16944J05222l359138R43168N628981j487156r203936
12013a9314820J170915J8976270J7005243k888750j2658796n765724m008560j2592164
$$ plain form
12070 -7534755 -10504583 -13614080 -16219066 -13194244 -4777741 -770365 -6215154 -11155672
12062 -11155672 -5652309 3287940 3684619 -139104 4189561 12769794 10151276 -2817152
12054 -2817152 -8321089 -1837921 28668 -10502390 -17424913 -8444347 3033910 -124327
12046 -124327 -11433901 -13586960 -5644491 576334 446642 -4483872 -16698595 -33583382
12038 -33583382 -38525519 -21554983 -84100 2598337 -8328405 -10215425 -1762205 -2988018
12030 -2988018 -17683112 -24938946 -13335397 2451790 7493201 6043167 5525196 2099320
12022 2099320 -6639658 -12658905 -11941961 -11836739 -15195877 -14252709 -8623728 -10110884 -19314820
12013 -19314820 -18143905 832365 17837608 14948858 2290062 -3475662 -7484222 -20076386
12005b0076386q428208J4596634K6615973P777878j8159726j9326093j83932J2749839
11997d434021R969839J216066o111927j0033192o913493J679504N137565l85083
11989i874742m371390q79368N44128n065468n288561O756225J4820414M147470
11981G88708j2235066j3136331j504189N384119O171971J1357432J7684746J2367536
11973B6878926j423556p846668n424548p282263j4250831j1477958M215471J5664003
11965i47424J1314574J104173k282349j710960m932634r061911p263297j565730
11957a5345558J691879K594970M539544N621061K011888l407913l970098N87113
11949e677114L671681J652484j392757j36940M633929P357079M430293k463325
$$ plain form
12005 -20076386 -28504594 -13907960 12708013 20485891 2326165 -16999928 -17183860 -4434021
11997 -4434021 5535818 6751884 639957 -9393235 -16306728 -14627224 -9489659 -9874742
11989 -9874742 -14246132 -15125500 -14581372 -19646840 -24935401 -18179176 -3358762 788708
11981 788708 -11446358 -24582689 -26086878 -20702759 -14530788 -3173356 14511390 26878926
11973 26878926 25455370 17608702 12184154 4901891 -9348940 -20826898 -16611427 -947424
11965 -947424 10367150 11471323 9188974 7478014 2545380 -6516531 -13779828 -15345558
11957 -15345558 -13653679 -11058709 -6519165 -898104 1113784 -2294129 -6264227 -5677114
11949 -5677114 -2005433 -352949 -1745706 -1882646 2751283 10108362 14538655 12075330
11941A2075330q613336r530619k828709R102699J7273559J2138577m312708j6822633
11933H482160j3609298j754244K271756m328324p539981J902759J4545394J5519494
11925A5489716M169350o635964o761673J183949O194892M27229j1926132j7525258
11917a5383891r093280M336834Q604891L171693q53543L37244p40635o441759
11909a6062446q019208j407140M600701L736195L346147J0212396J6208397J0082319
11901B2697361m259494j3246451j2212645p693104m936055k942896m2577L080034
11893a9555827M898864L707731m97017l392574j214021J579716j418904m928528
11885b0820560J568887J2146943P863892j1556727k0637669n527740J2544351
$$ plain form
11941 12075330 3461994 -6068625 -8897334 205365 17478924 29617501 25304793 8482160
11933 8482160 -5127138 -6881382 -4609626 -8937950 -16477931 -14575172 -29778 15489716
11925 15489716 19659066 13023102 6261429 7445378 13640270 14067499 2141367 -15383891
11917 -15383891 -24477171 -20140337 -11535446 -8363753 -9217296 -8880052 -9620687 -16062446
11909 -16062446 -24081654 -25488794 -20888093 -17151898 -13805751 -3593355 12615042 22697361
11901 22697361 18437867 5191416 -7021229 -14714333 -19650388 -22593284 -22635861 -19555827
11893 -19555827 -14656963 -10949232 -11446249 -14838823 -16052844 -14473128 -15892032 -20820560
11885 -20820560 -19251673 -7104730 759162 -10797565 -31435234 -36962974 -24418623
11878b4418623R861941k986849j378530J1634811J3191454R46393n938891l001969
11870b090263n646269j5279326j1917426R682292K4800892J4698059n243444j0699032
11862a694517k896063J449201n4857K492382P931736M537403p769102j4088398
11854a0092215o386407M957624O386449j472019p416969m998309J683422N720233
11846a1618191N886237N258246L948247j420192r126212r418081K989881J7215406
11838C715341J6638325P49478j3510240j4361438q652002p677617r598474n022637
11830c7719264O250597J4375861J3179006O254283p9017k845698j394447L145454
11822A166775O246168L309528l745119p745448n559252j554183r6938J71557J521875
$$ plain form
11878 -24418623 -14556682 -17543531 -18922061 -7287250 5904204 6850597 911706 -2090263
11870 -2090263 -7736532 -23015858 -34933284 -25250992 -450100 14247959 9004515 -1694517
11862 -1694517 -4590580 -3141379 -3196236 -703854 7227882 11765285 3996183 -10092215
11854 -10092215 -16478622 -11520998 -5134549 -6606568 -14023537 -19021846 -17338424 -11618191
11846 -11618191 -5731954 -473708 3474539 2054347 -7071865 -16489946 -13500065 3715341
11838 3715341 20353666 21103144 7592904 -6768534 -15420536 -23098153 -32696627 -37719264
11830 -37719264 -31468667 -17092806 -3913800 2340483 2261466 -584232 -1978679 1166775
11822 1166775 7412943 10722471 6977352 -768096 -6327348 -7881531 -7978469 -7806912 -6285037
11813f285037J957392k08350j266225J678697L105451l505496j2489637j0963742
11805b7976947J902451J1983955J0405730M892635M374320M496373j021948n737789
11797C318780j470936M589550M63811q707017p818120K019819M373382m838997
11789h069728j0702870m243443N114567P937669P486367P067504K689551l658403
11781C621214j878055N835428K341370j4732395k1786979m530887J5623352J2115352
11773c391600o421217j1439108J782749J2161495P799489k403880q853955r877960
11765b0643987k459381J3462492K2983972J0882827j1903985j8804550n685135
11758a2167747M591832j143346q968716m567681M778120O267799K096200J553170
$$ plain form
11813 -6285037 -4327645 -4535995 -5802220 -4123523 -1018072 -4523568 -17013205 -27976947
11805 -27976947 -26074496 -14090541 -3684811 1207824 5582144 10078517 9056569 3318780
11797 3318780 1847844 6437394 6901205 -1805812 -9623932 -7604113 -3230731 -8069728
11789 -8069728 -18772598 -23016041 -17901474 -9963805 -2477438 4590066 7279617 3621214
11781 3621214 1743159 7578587 9919957 -4812438 -26599417 -31130304 -15506952 -3391600
11773 -3391600 -9812817 -21251925 -19469176 -7307681 491808 -1912072 -10766027 -20643987
11765 -20643987 -23103368 -9640876 13343096 24225923 12321938 -6482612 -12167747
11758 -12167747 -7575915 -8719261 -17687977 -22255658 -17477538 -11209739 -9113539 -7560369
11750g560369N515516R263560J0467204O898936l396567j3907051j3142286j737589
11742g598646O169114L783228M0763J103537o68924r646294j4244610m852867
11734b5914699P698289P000919l849737p677061Q10913R388239P988693J325307
11726c229137r83182J853876K856666j408288n216714j395771O955152Q397350
11718G829952l8063n736544J140643R492511J804489j6993152k3206485q223281
11710c3929930R942913J4377042J0217516Q596543O823740j642735j0512221r406792
11702e533924r76067M336285M079661K394463n85603n935505q497991m184250
11694a4902931O41873j157275l913521J878340J1593992J1731489J075532p366266
$$ plain form
11750 -7560369 -2044853 7218707 17685911 24584847 21188280 7281229 -5861057 -7598646
11742 -7598646 -1429532 2353696 2394459 3497996 2829072 -6817222 -21061832 -25914699
11734 -25914699 -18216410 -11215491 -15065228 -22742289 -21931376 -12543137 -4554444 -3229137
11726 -3229137 -4212319 -2358443 498223 -910065 -6126779 -7522550 -567398 7829952
11718 7829952 7791889 2055345 3195988 12688499 14492988 -2500164 -25706649 -33929930
11710 -33929930 -23987017 -9609975 607541 9204084 16027824 14385089 3872868 -5533924
11702 -5533924 -6509991 -2173706 1905955 4300418 3714815 -2220690 -10718681 -14902931
11694 -14902931 -14261058 -15418333 -19331854 -17453514 -5859522 5871967 6947499 -418767
11686d18767n778650j15979K380194K626044L367133K855528r41930o001906q802132
11677a0830465p075742l43115P540859Q755274J199526n001756M54690J1545084
11669F244355J2146925j265035j4363077j4425314m430979N341484R331273O205474
11661D785106k996530j0401663n298799R738991J6393252M016560j3029323j3680691
11653a0473097M84704Q716499J253794r479058r611642j288142O077711R733001
11645d586230J0623018N934882n467569j5769774j5656802o086252M347150J0373704
11637a6287873J1726323Q101937O27806m695444l354238L91876P64518J415905
11629a309190Q578112J6193162J1577853l431464j1449011l978794O514279O000583
$$ plain form
11686 -418767 -6197417 -6313396 -3933202 -1307158 2059975 4915503 3973573 -2028333 -10830465
11677 -10830465 -17906207 -18249322 -10708463 -1953189 -753663 -5755419 -5300729 6244355
11669 6244355 18391280 17126245 2763168 -11662146 -16093125 -10751641 -1420368 4785106
11661 4785106 1788576 -8613087 -13911886 -4172895 12220357 16236917 3207594 -10473097
11653 -10473097 -9988393 -1271894 -18100 -9497158 -19108800 -20396942 -14319231 -4586230
11645 -4586230 6036788 11971670 6504101 -9265673 -24922475 -31008727 -26661577 -16287873
11637 -16287873 -4561550 3540387 4168193 -527251 -3881489 -3489613 -2725095 -1309190
11629 -1309190 7268922 23462084 35039937 31608473 20159462 16180668 22694947 28695530
11621B8695530j570290l756843M82573J554130n155798j4119425j7556005j1766937
11613b3193065J304967J3340875J4500203M597281m651621l871038K028343J950695
11605F006640n680812j1868482r138193N19846Q242244O263991l997496j1123506
11597b0775768n706436O941988J2886737P765792j77487m449249n779761l364076
11589a2658260M583681J0091742K420918j1082203j0673667M267145J1825159
11582a225485L223007l972269j17720j654155j6304532k0665081L02208J9606164
11574b0807863Q446515j3754738r693711J3776891J8673549l66973j2159709m462412
11566b0348451L048222K111764O469172J4345328N828932j3796888j3730969P301796
$$ plain form
11621 28695530 27125240 23368397 23850970 25405100 20249302 6129877 -11426128 -23193065
11613 -23193065 -21888098 -8547223 5952980 10550261 5898640 2027602 4055945 6006640
11605 6006640 325828 -11542654 -20680847 -20161001 -11918757 -5654766 -9652262 -20775768
11597 -20775768 -26482204 -19540216 -6653479 1112313 934826 -3514423 -9294184 -12658260
11589 -12658260 -8074579 2017163 4438081 -6644122 -17317789 -13050644 -1225485
11582 -1225485 1997522 -1974747 -2092467 -3746622 -20051154 -40716235 -40414027 -20807863
11574 -20807863 -12361348 -26116086 -35809797 -22032906 -3359357 -3726330 -15886039 -20348451
11566 -20348451 -17300229 -15188465 -8719293 5626035 11454967 -2341921 -16072890 -8771094
11558h771094J2477915r528635k0496654K668786K5660748J3115626j3501275
11551A625417j4816590K794887O902538k612681j327786R669860P204532q068563
11543A371614j1224355K406726R067673l429829j7867902j5590922P48545J6635476
11535a7882974K0291535P671068j1704490j7548377k503664J4018634J1619369
11528C961101k000796o787163k678602k376414l323452M934882J3715897O097156
11520A1542609r789782r838708N149894R892188k211938r248182m69593O427102
11512A453590j018446q627914l182147M026299r09395r705402p579249K180298
11504b3362366O814413M756555K142833o67306m974299n516153O53765N357945
$$ plain form
11558 -8771094 3706821 -5821814 -26318468 -23649682 2011066 15126692 1625417
11551 1625417 -13191173 -10396286 -3493748 -6106429 -7434215 2235645 9440177 1371614
11543 1371614 -9852741 -7446015 1621658 -1808171 -19676073 -35266995 -34518450 -17882974
11535 -17882974 2408561 10079629 -1624861 -19173238 -21676902 -7658268 3961101
11528 3961101 1960305 -4826858 -7505460 -9881874 -13205326 -8270444 5445453 11542609
11520 11542609 1752827 -8085881 -2935987 6956201 4744263 -4503919 -4973512 1453590
11512 1453590 435144 -8192770 -11374917 -7348618 -8258013 -17963415 -25542664 -23362366
11504 -23362366 -16547953 -11791398 -9648565 -10315871 -15290170 -20806323 -20152558 -14794613
11496a4794613J277557m932988k931880M758709P651082L330267j601160k358044
11488i601070R23661O741669J1029834O846990o461140j7260007j3235983K533742
11480a8482304J4393098J2578720K559658m921253p304021r584320j2722959r450277
11472c2933658M160289J7652177J6104092J173147q859472l909542N160629N869572
11464D417234K809193M738193N684676l366443j3084085p268419Q681510J2905478
11456A5517337M77103j0000517o242341J859414J980244l642187q077776r986123
11448a8114846p159071M098417J6372747J4662560Q4087p408705R61907Q562111
11440A2059207J080389j0085443q311642N66041N13610o778741p029176J077123
$$ plain form
11496 -14794613 -13517056 -18450044 -21381924 -16623215 -8972133 -5641866 -7243026 -9601070
11488 -9601070 -8677409 -1935740 9094094 15941084 9479944 -7780063 -21016046 -18482304
11480 -18482304 -4089206 8489514 11049172 6127919 -1176102 -10760422 -23483381 -32933658
11472 -32933658 -28773369 -11121192 4982900 6156047 -2703425 -6612967 -1452338 4417234
11464 4417234 7226427 11964620 17649296 14282853 1198768 -6069651 2611859 15517337
11456 15517337 15994440 5993923 -248418 1610996 3591240 -50947 -8128723 -18114846
11448 -18114846 -25273917 -21175500 -4802753 9859807 9943894 2535189 3497096 12059207
11440 12059207 13139596 3054153 -5257489 -4691448 -4177838 -10956579 -17985755 -16908632
11432a6908632N550157K482252l07336P35905J365565J303188M855822R537858
11424H614779P476590p37915n524430l095662k38233k683046p734157r810040
11416a3732114n993279L447067J2937916J2682691P78153r269894m586538O653621
11408B917623N468934q028673j2657273J289084J5330330R602610p685500j2970114
11400f732979j467330Q192127K022599j1572552j6037962q027602K054034N258440
11392b6311225L269172L516686R098550J4686105J2428305K184412o115648l653738
11384I102619M738624M848481q034502k0280740j5749660K704772J5414728J0359224
11376C103546k245623m507274N380045J1611845K282774j4904926k1933942j1489717
$$ plain form
11432 -16908632 -11358475 -8876223 -9183559 -8447654 -7082089 -5778901 -923079 8614779
11424 8614779 16091369 15353454 9829024 6733362 6495129 3812083 -3922074 -13732114
11416 -13732114 -19725393 -16278326 -3340410 9342281 10120434 850540 -3735998 2917623
11408 2917623 8386557 357884 -12299389 -11010305 4320025 13922635 6237135 -6732979
11400 -6732979 -8200309 -8182 2014417 -9558135 -25596097 -33623699 -31569665 -26311225
11392 -26311225 -23042053 -19525367 -10426817 4259288 16687593 18872005 12756357 9102619
11384 9102619 13841243 18689724 10655222 -9625518 -25375178 -22670406 -7255678 3103546
11376 3103546 857923 -3649351 1730694 13342539 15625313 720387 -21213555 -32703272
11368c2703272N957226J5040188J1006893J101698n554465n426512K16824P665359
11360b696061J0937806N246289n877186j1603374o972616l38207q13734l339436
11352a5456519L110318J5355540J7804496N585583q274067j2681959j0894747
11345e451355p133715K608695J5783155J6300798j312363j5633648p321969P795094
11337E634692J146249k0430649k1140309P269376K9025134J6754008r387819j5390018
11329f519336k402659M212850j148810j231873R284752J4619814O175053l510458
11321A9479333k339927L772411L834607j327616m552110m813725n307000o120518
11313B625455o305078p528477r507881p562780o48510M428679L766839M809591
$$ plain form
11368 -32703272 -26746046 -11705858 -698965 402733 -5151732 -10578244 -10361420 -2696061
11360 -2696061 8241745 13488034 7610848 -3992526 -10965142 -11303349 -12117083 -15456519
11352 -15456519 -12346201 3009339 20813835 26399418 18125351 5443392 -5451355
11345 -5451355 -12585070 -9976375 5806780 22107578 20795215 5161567 -2160402 5634692
11337 5634692 6780941 -13649708 -34790017 -27520641 1504493 18258501 8870682 -6519336
11329 -6519336 -8921995 -4709145 -5857955 -7089828 2194924 16814738 22989791 19479333
11321 19479333 17139406 20911817 24746424 23418808 18866698 14052973 8745973 2625455
11313 2625455 -3679623 -11208100 -20715981 -28278761 -28927271 -24498592 -20731753 -15922162
11305a5922162J4466874K3690380J6450371o097335k2816542j8229846j268245
11298i726505P968519K836796o337608q483860k579633O162109J2679167J3596181
11290A6115166Q159545q41805j0061322j8084521k1441118j3020184O847587K1382717
11282a0943935J2912842j1120933k2126041o320812J6928057K2275157J0967116
11275A2571451K148496J852230o55535r636060j5280724j1097765k539932N398835
11267a7239004J4167618K0240924J3129114o437281j9749305j3280761J589088
11260g579607N046870k838035n482934K489035P673850L36828j0039845r014764
11252a9408602K331558J0042318N906220m526251j1125110r803487l223644M225850
$$ plain form
11305 -15922162 -1455288 22235092 38685463 32588128 9771586 -8458260 -9726505
11298 -9726505 -1757986 1078810 -5258798 -13742658 -16322291 -10160182 2518985 16115166
11290 16115166 24274711 23432906 13371584 -4712937 -26154055 -39174239 -32326652 -10943935
11282 -10943935 1968907 -9152026 -31278067 -37598879 -20670822 1604335 12571451
11275 12571451 14719947 16572177 15916642 6280582 -9000142 -20097907 -22637839 -17239004
11267 -17239004 -3071386 17169538 30298652 23861371 4112066 -9168695 -7579607
11260 -7579607 -2532737 -5370772 -10853706 -8364671 -690821 -353993 -10393838 -19408602
11252 -19408602 -17077044 -7034726 -1128506 -5654757 -16779867 -26583354 -29806998 -25581148
11244b5581148R796851J2824031J3405523J0298915J407511j1075115j7712677
11237f636109j0015600O867266J6173063Q793610n138387j0323776o417623m488502
11229a1186058p183874n423116M336554J2614870J1294726M620728J62798j650260
11221G586368l202558m035160m939031q098644q661139J321638J5065283J3704158
11213H740915l685861j1932436K865800J7841959P972122j2173144j1869282M003110
11205A763183M177444j3232029j6022585N671805K0008634O073342j2032435p236196
11197a0828837O799014L668624r557410p910062O817945J1438132J764709m689480
11189b497365j703735j57074k311166J823978J1089196J1711363K226959l662530
$$ plain form
11244 -25581148 -15784297 -2960266 10445257 20744172 22151683 11076568 -6636109
11237 -6636109 -16651709 -9784443 6388620 15182230 10043843 -279933 -6697556 -11186058
11229 -11186058 -18369932 -23793048 -19456494 -6841624 4453102 9073830 9236628 7586368
11221 7586368 4383810 348650 -4590381 -12689025 -21350164 -20028526 -4963243 8740915
11213 8740915 5055054 -6877382 -4011582 13830377 21802499 9629355 -2239927 1763183
11205 1763183 5940627 -7291402 -23313987 -17642182 2366452 8439794 -3592641 -10828837
11197 -10828837 -4029823 -361199 -9918609 -17828671 -11010726 427406 2192115 -2497365
11189 -2497365 -4201100 -4358174 -6669340 -4845362 6243834 17955197 20182156 16519626
11181A6519626k541783o263849j6656309j8583619n817800P737478J1232241J0633551
11173c740464J0460432L739364q100537p871845Q647278J7665009J451116k0777628
11165A472725k0149088j634524P353791J751098J053580R882043R221052o924392
11157B026285j6287017l376025J4661321J4969473K716799k607056m81816n466247
11149F155717j7226583j8557063m011882J0101318R918300K065075l02193L252104
11141h605207M961465L683980M212185O140074L629359m050734r387214o141528
11133e557620K129485N627185m98797r829647j0855262l68058J1421475J2384358
11125D453119L293691m216688l882896j482447k966018m078358J612029R695920
$$ plain form
11181 16519626 13977843 7713994 -8942315 -27525934 -33343734 -25606256 -14374015 -3740464
11173 -3740464 6719968 10459332 2358795 -5513050 3134228 20799237 22250353 1472725
11165 1472725 -18676363 -20310887 -12957096 -11205998 -10152418 -270375 8950677 2026285
11157 2026285 -14260732 -17636757 -2975436 11994037 14710836 12103780 11621964 6155717
11149 6155717 -11070866 -29627929 -33639811 -23538493 -13620193 -11555118 -11857311 -8605207
11141 -8605207 -3643742 40238 4252423 10392497 14021856 9971122 583908 -5557620
11133 -5557620 -3428135 2199050 1700253 -8129394 -18984656 -19352714 -7931239 4453119
11125 4453119 7746810 3530122 -352774 -1835221 -4801239 -8879597 -7267568 2428352
11117B428352Q897921k491321j1911928p570053N904338J1747938J606331j2246472
11109c634894j0554111P253641J9313153R023814j1343530j6258035j669830J1290546
11101C420754P763907k753908n463967j087625K236572L779304M884405J184110
11093A3963552o585760n974403P627160J6531709M580214j4616704j5400645R49932
11085A075055R783959K609129l601508J422302O421138K638202k130568l083515
11077A5134194q588191j8919369j7665258L58686J3921196O641401n731197j118782
11069a5967320J2212042J0457494n417175j1931435j278421R068751N989715l010578
11061A23073p427293q240503q588000n585588J790065Q278051J0560609J0163731
$$ plain form
11117 2428352 11326273 8834952 -3076976 -10647029 -4742691 7005247 8611578 -3634894
11109 -3634894 -14189005 -6935364 12377789 21401603 10058073 -6199962 -7869792 3420754
11101 3420754 11184661 8430753 2966786 1879161 4115733 7895037 12779442 13963552
11093 13963552 7377792 1403389 9030549 25562258 30142472 15525768 125123 1075055
11085 1075055 10859014 13468143 9866635 11288937 17710075 20348277 18217709 15134194
11077 15134194 6546003 -12373366 -30038624 -29679938 -15758742 -9117341 -14848538 -15967320
11069 -15967320 -3755278 6702216 1285041 -10646394 -11924815 -2856064 3133651 123073
11061 123073 -7304220 -15544723 -24132723 -29718311 -27928246 -19650195 -9089586 1074145
11053A074145O314136k928683j1065916p618062M818205J0937570M462484l210775
11045B783104j722019L441034K654706k328703m143152k589614j597040K94412
11037c207272O026017J0397135M804336q546462j5692961p336035Q234505J3100231
11029G779494J058409j2662243q658783R840019J7372754Q1079k1519327j8184680
11021b4893278O270733J9201683N579395j2320048j0043587N193421J1102985
11014I1304M375256j602527k572971n472771r301516m889032N779487Q534868
11006e057902j072152j0242609p902883J993561J0521956J4354929J1450554o08028
10998A3437426j5135711j7640155n168627O667702N311633r98476J486841R167131
$$ plain form
11053 1074145 7388281 4459598 -6606318 -14224380 -9406175 1531395 5993879 2783104
11045 2783104 1061085 4502119 7156825 4828122 684970 -1904644 -3501684 -3207272
11037 -3207272 2818745 13215880 18020216 9473754 -6219207 -13555242 -5320737 7779494
11029 7779494 8837903 -3824340 -12483123 -2643104 14729650 14810729 -6708598 -24893278
11021 -24893278 -18622545 579138 6158533 -6161515 -16205102 -11011681 91304
11014 91304 4466560 2864033 291062 -5181709 -14483225 -19372257 -13592770 -5057902
11006 -5057902 -6130054 -16372663 -24275546 -22281985 -11760029 2594900 14045454 13437426
10998 13437426 -1698285 -19338440 -24507067 -17839365 -12527732 -13526208 -12039367 -2872236
10990b872236Q361191j218850o752043l819286j767025o272559j0616202q076619
10982c3033629j409377M503245R377128J2102448Q042735k171551q935255n303305
10974a6827561L594794Q443188P389990M370968J695251M77403K761481O139036
10966A8044550J868834j2552600k3218154j3747177J0916333K6154277J6871756
10959B4337819m266776j4019615o818713L147624M493296J806295L435629O317606
10951A8433165K088935o787435r038743l182873j551257j0139007j6179228o456125
10943c2812568J0903847J7123490R986954M141767N931225N776876j583773p038152
10935A2429666m210021p31444l122634m734854K90042M373819M96420l610548
$$ plain form
10990 -2872236 5488955 4270105 -2481938 -6301224 -8068249 -14340808 -24957010 -33033629
10982 -33033629 -34443006 -29939761 -20562633 -8460185 -417450 -2589001 -11524256 -16827561
10974 -16827561 -13232767 -4789579 2600411 6971379 8666630 9144033 11905514 18044550
10966 18044550 19913384 7360784 -15857370 -29604547 -18688214 7466063 24337819
10959 24337819 20071043 6051428 -767285 2380339 6873635 8679930 12115559 18433165
10951 18433165 20522100 13734665 4695922 1513049 -38208 -10177215 -26356443 -32812568
10943 -32812568 -21908721 -4785231 5201723 9343490 15274715 21051591 19467818 12429666
10935 12429666 8219645 7488201 4365567 -369287 -79245 4294574 4790994 1180446
10927A180446R4444K884545n951294j6701534j1695487N583653J4701849Q996264
10919i07114J208415j201201m380055q595344l014452J1739389J6403126J163948
10911A2416712j5749730j2701357M831697J4686801R776447K018793l70608j629701
10903A3279054m529018l989981R61386J978257m680172r108707k218455P615459
10895f92177M433232j0870177j8993187q283515R671606J7832991J6072772J3762482
10887B2934027R146208n898394k3696328k4196728m675073J2868426J1759335
10880a758527R34054m229040l811297l453571M05749R262091J1612056J335791
10872A0297306o889435k13802Q256019Q39351j2355473r747099L302369L543646
$$ plain form
10927 1180446 1274890 4159435 -1791859 -18493393 -30188880 -24605227 -9903378 -907114
10919 -907114 301301 -899900 -5279955 -13875299 -16889751 -5150362 11252764 12416712
10911 12416712 -3333018 -16034375 -11202678 3484123 13260570 15279363 14908755 13279054
10903 13279054 8750036 4760055 5721441 7699698 3019526 -6089181 -8307636 -692177
10895 -692177 3741055 -7129122 -26122309 -34405824 -24734218 -6901227 9171545 22934027
10887 22934027 32080235 26181841 2485513 -21711215 -26386288 -13517862 -1758527
10880 -1758527 -824473 -5053513 -8864810 -12318381 -11912632 -2650541 8961515 10297306
10872 10297306 3407871 3194069 11450088 12289439 -66034 -9813133 -6510764 -2967118
10864b967118q348063q507751P676926J7422344R685433M01363M14188j168969
10856A4608353j0366332j3855457m721070L483239K353891L075270J0970538J1502360
10848A7050792j839818j1264441n038315Q44354p557143j5140804n143530Q873462
10840a9215443O269346m296679j551073J0183107J0142386j958859p898557k997432
10832a1323204J131409P48658J933923L287104q7100j323833O526701J1339148
10824A2232806o00213j6207717j2955636K269058L385375r520325j0063940P249672
10816b4210920J5954348K952875r060477j52864J4827727J2612366k636327j1010826
10808g24098q015851l644228j672174J528861M520785K565873k305731m313040
$$ plain form
10864 -2967118 -11315181 -19822932 -12146006 5276338 14961771 15363134 15777322 14608353
10856 14608353 4242021 -9613436 -14334506 -10851267 -8497376 -5422106 5548432 17050792
10848 17050792 15210974 3946533 -1091782 -247428 -7804571 -22945375 -28088905 -19215443
10840 -19215443 -12946097 -17242776 -18793849 -8610742 1531644 -427215 -8325772 -11323204
10832 -11323204 -10191795 -9443137 -7509214 -4222110 -4309210 -5633043 893658 12232806
10824 12232806 11632593 -4575124 -17530760 -15261702 -11876327 -21396652 -31460592 -24210920
10816 -24210920 -8256572 -5303697 -14364174 -14517038 310689 12923055 10286728 -724098
10808 -724098 -8739949 -12384177 -14056351 -12527490 -8006705 -5440832 -7746563 -12059603
10800a2059603l137292j580396J306565O837588J0517505O589314l346730j1080324
10792e953373j0037098j383456O161248L888157o093006j0974672l369824Q063748
10784a9698276J1793908J0012310J0453497R289634r62582j1461340n840350J1035431
10776A4622232J5121804j035042j5705008j0495294L356321M498758p097986j3530170
10768a0264385n461956Q206409J3384290M645570j0936229j8753335r950945O977324
10760b2153257J3971433N412740n201902l614676Q331481J7918297J6040708L094297
10752C3799121j2360244j8354829j0427236Q86530J880966n051370n337933L714145
10744a1250850P278658l268731j4800215j0153763P858927K0155285J4590922
$$ plain form
10800 -12059603 -15196895 -16777291 -15470726 -8633138 1884367 8473681 5126951 -5953373
10792 -5953373 -15990471 -17373927 -11212679 -7324522 -13417528 -24392200 -27762024 -19698276
10784 -19698276 -7904368 2107942 12561439 21851073 20888491 9427151 3586801 14622232
10776 14622232 29744036 28708994 13003986 2508692 5865013 10363771 3265785 -10264385
10768 -10264385 -15726341 -7519932 5864358 10509928 -426301 -19179636 -29130581 -22153257
10760 -22153257 -8181824 -2769084 -7970986 -11585662 -3254181 14664116 30704824 33799121
10752 33799121 21438877 3084048 -7343188 -6456658 -4575692 -9627062 -14964995 -11250850
10744 -11250850 -3972192 -7240923 -22041138 -32194901 -24335974 -4180689 10410233
10737A0410233j652534j1113853m526096Q925626J1897886J390761o843754k820225
10729E668044J062902p704192j5766432l695207J6802311J5921372n103097j1995851
10721d810150P857884K3259475Q453531j6527264j8946561k182161P030796K970888
10713G106438K374565J0579269J4396622O742347m056546j0059025j1866980j1008463
10705D208227p563113m290474k872498J37083M907429L707352m953273p896997
10697a4616264L173710J3995981O893979j0396523j4487221o50165J2056176R497122
10689E466795j109189n949691k127508L397237L867556l79648j500514O125530
10681G790568J3929501P077248j1139273j8033056m205819R996030N643870n324340
$$ plain form
10737 10410233 8757699 -2356154 -6882250 2043376 13941262 15332023 8488269 5668044
10729 5668044 6730946 -973246 -16739678 -20434885 -3632574 12288798 7185701 -4810150
10721 -4810150 3047734 26307209 34760740 18233476 -713085 -2895246 4135550 7106438
10713 7106438 9481003 20060272 34456894 41199241 37142695 27083670 15216690 4208227
10705 4208227 -3354886 -7645360 -10517858 -10380775 -5473346 -1765994 -6719267 -14616264
10697 -14616264 -11442554 2553427 9447406 -949117 -15436338 -16086503 -4030327 5466795
10689 5466795 4357606 -1592085 -3719593 -322356 3545200 3165552 1665038 7790568
10681 7790568 21720069 28797317 17658044 -375012 -4580831 5415199 11059069 5734729
10673E734729k606595P308376M995409n835172o435014J066920j706890j2423113
10665i901350r360305Q812303J7772734P870663k121901m65027m85252j0497786
10657A624079j5400878n081638N151375J410027m958279m50214N426968K61980
10649a2016580n346302L483682J7025454J6376909N413638J290859K767630m506223
10641B4489067j6917744j5775538j168532M489730p689324j7869988q389735R560899
10633b9271165J3908462L356655l863085K871608J3716068J3341681P75007j0145347
10625D689884q522515J53999K496436l425358n749168K471068J2147588J1507510
10617A5769444J724484q303699j4454884j5798483r009185M372631J2338857O837262
$$ plain form
10673 5734729 3128134 10436510 15431919 9596747 3161733 4228653 2521763 -9901350
10665 -9901350 -19261655 -10449352 7323382 15194045 13072144 12607117 12121865 1624079
10657 1624079 -13776799 -18858437 -13707062 -12297035 -17255314 -17705528 -12278560 -12016580
10649 -12016580 -17362882 -13879200 3146254 19523163 24936801 26227660 28995290 24489067
10641 24489067 7571323 -8204215 -9372747 -4883017 -12572341 -30442329 -38832064 -29271165
10633 -29271165 -15362703 -12006048 -15869133 -12997525 718543 14060224 14835231 4689884
10625 4689884 -3832631 -3678632 -1182196 -4607554 -10356722 -7885654 4261934 15769444
10617 15769444 17493928 9190229 -5264655 -21063138 -30072323 -25699692 -13360835 -6523573
10609f523573k138677n51345P157614N693238m512322p046778L297338J1669330
10601G044825O569187m222403q607374p066218n476986k669897M309275J0738793
10593F19202J0213341M791260Q96652m99496k472320m873205n135267l484233
10585E5934j919493l74155K057855M537343N842167N245984Q23818q000332j5043927
10576f774806j1946714j093850M410026j455757q382169m984300N091290J1164742
10568a3971538J1944298J2465203J0316845q69231j5496256j8008928m250016
10561a7869623J0810999J2220217K816472m596006n305036m569045n851503o103935
10553a8447460k286317M031982R168754R607523K240350j1390855k0371067j2177813
$$ plain form
10609 -6523573 -8662250 -9213595 -2055981 3637257 -875065 -7921843 -4624505 7044825
10601 7044825 13614012 9391609 784235 -6281983 -11758969 -14428866 -10119591 619202
10593 619202 10832543 15623803 16520455 16020959 13548639 8675434 3540167 55934
10585 55934 -1863559 -2237714 -179859 4357484 10199651 15445635 16269453 8269121 -6774806
10576 -6774806 -18721520 -19815370 -15405344 -16861101 -25243270 -30227570 -25136280 -13971538
10568 -13971538 -2027240 10437963 20754808 19885577 4389321 -13619607 -17869623
10561 -17869623 -7058624 5161593 7978065 3382059 -1922977 -6492022 -12343525 -18447460
10553 -18447460 -20733777 -16701795 -7533041 2074482 4314832 -7076023 -27447090 -39624903
10545c9624903R895135K4275340J4787696p436172j6561430n184309Q184539P483592
10537d180512K42257J193287P483243N316575n707761j1802731o791000J179794
10529a3066848N770630R745746J2313007M671866j3508536k5602787j7116384
10522c6793306M268813J7956926J5000920M459571j657215j165261O73726L06757
10514C050931j72120K230976M482221k18222j0978567j6549718j0384044j236962
10506b9775505P00969O5915M991541Q141151j258290j2687587o532034J1033231
10498b5320609J3704012k052038j0789784j581003N842932J8146l571430p7391
10490b3827165j1285731l6968973l2190984K5457703Q1452204O9525967P065133
$$ plain form
10545 -39624903 -29729768 -5454428 9333268 1897096 -14664334 -19848643 -11664104 -4180512
10537 -4180512 -3938255 -2744968 4738275 10054850 4347089 -7455642 -14246642 -13066848
10529 -13066848 -7296218 2449528 14762535 19434401 5925865 -19676922 -36793306
10522 -36793306 -32524493 -14567567 433353 4892924 3235709 2070448 2744174 3050931
10514 3050931 2878811 5109787 9592008 9373786 -1604781 -18154499 -28538543 -29775505
10506 -29775505 -29074536 -29008621 -24017080 -15875929 -17134219 -29821806 -36353840 -25320609
10498 -25320609 -11616597 -13668635 -24458419 -26039422 -20196490 -20178344 -23749774 -23827165
10490 -23827165 -35112896 -72081869 -104272853 -78815150 2637054 72163021 79228154
10483G9228154l1297038j9815573l76511j151452j938310J0171261J2248390n821407
10475D1247514j6221733k843780Q709849j613291j1875956N32260J7466956J2875926
10467D8277745l774363r979694r070012j3721565j4987191j316799J2401446P569742
10459A5399309m872100n063401N74970l559303q868544n67563Q316286k004341
10451f44687j7553735j0414954J1671282J6332053Q47315o077466M547845J0148609
10443H856262J683q099648l352336M30258n785594r424684j517956P387215Q719321
10434b785479R732128J4246590J1602790l030284j6785936j8886431j4827312
10427b0733934j1211405m055496P865632J4707863J0812862L770873N2000l657552
$$ plain form
10483 79228154 47931116 28115543 27739032 26587580 24649270 34820531 47068921 41247514
10475 41247514 25025781 22182001 30891850 29278559 17402603 17934863 35401819 48277745
10467 48277745 44503382 34523688 25453676 11732111 -3255080 -4571879 7829567 15399309
10459 15399309 10527209 5463808 6038778 2479475 -6389069 -6956632 1359654 -644687
10451 -644687 -18198422 -28613376 -16942094 -610041 237274 -5840192 -1292347 8856262
10443 8856262 8857945 758297 -2594039 -2163781 -7949375 -17374059 -18892015 -11504800 -2785479
10434 -2785479 6946649 21193239 32796029 29765745 12979809 -5906622 -20733934
10427 -20733934 -31945339 -36000835 -28135203 -13427340 -2614478 1156395 1208395 -2449157
10419b449157p606986l670926Q572526J6081313J1924924N908877O375551O216881
10411D1353003k199043j1776743j2549109p730987n766028n109165J060561J0643146
10403G925635J3621725M981729r428124j8046908j2849124K299353J2437604O924807
10395G866697o381306r979069Q79167J3346020J4309086L745098r180084j5142633
10387e37024j0355181l10340M372922J436182j17915L064418R49069r458460j1434013
10378b2390342N153658K0055598J0678308q507670o153909J3978147J7753075
10371C0566865k839029j6444137l934863J3082996J0502004l000920p925842n270877
10363A4736197n479454o536158k449146K424818L341408M703227P420918L196248
$$ plain form
10419 -2449157 -10056143 -13727069 -5154543 10926770 22851694 28760571 35136122 41353003
10411 41353003 39153960 27377217 14828108 7097121 1331093 -3778072 -2717511 7925635
10403 7925635 21547360 26529089 17100965 -945943 -13795067 -11495714 941890 7866697
10395 7866697 1485391 -8493678 -7614511 5731509 20040595 23785693 14605609 -537024
10387 -537024 -10892205 -11202545 -6829623 -5393441 -5511356 -2446938 -1497869 -10956329 -22390342
10378 -22390342 -17236684 2818914 13497222 4989552 -1164357 12813790 30566865
10371 30566865 27727836 11283699 7348836 20431832 30933836 27932916 20007074 14736197
10363 14736197 9256743 2720585 271439 2696257 6037665 10740892 18161810 21358058
10355B1358058p495325j0172461p03291M844045k692696r483942m138389K183964
10347f300037j971418o556592M02298J0017536R169734L020795J419379l99946
10339H801749p472038q537639M134990J4423945N742079r530893r271663K171681
10331D62211M025695m132347m301582N684825P686404n759663j9307882j7731943
10323c3374282l649747J0673290J5862729R180247k730396o253362L575218J3235911
10315F519608O995056j1304001k3083393j7238687J394281J9953644K5970284
10308I206792J5305886j083953p053080k738212k896376r661612p400328O401141
10300H0258J0132956n947215j8149923o208743J2212044J1460740O17261L515199
$$ plain form
10355 21358058 13862733 3690272 2986981 7831026 5138330 -4345612 -8484001 -6300037
10347 -6300037 -8271455 -14828047 -14425749 -4408213 4761521 7782316 9201695 8801749
10339 8801749 1329711 -7207928 -3072938 11351007 17093086 7562193 -1709470 462211
10331 462211 4487906 355559 -3946023 1738802 9425206 3665543 -15642339 -33374282
10323 -33374282 -37024029 -26350739 -10488010 -1307763 -4038159 -10291521 -6716303 6519608
10315 6519608 13514664 2210663 -20872730 -38111417 -36717136 -16763492 9206792
10308 9206792 24512678 23428725 16375645 13637433 10741057 1079445 -6320883 80258
10300 80258 10213214 4265999 -13883924 -20092667 -7880623 3580117 4197378 7712577
10292G712577J3964463Q147858j0232474j6119837p964303p443136j6227109j2099358
10284d0261319Q124635J8919915P649669p173915r213865n559797l744661L333564
10276b7925774J6219873J9339426P702030m78980O560040J3498496L766622j2819656
10268B5862077j6204542n431405M746013N580969r90085r694638j3001840m675251
10260a3808702Q712333J0771341j630212j0458704j478738J4703966J7782878
10253B4594162M264357j1994135j7924038j0559407M602642J6280899J4895228
10246B4159708L800129l727487k951421l335582j0329057j3438647k264016J4749655
10238F663282J9267449O399782j0191742j4550603l907405J0320712J3802375
$$ plain form
10292 7712577 21677040 29824898 19592424 3472587 -4491716 -11934852 -28161961 -40261319
10284 -40261319 -32136684 -13216769 -5567100 -12741015 -21954880 -27514677 -31259338 -27925774
10276 -27925774 -11705901 7633525 15335555 14856575 21416615 34915111 38681733 25862077
10268 25862077 9657535 4226130 8972143 14553112 13563027 3868389 -9133451 -13808702
10260 -13808702 -5096369 5674972 4044760 -6413944 -7892682 6811284 24594162
10253 24594162 28858519 16864384 -1059654 -11619061 -7016419 9264480 24159708
10246 24159708 27959837 24232350 21280929 17945347 7616290 -5822357 -8086373 6663282
10238 6663282 25930731 32330513 22138771 7588168 3680763 14001475 27803850
10231B7803850L700018p890635q800514k813489k964115j0810810j4068747o140706
10223b1985148M486950Q434098P323100N652702J527926o660576j2709107j0520538
10215b4450593m405155l760672r999726j4347598q066069P355618J9953033J8643880
10207a9077282O566031j103109L385343R489600M418167p070569j0240323k244083
10199a5876225O909733J1163038J1691442P015322l556305r027417J703037J7394192
10191B7416817J4456986p432935k1532157j2736120J713898J334389q100195r524258
10183a4403575k474640J835023J583335K777138M568991K335028l13501K708686
10175a383515O779461L014600n616490q008670k674133Q26874k481092p360358
$$ plain form
10231 27803850 31503868 23613233 14812719 11999230 9035115 -1775695 -15844442 -21985148
10223 -21985148 -17498198 -9064100 -1741000 3911702 5439628 -1220948 -13930055 -24450593
10215 -24450593 -28855748 -32616420 -42616146 -56963744 -65029813 -57674195 -37721162 -19077282
10207 -19077282 -12511251 -13614360 -10229017 -739417 3678750 -3391819 -13632142 -15876225
10199 -15876225 -8966492 2196546 13887988 20903310 17347005 8319588 10022625 27416817
10191 27416817 41873803 34440868 12908711 172591 1886489 3220878 -4879317 -14403575
10183 -14403575 -16878215 -15043192 -13459857 -10682719 -6113728 -3778700 -4092201 -1383515
10175 -1383515 5395946 8410546 2794056 -5214614 -7888747 -7061873 -9542965 -16903323
10167a6903323q541027o048787L58398J1630926K1823160J9829996L916403j2400773
10159A3664973j5091515n998525J525696N94830k877487j960565J303439K294333
10151f544821L435396Q808156J3028594P030388n225180q944401q69655M507072
10143A5225549j966713r568461p425472l858352r422523j3619918o98418J9443106
10135a1891202K1512945L720791r284217m537336L891923L924095L831327R678940
10127B0847266Q705256o828629j8781283q121940J2627700J5571660j095091j1551467
10119A1373472j897850J0480729L985788j6141125k4889961r317835J5938154
10112a0468628K5457121J1289627q704011j1953089K482272J4637925J0290542
$$ plain form
10167 -16903323 -25444350 -31493137 -31134739 -19503813 2319347 22149343 26065746 13664973
10159 13664973 -1426542 -7425067 -5899371 -5304541 -8182028 -10142593 -8839154 -6544821
10151 -6544821 -3109425 5698731 18727325 25757713 20532533 11588132 10718477 15225549
10143 15225549 13258836 3690375 -3735097 -7593449 -17015972 -30635890 -31334308 -11891202
10135 -11891202 9621743 13342534 4058317 -479019 3412904 7336999 11168326 20847266
10127 20847266 29552522 22723893 3942610 -4179330 8448370 24020030 22924939 11373472
10119 11373472 9475622 19956351 23942139 7801014 -17088947 -26406782 -10468628
10112 -10468628 14988493 26278120 17574109 5621020 8103292 22741217 33031759
10105C3031759k299993o970451k261355K63459m177321p375137l052778K548392
10097I706575J168632l355051r15647P098989P077944n945412j7078710j0781611
10089a3024291N739999J1673994K228474o269544k096692P160872J0344788P177865
10081B2935465j6734j2318190k2321866j4356036R485961K1559482N416426j6403844
10073f019336j4142237M571400R798594k021803p038186K559106Q123105P03669
10065c465688m606102R28141L850461m679150j1369544m494019N884899O029175
10057a1921827p56818m901807n963405n043080K271624J3315895J4492546K334092
10049C827220p185351k900614M199749J692875k931305J710801Q871321O710220
$$ plain form
10105 33031759 30731766 23761315 21499960 21763419 17586098 10210961 7158183 9706575
10097 9706575 10875207 7520156 6604509 13703498 20781442 14836030 -2242680 -13024291
10089 -13024291 -7284292 4389702 6618176 348632 -1748060 5412812 15757600 22935465
10081 22935465 22918731 10600541 -11721325 -26077361 -16591400 4968082 10384508 -6019336
10073 -6019336 -20161573 -15590173 -5791579 -7813382 -14851568 -12292462 -4169357 -3465688
10065 -3465688 -8071790 -7143649 -3293188 -7972338 -19341882 -23835901 -17951002 -11921827
10057 -11921827 -12678645 -17580452 -23543857 -28586937 -26315313 -12999418 1493128 3827220
10049 3827220 -3358131 -6258745 -2058996 -366121 -3297426 -1586625 7284696 13994916
10041A3994916M59528J146531K944474n879104j6950467j1016588Q858140J7030548
10033A0587978K027174j6780434j7179583k743598P423620O465642M193298Q135812
10025B129909J2734827R785524Q78434o799007j2005519j7756963j9768168r082450
10017c9883413R631758J6228091K290432j2098420n103361J2909780J3788282
10010b236851m692482j5195232l666318J0384677O891609m679493m838750L909988
10002a4122852M850363l212161m259327R223995K4320960K3377660L185700k2075466
9994B1288872l2478793j9104685O759363K3562180K0667632N829939q210109j6307252
9986B007147j7852934j1203373J891486J2421591J1750427J070455r831042j1173258
$$ plain form
10041 13994916 14454444 15600975 18545449 12666345 -4284122 -15300710 -6442570 10587978
10033 10587978 12615152 -4165282 -21344865 -24088463 -16664843 -10199201 -6005903 2129909
10025 2129909 14864736 24650260 25528694 18729687 6724168 -11032795 -30800963 -39883413
10017 -39883413 -30251655 -14023564 -11733132 -23831552 -28934913 -16025133 -2236851
10010 -2236851 -6929333 -22124565 -25790883 -15406206 -8514597 -13194090 -18032840 -14122852
10002 -14122852 -9272489 -12484650 -16743977 -7519982 16800978 40178638 43364338 21288872
9994 21288872 -11189921 -30294606 -23535243 26937 20694569 26524508 18314399 2007147
9986 2007147 -15845787 -27049160 -25157674 -12736083 -985656 84799 -9746243 -20919501
9978b0919501n61732J4129232J9924244J1803385o49069m928793j020769J973348
9970A9750345J006284J061022L580268L267876k541742r095469j0105153m184651
9962B738780L366933L531868o068602j3035364l608074J3839829J5950947O20419
9954A7336736o700653N208092J1920524n591794k5026806j7071988O717279J4438918
9946A230308M173154k637465k735330p235766r205113M402910J9195561J3027399
9938B0215658j665354J272381J0831436j890759k4700847k0631092L751129P604864
9930e212584q817878m355921K3291519K8206324r63437j9793518q340989j123556
9922B889960j2878956q191035K2546655L0875014m735435l2451425j3646342J1614403
$$ plain form
9978 -20919501 -21481233 -7352001 12572243 24375628 23726559 18797766 17776997 19750345
9970 19750345 20756629 21817651 25397919 28665795 26124053 17028584 6923431 2738780
9962 2738780 6105713 9637581 3568979 -9466385 -13074459 765370 16716317 17336736
9954 17336736 10636083 15844175 27764699 22172905 -2853901 -19925889 -13208610 1230308
9946 1230308 5403462 2765997 30667 -7205099 -16410212 -12007302 7188259 20215658
9938 20215658 18550304 19822685 30654121 28763362 4062515 -16568577 -12817448 -5212584
9930 -5212584 -14030462 -18386383 4905136 33111460 32148023 12354505 4013516 2889960
9922 2889960 -9988996 -18180031 4366624 35241638 30506203 -1945222 -15591564 -3977161
9914c977161j66668j9150821j985074K8246249K6765274L762227o239566p642493
9906A9611967j7093260j7487984L707920J5132705m009252j9347113n150917N575928
9898a9060006q310022o038232K8045901L0996528k1623533m0930716K2421074
9891a4499006N4777065l8000318j19813313k085096K20069648K50471956K3553733
9884C74474669j87255039j62528449j5842072L6735214q689579k1138201J7122992
9877C2879535K2627256j1807889j9628430K662476J669434j9018453j2411346
9870c027417R254620k699735k9581640j2441879L3142705L5994793n123418j9739696
9862E778333R018873J9773579j2410253l2866806o258272K4982809J7202876p805927
$$ plain form
9914 -3977161 -4143829 -23294650 -25279724 2966525 29731799 33494026 27254460 19611967
9906 19611967 2518707 -14969277 -11261357 3871348 -137904 -19485017 -24635934 -19060006
9898 -19060006 -27370028 -33408260 -5362359 25634169 4010636 -36920080 -14499006
9891 -14499006 40278059 2277741 -117535572 -119620668 100448980 350920936 374474669
9884 374474669 187219630 24691181 8849109 45584323 36894744 15756543 32879535
9877 32879535 55506791 43698902 24070472 26732948 28402382 9383929 -3027417
9870 -3027417 6227203 3527468 -26054172 -38496051 -5353346 30641447 25518029 5778333
9862 5778333 14797206 34570785 22160532 -10706274 -16964546 8018263 25221139 17415212
9854A7415212j1404310O55626K945107m790889r345325r302509n710673N071518
9846a4466243J4639646O924860j1042130j3313467K684717J1363924L680429L53351
9838H25087J0384482J3698009l35752j2220456p687640j793801q337042j3912037
9830a9379150l764212J0566444J1041428J407214m119280m666089p149304r633298
9822b5696247o350551k5275L175398L363845L461838L977079O094607J0670477
9814a328829J1665941K193768j1100757j3330310l341401M268795K014713j356626
9806a0314706Q59517J967848l849309r502339o015600L896087J0360733Q029657
9798d568112l27416o353005k303591R047036J4010393N538245m893196m037373
$$ plain form
9854 17415212 6010902 6666528 9611635 4820746 -4524579 -13827088 -19537761 -14466243
9846 -14466243 173403 7098263 -3943867 -17257334 -14572617 -3208693 471736 825087
9838 825087 11209569 24907578 24571826 12351370 4663730 2869929 -5467113 -19379150
9830 -19379150 -23143362 -12576918 -1535490 -128276 -4247556 -8913645 -16062949 -25696247
9822 -25696247 -32046798 -32072073 -28896675 -25532830 -22070992 -18093913 -11999306 -1328829
9814 -1328829 10337112 12530880 1430123 -11900187 -15241588 -10972793 -8958080 -10314706
9806 -10314706 -9455189 -7487341 -11336650 -20838989 -26854589 -22958502 -12597769 -4568112
9798 -4568112 -4895528 -11248533 -13552124 -4505088 9505305 15043550 10150354 6112981
9790F112981K460779J578358l062242Q24639P954572K057533j2418999j2428826
9782f921205N024577J3563340k104197k0740679j6051274N326304J6544211Q741591
9774C382668k802061m351664J562105O070934O031834L987675K653296J602301
9766A8137088j602855o127934n735594K917770J1711976R026408l569921j1654920
9758A3102018o938235K697225N276772n74077o743838o093627Q90500O474748
9750H091486L059501o191787p954078L368116J3715725O449560j2197930j8871348
9742a0530755m512873J4333962J9113496J0984781K879544O58837K28532l061587
9734C0093937q964348j3158616j0550391j024250P616025P040260j517610r313373
$$ plain form
9790 6112981 8573760 10152118 7089876 7914515 15869087 17926620 5507621 -6921205
9782 -6921205 -1896628 11666712 9562515 -11178164 -27229438 -21903134 -5358923 3382668
9774 3382668 580607 -3771057 -2208952 3861982 9893816 13881491 16534787 18137088
9766 18137088 16534233 10406299 4670705 7588475 19300451 28326859 24756938 13102018
9758 13102018 6163783 8861008 14137780 13563703 6819865 726238 1616738 8091486
9750 8091486 11150987 4959200 -2994878 373238 14088963 20538523 8340593 -10530755
9742 -10530755 -15043628 -709666 18403830 29388611 32268155 32926992 33155524 30093937
9734 30093937 21129589 7970973 -2579418 -3603668 4012357 11052617 9535007 221634
9726B21634j0395975m291148P533651J9252222J9069654K199086j6671403j7698817
9718g81096k855016O051541j410558j0919796p407014K704820L972011m451374
9710a5096482j0293532p068215J71382N255567P291060O983559M171698M78120
9702h106843m30408K582861N432046K796269m917969j0137673o149376L899380
9694a5031713J0312664R671129P779686P534761L246981o466119j0392684j031323
9686E623382Q955402K271194j5281275k0241135m683935J3831048J9062257J5221916
9678B4758854J1953238O918269m271070j3382381j0011566L96948L581852k048563
9670A7895581m846438j49435K683137k884329q368811k801892R718137J4713570
$$ plain form
9726 221634 -10174341 -14465489 -6931838 12320384 31390038 33589124 16917721 -781096
9718 -781096 -3636112 2415429 1004871 -9914925 -17321939 -14617119 -10645108 -15096482
9710 -15096482 -25390014 -32458229 -32286847 -27031280 -19740220 -12756661 -8584963 -8106843
9702 -8106843 -8537251 -5954390 -522344 2273925 -2644044 -12781717 -18931093 -15031713
9694 -15031713 -4719049 4952080 12731766 20266527 23513508 17047389 6654705 5623382
9686 5623382 14578784 16849978 1568703 -18672432 -23356367 -9525319 9536938 24758854
9678 24758854 36712092 43630361 39359291 25976910 15965344 16362292 19944144 17895581
9670 17895581 13049143 12899708 15582845 12698516 4329705 1527813 11245950 25959520
9662B5959520P135544l034395o134013m563972m321228l098861L843331J0937476
9654B6723402P625338m059818r681971l252333L728264k94586j0742099j5433855
9646e387658j0647900j065866Q321551J2462026O462708n857748j1329203m080925
9638a1123015N227334N779228K442827M003116O115561Q89934n534041k591199
9630E209745L996194J66412j1635282j5302375p491637j207995j643819J558454
9622b6350303J2999219K0480437J3139703k802798j3479259j2372591j865314
9615a0250906J0219029J3574140N264758l212065k2190Q214663O373865l618432
9607B6542862o275870j12182J013529m452918k400972P317023N779233r959167
$$ plain form
9662 25959520 33095064 30060669 23926656 19362684 15041456 11942595 15785926 26723402
9654 26723402 34348740 30288922 20606951 17354618 21082882 20788296 10046197 -5387658
9646 -5387658 -16035558 -17101424 -8779873 3682153 10144861 4287113 -7042090 -11123015
9638 -11123015 -5895681 -116453 2326374 6329490 12445051 13334985 7800944 5209745
9630 5209745 9205939 9372351 -2262931 -17565306 -25056943 -26264938 -27908757 -26350303
9622 -26350303 -13351084 7129353 20269056 17466258 3986999 -8385592 -10250906
9615 -10250906 -31877 13542263 18807021 15594956 15572766 23787429 30161294 26542862
9607 26542862 20266992 20154810 21168339 16715421 14314449 21631472 27410705 17451538
9599A7451538j5325245J894886J7560315Q868187q889563r894165l61048j954417
9591I350488r679101k574132J3254077J0644830j0982650k1072566o491155R516186
9583h034023P587488K71459M093670J0662753N832405l307888k455515M270542
9575A8920891M060724r12735l99382K406512k736708j1426447j0338561j053787
9567a479493K771919M49131M192054J2266736O341721j6089780k9439024j4909795
9559c5896531J0672541J9400314J1247902O336483Q253629K021282j2912344j5781251
9551f657975J335840J6656158J0493198n116852p008960L258504O199334j421720
9543A7737527l553667N154050R805947R22642j0500232j2472818r410126q750237
$$ plain form
9599 17451538 2126293 4021179 21581494 30449681 21560118 11665953 11304905 9350488
9591 9350488 -328613 -2902745 10351332 20996162 10013512 -11059054 -17550209 -8034023
9583 -8034023 -446535 -175076 3918594 14581347 20413752 17105864 14650349 18920891
9575 18920891 22981615 22068880 21669498 24076010 21339302 9912855 -425706 -1479493
9567 -1479493 1292426 1741557 5933611 18200347 24542068 8452288 -20986736 -35896531
9559 -35896531 -25223990 -5823676 5424226 11760709 20014338 22035620 9123276 -6657975
9551 -6657975 -5322135 11334023 21827221 16710369 9701409 12959913 19159247 17737527
9543 17737527 14183860 19337910 29143857 30066499 19566267 7093449 -2316677 -11066914
9535a1066914n361493N936987J4169548O394925q725480j0389079L286997J2270433
9527F515924N243516m584855k110806O241576M561578o433462j0521234p86598
9519a874361J0529074R998463M20832o018831n480733m952867q642607j0496259
9511a6517289m239806M662718M839286l637210o504747M966448J8668146J6139991
9503A8377537p42033j0882374m226624L775799k644963j3071249o467468J3716072
9495b165303K1254335N532043j2555182j1694665P97785M969168o87885k316204
9487C134092L309816N598755P53707k841531j607771k628956q139661r063874
9479a1485423j062456N534232R38671q222880q101166K927674J2888704J1800829
$$ plain form
9535 -11066914 -16428407 -10491420 3678128 10073053 1347573 -9041506 -5754509 6515924
9527 6515924 11759440 7174585 5063779 11305355 15866933 9433471 -1087763 -1874361
9519 -1874361 8654713 18653176 19074008 13055177 7574444 2621577 -6021030 -16517289
9511 -16517289 -20757095 -16094377 -11255091 -14892301 -21397048 -16430600 2237546 18377537
9503 18377537 17635504 6753130 2526506 6302305 3657342 -9413907 -15881375 -2165303
9495 -2165303 19089032 24621075 12065893 371228 1169013 6138181 5450296 3134092
9487 3134092 6443908 12042663 12796370 9954839 8347068 5718112 -2421549 -11485423
9479 -11485423 -12547879 -7013647 -6074976 -14297856 -22399022 -19471348 -6582644 5218185
9471E218185K195018n466103m877781j198275m527695j4022007j4618627K254059
9463c5043226K1083293J9758260J702998p715641J448749J0362531K639716j1292504
9455B944176j3814073o748806k123010P9724O968678J5189961J5745498R546253
9447B7788401L032961m376536j3601593j5330621l270548R776479P782789l013595
9439H787737m370520L639966M540857n072744j0817321n821513Q26600K804102
9431e482836L325095J751768n354455q598903M882866K3516225J9786589o448640
9423B7377709k1970243r417856O916526K265751j0252685p158819M283431L140551
9415d815635n427894j371734J1038249J0290972j826036k259691J0739013J2627661
$$ plain form
9471 5218185 7413203 1947100 -2930681 -4128956 -8656651 -22678658 -37297285 -35043226
9463 -35043226 -13959933 5798327 7501325 -214316 1234433 11596964 14236680 2944176
9455 2944176 -10869897 -17618703 -19741713 -19661989 -12693311 2496650 18242148 27788401
9447 27788401 30821362 26444826 12843233 -2487388 -5757936 4018543 11801332 8787737
9439 8787737 4417217 8057183 12598040 7525296 -3292025 -9113538 -8286938 -5482836
9431 -5482836 -2157741 -405973 -5760428 -14359331 -9476465 14039760 33826349 27377709
9423 27377709 5407466 -4010390 2906136 5171887 -5080798 -12239617 -7956186 -4815635
9415 -4815635 -10243529 -11615263 -577014 9713958 7887922 5628231 16367244 28994905
9407B8994905l457617j2243340P18602J2942652J994970j7213149j7223260j328511
9399f814748N616246j910272o726029j812530Q35804l771002l252027Q797785
9391i036773J8549183J1778537n772185j8105741j8405071r733279L423177J4031334
9383a3270818J1834046m086088j7667729j2588448O445905J9407218J5537488
9376E611574K546404o736306p026211p81429N138543L442975n102431r161189
9368a2068070j339323Q599418O663705k935279l896217M775847O443279m380886
9360A862474j0920855j107454J2533971J3291191N065909P46435j106891q770651
9352A1594129j5718937p970200J0131399J7807771O967431p756807j1555126o983833
$$ plain form
9407 28994905 25537288 13293948 14012550 26955202 28950172 11737023 -5486237 -6814748
9399 -6814748 -1198502 -3108774 -9834803 -11647333 -10811529 -14582531 -17834558 -9036773
9391 -9036773 9512410 21290947 15518762 -2586979 -20992050 -30725329 -27302152 -13270818
9383 -13270818 -1436772 -5522860 -23190589 -35779037 -29333132 -9925914 5611574
9376 5611574 8157978 1421672 -5604539 -6385968 -1247425 2195550 -2906881 -12068070
9368 -12068070 -13407393 -4807975 1855730 -1079549 -4975766 -199919 6243360 1862474
9360 1862474 -9058381 -10165835 2368136 15659327 20725236 21471671 20364780 11594129
9352 11594129 -4124808 -12095008 -1963609 15844162 22811593 15054786 3499660 -3484173
9344c484173l465770j836664K695186R811526J3704246J0594641K947549k799545
9336B8166996k631354J63240n00419l235117l26483P780687R216578r73675j0232099
9327B7428354p176432J3056j468378n995597n99465Q433916L402823j2689964
9319A1348313j6826685k205054J0367235N576138m029809j433649P656701P108013
9311A7561203l186822r756532o777766n76119K564051J833438j555125m692166
9303d585838l159927K606938N382370J111697m387198m094629N87965M412801
9295b125821O378612P249283M910846j322454o721935p183912m444267p05998
9287c965646N462376J2347260J1773887P99058r320784n930718O261526R524173
$$ plain form
9344 -3484173 -6949943 -8786607 -6091421 3720105 17424351 28018992 30966541 28166996
9336 28166996 25535642 25698882 25198463 21963346 21636863 29417550 38634128 37660453 27428354
9327 27428354 20251922 20264978 18796600 12801003 12201538 20635454 24038277 11348313
9319 11348313 -5478372 -7683426 2683809 8259947 4230138 2796489 10453190 17561203
9311 17561203 14374381 4617849 -2159917 -2736036 -171985 1661453 106328 -4585838
9303 -4585838 -7745765 -5138827 243543 1355240 -3031958 -7126587 -6538622 -2125821
9295 -2125821 4252791 11502074 16412920 15090466 8368531 1184619 -3259648 -3965646
9287 -3965646 1496730 13843990 25617877 26416935 17096151 11165433 17426959 26951132
9279B6951132l215414j7740953j5770038J838524J4973597Q196452r880101j6914895
9271a1561696n390183Q484198Q524190N79837M15669Q200847J0495043L745848
9263B3493753j392651K46995J000942l617251o709515l220078J873238M018041
9255A5693474N216505M764807k761011j4378099j7207872p252998L397140N407519
9247g120535M625826P526235Q657256L055619k313997j326726o10117o390811
9239F102750j1185187o839537Q8848M5514k411545J932312R046195Q579762J858269
9230G217381j808476j136878j501358k991105k698930l284830p060428q112900
9222b1377524k500703J757847j725460l446230O625152J8383309J5121452P32231
$$ plain form
9279 26951132 23735718 5994765 -9775273 -7936749 7036848 15233300 5353199 -11561696
9271 -11561696 -16951879 -8467681 56509 636346 1052015 9252862 19747905 23493753
9263 23493753 22101102 22348097 23349039 19731788 13022273 9802195 11675433 15693474
9255 15693474 20909979 25674786 22913775 8535676 -8672196 -15925194 -12528054 -7120535
9247 -7120535 -2494709 5031526 13688782 16744401 14430404 13103678 12493561 6102750
9239 6102750 -5082437 -11921974 -11833126 -11787612 -14199157 -12266845 -3220650 5359112 7217381
9230 7217381 5408905 4272027 2770669 -220436 -2919366 -6204196 -13264624 -21377524
9222 -21377524 -23878227 -22120380 -23845840 -27292070 -20666918 -2283609 12837843 13570074
9214A3570074o920001m650707m281944p323399k719545Q937728J1701745N1794
9206H365745j0976404q068660L812909J2560285J2309560K225786j3214528k0228620
9198a3213927q453618R757235J1168006l744289r362545N117401J7819759R068627
9190A8156649q050159j0477734n02509L825279P09751K781730R960853Q241622
9182B4645482m675213j3217563p078664N421467J1320026P430354k693332j3895516
9174G257041j7475711o131208J3239758K2009456J1982831l642824q586030m042288
9166A4611025j590645l081340n24328O817704Q938370J051166q129806q968631
9158I123515l172824K072745M674145N776293M156901K32531l88962L849993L783979
$$ plain form
9214 13570074 6650073 1999366 -2282578 -9605977 -12325522 -3387794 8313951 8365745
9206 8365745 -2610659 -10679319 -6866410 5693875 18003435 20229221 7014693 -13213927
9198 -13213927 -21667545 -11910310 -742304 -4486593 -13849138 -8731737 9088022 18156649
9190 18156649 10106490 -371244 -873753 2951526 3661277 6443007 16403860 24645482
9182 24645482 19970269 6752706 -325958 5095509 16415535 23845889 21152557 7257041
9174 7257041 -10218670 -16349878 -3110120 18899336 30882167 27239343 18653313 14611025
9166 14611025 13020380 9939040 9414712 16232416 25170786 26221952 18092146 9123515
9158 9123515 5950691 8023436 12697581 18473874 22630775 22863306 22474344 26324337 30108316
9149C0108316o802676j6460159r700691P570867J3483448J850883j0031962r501188
9141E16838m901733n336463l899271N005908R482271m51368j1753744p542574
9133a8880136M124208L800454n625499m589934Q115448J3415802N656688P24076
9125F741107N341117N267933n932722j1789218j209978J0317752N880506m929975
9117I686522l684516N840105O635906j553962m355560M26762P45835n763688o825292
9108A152112K271670R645899O078291j411626k759053L3032m46384l612936l223463
9099G727542J265535L523089l00918n882693n410242L121484J1987343J1059728
9091B7090868J91639r220620q157329j252865J045589k564361m619682j533042
$$ plain form
9149 30108316 23305640 6845481 -2855210 4715657 18199105 20049988 10018026 516838
9141 516838 -4384895 -9721358 -13620629 -8614721 867550 416182 -11337562 -18880136
9133 -18880136 -14755928 -10955474 -16580973 -21170907 -13055459 360343 6017031 6741107
9125 6741107 12082224 17350157 11417435 -371783 -1581761 8735991 14616497 9686522
9117 9686522 6002006 11842111 18478017 16924055 12568495 12995257 13741092 7977404 1152112
9108 1152112 3423782 13069681 19147972 17736346 14977293 15010325 14563941 10951005 7727542
9099 7727542 8993077 12516166 12215248 6332555 922313 4043797 16031140 27090868
9091 27090868 27282507 18061887 9904558 8651693 9697282 7132921 2513239 980197
9083I80197K738275M644313M279204J360590l278237l189909N961545J4357474
9075B7853452P258724j0884986j7140052k593681J1462314L337912j5898395j7860159
9067a4464871J421258J6349454Q753255r465827j6563118q145925M545077J1790248
9059e780449J1210068M634614k072233k055506K921802K447773o679918j2714337
9051h088186n531297P025733J0380343M593305J583076M522627M141913l928365
9043A4699149j1016881q352307J256415Q639121Q385515J261281p311762r649788
9035b089257k807624O006790P358358K675133J510840N879255P360300J840262
9027B7734057l522928k723477p38149m366523j0695309j1982353o984294q51908
$$ plain form
9083 980197 3718472 8362785 12641989 14002579 10724342 7534433 13495978 27853452
9075 27853452 35112176 24227190 7087138 4493457 15955771 19293683 3395288 -14464871
9067 -14464871 -13043613 3305841 12059096 2593269 -13969849 -22115774 -17570697 -5780449
9059 -5780449 5429619 10064233 7992000 5936494 8858296 11306069 4626151 -8088186
9051 -8088186 -13619483 -6593750 3786593 8379898 9962974 14485601 18627514 14699149
9043 14699149 3682268 -4670039 -3413624 5225497 13611012 14872293 7560531 -2089257
9035 -2089257 -4896881 1109909 8468267 11143400 12654240 18533495 25893795 27734057
9027 27734057 24211129 21487652 20749503 16382980 5687671 -6294682 -13278976 -14130884
9019a4130884K732104L862984L530511K802202L110704M657341N980414N697747
9011A8243123K667136l873945j0483716r287560J579893J0940303P624933k467855
9003A4942312m603258J541132K181176o465747j1924426p476243k176965j380246
8995a5362265M066275J7482443K2896621Q228593j1897144j5014598k926874L637557
8987A1110608l759833j3445599j4003982o360391L479354J0245706Q639153j581119
8979e676103j0494452p991174K649926R927697R891373P664102O457914M443071
8971A6872354M47952m569963r145030r965104m765377K91308l471922j0040723
8963b4346505k957751J5845192K1367292L312097j2887742l387974J5941120J5554249
$$ plain form
9019 -14130884 -11398780 -7535796 -4005285 -1203083 1907621 6564962 12545376 18243123
9011 18243123 20910259 17036314 6552598 -2734962 -1155069 9785234 17410167 14942312
9003 14942312 10339054 11880186 14061362 7595615 -4328811 -11805054 -13982019 -15362265
8995 -15362265 -11295990 6186453 29083074 37311667 25414523 10399925 7473051 11110608
8987 11110608 7350775 -6094824 -20098806 -26459197 -22979843 -12734137 -4094984 -5676103
8979 -5676103 -16170555 -24161729 -21511803 -11584106 -1692733 5971369 12429283 16872354
8971 16872354 17320306 12750343 3605313 -6359791 -11125168 -10833860 -14305782 -24346505
8963 -24346505 -27304256 -11459064 9908228 13220325 332583 -3055391 12885729 28439978
8955B8439978q01337p431238k290556m470531j2718168o134011J2636094J4409095
8947B1639326p911268k3889265j2061660R950811J7451500J2240376O882259R89833
8939B5291912p939238j1638634p076825o118300j3137540j2908258K514105J5131359
8931a5881419Q040959p432052j1278434m473468P49046M039753R620771J0828044
8923e786800L194912r25627P763394J4884770M645634j0545201q436159N770852
8915A0565775Q274468l860634j0438366l203793L801058Q45277m466217n041829
8907c524261m699898n584002k629132M128847O404810J569262k550057m07959
8899g292390L964444M584220N2706p444710j2546236r252059l9727M058653M02283
$$ plain form
8955 28439978 27638641 20207403 17916847 13446316 728148 -5405863 7230231 21639326
8947 21639326 13728058 -10161207 -22222867 -12272056 5179444 17419820 24302079 25291912
8939 25291912 17352674 5714040 -1362785 -7481085 -20618625 -33526883 -31012778 -15881419
8931 -15881419 -7840460 -15272512 -26550946 -31024414 -30275368 -26235615 -16614844 -5786800
8923 -5786800 -2591888 -3517515 4245879 19130649 23776283 13231082 4794923 10565775
8915 10565775 18840243 14979609 4541243 1337450 5138508 5983785 1517568 -3524261
8907 -3524261 -8224159 -13808161 -16437293 -12308446 -5903636 -4334374 -6884431 -7292390
8899 -7292390 -3327946 1256274 1308980 -6135730 -18681966 -27934025 -27973752 -23915099 -23512816
8890b3512816J295497J2458359J8476572O450137r368061q362490K872165L736857
8882D046220l276387O22422J2138511Q961393p892381j0982781O520547J6231328
8874B6368872J450795j4355637o822140R843311Q452244p480933j3521257l780545
8866A54710O037717O766525L269933j311557p992563j1208118l802515Q018492
8858f7376R819512q75050j1340723j0263336J368029J3976849J6856907O159036
8850B5633848q215780j0504765k77915M448340o011498j6236947r472193M753803
8842a5883107N971953l795080m834236O348046J2029302L536809o095511n363431
8834h085255l94438K50399m06023J182995j033476j0033070j4791736m862301
$$ plain form
8890 -23512816 -22217319 -9758960 8717612 15167749 5799688 -2562802 309363 4046220
8882 4046220 769833 1392255 13530766 22492159 14599778 3616997 10137544 26368872
8874 26368872 27819667 13464030 6641890 16485201 24937445 17456512 3935255 154710
8866 154710 6192427 12958952 16228885 14917328 6924765 -4283353 -8085868 -67376
8858 -67376 9752136 8877086 -2463637 -12726973 -11358944 2617905 19474812 25633848
8850 25633848 17418068 6913303 6635388 11083728 5072230 -11164717 -20636910 -15883107
8842 -15883107 -9911154 -13706234 -18540470 -12192424 -163122 3373687 -2721824 -8085255
8834 -8085255 -8479693 -8229294 -8635317 -7452322 -8485798 -18518868 -33310604 -38172905
8826c8172905J2077425J9105089J1253792j945643j0326049j0190749j837859
8819b0036899J0135427J6186622J0475897l15432m059524J219628N454070O89683
8811A9749472q672799j1476277k365266J1946880J7440185N845529j4514117k4400766
8803f447159j4551994K865349R794712N059801J898398N029075L931330p080705
8795D98807j5567701p870124R686302J8890238J3958852M937698n24509m563224
8787A9446339p595633m461269L038528L738845m644170p691513M056562J6963288
8779B2850977J2644558m001126j2726562q861117o138718r135997n197659R637052
8771i28592J7664071N728223j1629746j1997117K599180J1189842N684518j334220
$$ plain form
8826 -38172905 -26095480 -6990391 4263401 2317758 -8008291 -18199040 -20036899
8819 -20036899 -9901472 6285150 16761047 16445615 12386091 13605719 19059789 19749472
8811 19749472 11076673 -399604 -2764870 9182010 26622195 32467724 17953607 -6447159
8803 -6447159 -20999153 -18133804 -8339092 -3279291 -1380893 3648182 7579512 498807
8795 498807 -15068894 -22939018 -13252716 5637522 19596374 24534072 24009563 19446339
8787 19446339 11850706 7389437 10427965 14166810 9522640 1831127 5887689 22850977
8779 22850977 35495535 31494409 18767847 9906730 3768012 -5367985 -10565644 -928592
8771 -928592 16735479 22463702 10833956 -1163161 1436019 12625861 18310379 16976159
8763A6976159O9610L254226j055286r665426j2720856p051948K260019R199128
8755A265626J1271868R168786M886333l53156o207083j0663929j0149224m448453
8747e229232J850900N515703P608565P262561P7034j1189120j3352716p91650
8739h247955J1254323N661108r938513j2794569J137162J2701120J0577450N627069
8731A5977195P154291N819022o297864j5960962p413023J0367001J4432786O96748
8723B4775194j1764038q190404M968155J2171667O573458o308353j4920506j1215531
8715c910358M87669O541614J333242m050048J385047J0264339P737488m645333
8707A5143660j0930033m634981M509660P848444O860886L170988n486177j5342649
$$ plain form
8763 16976159 17045769 20299995 19244709 9579283 -3141573 -10193521 -7933502 1265626
8755 1265626 12537494 21706280 26592613 26239457 20032374 9368445 -780779 -5229232
8747 -5229232 -3378332 2137371 9745936 17008497 17085531 5896411 -7456305 -8247955
8739 -8247955 3006368 8667476 -1271037 -14065606 -12928444 -227324 10350126 15977195
8731 15977195 23131486 28950508 22652644 6691682 -721341 9645660 24078446 24775194
8723 24775194 13011156 4820752 9788907 21960574 28534032 22225679 7305173 -3910358
8715 -3910358 -3422689 3118925 4452167 402119 1787166 12051505 19788993 15143660
8707 15143660 4213627 -421354 4088306 11936750 18797636 21968624 16482447 1139798
8699A139798j6439317p493213J267570M338476O947097J0469348P160475l127815
8691D262419o570252L360176J2197111N429670q603072j1781995k884927M701950
8683A11080N105546L680367L146086J531992R37804L794972L414175o742197j7372968
8674b393143j3768554k97608M342821k798453m470304O040184J1603108J13284
8666a628665j2962838q134159O531768Q167914m727631j1063981r09416J0472499
8658a4254509P813182j872988k579990N954918R178429n96452j3854443j5983175
8650b6195028l616177J2588297J8328276Q547720p431980j4077171n763839O269588
8642a1350314P236591j899628n482363M504005J5877988J3075437o36093q864876
$$ plain form
8699 1139798 -15299519 -22792732 -21525162 -17186686 -10239589 229759 7390234 4262419
8691 4262419 -2307833 1052343 13249454 18679124 10076052 -1705943 -4590870 111080
8683 111080 5216626 8896993 12043079 13575071 14512875 18307847 21722022 14979825 -2393143
8674 -2393143 -16161697 -16459305 -12116484 -14914937 -19385241 -13345057 -1741949 -1628665
8666 -1628665 -14591503 -22725662 -16193894 -8025980 -12753611 -23817592 -24727008 -14254509
8658 -14254509 -6441327 -8314315 -10894305 -4939387 4239042 3642590 -10211853 -26195028
8650 -26195028 -29811205 -17222908 1105368 9653088 2221108 -11856063 -17619902 -11350314
8642 -11350314 -4113723 -6013351 -11495714 -6991709 8886279 21961716 21325623 12460747
8634A2460747n957960j157918P41269O283051J5608406J4832502k096397j7868426
8626B2845274j4046662J277679O255443j309641m136178L600106P909616N36128
8618B2931765q243842r310660q150480r270430n030398P554162J4611399N207421
8610A0298937q987613r922010N51132O941249M900204K583276K550263k48881
8602H666557m813173m631555j069053j483194m709131k983097K395178K853699
8594e773769m0508L850805J2196473R474950o628224j6382976n944344J1342672
8586B095079J4532793L860287m413467l305035l82322k152960o250493p872624
8578c888742m798024K379680Q569987O833017j098289l560358L888536Q615026
$$ plain form
8634 12460747 6502787 5344869 6086138 12369189 27977595 42810097 40713700 22845274
8626 22845274 8798612 10076291 16331734 15022093 10885915 14486021 22395637 22931765
8618 22931765 14687923 5377263 -2773217 -12043647 -17074045 -9519883 5091516 10298937
8610 10298937 1311324 -8610686 -8059554 -1118305 3781899 6365175 8915438 8666557
8602 8666557 3853384 -778171 -1847224 -3330418 -8039549 -11022646 -8627468 -5773769
8594 -5773769 -5814277 -1963472 10233001 19707951 13079727 -3303249 -9247593 2095079
8586 2095079 16627872 20488159 16074692 12769657 12387335 10234375 3983882 -3888742
8578 -3888742 -8686766 -6307086 2262901 9095918 7997629 4437271 8325807 16940833
8570A6940833r5658j0636620m492090J2499922J4599471n906383k4875467j8915994
8562b0881986L818687J7538070J2645719J757753k564303k121680m273940q737406
8554b819086q070153J410534J2543466J3581985K958849o036593j530710Q868590
8546B0906882O901660q998372j9010218j0659702J849853o20640j2215546j1556460
8538c3402543L858729J2722361K175226j2868605j1722608L394499J2840261P145158
8530a5857522l075619l809785N347981J3601824J2916104N701425j01123p56673
8522A3966612J58180j856333n458532n565732n02967O370618J1152456J1710700
8514B9975002O613011l020847j0435324p957128L012218J1552558R501366J80748
$$ plain form
8570 16940833 16845175 6208555 1716465 14216387 28815858 22909475 -1965992 -20881986
8562 -20881986 -17063299 474771 13120490 14878243 12313940 10192260 5918320 -2819086
8554 -2819086 -10889239 -9478705 3064761 16646746 19605595 13569002 12038292 20906882
8546 20906882 27808542 18810170 -200048 -10859750 -9009897 -9630537 -21846083 -33402543
8538 -33402543 -29543814 -16821453 -14646227 -27514832 -39237440 -35842941 -23002680 -15857522
8530 -15857522 -18933141 -22742926 -17394945 -3793121 9122983 14824408 14723285 13966612
8522 13966612 14124792 12268459 6809927 1244195 741228 7111846 18264302 29975002
8514 29975002 36588013 33567166 23131842 15174714 18186932 29739490 39240856 39421604
8506C9421604p726562j0746025j1236782j0722630p574583j038457N629486P272807
8498C278858K101231n060447o477611m49994N584145M391632j106812k726725
8490d65723K68117J053735k631835n200320l456130q16809J342516O355200J1853676
8481H302427P978688o313406j5857356r023954M044794O097634j403933l191135
8473i366241K809052K276238r148989j4885168k370098J5080793J5604454N05723
8465E05764p192386M388258J9223518J6356210m58911q396718J646866J1959298
8457C8031899L789586j5073904k1312575r218932L115183J511660o628770q289830
8449a4075683l459826K011620Q855537J6654180J4936318j998819j9482813j9098716
$$ plain form
8506 39421604 31695042 20949017 9712235 -1010395 -8584978 -9623435 -3993949 3278858
8498 3278858 5380089 319642 -6157969 -6607963 -1023818 3367814 2261002 -465723
8490 -465723 -197606 856129 -1775706 -6976026 -10432156 -11248965 -9906449 -3551249 8302427
8481 8302427 16281115 9967709 -5889647 -14913601 -10868807 -4771173 -6175106 -9366241
8473 -9366241 -6557189 -4280951 -13429940 -28315108 -30685206 -15604413 41 505764
8465 505764 -6686622 -2298364 16925154 33281364 32822453 24425735 26072601 38031899
8457 38031899 41821485 26747581 5435006 -3783926 -668743 842917 -5785853 -14075683
8449 -14075683 -17535509 -15523889 -6668352 9985828 24922146 22923327 3440514 -15658202
8441a5658202n351646K437546O34738K801283J1569622J2271773j23046r640915
8433a058847m789725L470759J688682m562383l759311Q39574K05430j508067M751115
8424d722773J2823714Q516241n933047j2687249m529695N866604O412590J190469
8416F936854n83108J51324l446916j1165422j5252053j0746237j033973O623089
8408b8516442Q600171P617747Q005260Q801000M838591l639297p680880j307273
8400c281123P823149P403095k059090p952568l793886K949851L756745L48564
8392E194737j879352l476172o847334q804116n668414j683693l019510n537917
8384c1721771R39294J5064849K1348742J0412180o444793j1070282j991188N291630
$$ plain form
8441 -15658202 -21009848 -18572302 -17937564 -15136281 -3566659 8705114 8582068 -1058847
8433 -1058847 -5848572 -2377813 -689131 -5251514 -9010825 -8171251 -7965821 -9473888 -4722773
8424 -4722773 8100941 16617182 10684135 -2003114 -6532809 -666205 5746385 6936854
8416 6936854 6353746 6505070 3058154 -8107268 -23359321 -34105558 -35139531 -28516442
8408 -28516442 -19916271 -12298524 -4293264 4507736 9346327 5707030 -1973850 -3281123
8400 -3281123 4542026 11945121 9886031 1933463 -1860423 1089428 4846173 5194737
8392 5194737 3315385 -160787 -7008121 -15812237 -21480651 -23164344 -26183854 -31721771
8384 -31721771 -30782477 -15717628 5631114 16043294 9598501 -1471781 -3462969 1828661
8376A828661L85615r021085r348608M60043Q403344N096781m832740q434723k42025
8367a5704737R832450P332968p751112j8086666r486048J0237887K0400107J2967427
8359I742276k63683n821823l580730q20644q81362k798980m938064m392394P97491
8350a2957913N867080L706396k576989k059303N543995P165767j712636p809476
8342d833079k546471K589946k603043o769627K625573J3341593O997611p551160
8334A251343p393737M969457O248158n808279q495664M098145R443345k881142
8326A431626j1660326j584004R595352L330585o323102J591237J6095628J1400805
8318B3877801r707009j9753850q360291O889468J0366111N845280K034788k77597
$$ plain form
8376 1828661 2214276 -6806809 -16155417 -15695374 -7292030 -2195249 -7027989 -15462712 -15704737
8367 -15704737 -5872287 1460681 -6290431 -24377097 -33863145 -23625258 -3225151 9742276
8359 9742276 9478593 3656770 76040 -744604 -1625966 -4424946 -9363010 -13755404 -12957913
8350 -12957913 -7090833 -3384437 -5961426 -8020729 -2476734 4689033 2976397 -4833079
8342 -4833079 -7379550 -4789604 -7392647 -14162274 -11536701 1804892 8802503 1251343
8334 1251343 -6142394 -1172937 5075221 -733058 -9228722 -5130577 4312768 1431626
8326 1431626 -10228700 -11812704 -2217352 1113233 -5209869 -3618632 12476996 23877801
8318 23877801 14170792 -5583058 -13943349 -7053881 3312230 9157510 11192298 10914701
8310A0914701l084628o873271j2703941j7822143j2369461O930550K4451867K2375886
8302A1819560O239617k901303M91065J970375n448711r142678J119492J4971694
8294A9119111J5367530J159499j3136491j5212345o784201K16883k889362j1159558
8286a3318934j1669746j052772R525582J1323507R940991J1603772R035753m632074
8278B0756079j7499231j3068791K892355R502822J903955n200098m212751k999040
8270g924700m416251j564R891163J1160292L06912n966867L033917J3793225R831525
8261B9707652l971021j2351389j1920392q032315j018723R039445J3116021M480806
8253A9050084p631501r914207m414127k124709l309207K66138P466522Q321558
$$ plain form
8310 10914701 7830073 956802 -11747139 -29569282 -41938743 -35008193 -10556326 11819560
8302 11819560 18059177 15157874 15648939 17619314 12170603 3027925 4147417 19119111
8294 19119111 34486641 35646140 22509649 7297304 513103 729986 -2159376 -13318934
8286 -13318934 -24988680 -26041452 -16515870 -5192363 4748628 16352400 25388153 20756079
8278 20756079 3256848 -9811943 -6919588 2583234 4487189 -712909 -4925660 -7924700
8270 -7924700 -12340951 -12342515 -2451352 8708940 9015852 3048985 6082902 19876127 29707652
8261 29707652 25736631 13385242 1464850 -6567465 -7586188 1453257 14569278 19050084
8253 19050084 11418583 1504376 -2909751 -5034460 -8343667 -8077529 -611007 7710551
8245G710551J472477l755039l432279l342387n077699j265811J0159058J7775800
8237B0244671J0277315p618577j9108720j3167746M029172J4427641N848831j3428129
8229A504458k1561837r038191Q149360R729247m82159j858990R270525J2039779
8221G752192n976566k5578362k0600225M695711K0757639J2161868n251786r267833
8213b1307362J486436J2347926J3639589P004395k708449j1153384j2340175k597871
8205a5628895J1936813J8692608J1923106j562649j0828507j0773877l488906
8198B69693M781816O661229m55965q904262p101591M776715J1785322L137007
8190A4949964j1223148j2066126L377304J7383602J4860728P83483j0076413j2254490
$$ plain form
8245 7710551 9183028 5427989 1995710 -1346677 -6424376 -7690187 2468871 20244671
8237 20244671 30521986 22903409 3794689 -9373057 -5343885 9083756 14932587 1504458
8229 1504458 -20057379 -29095570 -20946210 -11216963 -11699122 -13558112 -4287587 7752192
8221 7752192 1775626 -23802736 -44402961 -39707250 -18949611 -6787743 -12039529 -21307362
8213 -21307362 -19820926 -7473000 6166589 13170984 10462535 -690849 -13031024 -15628895
8205 -15628895 -3692082 15000526 26923632 25360983 14532476 3758599 269693
8198 269693 5051509 11712738 11256773 2352511 -4749080 27635 11812957 14949964
8190 14949964 3726816 -8339310 -4962006 12421596 27282324 28065807 17989394 5734904
8182E734904j0317031o437739J274466Q847026P090802l147337o998414M001408
8174D8085J5457610P470624j4994308k5298684j1336018P792898R679849j439697
8166a2619641o076907L15682N702803L862352K55041k641702q256455j2968428
8158c2427255o865669Q742211J9064084J5507343M864342m205567j0006094j0074385
8150a5400990m10313J2502496J4753991O007635J154298N012665M373189o189934
8142B1803037j1738559l248115M353319k568337j2256931q583900J247134K129851
8134h862501j591937J598273N082051k268706r557108k02046J4847518J1638695
8126A0684239n460746r943946K227560Q265183k49989o175500j523490N58489
$$ plain form
8182 5734904 -4582127 -11019866 -9745400 -898374 6192428 3045091 -3953323 48085
8174 48085 15505695 22976319 7982011 -17316673 -28652691 -20859793 -11179944 -12619641
8166 -12619641 -18696548 -18380866 -12678063 -8815711 -8560670 -11202372 -19458827 -32427255
8158 -32427255 -39292924 -30550713 -11486629 4020714 8885056 4679489 -5326605 -15400990
8150 -15400990 -15811303 -3308807 11445184 17452819 18607117 23619782 27992971 21803037
8142 21803037 10064478 6816363 11169682 8601345 -3655586 -12239486 -10992352 -8862501
8134 -8862501 -10454438 -8856165 -3774114 -6042820 -15599928 -15801974 -954456 10684239
8126 10684239 5223493 -4720453 -2492893 5772290 5522301 -653199 -2176689 -1618200
8118a618200l679466J79561J2039215R843549j0067563j8749784r83097J6083926
8110C048141O243461j2433464q748851J0070431J3399249j323069q976710j715551
8102d36363K039799n563005p917281N435337J9787473J8200446N171904m332943
8094C2385367o705787r049591j4073084j5739211q539337M245553J2866680J1551501
8086F942091N372734L198158M655582J411128p397844j1166864m068859M985744
8078C931870N990406J905113K11874n66319n211459j0034118q231070j832953
8070a3836656K090419K606422L121920L672414L862416P017468J1780508P516359
8062B7831270r429833k2326646j2823153J0746977K0822481O819768j1708357
$$ plain form
8118 -1618200 -5297666 -5118105 6921110 16764659 6697096 -12052688 -13035785 3048141
8110 3048141 9291602 -3141862 -11890713 -1820282 11578967 10255898 1279188 -436363
8102 -436363 1603436 -3959569 -11876850 -6441513 13345960 31546406 36718310 32385367
8094 32385367 25679580 16629989 2556905 -13182306 -21721643 -17476090 -4609410 6942091
8086 6942091 12314825 15512983 20168565 21579693 14181849 3014985 -1053874 3931870
8078 3931870 9922276 11827389 12039263 11472944 6261485 -3772633 -12003703 -13836656
8070 -13836656 -11746237 -9139815 -6017895 -2345481 1516935 8534403 20314911 27831270
8062 27831270 18401437 -3925209 -16748362 -6001385 14821096 21640864 9932507
8055I932507j2003316M440556J7430545J2733549m812665j8660018j7287822m895544
8047a3122208M481905L629223j496081l591065l778169l890335J142723J2389884
8039d234123J6670666K462945j7813209j8669023L432758K1888571J3616701j1209819
8031F145467k2890678q723094J4461880K2602554J0871807m838617q522273j168286
8023G938760L705773j911605j1365123j2238072o79004J4472758J9829135R856848
8015B9609470o725996j4628094q900856o04287j173512p171855q812159o605900
8007b5013189o344339l367090R999265K3604265J7635755n689948k0743690j4967653
7999b4886624m127890k113305L4175J0498381J6118479N814626n616848n97915
$$ plain form
8055 9932507 -2070809 2369747 19800292 32533841 27721176 9061158 -8226664 -13122208
8047 -13122208 -8640303 -5011080 -6507161 -10098226 -13876395 -17766730 -16624007 -4234123
8039 -4234123 12436543 14899488 -2913721 -21582744 -18149986 3738585 17355286 6145467
8031 6145467 -16745211 -25468305 -11006425 11596129 22467936 17629319 9107046 7938760
8023 7938760 11644533 9732928 -1632195 -13870267 -14549271 -76513 19752622 29609470
8015 29609470 22883474 8255380 -645476 -1249763 -2423275 -9595130 -18407289 -25013189
8007 -25013189 -31357528 -34724618 -24725353 -1121088 16514667 10824719 -9918971 -24886624
7999 -24886624 -29014514 -31127819 -31093644 -20595263 -4476784 1337842 -4279006 -4876921
7991d876921J0809439Q567834k931992m803311K443749K713951m693252n452376
7983A777121J922390M686152N05718j468838k679067j2535111k3500277j5553584
7975d6845496J0429385K8517896K2910272N317490p823837j3287105j0773245
7968a1554640K065849J6308132J5391319J036859n648789J839770L339554j3038361
7960I739693k6647952j4002321J4371359K7813415J5740819m990954j6093337
7953E930722j4236159n179497L754456N672510j097413r283793r265474P39290
7945b2965358J2991077J6658515O659491r372909j5308145m501093J0248723J3783783
7937H194084R506335R545026J0893991J636092j2295935j1299404M436669J1124759
$$ plain form
7991 -4876921 5932518 14500352 11568360 6765049 9208798 11922749 7229497 1777121
7983 1777121 3699511 8385663 8891381 7422543 4743476 -7791635 -31291912 -46845496
7975 -46845496 -36416111 -7898215 15012057 20329547 12505710 -781395 -11554640
7968 -11554640 -9488791 6819341 22210660 23247519 17598730 19438500 22778054 9739693
7960 9739693 -16908259 -30910580 -16539221 11274194 27015013 22024059 5930722
7953 5930722 -8305437 -13484934 -9730478 -4057968 -5155381 -14439174 -23704648 -22965358
7945 -22965358 -9974281 6684234 13343725 3970816 -11337329 -15838422 -5589699 8194084
7937 8194084 17700419 27245445 38139436 39775528 27479593 16180189 20616858 31741617
7929C1741617j748164j5393370j2940732k872399J525128K602848K944129o543625
7921f84568k3625432k3059461O889057L5630774K7529049n567329k0704827n016469
7913h609206J2356452Q860981l304567n550387j935208m856176j0419548n819126
7905a9276785P540823J3789622M312992j0583659j4866355o465032J973411J845038
7897b1729945J65120O031849J3206032R353253j598365l920137L360531M766666
7889I635004l381905o230727L15388o21572j3886315j5912812P077525K8979528
7881E974114K0102855o000557j4181681j494316N799914l63885k881118K767697
7873I723023Q96841j0569789j2767958K8548R466631N134606q23912m02037k807590
$$ plain form
7929 31741617 29993453 14600083 1659351 -1213048 312080 2914928 5859057 -684568
7921 -684568 -24310000 -47369461 -40480404 -4849630 22679419 17112090 -3592737 -8609206
7913 -8609206 3747246 12608227 9303660 3753273 1818065 -3038111 -13457659 -19276785
7905 -19276785 -11735962 2053660 6366652 -4217007 -19083362 -25548394 -23574983 -21729945
7897 -21729945 -21564825 -15532976 -2326944 7026309 5427944 1507807 4868338 9635004
7889 9635004 6253099 22372 337760 -283812 -14170127 -30082939 -23005414 5974114
7881 5974114 26076969 20076412 5894731 4400415 10200329 9836444 6955326 9723023
7873 9723023 10619864 50075 -12717883 -12689335 -3222704 1911902 1087990 685953 -2121637
7864b121637r979242p577470N763710Q471384p108668j4993316M881428L0758044
7856H094233K9034231K806464j6617620j4763846m395740J485164K467370k8715
7848H081541n387590p122027l87598O333383K189828p265836p675491J580865
7840i652925Q178561P131952M644257L753561J191073k516677l297209k390132
7832G042461k940929j488454M493826O710907p33979n511169N431552J8690344
7824C1694559J0143153j3979824k1222627l041731J0184105k742438k0302909
7817i267712j4004296P088905J5108928Q766368Q200263J4447475Q356815j0360694
7809B8336052j6283071M64833J4632860L546765j7680894j9296331o29176J2247500
$$ plain form
7864 -2121637 -12100879 -19678349 -13914639 -5443255 -12551923 -27545239 -22663811 8094233
7856 8094233 37128464 39934928 23317308 8553462 4157722 5642886 8110256 8081541
7848 8081541 2693951 -4428076 -4815674 1517709 3707537 -3558299 -11233790 -9652925
7840 -9652925 -1474364 5657588 10301845 14055406 15246479 12729802 9432593 7042461
7832 7042461 4101532 2613078 7106904 13817811 13083832 7572663 13004215 31694559
7824 31694559 41837712 27857888 6635261 3593530 13777635 11035197 -9267712
7817 -9267712 -23272008 -16183103 -1074175 7692193 15892456 30339931 38696746 28336052
7809 28336052 12052981 12517814 27150674 30697439 13016545 -6279786 -6908962 5338538
7801E338538N867742o027217p758234k104283P06280l51580o94135p06334k842878
7792h572101l821320R85796Q224180R844610M455641j984713o235874j0556606
7784g660387j4033913r495289N600071K0483839K0448331M309216j2415896j3280926
7776f044954J873411J6347698J3347474o237193k3945164k3519526q407570M962783
7768c1623041Q850045J0045352J3302008J1563201M13709q915458m216568O916512
7760F335760O644344n703053j2665930n841961L584850N944126O789682J0884978
7752A5972796R730779j832225j1549721q576794l537199j0261423j8167623p155185
7744c5376595J5418863K0253382O39796j5698465q016077Q948288J1962213L513355
$$ plain form
7801 5338538 11206280 5179063 -2579171 -4683454 -3977174 -4328754 -5022889 -5729223 -8572101
7792 -8572101 -12393421 -11407625 -3183445 6661165 11116806 9132093 2896219 -7660387
7784 -7660387 -21694300 -31189589 -25589518 -5105679 15342652 19651868 7235972 -6044954
7776 -6044954 -4171543 12176155 25523629 19286436 -4658728 -28178254 -36585824 -31623041
7768 -31623041 -22772996 -12727644 574364 12137565 12551274 3635816 -580752 6335760
7760 6335760 12980104 7277051 -5388879 -11230840 -7645990 -1701864 5087818 15972796
7752 15972796 25703575 23871350 12321629 3744835 207636 -10053787 -28221410 -35376595
7744 -35376595 -19957732 295650 935446 -14763019 -22779096 -13830808 -1868595 1644760
7736A644760K44340L202657J158053n978619p899100l281079l47039r92184l09519
7727a2557730R69477q65837n73296Q525631J7449803J0750447o907837j3152992
7719C637666o89536J1654507P616386m842546j0282304q005780n518531l289258
7711i719396P63116K277726j193558k121892M308999Q674291J816470p938282
7703c132526p118367Q83556K818890j246406l11317N164547L291435o123866q583079
7694a4357133M87422P344152M046172K743548J3553238K3485637J4099351r176307
7686D2226080k2863418j6918405m700808j355779n776823p557243j978362O751132
7678a2173626J1354100P321602k929569j0257494p404742J974735P713865O615402
$$ plain form
7736 1644760 1889100 5091757 6249810 271191 -7627909 -10908988 -11256027 -12248211 -12557730
7727 -12557730 -11588253 -12454090 -13027386 -4501755 12948048 23698495 16790658 3637666
7719 3637666 2948130 14602637 22219023 17376477 7094173 -911607 -6430138 -9719396
7711 -9719396 -8956280 -6678554 -7872112 -9994004 -5685005 2989286 4805756 -3132526
7703 -3132526 -10250893 -9367337 -6548447 -7794853 -8106170 -2941623 349812 -5774054 -14357133
7694 -14357133 -13869711 -6525559 -2479387 264161 13817399 37303036 51402387 42226080
7686 42226080 19362662 2444257 -2256551 -3612330 -9389153 -16946396 -18924758 -12173626
7678 -12173626 -819526 6502076 3572507 -6684987 -14089729 -12114994 -4401129 2214273
7670B214273M979676O472464N745866j348387q896165r827947p939461j1109169
7662a9708850j5702155r995415N737418J5546770J0250064J728858M077809J0084884
7654B019383K694789j4343903j7516492N00451J5746564O650810j2780440j3002915
7646c0031753O416913J6081125J645589j4480398p250950J3984480K0551132N977564
7638A2893702q133018n605707M394529N838260j448538p060791p374894o154870
7630a2651327l798755K234594Q283028O668120j997267p867892n583902o64627
7622a5378028J150525K470655O430697Q101845K391992m894384m276374K021418
7614a981654L349451j271761j242362O356112R013812j775245j4760877j4371882
$$ plain form
7670 2214273 7193949 13666413 19412279 18063892 9167727 -660220 -8599681 -19708850
7662 -19708850 -35411005 -45406420 -39669002 -24122232 -13872168 -12143310 -8065501 2019383
7654 2019383 4714172 -9629731 -27146223 -26645772 -10899208 -4248398 -17028838 -30031753
7646 -30031753 -23614840 -7533715 -5888126 -20368524 -27619474 -13634994 6916138 12893702
7638 12893702 4760684 -845023 3549506 9387766 7939228 878437 -6496457 -12651327
7630 -12651327 -16450082 -14215488 -5932460 735660 -1261607 -9129499 -14713401 -15378028
7622 -15378028 -14227503 -11756848 -5326151 2775694 5167686 273302 -4003072 -1981654
7614 -1981654 1367797 96036 -1146326 5209786 14223598 12448353 -2312524 -16684406
7606a6684406l794563J611941n73058K234194J3882213K0264615J0477083n937589
7598B1480430j2554763p463963o50991K577832L566442P88974p881452j4850015
7590a4987506r001572N594784J1133355J865650n184053M335786J7562550J1290759
7582B2609753j2369729k5958355j4044210O895578J3650240O528188J772618M210770
7574C294853M014560l018776q425843o067529n04833L503048P801828J1851431
7566A2448739Q624250k702805j0253787n431381L349450M114825M68238L172181
7558A3789710Q695821L873193r411424j3456293k861629N029172k919638j4397225
7550a1658313j1126644K704738Q505506K507931j552716K755410N129100k211803
$$ plain form
7606 -16684406 -20478969 -18867028 -19440086 -17205892 -3323679 16940936 27418019 21480430
7598 21480430 8925667 1461704 810713 3388545 6954987 7743961 -137491 -14987506
7590 -14987506 -23989078 -18394294 -7260939 -5395289 -10579342 -6243556 11318994 22609753
7582 22609753 10240024 -15718331 -29762541 -22866963 -9216723 -2688535 -915917 3294853
7574 3294853 7309413 4290637 -4135206 -10202735 -10707568 -7204520 597308 12448739
7566 12448739 21072989 18370184 8116397 2685016 6034466 10149291 10617529 13789710
7558 13789710 22485531 26358724 16947300 3491007 629378 5658550 2738912 -11658313
7550 -11658313 -22784957 -20080219 -11574713 -9066782 -10619498 -7864088 -2734988 -4946791
7542d946791j0749082q886858J025124P208481M148606k996028o037958j187075
7534b2421581Q018896J2564357P081295j056925J435451J4319094J9679225M686252
7526D4306064j8455297k6017908j2954650K087491K641151n855539p182671K932181
7518a8499178J3107036J2447711L192811m223198m629222k960849n636326j0548704
7510a7749919r643932r68434P304168P603585K951035J597124N425695R504825
7502F024147J0423593Q422760L160267n002842j0174359n763249M704737R510368
7494B1305422L655039n388399r045677p155694l410101N25991K549197j7320l793784
7485g75326j327358N627777N543521l371682n940760O217212J6425661N654172
$$ plain form
7542 -4946791 -15695873 -24582731 -23557607 -16349126 -12200520 -15196548 -21234506 -22421581
7534 -22421581 -14402685 -1838328 5242967 4186042 5621493 19940587 39619812 44306064
7526 44306064 25850767 -167141 -13121791 -11034300 -8393149 -14248688 -21431359 -18499178
7518 -18499178 -5392142 7055569 10248380 6025182 1395960 -1564889 -7201215 -17749919
7510 -17749919 -27393851 -28362285 -21058117 -13454532 -10503497 -8906373 -3480678 6024147
7502 6024147 16447740 24870500 28030767 23027925 12853566 7090317 11795054 21305422
7494 21305422 24960461 19572062 10526385 3370691 -39410 486581 3035778 3018458 -775326
7485 -775326 -2102684 3525093 9068614 5696932 -243828 5973384 22399045 28053217
7477B8053217j5950637k1720637q183519J850672k984436p094802J979592J1959559
7469a2090991Q734621R52439L121029R449327N656473m031884m511364K078281
$$ plain form
7477 28053217 12102580 -9618057 -17801576 -15950904 -18935340 -26030142 -24050550 -12090991
7469 -12090991 -3356370 -2403931 717098 10166425 15822898 11791014 7279650 9357931
$$ [...]
##END NTUPLES=NMR SPECTRUM
##END=
