##TITLE=31Pdec_5B1603
 DMSO-d6, 64 sc
 17.3.2023
##JCAMPDX= 6.0         $$ Bruker NMR JCAMP-DX V2.0
##DATA TYPE= NMR SPECTRUM
##DATA CLASS= NTUPLES
##ORIGIN= UXNMR, Bruker Analytische Messtechnik GmbH
##OWNER= root
$$ XWIN-NMR		Version 3.5
$$ Fri Mar 17 14:36:49 2023 Russian Standard Time (UT+4h)  she@DPX200
##.OBSERVE FREQUENCY= 81.013821
##.OBSERVE NUCLEUS= ^31P
##.ACQUISITION MODE= SIMULTANEOUS
##.ACQUISITION SCHEME= undefined
##.AVERAGES= 64
##.DIGITISER RES= 16
##SPECTROMETER/DATA SYSTEM= spect
##.PULSE SEQUENCE= zgpg30
##.SOLVENT NAME= DMSO
##.SHIFT REFERENCE= (INTERNAL, DMSO, 0, 248.564)
##AUDIT TRAIL= $$ (NUMBER, WHEN, WHO, WHERE, WHAT)
$$ ##TITLE= Audit trail, XWIN-NMR		Version 3.5
$$ ##JCAMPDX= 5.01
$$ ##ORIGIN= Bruker BioSpin GmbH
$$ ##OWNER= she
$$ F:/spectra/data/she/nmr/P31/1/pdata/1/auditp.txt
$$ ##AUDIT TRAIL=  $$ (NUMBER, WHEN, WHO, WHERE, WHAT)
(   1,<2023-03-17 14:35:06.87 +0400>,<she>,<DPX200>,
      <continue with go, POWCHK disabled, PULCHK disabled
       configuration hash MD5:
       00 E9 B6 7A A2 85 ED C7 34 08 36 98 17 FE 4E 26
       data hash MD5: 32K
       2C CE 16 31 78 7D 0E E9 B8 58 C5 0F DC 70 B3 EB>)
(   2,<2023-03-17 14:35:22.53 +0400>,<she>,<DPX200>,
      <Start of raw data processing
       efp BC_mod = 2 LB = 1 FT_mod = 6 PKNL = 1 PHC0 = -10875.78 PHC1 = 21.01018 SI = 64K 
       data hash MD5: 64K
       EC 31 B6 C6 B7 2F 5D A3 DD 9B 74 C7 51 F4 55 5C>)
(   3,<2023-03-17 14:36:20.87 +0400>,<she>,<DPX200>,
      <pk PHC0 = 67.53571 PHC1 = -190.8 
       data hash MD5: 64K
       71 D6 67 E8 40 11 B5 AC 27 26 28 30 11 B0 A4 03>)
(   4,<2023-03-17 14:36:23.56 +0400>,<she>,<DPX200>,
      <abs ABSG = 5 
       data hash MD5: 64K
       78 E7 54 EA 89 AF C9 53 12 0B CB AA 4C 64 E5 51>)
$$ ##END=
$$ 
$$ hash MD5
$$ 5F 8A AB 7D DA 58 00 31 6A 97 E3 EF 54 5E 91 E3
##$RELAX= 
##$RELAX= 
##$RELAX= 
##$RELAX= 
##$RELAX= 
##$RELAX= 
##$RELAX= 
##$RELAX= 
##$RELAX= 
$$ Bruker specific parameters
$$ --------------------------
##$DU= <F:/spectra>
##$EXPNO= 1
##$NAME= <P31>
##$PROCNO= 1
##$TYPE= <nmr>
##$USER= <she>
##$AMP= (0..31)
100 100 100 100 100 100 100 100 100 100 100 100 100 100 100 100 100 100 
100 100 100 100 100 100 100 100 100 100 100 100 100 100 
##$AQSEQ= 0
##$AQ_mod= 1
##$AUNM= <au_zg>
##$AUTOPOS= <>
##$BF1= 81.014009
##$BF2= 200.13
##$BF3= 200.13
##$BF4= 200.13
##$BF5= 200.13
##$BF6= 200.13
##$BF7= 200.13
##$BF8= 200.13
##$BYTORDA= 1
##$CFDGTYP= 0
##$CFRGTYP= 5
##$CHEMSTR= <none>
##$CNST= (0..31)
1 1 145 1 1 1 1 1 1 1 1 1 1 1 1 1 1 1 1 1 1 1 1 1 1 1 1 1 1 1 1 1 
##$CPDPRG= <waltz16>
##$CPDPRG1= <>
##$CPDPRG2= <waltz16>
##$CPDPRG3= <>
##$CPDPRG4= <mlev>
##$CPDPRG5= <mlev>
##$CPDPRG6= <mlev>
##$CPDPRG7= <mlev>
##$CPDPRG8= <mlev>
##$CPDPRGB= <>
##$CPDPRGT= <>
##$D= (0..31)
0 1 0 0 0 0 0 0 0 0 0 0.03 2e-05 3e-06 0 0 0 0 0 0 0 0 0 0 0 0 0 0 0 0 
0 0 
##$DATE= 1679049228
##$DBL= (0..7)
120 120 120 11 120 120 24 19 
##$DBP= (0..7)
150 150 150 150 150 150 150 150 
##$DBP07= 0
##$DBPNAM0= <>
##$DBPNAM1= <>
$$ [...]
##$SUBNAM3= <"">
##$SUBNAM4= <"">
##$SUBNAM5= <"">
##$SUBNAM6= <"">
##$SUBNAM7= <"">
##$SUBNAM8= <"">
##$SUBNAM9= <"">
##$SW= 501.771253377433
##$SWIBOX= (0..15)
0 1 3 0 0 0 0 0 0 0 0 0 0 0 0 0 
##$SW_h= 40650.406504065
##$TD= 32768
##$TD0= 1
##$TE= 0
##$TE2= 300
##$TE3= 300
##$TEG= 300
##$TL= (0..7)
0 120 53 12 22 120 120 120 
##$TP= (0..7)
150 150 150 150 150 150 150 150 
##$TP07= 0
##$TPNAME0= <>
##$TPNAME1= <>
##$TPNAME2= <>
##$TPNAME3= <>
##$TPNAME4= <>
##$TPNAME5= <>
##$TPNAME6= <>
##$TPNAME7= <>
##$TPOAL= (0..7)
0.5 0.5 0.5 0.5 0.5 0.5 0.5 0.5 
##$TPOFFS= (0..7)
0 0 0 0 0 0 0 0 
##$TUNHIN= 0
##$TUNHOUT= 0
##$TUNXOUT= 0
##$USERA1= <user>
##$USERA2= <user>
##$USERA3= <user>
##$USERA4= <user>
##$USERA5= <user>
##$V9= 5
##$VALIST= <valist>
##$VCLIST= <CCCCCCCCCCCCCCC>
##$VD= 0
##$VDLIST= <DDDDDDDDDDDDDDD>
##$VPLIST= <PPPPPPPPPPPPPPP>
##$VTLIST= <TTTTTTTTTTTTTTT>
##$WBST= 1024
##$WBSW= 4
##$XGAIN= (0..3)
0 0 0 0 
##$XL= 0
##$YL= 0
##$YMAX_a= 827
##$YMIN_a= -495
##$ZGOPTNS= <>
##$ZL1= 120
##$ZL2= 120
##$ZL3= 120
##$ZL4= 120
##$ABSF1= 248.5645
##$ABSF2= -253.2056
##$ABSG= 5
##$ABSL= 3
##$ALPHA= 0
##$AQORDER= 0
##$ASSFAC= 0
##$ASSFACI= 0
##$ASSFACX= 0
##$ASSWID= 0
##$AUNMP= <proc_1d>
##$AZFE= 0.1
##$AZFW= 0.5
##$BCFW= 0
##$BC_mod= 2
##$BYTORDP= 0
##$COROFFS= 0
##$CY= -3
##$DATMOD= 1
##$DC= 0
##$DFILT= <>
##$DTYPP= 0
##$F1P= 0
##$F2P= 0
##$FCOR= 1
##$FTSIZE= 65536
##$FT_mod= 6
##$GAMMA= 0
##$GB= 0
##$INTBC= 1
##$INTSCL= 6.047779e-11
##$ISEN= 30
##$LB= 1
##$LEV0= 0
##$LPBIN= 0
##$MAXI= 10000
##$MC2= 0
##$MEAN= 0
##$ME_mod= 0
##$MI= 50
##$NCOEF= 0
##$NC_proc= -12
##$NLEV= 6
##$NOISF1= 182.463
##$NOISF2= 159.3651
##$NSP= 0
##$NTH_PI= 0
##$NZP= 0
##$OFFSET= 248.5645
##$PC= 4
##$PHC0= -10808.24
##$PHC1= -169.7898
##$PH_mod= 1
##$PKNL= yes
##$PPARMOD= 0
##$PSCAL= 0
##$PSIGN= 0
##$REVERSE= no
##$SF= 81.0140089999694
##$SI= 65536
##$SIGF1= 159.3651
##$SIGF2= -187.1042
##$SINO= 113.3802
##$SIOLD= 16384
##$SREGLST= <1H.CDCl3>
##$SSB= 0
##$STSI= 65536
##$STSR= 0
##$SW_p= 40650.406504065
##$SYMM= 0
##$S_DEV= 0
##$TDeff= 32768
##$TDoff= 0
##$TI= <>
##$TILT= no
##$TM1= 0
##$TM2= 0
##$TOPLEV= 0
##$USERP1= <user>
##$USERP2= <user>
##$USERP3= <user>
##$USERP4= <user>
##$USERP5= <user>
##$WDW= 1
##$XDIM= 65536
##$YMAX_p= 177662000
##$YMIN_p= -265239789
$$ End of Bruker specific parameters
$$ ---------------------------------
##NTUPLES= NMR SPECTRUM
##VAR_NAME=  FREQUENCY,     SPECTRUM/REAL,   SPECTRUM/IMAG
##SYMBOL=    X,             R,               I
##VAR_TYPE=  INDEPENDENT,   DEPENDENT,       DEPENDENT
##VAR_FORM=  AFFN,          ASDF,            ASDF
##VAR_DIM=   65536,         65536,           65536
##UNITS=     HZ,            ARBITRARY UNITS, ARBITRARY UNITS
##FACTOR=    0.620285442955139, 1,           1
##FIRST=     20137.2065510682, 0,            0
##LAST=      -20513.1999529968, 0,           0
##MIN=       -20513.1999529968, -265239789,  0
##MAX=       20137.2065510682, 177662000,    0
$$ Real data points
##PAGE= N=1
##DATA TABLE= (X++(R..R)), XYDATA
$$ [...]
##PAGE= N=2
##DATA TABLE= (X++(I..I)), XYDATA
12968A4333781L313341l001191r196365j1681336q382386o8421P500109P169043
12960a3425k60635m889247m21268O951025Q053241L797590J050933J66538l409890
12951A1024862p808375o257107J94312K702645p33894j712805L621501O815045
12943G846184Q25869p595114p796807q87117L819213L492178K995519L590559
12935F290484O96399o060132r445803m734176L043282O017119L390416M34654
12927c67757M77846J934328K075208M57075j380512j777666m78441J005693J208830
12918C154604J007417K281789L890340K087800l197667o028580k149404L739029
12910D785328L536356k935211q037666p229640l222997J193401O504496J0290135
$$ y = [14333781, 17647122, 14645931, 5449566, -6231770, -14614156, -14682577, -7182468, -13425, -274060, -5163307, -5584575, 1366450, 9419691, 13217281, 14268214, 14434752, 11024862, 3216487, -3040620, -2846308, -143663, -877557, -2590362, 1031139, 7846184, 8672053, 1076939, -6719868, -7606985, -3787772, -295594, 2699925, 6290484, 6986883, 926751, -8519052, -13253228, -10209946, -4192827, -802411, -367757, 110089, 2044417, 4119625, 4576700, 3196188, 1418522, 940081, 1945774, 3154604, 4162021, 6443810, 10334150, 12421950, 9224283, 3195703, 1046299, 4785328, 8321684, 5386473, -2651193, -9880833, -13103830, -11910429, -5405933, 4884202]
12902D884202O571724l585339r286794m715767J316338l18085l744830M37844
12894h440707O101736J060665q797837n586887R585430J4287393K37609j1390676
12886b943274l129497J0748049Q085105n637259q846790k12390K274489n758476
12878e420043q818233m9224P460624L969238k474496l166517k739079o036723
12870a7274453o299472J876453J0070401Q671687K316466Q65489K905911L10149
12862C442631o371549q712454l706283L109402O068552M090691q05188m543137
12854g427335l631645n00245j348046n511573m435593M231872J0692390P955017
12846B4842L083557M339450O590499J423364o257371n846872L16235R62288m547433
$$ y = [4884202, 11455926, 7870587, -1416207, -6131974, -4815636, -5133721, -8878551, -8440707, -2338971, -1278306, -10076143, -15663030, -6077600, 8209793, 8447402, -2943274, -6072771, 4675278, 12760383, 7123124, -1723666, -1936056, 338433, -5420043, -14238276, -14287500, -6826876, -2857638, -5332134, -8498651, -11237730, -17274453, -23573925, -21697472, -11627071, -2955384, -638918, 226571, 3132482, 3442631, -2928918, -11641372, -15347655, -12238253, -6169701, -2079010, -2884198, -7427335, -11058980, -11559225, -12907271, -18418844, -22854437, -18622565, -7930175, 24842, 3108399, 7447849, 14038348, 15461712, 9204341, 3357469, 3673704, 4635992, 88559]
12837H8559n876162j66446L863541J537533j580096j489340j283860j853045J073523
12828e685793O746520P351349O20438n609536n849780m057923l758464j468798
12820a1711987M143220O570241K217011k000640K79967M196005K671900j125110
12812E240607k03803K998961O39799o363563q879861l702714K258436L077835
12804d934303J259654J602813L581568L345988K0225l194041l284269r38136P78081
12795a762420Q59673J704833M440993N331591R69331m725002m922976q86656p38406
12786B70961n844636p436457p73313O421101O081175J973494J329174J815199
12778C836698k357218o955158l240513N547807O821169j449636o582905p64035
$$ y = [88559, -5787603, -5954049, -2090508, -552975, -2133071, -3622411, -4906271, -6759316, -5685793, 1060727, 8412076, 9032514, 3422978, -2426802, -6484725, -10243189, -11711987, -7568767, -998526, 1218485, -782155, -502188, 3693817, 6365717, 5240607, 5036804, 8035765, 8675564, 2312001, -6567860, -10270574, -8012138, -4934303, -3674649, -2071836, 1509732, 4855720, 4875945, 1681904, -1602365, -2540501, -1762420, -902747, 802086, 5243079, 10574670, 11544001, 6818999, 1896023, 1009367, 270961, -5573675, -13010132, -13783445, -7362344, -1281169, 692325, 2021499, 3836698, 1479480, -5475678, -8716191, -3168384, 3652785, 2203149, -4379756, -5143791]
12770e143791P060509N417339l077334p654056n193350j084715J480842L827661
12762d366895N061648J901936l761949m615072J860037Q428448P229237K2624
12754A1760014n102934m854851l387925m199874m770287j624385L176517M607692
12746d396033K029774j86570O90886K243660J212353j600428k688476m98212K947341
12737b45705M326912K062400k240118n081606m484415j766209R22065L328526
12729c178150N325886M494673m48678m991745l065272L571915O011843K94521
12721H014993o753196p084261j819533K347420L016552K938633L479678K778560
12713F918846l3427k869549l263599p72825K661121L524755l57407o382934q901602
$$ y = [-5143791, 1916718, 7334057, 4256723, -3397333, -8590683, -9675398, -8194556, -4366895, 694753, 2596689, -1165260, -5780332, -3920295, 4508153, 11737390, 11760014, 6657080, 1802229, -1585696, -5785570, -10555857, -12180242, -9003725, -4396033, -2366259, -2552829, -1861943, 381717, 1594070, -6358, -2694834, -3193046, -245705, 4081207, 6143607, 3903489, -1178117, -5662532, -7428741, -6506676, -3178150, 2147736, 6642409, 6193731, 1201986, -1863286, 1708629, 7720472, 8014993, 1261797, -5822464, -7641997, -5294577, -2278025, 660608, 4140286, 6918846, 6885419, 4015870, 752271, -20554, 2640567, 6165322, 5807915, -575019, -9476621]
12704i476621n684596j4786M418606O696733N863598P46320n077908m797471J266050
12695f060075L937840p78535l872696K323823R508751M768865q167902j2574128
12687a0914057k707632Q947404J0281945L497067l206420o999920p978447m444662
12679a3524722K555453O570263M032985R1589N30025K819970J285642l017881
12671A343324m337113j613133O87350K70158j73429J567787L314407J748433k714328
12662I3456n977906m739610r4212L824330M546639L161711J217642j425103l855368
12653c248421k859853J841058M549458J119015l413228j492872M823186O576333
12645G894676J850397k240008k217542k875513o409582o973559j341611L789360
$$ y = [-9476621, -15161217, -15176003, -10757397, -4060664, 1802934, 2549254, -2528654, -7326125, -6060075, -2122235, -2900770, -6773466, -4449643, 5059108, 9827973, 1660071, -10914057, -13621689, -4674285, 5607660, 9104727, 5898307, -1101613, -9080060, -13524722, -10969269, -4399006, -366021, -274432, 255593, 3075563, 4361205, 1343324, -2993789, -4606922, -3919572, -3649414, -3822843, -2255056, 1059351, 2807784, 93456, -5884450, -10624060, -10718272, -6893942, -2347303, 814408, 2032050, 606947, -3248421, -6108274, -4267216, 282242, 1401257, -2011971, -3504843, 1318343, 7894676, 9745073, 7505065, 5287523, 2412010, -3997572, -10971131, -12312742, -8523382]
12637h523382J950614k724248k638049J410998L152175J433871M17834J836919
12629c683268L401602L036890R0707m945555q189397m334614M653782Q491599
12621a478254K295699m681634k034868N721463O289276j204281o079671l816516
12613d988786j319892k874408k964984K170394O084903K286955m375227m355373
12605a0336418K732123Q215600O528252J079405k005665j248498N10983J046190
12597F521972J141621K226397L106515R59330l976808p098400m951636k07111
12589b278120J815364K96823q39270Q07526L206713L413226R82544k382893m202856
12580H19057k592564J256073K878161j50916l841917k570313K612751N011156
$$ y = [-8523382, -6572768, -9297016, -11935065, -10524067, -7371892, -5938021, -5520187, -3683268, -281666, 2755224, 2845931, -2099624, -10289021, -14623635, -9969853, -1478254, 817445, -3864189, -5899057, -177594, 6111682, 4907401, -1172270, -4988786, -6308678, -9183086, -12148070, -9977676, -3892773, -1605818, -5981045, -10336418, -7604295, 611305, 7139557, 8218962, 6213297, 4964799, 5475782, 6521972, 7663593, 9889990, 12996505, 13955835, 9979027, 2880627, -2071009, -2278120, -462756, -165933, -1005203, -197677, 3009036, 6422262, 7404806, 5021913, 819057, -1773507, -517434, 2360727, 2209811, -1632106, -4202419, -1589668, 3421488]
12572C421488J595706l432833n081259k969995Q49140M804644O564646L342772
12564I094309l456777p225480l364619M309874P475570K810940m664041p449781
12556b470005l275837L148649N535805K810354l80680j95681J551521J008136
12548G732262j432778j959963N12679K763263J854975j731923n500740o761210
12540d523435l709550K149829N479472K671877k829568m777219k633768q41063
12532i013425m73089J824796N889284O212342Q71105l997998k739187J757342
12524C31170L047482M02356j552665R957L320725M795412K003824m199777q759927
12515f01443o615031L63754M456012K349358m78647R88908L193113P30700l540380
$$ y = [3421488, 5017194, 1584361, -3496898, -6466893, -5617753, -813109, 5751537, 9094309, 5637532, -1587948, -4952567, -642693, 6832877, 9643817, 4979776, -2470005, -5745842, -2597193, 2938612, 5748966, 5368286, 5172605, 6724126, 7732262, 6299484, 4339521, 4852200, 7615463, 9470438, 7738515, 2237775, -4523435, -8232985, -6083156, -603684, 2068193, -761375, -5538594, -8172362, -9013425, -9486514, -7661718, -1772434, 4439908, 5311013, 1313015, -1426172, 331170, 3378652, 3781008, 2228343, 2238300, 5559025, 10354437, 12358261, 8158484, -601443, -7216474, -6852720, -2396708, -47350, -525997, 462911, 3656024, 4386724, 846344]
12506H46344k730441K380295M222851O48028j942969O35613L913816K673361p77710
12497I869188j287017M14032l37192l500215m006201m89864J524614j966549o298090
12488f077294m261899K792166N942930J334344m038088k251272M528711P735936
12480E705534M072460j994667n725891o320246m201471n2180K809970P21272m222341
12471i207560n428102q72420L912856L758170M1930k975290l307751q67940L141594
12462a1804513M741921O84658m825959l778175K871717M577766k232751o564941
12454a6330277N01527J0474479R626822o342m724197q58066J463850l447205p940902
12445a1240311m197491L988444P931952N425291N34983k778248k962469p29578
$$ y = [846344, -1884097, 496198, 4719049, 5367077, 3424108, 4059721, 7973537, 10646898, 9869188, 8582171, 8996203, 8659011, 5158796, 1152595, 662731, 2187345, 220796, -6077294, -10339193, -7547027, -1604097, -269753, -4307841, -6559113, -2030402, 5705534, 9777994, 7783327, 2057436, -4262810, -8464281, -8516461, -5706491, -4985219, -9207560, -14635662, -15508082, -11595226, -7837056, -7795126, -10770416, -14078167, -14946107, -11804513, -7062592, -6377934, -11203893, -14982068, -12110351, -7532585, -9765336, -16330277, -15828750, -5354271, 4272551, 4266209, -457988, -1316054, 147796, -3299409, -11240311, -15437802, -11449358, -3517406, 1907885, 2442868, -335380, -3297849, -4027427]
12437d027427Q91928k12699j244502J784907O291747N213252k119737p783107
12429a205638o055842l66227K921156J925251j827729o009085o533303o4160R562565
12420g653012J3228036P845993R3937l708213m677971n089040k749845L054089
12412C43974O741358L763342k398722n817968n462610k515724K870152O970928
12404D494730K868910p446189j0216224J169157J2974404R335503l652130p471826
12396B056335O3759L673589k533141o317838J34183O803909L761071k277567p25649
12387D638651M752790L602847l636629p185053l517981J918620M729996M807635
12379A0110876J770118l937116o949089k356541N658461Q005825K710522m027007
$$ y = [-4027427, -3135499, -3348198, -4592700, -2807793, 3483954, 8697206, 6577469, -1205638, -7261480, -7627707, -4706551, -2781300, -4609029, -10618114, -17151417, -17215577, -7653012, 5575024, 13421017, 13514954, 9806741, 5128770, 39730, -2710115, 343974, 7085332, 10848674, 8449952, 2631984, -2830626, -5346350, -2476198, 4494730, 7363640, -82549, -10298773, -9129616, 3844788, 13180291, 9528161, 2056335, 2120094, 5793683, 3260542, -3057296, -2923113, 3880796, 7641867, 5364300, 4638651, 9391441, 12994288, 9357659, 2172606, -1345375, 573245, 5303241, 10110876, 11880994, 7943878, 994789, -1361752, 4296709, 12302534, 15013056, 10986049]
12371A0986049p339539p060054l348575K672751N039910q92558q391280n720330
12363a4053626N788582J1032818K534160q340416q304811n48504L187636J345829
12355g358332J679001N607055N775288n69332o328139n347038l66588L168745
12347c739340M639705N608156M857346P17023m724579p594616o654636l382875
12339a0273816K87185K359615J329918j448940k079481J163069N400794P019511
12331C757855N472845J650407m127627r764551j0477644m289352L819898P285498
12323f672671N701215L279568J714107l66855k179506r80984K221153K775935
12315E491962m23190k823696j199714J731550K057048J03369j496434j765512
$$ y = [10986049, 3646510, -3413544, -6762119, -4089368, 950542, 57984, -8333296, -14053626, -8265044, 2767774, 5301934, -3038482, -11343293, -11891797, -8704161, -7358332, -5679331, -72276, 5703012, 5133680, -1194459, -6541497, -6908085, -3739340, 900365, 6508521, 11365867, 12082890, 7358311, -236305, -6890941, -10273816, -9986631, -7627016, -6297098, -7746038, -9825519, -8662450, -3261656, 3757855, 9230700, 10881107, 6753480, -3011071, -13488715, -17778067, -13958169, -6672671, -971456, 2308112, 4022219, 3655364, 1475858, 494874, 2716027, 5491962, 5068772, 2245076, 1045362, 2776912, 4833960, 4937329, 3440895, 1675383]
12307A675383q25162J420241L425252K057827k554044n338805k775742J723076
12299a191974K504527p66136m011231m858924l705218o83263L788987O631888
12291b291344M790047k31349m208804n478146m640975j082040M891059Q066598
12283a84954L393217m899635o574228M79762O582303L996024k567208m252417
12275d027136j005510P11998n82901j38458L584669N583213K250512k714779l376398
12266B85210N44573L787009K183752l016971p006909o181746j143910M063620
12258f485372N418864K216984k342700l885369j094756K458112J986990k334859
12250d062106m934879k363079J374757P49726k167882m38668O059941Q808640
$$ y = [1675383, 850221, 2270462, 5695714, 7753541, 5199497, -139308, -2915050, -1191974, 1312553, 546417, -3464814, -8323738, -12028956, -12712219, -8923232, -2291344, 2498703, 2267354, -1941450, -7419596, -12060571, -13142611, -8251552, -184954, 3208263, -1691372, -8265600, -7785838, -1203535, 2792489, 225281, -4027136, -5032646, -4320648, -4903549, -5042007, -1457338, 4125875, 6376387, 3661608, 285210, 829783, 4616792, 6800544, 3783573, -3223336, -9405082, -10548992, -6485372, -1066508, 1150476, -1192224, -5077593, -6172349, -3714237, -1727247, -4062106, -8996985, -11360064, -9985307, -9235581, -11403463, -11842131, -5782190, 3026450]
12242C026450L176132l935965m057829N68268J507012k468501m511262j464217
12234h159912J490187k27861l658889l761819q20111J820095L754756O304929
12226c258625P435356L556678l493642o701424l323339N21239j207651m620813
12218a1092221j627519N849979O391694l210034j0026272k609510J0597825J2115704
12210F389646J089003o065892j457552L259857k248685r575399o195514L496853
12202a1307683N928555J99885k871779O1708J968270R50034L364833R205494Q858658
12193A6357975n19506q128523n786536j51722p98352n381686n707354j458726
12185a1574430J421953J097426J17950r23799k540080k390289J075758M109306
$$ y = [3026450, 6202582, 2266617, -1791212, -1222944, 284068, -2184433, -6695695, -8159912, -6669725, -6897586, -10556475, -14318294, -15138405, -13318310, -9563554, -3258625, 4176731, 7733409, 4239767, -2461657, -5784996, -5263757, -6471408, -11092221, -12719740, -6869761, -478067, -3688101, -13714373, -16323883, -5726058, 6389646, 7478649, 1412757, -44795, 3215062, 966377, -8609022, -14804536, -11307683, -5379128, -5179243, -8051022, -7989314, -6021044, -5071010, -1706177, 7499317, 16357975, 15838469, 7709946, 1923410, 1771688, 973336, -4408350, -10115704, -11574430, -10152477, -9055051, -8937101, -9860900, -12400980, -14791269, -13715511, -9606205]
12177i606205K962354L24409M52799J721564N21584j374189n08886R09980r90025
12168e586615l813722k954616k10529J69475M03932M322338P153022K073133n323341
12159c766923k957205P342421J0477826J865960n251271k320710O63687n912204
12151A41581j2869892p229735N031581Q172202K286110J645781R353193J1828783
12143A8359604J769986r458344r457638k302559N85096k176259l801405k632587
12135i114106k937067m700166k338087N324319J1078235Q350463j2124n218025
12127D33442l104103J394314P93991n134019q319598k727661O410472Q188760
12119b064402Q10280n193001j420357O572483P752488J660963k217522J92032
$$ y = [-9606205, -6643851, -6319442, -5866643, -4145079, -3623495, -4997684, -5506570, -4596590, -5586615, -9400337, -12354953, -12565482, -12396007, -11992075, -7669737, -516715, 1556418, -3766923, -6724128, 618293, 11096119, 12962079, 7710808, 5390098, 6053785, 141581, -12728311, -19958046, -14926465, -6754263, -4468153, -2822372, 6530821, 18359604, 20129590, 10671246, 1213608, -1088951, -503855, -2680114, -6481519, -9114106, -12051173, -16751339, -19089426, -13765107, -2686872, 5663591, 5651467, 433442, -2670661, -1276347, -482356, -5616375, -13935973, -16663634, -10253162, -2064402, -1254122, -6447123, -7867480, -1294997, 6457491, 8118454, 5900932, 6092964]
12111F092964K076711k064917p114831n699951R8942K531914L52486n31011K238170
12102b019523L826255J047255j896369m40352K541879J231590l740091o166120
12094e615476l626730l14833K80717J87035J965461L509581K032511J39537K389589
12085I47392O778456N722593k879603j0869704r713937j526157M312670L385303
12077c842987R68o52965J127465K221873J401473n92842k449745k088430J647803
12068c227387N469163L849669k763123o565640l147137J251807p14781n041252
12060a0888681k335209N701761O692778l360278j2091236p844456L755417Q744909
12052a1624995M450851J56107R84620J910615j241387m486881l251112j09139
$$ y = [6092964, 8169675, 6104758, -1010073, -6710024, -6611082, -4079168, -3726682, -4257693, -2019523, 1806732, 2853987, 957618, 517266, 3059145, 4290735, 550644, -5615476, -9242206, -9557039, -9276322, -9089287, -7123826, -3614245, -1581734, -1442197, 947392, 7725848, 13448441, 10568838, -300866, -10014803, -11540960, -7228290, -3842987, -3842019, -4494984, -3367519, -1145646, 255827, -337015, -2786760, -4875190, -3227387, 2241776, 6091445, 3328322, -3237318, -6384455, -5132648, -5847429, -10888681, -13223890, -7522129, -829351, -4189629, -16280865, -24125321, -20369904, -11624995, -7174144, -7018037, -6033417, -4122802, -5364189, -9851070, -13102182, -13211321]
12044a3211321R0449j990837k382225m75304J470802L206031N859211P678033
12036B44839N476593M36689k136214k7504K743342J800965j755353l788345k894465
12027A00547q85197P14743J375355j78431m550077q296607o051965K003415Q083813
12018g684404N564597j978884m472825J973545R931856R884500J766421n699326
12010I285480o115898k362800j238513l854610m737495l24245N423625O365970
12002B441514K640944j90248M32012J183282q19259l515496l867556k046179J046713
11993b694273N813921R773835O604309m533874j3216543r495911J338463N155024
11985a255049r55169n654444j610893M627071N268852K961703K787864J867590
$$ y = [-13211321, -13120872, -15111709, -17493934, -17969238, -16498436, -13292405, -7433194, 244839, 5721432, 6158121, 4021907, 3994403, 6737745, 8538710, 6783357, 2995012, 100547, -784650, -69907, 1305448, 1127017, -3423060, -11719667, -17771632, -15768217, -7684404, -2119807, -4098691, -8571516, -6597971, 3333885, 13218385, 14984806, 9285480, 3169582, 806782, -431731, -4286341, -9023836, -9348081, -3924456, 2441514, 5082458, 4892210, 5324222, 6507504, 5688245, 2172749, -1694807, -3740986, -2694273, 3119648, 12893483, 19497792, 14963918, 1747375, -7748536, -6410073, -1255049, -2210218, -7864662, -9475555, -4848484, 420368, 3382071, 6169935, 8037525]
11977H037525l801762r084906o702494m5320J465460k683000l985427J150100
11969a5649824O993520Q421787O461228K811688k801159p822573p129471r03941
11961i618745M220525M389663K720135J983595q6100m717741p693336n540684
11953a4342688j183833Q74863O78486K32432o98263j954012n57246M154648O834883
11944e960730L022168l284207m599283l15036L581265L684960K292956J763205
11936A85298J276411M3224p03902k58938K23388n0323n14972r79091j877662k520740
11926e177307j673246j62630j58358j353806q11603K332843M902627M185725J961514
11917D045759J596837K833726K416095p18957l864723m530825l263893j339055
$$ y = [8037525, 4235763, -4849143, -11551637, -11596957, -10131497, -12814497, -16799924, -15649824, -8656304, -234517, 6226711, 9038399, 6237240, -1585333, -8714804, -9618745, -5398220, -1008557, 1711578, 3695173, 3609073, -1108668, -8802004, -14342688, -15526521, -14651658, -13973172, -13740740, -14439003, -16393015, -16950261, -12795613, -5960730, -2938562, -6222769, -10822052, -11137088, -7555823, -3870863, -1577907, 185298, 1461709, 1504933, 801031, 542093, 765481, 715158, 200186, -778905, -2656567, -5177307, -6850553, -7013183, -7171541, -8525347, -9336950, -7004107, -2101480, 2084245, 4045759, 5642596, 8476322, 10892417, 10173460, 6308737, 1777912, -1485981, -2825036]
11909b825036J694791N829682Q050722N494608L48991k320831j776585k253806
11901A2242536n237592o177846k051489K571792K058739j286519j072154K447415
11893C494882K714721k204601o256633m677024l69226J693264J172521L75253
11885d056843P5100N45485K700962M966288L126811k835811n755841k30184Q245712
11876F781679R009809L03655q049832p246422k61347L068054n39389l680979Q90896
11867B76124Q707141Q241762k588716j1514120q127113J286449L541874j264297
11859a440896j289104O102453Q921630M57290q588910o405865K139496M978824
11851D874918K055485K298855O236147N195450l020897r671260p903338q64786
$$ y = [-2825036, -1130245, 4699437, 12750159, 18244767, 18593758, 16272927, 14496342, 12242536, 7004944, 827098, -1224391, 1347401, 3406140, 2119621, 1047467, 3494882, 6209603, 4005002, -2251631, -6928655, -7297881, -5604617, -4432096, -4056843, -3981743, -3436258, -735296, 4230992, 7357803, 4521992, -1233849, -1464033, 6781679, 15791488, 16095143, 8045311, 798889, 537542, 3605596, 3066207, -614772, 276124, 8983265, 17225027, 14636311, 3122191, -5004922, -3718473, -176599, -1440896, -2730000, 3372453, 12294083, 12751373, 4162463, -2243402, -103906, 4874918, 6930403, 9229258, 15465405, 20660855, 17639958, 7968698, 65360, -799426]
11843g99426M659004N192734L78806o871407r641304l787397M453866N415854
11835i99270K90987p08594N041861Q493771M097038j797145k550947j179549k164243
11826H523909k375690J730805N205395J893957m671446o434527k829747N94455
11818A637111J859511K410096N79740n559420j0896182q323754k09616M519341
11810a3983173M381345O202204J0925429R876387n10929j0465471j0186658l335160
11802g096026O71300J246786M001424P796817N356026l565242r487512o217699
11794g294126R99494L935784K061722L16103M97017J59858j736268k810398j185971
11785e056785J369156J244444k644399o414130m058287N338194J3958343J2564545
$$ y = [-799426, 3859578, 9052312, 9431118, 2559711, -7081593, -10868990, -6415124, -999270, -708283, -1416877, 3624984, 12118755, 16215793, 14418648, 11867701, 10688152, 8523909, 6148219, 7879024, 13084419, 14978376, 10306930, 3872403, 1042656, 1637111, 3496622, 5906718, 6486458, 927038, -9969144, -18292898, -18502514, -13983173, -9601828, -3399624, 7525805, 17402192, 16891263, 6425792, -3760866, -7096026, -6424726, -5177940, -1176516, 6620301, 11976327, 8411085, -1076427, -7294126, -6294632, -2358848, -297126, 18977, 515994, 675852, -1060416, -3870814, -5056785, -3687629, -2443185, -5087584, -11501714, -15560001, -10221807, 3736536, 16301081]
11777A6301081K141649o203184n033112O11773J921607j225733k716952j350325
11769D446804j293473k760566j321451K339732J213439n749645q798344j300027
11761a3223531Q441419P969064j062888n427247M5211N734080K614591m721553
11753C69146o189434j091944K742683J795342O22890K281701K721574j285139
11745A966819m508003l60959P182602P128933k324497r592956n832812K395624
11737c945249L807133l28676R3903N884798O438745k513846j0591605p690180
11729h844977J718529O294568L312983j082648k523551j850509n96753O16714
11721b955644P90633P1343K47873O53112j962919n923686l680883N709061J0663705
$$ y = [16301081, 18442730, 12239546, 7206434, 7818207, 9739814, 8514081, 5797129, 4446804, 3153331, 392765, -928686, 1411046, 2624485, -3125160, -11923504, -13223531, -4782112, 3186952, 2124064, -3303183, -3257972, 2476108, 5090699, 369146, -5820288, -6912232, -4169549, -2374207, -1751317, 530384, 3251958, 1966819, -2541184, -2902143, 4280459, 11409392, 9084895, -508061, -6340873, -3945249, -138116, -466792, -372889, 5511909, 11950654, 9436808, -1154797, -8844977, -7126448, -831880, 2481103, 1398455, -1125096, -2975605, -3572358, -2955644, -2165011, -2093668, -1845795, -1192683, -3155602, -9079288, -12760171, -7051110, 3612595]
11712C612595K665672q756708q296978K333110P336770Q94645n979936m216603
11704a0407433J338197L116084K120337J890759Q84278k277896l582826l06948
11696g225448L090113J688783k258927l432971q10949K878078M721347K274435
11688I24461l998447p567608k359644O239729O407319j730543m592386L149032
11680c528087Q901727K858005n182272k518146M610959K228673o731242p518020
11672f878403J067179N491485J068614j832723K264165N165637J457574j910318
11664E893210K15413J195119m378243r282258n256820L119860O113679L301207
11656I21167J008028J126422J250070J135672J232929o16302m194922m245149
$$ y = [3612595, 6278267, -2478441, -10775419, -8442309, -1105539, -210894, -6190830, -10407433, -9069236, -5953152, -3832815, -1942056, -1057778, -3335674, -6918500, -7225448, -4135335, -2446552, -4705479, -8138450, -8949399, -6071321, -1349974, 924461, -3073986, -10641594, -13001238, -6761509, -354190, -2084733, -6677119, -3528087, 5373640, 8231645, 3049373, 531227, 5142186, 7370859, 639617, -6878403, -5811224, -319739, 748875, -1083848, 1180317, 6345954, 7803528, 5893210, 6108623, 7303742, 2925499, -6356759, -11613579, -8493719, -2380040, 921167, 1929195, 3055617, 4305687, 5441359, 6674288, 6057986, 1863064, -2382085]
11648b382085K37762J059596o035958j0791245k686492J0372038J1770825J114166
11640B658607o014505k592879J709420l56533k404010J239118M234394O65820
11632h60568k817805J613325Q259183O532814j778928n935613l152831m46440
11624A413137j443723k397847j189556k81327J58339K964919O401549M522040
11616A0147531k650134p215757m472025J189911M230454M797003M386161J623411
11608A2036555l360053o233436m519532j354931L16043J753750L115227P08161
11600B461784n596013q687572l963553L084734N415946M649767N384444N301512
11592H051049J75454n903539n583470m83265J861093Q10593J609829L587479J474740
$$ y = [-2382085, -2144323, -1084727, -7120685, -17911930, -20598422, -10226384, 1544441, 2658607, -3355898, -5948777, -4239357, -4595890, -6999900, -5760782, -1526388, -860568, -3678373, -2065048, 6194135, 12726949, 10948021, 5012408, 1859577, 1413137, -30586, -2428433, -3617989, -3899316, -3740977, -776058, 5625491, 10147531, 7497397, 281640, -4190385, -3000474, 1229980, 6026983, 10413144, 12036555, 8676502, 2443066, -2076466, -3431397, -3115354, -1361604, 1753623, 2461784, -3134229, -11821801, -15785354, -12700620, -7284674, -2634907, 2749537, 8051049, 8226503, 2322964, -3260506, -3743771, -1882678, -1072085, 537744, 4125223, 5599963]
11583E599963k191828O98018P962410P623293k148236q075669l005838K325259
11575H787372j908407p666330l780577L698663J954547n527657m437988N090040
11567c790337P435886k630595j0555521m605522O676224Q680737J555549l591739
11559h25318k086560J226016K293409J772254L35591k103038l219063r22665J447088
11550b082286j018896n917311n305249K338341Q415602N526011k694467p078909
11542g817164m490527P11615M310506O183565P062742N945125K104330k989301
11534A1020891p027981q619700p309166l607032N84608L216481M113801M360821
11526c267277L967830K187698j92648j526460k072816k938076k579571J164619
$$ y = [5599963, 3408135, 4106153, 12068563, 19691856, 17543620, 9467951, 6462113, 8787372, 6878965, -787365, -4567942, -869279, 1085268, -4442389, -8880377, -3790337, 3645549, 1014954, -9540567, -14146089, -7469865, 1210872, 2766421, -825318, -2911878, -1685862, 607547, 2379801, 2715392, 612354, -2606709, -3529374, -2082286, -3101182, -9018493, -14323742, -11985401, -3569799, 1956212, -738255, -7817164, -12307691, -11596076, -7285570, -1102005, 5960737, 11905862, 14010192, 11020891, 3992910, -4626790, -11935956, -15542988, -14958380, -11741899, -7628098, -3267277, 700553, 2888251, 2695603, 1169143, -903673, -3841749, -6421320, -5256701]
11518e256701N132374K802150n412537r939933m481572M736781P733028L962316
11510g24094N85j624380k889638k585394K078330P130850N200419j954558m275915
11501C56205J031016M924685J474844k732940n39694L321730L85393p126991r546439
11492h452191m255151J659644K245979o77454j854447J140434O069135P940299
11484C816248M103262j253841j281164L435832M828835J50746k999090J43755
11476A0944583J972171m855076j2764992r439165J999439O707457O59289m501019
11468i277313q33466M944693M433519R4799j598341o65862l87848m01550M13371
11459c277998l11760l703772n461041k190771K347634L007542J377846K297803
$$ y = [-5256701, -124327, 2677823, -2734714, -12674647, -17156219, -12419438, -4686410, -724094, -723509, -2347889, -5237527, -7822921, -5744591, 1386259, 6586678, 4632120, 356205, 1387221, 6311906, 7786750, 5053810, 4514116, 7835846, 8221239, 1094248, -8452191, -12707342, -11047698, -8801719, -9479173, -11333620, -10193186, -4124051, 3816248, 7919510, 6665669, 5384505, 8820337, 13649172, 13799918, 10800828, 10944583, 12916754, 8061678, -4703314, -14142479, -12143040, -5435583, -4776294, -9277313, -10110779, -5166086, -732567, -637768, -2236109, -2901971, -3289819, -3691369, -3277998, -3589758, -7293530, -12754571, -14945342, -12597708, -9590166, -8212320, -5914517]
11451e914517N460631O465006M076931R76943j180561k606553k663854q42932
11443C771094O90709l37889k290313j989826J62396J376008J428248K069235K464482
11434G344144J08325l686235m034849N13750N124074M769238M67712k606773j639924
11425F359462R53130O50739l977340r093021q975134k252367N865300Q633225
11417a836006M577122j635225m367046k002035K400595M195001J458787k952982
11409a61789m453206k156635M77923R83645J000607K328979L156750J567539Q7101
11400B830914K050200M913386K716543m433710q740527m782194K926205N613740
11392C094557R89810m920992n586477r70108L272561K218135k899784n663226
$$ y = [-5914517, -453886, 6011120, 10088051, 11064994, 9884433, 7277880, 4614026, 3771094, 4461803, 4123914, 1833601, -156225, 6171, 1382179, 2810427, 4879662, 7344144, 7452469, 3766234, -268615, 245135, 5369209, 10138447, 10606159, 7999386, 6359462, 7312592, 7963331, 3985991, -5107030, -14082164, -16334531, -10469231, -1836006, 2741116, 1105891, -3261155, -5263190, -2862595, 1332406, 2791193, -161789, -4614995, -6771630, -6293707, -5310062, -4309455, -1980476, 1176274, 2743813, 2830914, 4881114, 9794500, 12511043, 8077333, -663194, -5445388, -2519183, 3094557, 4084367, -836625, -6423102, -7393210, -4120649, -1902514, -4802298, -10465524]
11384a0465524j606290N991574R293543N051992j775968m427507j875894J694328
11376A880254K749537J248242j134528k961232l319810k099560l94516K73341
11368c758272o72224k338500k711961L3993M984130P620566M322449j972448m346547
11359A161186j380249O69406k026195m111818P0021N710345L989032l225634n058925
11350d202831J548741O894520L662728k474352l139327q8202j14227l020663l285776
11341d219389k10745J863606J507673R34703K62849j836781l014710r6599L719874
11332a089519K203985l379090n037217m05838L622615J957479j420057p95651
11324d343293K783450M326390J688672l529787p901427p155998k7228P318035
$$ y = [-10465524, -12071814, -6080240, 3213303, 8265295, 6489327, 2061820, 185926, 1880254, 4629791, 5878033, 4743505, 1782273, -1537537, -3637097, -4031613, -3758272, -4430496, -6768996, -9480957, -9446964, -4462834, 3157732, 7480181, 5507733, 1161186, -219063, 450343, -1575852, -5687670, -5617649, 92696, 4081728, 856094, -4202831, -2654090, 4240430, 7903158, 5428806, 2289479, 2201277, 2087050, -933613, -4219389, -4430134, -2566528, -1058855, -124152, 138697, -1698084, -4712794, -4809393, -1089519, 1114466, -2264624, -7301841, -7707679, -4085064, -2127585, -3547642, -4343293, -1559843, 2766547, 4455219, 925432, -6975995, -14131993, -14159221, -6841186]
11316f841186O453320j622890o335812j885005N082261O103480K366911K08491
11308C529570J114934K346751K788406K179818j359550p289567j0048730o117380
11300a2855748J57624L211030M300181O782337Q037362L726297l263716o019478
11292D075889l594901o45597P85182J938052J832354j337651m561750l024115
11284d532537K038917N001809M150582K016033n79893l822645m562621o13832
11276i04187K738453o48455o435826m958218L200806P510467L694432j460228
11268B737244k944801l682733m896279j885965N646462R448203M799612k208314
11260G013429n010400n126384m594127K05064R243634J2614938L629885q801530
$$ y = [-6841186, -387866, -2010756, -8346568, -10231573, -5149312, 954168, 3321079, 3529570, 4644504, 6991255, 9779661, 11959479, 10599929, 3310362, -6738368, -12855748, -12698124, -9487094, -5186913, 1595424, 9632786, 13359083, 10095367, 4075889, 480988, -164609, 620573, 2558625, 4390979, 3053328, -1508422, -4532537, -2493620, 2508189, 6658771, 8674804, 8094911, 4272266, -290355, -904187, 1834266, 1185811, -5250015, -10208233, -7007427, 503040, 4197472, 2737244, -207557, -3890290, -8786569, -10672534, -5026072, 4422131, 9221743, 7013429, 2003029, -3123355, -7717482, -7512418, 1731216, 14346154, 17976039, 9174509]
11252I174509j1275054m119211J741987J779540P88253J457783J094301o17173
11244B4935m71288Q48720r94190m993035m388378K203861O733141K711852n333427
11235c657809p822615j966361O249492R689750O370004o51071o756297q851108
11227g396015o546194j558745L450194N933865M919128J940932o46339k310689
11219b213863l518406k766013J991376Q228818R550273L944476k471725l211306
11211I533630L08672J900230p92978m903222p358572p037231l477200K258346
11203i568325O239200N119531O62534k353197k260891j464658j721428j716404
11195g063638K00673L164899M456205K278369j869225l672397o07460L878703
$$ y = [9174509, -2100545, -6219756, -4477769, -2698229, -1909976, -452193, 642108, 24935, -446353, 402367, -591823, -5584858, -9973236, -7769375, -1036234, 1675618, -3657809, -11480424, -13446785, -7197293, 2492457, 8862461, 8211390, 1455093, -7396015, -13942209, -15500954, -12050760, -6116895, -1197767, 743165, 96826, -2213863, -5732269, -8498282, -6506906, 1721912, 11272185, 15216661, 12744936, 9533630, 9842302, 11742532, 10949554, 6046332, -1312240, -8349471, -11826671, -9568325, -3329125, 1790406, 2452940, 99743, -2161148, -3625806, -5347234, -7063638, -6862965, -3698066, 758139, 3036508, 1167283, -2505114, -3112574, 766129]
11187G66129L809991j041325m396076k695443k24983j627450m069819k128209
11179a1607185K915669M792989J696692j721161j550706Q49350J858506j98753
11171b964599l901170n663642k942093J840908L269141Q77398P18209N392386
11163c373462Q136667L187143l311298j965088L893010K466863o751541j0287235
11155h004941j394898Q497536O583911k465993m747198J542200M862316p86629
11147D086304p233504n652676M12279K068834n99648K46159O286676R348510M245732
11138A3208666k417841k278808J579554P7298o118775p039555m76248K805398
11130f60311m004692j1753468q695912J708146O699159L125565n69682R77680
$$ y = [766129, 4576120, 3534795, -861281, -3556724, -3781707, -5409157, -9478976, -11607185, -8691516, -3898527, -2201835, -3922996, -5473702, -4624352, -2765846, -2964599, -6865769, -12529411, -15471504, -13630596, -10361455, -9484057, -8765848, -3373462, 4763205, 7950348, 4639050, 2673962, 6566972, 9033835, 2282294, -8004941, -9399839, -902303, 5681608, 3215615, -1531583, 10617, 4872933, 4086304, -3147200, -8799876, -8387597, -6318763, -6918411, -6672252, -385576, 8962934, 13208666, 10790825, 8512017, 10091571, 10168869, 4050094, -2989461, -3465709, -660311, -4665003, -16418471, -25114383, -23406237, -16707078, -13581513, -14151195, -13173515]
11122a3173515M218820N382473N125571L521752o41340m212018j920068M122345
11114B424020N747469J405602j510951N46063J911411j150311m027345l756427
11106A589531n187972r944216r263695K224639J3948081J2518268J561782m246883
11098C199535j140392J326113j484751k780385J626389N454842L064252j699058
11090G566545l413896l394420m144085l065588J479999M096098j83897o933414
11082g992658q122793l333043J755095M677042O346806M761177k376866r556602
11074a3841842p521419K902337R714771N769338j841397k978737J911874N484864
11066d00211N246907M122854K726391q78281m841206m546942n59727J113885j707790
$$ y = [-13173515, -8954695, -3572222, 1553349, 5075101, 4433761, 221743, -1698325, 2424020, 8171489, 9577091, 8066140, 8612203, 10523614, 9373303, 5345958, 1589531, -3598441, -13542657, -22806352, -20581713, -6633632, 5884636, 7446418, 3199535, 2059143, 3385256, 1900505, -879880, 746509, 6201351, 9265603, 7566545, 4152649, 758229, -3385856, -6451444, -4971445, -875347, -1059244, -7992658, -16115451, -19448494, -17693399, -13016357, -6669551, -1908374, -4285240, -13841842, -21363261, -18460924, -8746153, -2976815, -4818212, -7796949, -5885075, -400211, 4846696, 8969550, 11695941, 10817660, 5976454, 1429512, 869785, 1983670, 275880]
11057B75880l866947j188334L004632L382329N21019j090678l93363m78786k747796
11048b582044m312531k066110K830633N672946L075683l060396o879347m704135
11040a2025301Q01952M138167L568887J475727p99374l901114o040837l324947
11032a6106840L223473O477010K818824k031234j667643J207901P4614m042662
11024a0046557m486888m87988J759249k73206k035320p04772O72427O67926L032477
11015a1902652Q265995R308785K188920n463176m664823J086862J750789k728303
11007b157603l058861K587217M685047j065907m869287J740114J0639912Q056259
10999A6556891m391355j1505059o175138K259370L306768j345209m360610m033335
$$ y = [275880, -3591067, -4779401, -1774769, 1607560, 2128579, 1037901, 644538, 165752, -2582044, -6894575, -8960685, -6130052, -457106, 2618577, -441819, -7321166, -12025301, -11223349, -7085182, -3516295, -2040568, -2839942, -6741056, -12781893, -16106840, -12883367, -6406357, -3587533, -5618767, -7286410, -6078509, -6003895, -10046557, -14533445, -15021433, -13262184, -13535390, -15570710, -16275482, -15603055, -14935129, -11902652, -3636657, 5672128, 7861048, 2397872, -2266951, -1180089, 570700, -2157603, -5216464, -2629247, 2055800, 989893, -3879394, -2139280, 8500632, 16556891, 12165536, 660477, -5514661, -3255291, 51477, -1293732, -5654342, -9687677]
10991i687677k559902N48511N780834Q466857L987589l964495p269420m326900
10983i024603o94409L43391J085655L109505M261857L285102J758859J4184l402346
10974G37195o715169n315212M46844L765479J133155j868704R15442O454006O892260
10965F445296R56747m618855m246921L98054L656238K337179j652284l817099
10957e41645k085532R02525J697807J076495J969623L251531P87042m617224o352410
10948c911788j698087L349462K846787o08239j125815R08053M03501l666373o660416
10939a0162915m768564P71130N562425N972928K363499n53648R40541L636818
10931C762214J389620m444887n502419L51237M577612J414212k898682j340328
$$ y = [-9687677, -12247579, -11699068, -5918234, 2548623, 6536212, 2571717, -4697703, -9024603, -9719012, -9375621, -8289966, -5180461, -918604, 2366498, 4125357, 4139541, 737195, -5977974, -11293186, -10846342, -7080863, -5947708, -7816412, -6900970, -446964, 6445296, 7402043, 2783188, -1463733, -1065679, 2590559, 4927738, 3275454, -541645, -2627177, -1724652, -26845, 1049650, 3019273, 6270804, 7057846, 2440622, -3911788, -5609875, -2260413, 586374, -21865, -1147680, -239627, 163874, -3502499, -10162915, -14931479, -14160349, -8597924, -2624996, -261497, -815145, 125396, 3762214, 5151834, 706947, -4795472, -4444235, 133377, 1547589, -1351093, -2691421]
10923b691421J804582m97059m493072k048687M470061N941697J926024j00436
10915D311689R33021r49258n389016m826248J412925M748720J893743k82743J855337
10906C708170K437951j687020m002253k41622L262850Q95193k110657L80053L784161
10897F426826J113783l873719k679679L293256M841001n96278o176933o369040
10889d020783k309423K787986O318567N215533q13774n698309l464435K467171
10881D82533L530289j074190l668962o94520K598899K178185J334202K611579
10873G298015J564378n018656j0724190p341412K323555P630186M814114N79949
10865A125939O37445K571658K551523J797019J963238K37753n086374q934450
$$ y = [-2691421, -886839, -1383898, -5876970, -7925657, -3455596, 2486101, 4412125, 4311689, 5244710, 4295452, -1093564, -5919812, -4506887, 241833, 2135576, 1852833, 3708170, 6146121, 4459101, 456848, 215226, 3478076, 4373269, 2262612, 2642665, 6426826, 7540609, 3666890, 987211, 4280467, 9121468, 8525190, 2348257, -4020783, -6330206, -3542220, 2776347, 7991880, 7178106, 1479797, -1984638, 482533, 4012822, 2938632, -730330, -1424850, 1174049, 3352234, 4686436, 7298015, 8862393, 3843737, -6880453, -14221865, -11898310, -4268124, 545990, 1125939, 1763384, 4335042, 6886565, 8683584, 10646822, 10884575, 5798201, -3136249]
10857c136249o178435m30944J431701N36500K784680O351953L613997l933179
10849A040024n307189J654919M684899k970889r668759l570244P129293O810477
10841a97469k422471n210449J306312M464493p67456l756907J913658O924083
10833B253794K783107l626325k436209K641921J636976m775659p139940k316215
10825a0978550L264450M031604J141758j677173k339428o04507J942737K593828
10817b625281O40812j579244k188970j785639r82454M54834J216196k34452j353303
10808h437501J615911N780664M128960k497728m959628m43763K551811j050365
10800c311639l904410L57414N035701J944592l675981j875895N096333P426270
$$ y = [-3136249, -9314684, -9745628, -8313927, -7777427, -4992747, 1359206, 4973203, 1040024, -4267165, -2612246, 2072653, -898236, -10566995, -14137239, -7007946, -197469, -2619940, -7830389, -6524077, -2059584, -2827040, -6583947, -4670289, 2253794, 5036901, 1410576, -1025633, 1616288, 3253264, -1522395, -8662335, -10978550, -7714100, -3682496, -2540738, -4217911, -6557339, -7161846, -5219109, -2625281, -1984469, -3563713, -5752683, -7538322, -8520776, -8065942, -6849746, -7084198, -8437501, -6821590, -1040926, 3088034, 590306, -4369322, -4813085, -2261274, -3311639, -7216049, -6858635, -1822934, 121658, -3554323, -5430218, -333885, 7092385]
10792G092385M242058K206785J330810l703812r896891q192962R8831L147374
10784c675422k798598p680586m071913K783631N872009N987355N199644J652793
10776C268913k993504j469192O402211Q867275j019013j2681760j2366882k860296
10768a4852248K665144R33288k12224K009185J559158l145652m672855P68262
10760a4947942O001898L638893l141296o214830l511432J055621M451087N897002
10752f770999M450541M75541k381041j322686J006117L98771j977662j427929
10744g549347K322372M401827K388126o45463k003686l041937m451290k977827
10736a1557225K832731P467734M700874k724238n504081j00182O540361O323921
$$ y = [7092385, 11334443, 13541228, 14872038, 11168226, 1271335, -6921627, -6822796, -3675422, -6474020, -14154606, -18226519, -15442888, -9570879, -3583524, 1616120, 3268913, 275409, -1193783, 5208428, 14075703, 13056690, 374930, -11991952, -14852248, -12187104, -11253816, -11466040, -9456855, -7897697, -11043349, -15716204, -14947942, -8946044, -5307151, -8448447, -14663277, -18174709, -17119088, -12668001, -6770999, -2320458, -1844917, -4225958, -5548644, -4542527, -4143756, -6121418, -7549347, -5226975, -825148, 1562978, 917515, -1086171, -4128108, -8579398, -11557225, -8724494, -1256760, 3444114, 719876, -4784205, -4884387, 1655974, 7979895]
10728G979895o1566n418003n584385l209793k628695l990232l699208M75633O158845
10719i977509Q549440N296682j212131o004399n542547n08803M321808L991204
10711a086255j138988m875442k524975K712602M289579J750169J56407P22658
10703E755n84912l819000l083852K413845M393045j057117m992241K08300O335268
10694a80909J633426q174553o747438O428272J3021468K875104j0847985j0999989
10686a2992604O04690Q941605O622533o14358m782074l505408J205741N722118
10678A202243O552123K825929l040546p785987q896270m977291J739559M952580
10670g427660J808749j141183L120697R381790O685789l284497p048497m36657
$$ y = [7979895, 7918329, 2500326, -3084059, -6293852, -8922547, -12912779, -16611987, -16136354, -9977509, -1428069, 3868613, 2656482, -3347917, -8890464, -9399267, -5077459, -1086255, -2225243, -7100685, -9625660, -6913058, -2623479, -873310, -716903, 5755, -579157, -4398157, -7482009, -5068164, -675119, -1732236, -6724477, -6516177, -180909, 1452517, -6722036, -13469474, -7041202, 5980266, 8855370, -1992615, -12992604, -12387914, -3446309, 3176224, 2561866, -2220208, -5725616, -4519875, 1202243, 7754366, 10580295, 7539749, -246238, -9142508, -14119799, -12380240, -7427660, -5618911, -6760094, -3639397, 5742393, 12428182, 9143685, 2095188, 1658531]
10662A658531N100095K011714k020889j16434P36743o003600j1663541o136420
10654a6433801L486338L940307j969921j425763M786786L524858o288350r305029
10646a9684575J671057J3005236J0261078j412468o825039k449603J865837r09744
10638d478221o297116o043477J174751Q649125R231831K875312l553769m013023
10630b454587L46174L649809K606886o75739k114180P1331L764436M635372Q66084
10621A0695586l567512l366352K8724k00065n192357p075418p75681O909920O301487
10612C758332j488019o773993m427854J764926N986899N623391J108219l935534
10604A616367l805169K775594Q691205O221796k465425p839691n092703J333052
$$ y = [1658531, 6758626, 8770340, 6749451, 6633017, 7369760, 1366160, -10297381, -16433801, -12947463, -9007156, -10977077, -12402840, -7616054, -4091196, -10379546, -19684575, -18013518, -5008282, 5252796, 3840328, -2984711, -5434314, -3568477, -4478221, -10775337, -16818814, -15644063, -6994938, 2236893, 5112205, 1558436, -2454587, -2108413, 1541396, 4148282, 3472543, 1358363, 1429694, 5194130, 9829502, 10695586, 7128074, 3761722, 3790446, 3590381, -1601976, -8677394, -9453075, -2543155, 3758332, 2270313, -4503680, -8931534, -7166608, -1179709, 4443682, 5551901, 1616367, -2188802, 586792, 9277997, 15499793, 13034368, 5194677, 101974, 1435026]
10596A435026M713653K812525k167728o313096o475747k909897P86912K103031
10588f015321K383403L414721L923458K116241p60236k192364j819278j133784
10580h3160j738855m635077q400809q399307k209823M931357O211739L673522
10572a0650413M237385O222465J398734q172422r214913J857087J1010644P410120
10564D098687r93506k576110k04545k027732n062139k135199L124582K602522
10556c173440j425071j516890M91859j849654n295015j593356O490051P752708
10548a18808J70387o233654m302436K214511N745641K927636l517273o378358
10540i492354r32374O762658N719903k993136o199931J52986M290287K03679j283583
$$ y = [1435026, 6148679, 8961204, 6793476, 480380, -5995367, -8905264, -8118352, -6015321, -3631918, -217197, 3706261, 5822502, 5062266, 2869902, 1050624, -83160, -1822015, -6457092, -14857901, -23257208, -25467031, -20535674, -14323935, -10650413, -6413028, -190563, 1208171, -6964251, -16179164, -14322077, -3311433, 4098687, 3105181, 529071, 324526, -1703206, -6765345, -8900544, -5775962, -3173440, -4598511, -6115401, -5623542, -7473196, -12768211, -14361567, -7871516, -118808, 51579, -6182075, -10484511, -8270000, -2524359, 403277, -3113996, -9492354, -10424728, -3662070, 2057833, -935303, -7135234, -6982248, -2691961, -2488282, -3771865]
10531c771865O076801R893895J241049p413108m173800L29306o355014j3347280
10523a7520016n852993O298150N710367j449901Q50244P235461L004114n003403
10515f727977j130720O827237J206442j0134719o891201M941887M193513m884692
10507a2600230k358532O030456j71881j1932691m020526J3959584J0242560r992122
10499a0843382j2665265J374401O89589j0519762P28133K1466285N093010l2432294
10491c7109285k3485167J9691440m799657j11482672j55156665l1470154J43431948
10484b00380212J77583352O5902676k7485157j6801498K0137232P638352j7561691
10477I033054m581336J6850783L644813j9978394j3661760O237554M291969q797850
$$ y = [-3771865, 2304936, 12198831, 13439880, 6026772, 1852972, 2182278, -4172736, -17520016, -23373009, -17074859, -11364492, -12814393, -11964149, -4728688, -1724574, -6727977, -7858697, -1031460, 174982, -9959737, -16850938, -11909051, -7715538, -12600230, -14958762, -8928306, -9100187, -21032878, -25053404, -11093820, -851260, -10843382, -23508647, -22134246, -21444657, -31964419, -31236286, -9770001, -4676991, -37109285, -60594452, -40903012, -45702669, -157185341, -312342006, -343812160, -200380212, -22796860, 43105816, 15620659, -1180839, 18956393, 26594745, 9033054, 4451718, 21302501, 24947314, 4968920, -8692840, -2455286, 1836683, -6961167]
10469f961167l156944J2962631J2276061j524162n937209p55933p7704j684820
10461E140753L415209P746972J712209n304233k627980O68444m742137p369823
10453a360586L144514J2607662N488366o833310o126886J569509L66651n776757
10445C079163l741923K158807m4963n459770k231449M667802L133595k713810
10437a152548j757396J644805k487513p271977l92668J0485501Q415196l271219
10429D212181o589536P84774M933260K016049J333099L691526J4582p979280p672111
10420e255456J807615O945818K594514j409645L48544P65830l967667o730996
10412d901443l046510J557275K601273K819362L496267J468233j903171m16905
$$ y = [-6961167, -10118111, 2844520, 15120581, 13596419, 7659210, 6903277, 6825573, 5140753, 8555962, 16302934, 18015143, 12710910, 10082930, 10751374, 6009237, -1360586, 1783928, 14391590, 19879956, 13046646, 6919760, 8489269, 8855920, 3079163, -662760, 1496047, 1451084, -4008686, -6240135, -1572333, 1561262, -1152548, -2909944, -1265139, -3752652, -11024629, -11417297, -931796, 7483400, 4212181, -2377355, -1592581, 3340679, 5356728, 6689827, 10381353, 10395935, 2416655, -5255456, -3447841, 3497977, 6092491, 4682846, 5031390, 5797220, 1829553, -4901443, -7947953, -6390678, -3789405, -970043, 2526224, 3994457, 2091286, 1674381]
10404A674381M960709N192502k010540p402675m540307J064484J864464j221312
10396d18294k931684j373401K239911N953952O838454L473812n99020j154108
10388A2029622q9644j633431l788177j862617J320611j103795o984740o870452
10380h982623P8808L697962m51023l614064J221414P322017N161986k283258m360227
10371b209008J355232O543758M374184k399545o392594m520264l22566J130807
10363b439996q28118k588519k088271j742376l520582m221363L3142O451838Q010483
10354b933762L002037k727790l685554o42432K235827K466613L55172k057933
10346c987822k307325K451J933998O14403k712583m543000m010976k830164j348766
$$ y = [1674381, 6635090, 11827592, 9817052, 2414377, -2125930, -1061446, 803018, -418294, -3349978, -4723379, -2483468, 3470484, 10308938, 13782750, 13183730, 12029622, 11939978, 10306547, 6518370, 4655753, 5976364, 4872569, -2112171, -8982623, -8903815, -5205853, -5656876, -9270940, -8049526, -727509, 4434477, 2151219, -2209008, -853776, 5689982, 10064166, 7664621, 1272027, -3248237, -3570803, -2439996, -3268114, -5856633, -7944904, -9687280, -13207862, -17429225, -17396083, -10944245, -2933762, 68275, -2659515, -6345069, -6987501, -4751674, -2285061, -1929889, -3987822, -6295147, -6292696, -4358698, -3744295, -6456878, -10999878, -15010854, -17841018, -19189784]
10337a9189784J526451M736556N245884K359211j205311l041241l126543j880065
10329a4574842R05039M246218N577302L754739J141871J156881L930198N527365
10321A1664771K377002l893410p773837o489561k681162R37535N425602J0227514
10313I794454Q763728k919618j5850363j6335698m547293N315138N185355K290946
10305h303351L996550N311631l62340p702901p215287k64787L948851K350466
10297h241168m42017j345476r01387J249874M857678N527348N77977m219993k001253
10288d938417L639344L483939k604218n502288j283365L627268L419370P23160
10280E64793N46085K753143L811046J895164j834075m324330k828136J349643
$$ y = [-19189784, -17663333, -12926777, -7680893, -5321682, -6526993, -9568234, -12694777, -14574842, -13669803, -9423585, -3846283, -91544, 1050327, 2207208, 6137406, 11664771, 14041773, 10148363, 2374526, -4115035, -6796197, -5858662, -433060, 9794454, 18558182, 15638564, -211799, -16547497, -21094790, -15779652, -10594297, -8303351, -4306801, 1004830, 642490, -7060411, -14275698, -14540485, -10591634, -8241168, -8683185, -10028661, -10930048, -9680174, -4822496, 704852, 1282829, -2937164, -4938417, -1299073, 2184866, -419352, -5921640, -7205005, -3577737, -158367, 564793, 1110878, 3864021, 7675067, 9570231, 7736156, 3411826, 583690, 1933333]
10272A933333K831310o51062l762746j154869L600346L405437n51182q51229L027841
10263G827179L083029l703614q998289m967511L852712O563635M74396o230407
10255b098870n931812q00296J750346J00647J32808M844800P785644K370178o148320
10246B005125o760486M79345M323435M34827k374022J479409M329408l30785n224367
10237a638111k071690L192188J090224l933431j534403N476342O172144J326473
10229H079736J239576N755729M010083n092202r380734l809187J624281l86613
10221B040669l383754p15462K610494j06648n557466o837140l844478m83312J936794
10212a4340303L110579J764448n62390N45K559734J944608j703254k391307N49582
$$ y = [1933333, 4764643, 4113581, 350835, -804034, 2796312, 6201749, 5650567, 4799338, 7827179, 10910208, 7206594, -1791695, -6759206, -2906494, 3657141, 4131537, -2098870, -8030682, -8830978, -7080632, -6979985, -6847177, -2002377, 5783267, 8153445, 2005125, -4755361, -4276016, 47419, 482246, -1891776, -412367, 3917041, 3586256, -1638111, -3709801, -517613, 572611, -3360820, -4895223, 581119, 6753263, 8079736, 9319312, 15075041, 19085124, 13992922, 4612188, 803001, 2427282, 2040669, -1343085, -2058547, 551947, 445299, -5112167, -11949307, -15793785, -16277097, -14340303, -11229724, -9465276, -10027666, -10027121, -7467387, -5522779, -7226033, -9617340, -9067758]
10203i067758O82224l204933l875159J112164M292379J785058L25618M190000
10195c760407O686056K768998j078160J001458K834138k249206q090798n873909
10187g761830N51218J957542o29351l64110J419684j027706m894717l075884K187919
10178a1637235L154032Q72924K077791M676223J198261m909513k688437O001955
10170a253999O626876l929404j0413235l291601O099573M701095j800472r13826
10162d174993M829682L650991l879068n315414K657039Q495871L858224m721719
10154E400613p231892l766643l55749J541702L830233M779296J376677l342698
10146B231539l145005J168285J753654m076199q484142m126749M819379Q467246
$$ y = [-9067758, -8385534, -11590467, -15465626, -14353462, -10061083, -8276025, -7950407, -3760407, 2925649, 5694647, 4616487, 5617945, 8452083, 6202877, -1887921, -7761830, -7210612, -5253070, -5882421, -6246531, -4826847, -5854553, -10749270, -13825154, -11637235, -8483203, -7610279, -5532488, -856265, 341996, -4567517, -7255954, -1253999, 5372877, 1443473, -8969762, -12261363, -6161790, -1460695, -3261167, -4174993, 654689, 4305680, 426612, -4888802, -2231763, 6264108, 10122332, 5400613, -1831279, -5597922, -5953671, -4411969, -581736, 4197560, 5574237, 2231539, -913466, 254819, 2008473, -2067726, -10551868, -14678617, -9859238, -1391992]
10138a391992M676916J00440p36206l49808j592507k606518j185744Q68052J177519
10129a039848Q01648J324784J154075j334244l482038j782257J680886J240954
10121a436040l415384n144956R63605R026256Q454920j388173q202708k437019
10113c579499Q200827P793442m773615j2182876k900460J0995236J0423341l210023
10105A0766373j1080450n063775K878536J968401k179919r75470J736653j360846
10097c310497o310149m652632J247146K435074p07238L83195O533294Q688218
10089D306411L235462j944666n11095K891380J548139k463430k595346J934485
10081F401340O137820O454218L163091k004531o397520o591038k229418J598547
$$ y = [-1391992, 3284924, 3385364, 2649158, 2299350, 706843, -1899675, -3085419, -2217367, -1039848, -238200, 1086584, 2240659, 906415, -2575623, -4357880, -2676994, -1436040, -4851424, -9996380, -9032775, -6519, 8448401, 7060228, -1142480, -3579499, 4621328, 12414770, 7641155, -4541721, -7442181, 3553055, 13976396, 10766373, -314077, -5377852, -2499316, -530915, -2710834, -3686304, -1949651, -3310497, -9620646, -14273278, -13026132, -10591058, -11298296, -10915101, -4381807, 4306411, 7541873, 5597207, 5086112, 7977492, 9525631, 7062201, 4466855, 6401340, 12539160, 18993378, 22156469, 20151938, 13754418, 7163380, 4933962, 6532509]
10073F532509q6110m967174n996208j254225L134939J571234l413929n235106
10065i714070k234700J562674L304963L977535M029266J779870j791115k030031
10057a115608J982952M114583M46439l077376L45572N714040K516061p734356
10049C192307j1672114l793444N162059M518656j463603k299924K763211O023326
10041B430474L657198j219212m733305m949498j259434L322848K743892l652789
10033c659826p404759j891831P257196R753455M493578j881609n938427p855078
10025g127301m914061M201335J0870335M926757q110100j1190072L4021J0018747
10017a290339O121588l466886l811927M069841O644143o17322p513678n243831
$$ y = [6532509, 6446399, 1479225, -4516983, -5771208, -2636269, -1065035, -4478964, -9714070, -11948770, -10386096, -7081133, -3103598, 925668, 2705538, 914423, -1115608, 867344, 4981927, 5428366, 2350990, 2696562, 8410602, 10926663, 3192307, -8479807, -12273251, -7111192, -2592536, -4056139, -6356063, -3592852, 2430474, 6087672, 4868460, 135155, -4814343, -6073777, -2750929, -7037, -3659826, -11064585, -12956416, -5699220, 4054235, 8547813, 6666204, 727777, -7127301, -12041362, -7840027, 3030308, 7957065, -153035, -11343107, -11309086, -1290339, 4831249, 1364363, -2447564, 1622277, 8266420, 7649098, 135420, -5108411]
10009e108411J808504M082783Q3976l517499k195680R77591O91495l028235n173435
10000a1378911k884305Q14556J641192j41383j076991P1478J479541K013951K474911
9991f985961L090873K788598J429740L56550K77099N57023O93956O95026K50019
9982C152923o71796r54672J10526J302060J417437J381022K052853J643557j483869
9973G950041m787086m085043L61494L776421K846573j063816m490756n102385
9965d594557k646657J034004L193103K902753J691206O17212r79005k623222k019287
9956c424450P61655K173059O72805r40992j196194k566226n134350m132070J520378
9947a2266385N276434L514847K308705O035446P546376p8458r535342r333756
$$ y = [-5108411, -3299907, 782876, 866852, -2650647, -4846327, -3868736, -3177241, -6205476, -11378911, -14263216, -13448660, -11807468, -11948851, -13025842, -12954364, -11474823, -9460872, -6985961, -3895088, -1106490, 323250, 679800, 956899, 1513922, 2207878, 2902904, 3152923, 2481127, 1526455, 1636981, 2939041, 4356478, 5737500, 7790353, 9433910, 7950041, 3162955, -922088, -560594, 3215827, 6062400, 4998584, 507828, -4594557, -7241214, -6207210, -3014107, -111354, 1579852, 2197064, 1218059, -1405163, -3424450, -2662795, -489736, 183069, -757923, -1954117, -4520343, -9654693, -13786763, -12266385, -6989951, -3475104, -1166399, 4869047, 12415423, 12336965, 2801623, -6532133]
9939f532133j694244K759084K601243L353518K832305m322079j0930972m928173
9931a6861451Q191912J0273203p60579p333993j091624N378097K154529l025238
9923c075144k428283j690757m543493k378265Q151061J3876173N552978n569208
9915G895062o108508j182186j591850m205123j450901K161270j69334k738388
9907g389958J063139L969103j292893n562159P99152P918521K965591n294501
9899b824005j374855Q337144O754476l343063o092545j721492j413549j123246
9891b801135Q992292J6670476M410819j1324298L54892K5820012J5989077l3992394
9883B4119741o4048728l3326683J9282978L3752576J1629516k163100O400559
$$ y = [-6532133, -8226377, -5467293, -2866050, 487468, 3319773, -1002306, -11933278, -16861451, -8669539, 1603664, 843085, -6490908, -7582532, -2204435, -49906, -3075144, -5503427, -7194184, -11737677, -14115942, -5964881, 7911292, 13464270, 7895062, 1786554, 604368, -987482, -5192605, -6643506, -4482236, -4651570, -7389958, -6326819, -2357716, -3650609, -9212768, -8413616, -495095, 2470496, -2824005, -4198860, 4138284, 10892760, 7549697, 1457152, -264340, -1677889, -2801135, 6191157, 22861633, 27272452, 15948154, 16303046, 42123058, 58112135, 24119741, -39928987, -73255670, -53972692, -20220116, -8590600, -10753700, -4353141]
9876d353141J2036487K972960l876953N13598L958568M65507l45497L562530J185328
9867A6119387q121444j0307101j891231L078879j876595n205114j60739K420155
9859e943803n073796j1391601m511859Q427633J2374005N608569j920870m087771
9851f519493k182419J535321N186491N689561K096942k083457l368084j878621
9843a523759J027138M067744M296021j69999n278497n421239k466366k594639
9835h063596m605584j322545O556648R375840M160893j94401J894223L650436
9827A1451914j227632p046579o023853j276891l77546k324505q72218L357080
9819d340230L799474q84103m884338m151598p68278J759584K589156K466812K114421
$$ y = [-4353141, 7683346, 10656306, 6779353, 7292951, 11251519, 11717026, 11371529, 14934059, 16119387, 7997943, -2309158, -4200389, -1121510, -2998105, -8203219, -8363958, -5943803, -11017599, -22409200, -26921059, -18493426, -6119421, -510852, -2431722, -6519493, -8701912, -7166591, -1980100, 3709461, 5806403, 3722946, 354862, -1523759, -496621, 3571123, 7867144, 7697145, 2418648, -3002591, -5468957, -8063596, -12669180, -13991725, -7435077, 1940763, 6101656, 5907255, 7801478, 11451914, 10224282, 3177703, -2846150, -4123041, -4500587, -6825092, -7697310, -4340230, -540756, -1424859, -6309197, -10460795, -11229073, -9469489, -6880333, -4413521, -2299100]
9810b299100K107955K291448J500704r64317m214589o331555n069184N91765P077429
9801e309444O961969j848599r833301o106841N721803J0727178K947014o972020
9793c712241p721984j461756L473340N248242O247425M938603q99537o700576
9785e88484n497165J749706P142785O405495K672501L8162j546039l951348o712353
9776b86740o813895k319057M020331O382509K995283p64588j09405J579772q27927
9767C856283l752618n57110M503913Q98857q821282r297105L264192J2539893
9759B635023O687465l352234k799782K743613j427482j2741968j4960169m160324
9751b7375858O688087Q605002O104106M472390K073749j515959k085582P61115
$$ y = [-2299100, -191145, 2100303, 3601007, 2636690, -1577899, -7909454, -12978638, -12386873, -5309444, 1652525, -196074, -10029375, -16136216, -10414413, 312765, 3259779, -3712241, -11434225, -12895981, -9422641, -4174399, 2073026, 7011629, 6112092, -588484, -6085649, -4335943, 2806842, 9212337, 11884838, 11923000, 10376961, 6425613, -286740, -7100635, -9419692, -5399361, 983148, 3978431, 3213843, 3104438, 4684210, 3856283, 103665, -453445, 4050468, 4949325, -3871957, -13169062, -9904870, 2635023, 9322488, 5970254, 3170472, 5914085, 4486603, -8255365, -23215534, -27375858, -20687771, -12082769, -5978663, -1506273, 567476, -948483, -3034065, -2272950]
9743b272950K004477P98466J698936M181809J827582m927884o524251M24509O212910
9734C423604K755122m233456n258702j291500M96002o93481N5010L385011M455988
9725C093598Q09065m395209o763930m546485R80859O008641O282217J345177m265061
9716a451128n829974l266165j9514J268903J052325K069553O124793J0335234
9708A0284027Q468778r00683r952138j0226215l706621Q35083Q08369J146845
9700c242555L291660K552749j614833k577100K115291N399588K151204k464668
9692E611336k571532j456022l862388n638366q51517O096216O188064M23257k064366
9683A874682R62619K467599q96397l869428k794629j287338k165587k124333Q51361
$$ y = [-2272950, -268473, 529993, 2228929, 6410738, 8238320, 3310436, -3213815, -2789306, 3423604, 6178726, 1945270, -3313432, -4604932, -4108930, -4802411, -4747401, -1362390, 3093598, 3902663, -492546, -7256476, -11802961, -10822102, -4813461, 1468756, 2813933, -1451128, -7281102, -10547267, -10566781, -9297878, -8245553, -6176000, -51207, 10284027, 18752805, 17852122, 7899984, -2326231, -6032852, -5197769, -4389400, -3242555, 49105, 2601854, 987021, -1590079, 525212, 5924800, 8076004, 5611336, 3039804, 1583782, -2278606, -7916972, -8768489, -2672273, 3515791, 3939048, 1874682, 2837301, 5304900, 4408503, 539075, -2255554, -3542892, -5708479, -7832812, -6981451]
9674f981451K081633j944853o099541l635947L326399P091388N601344L542358
9666B981330L320911J802186k950407p448645p735009m583937j213204J161573
9658a4665202K838309L087198J139964j501424k420156j446706m27235k64301
9650a3659553k5009J219975L122017M390904L565845M94878k041297k93591M888840
9641A663009P022093J991019n134216o158877j339931J179904k199977n397827
9633h374803k433376L610880N514226J546147m017278o812984n070569O84952
9625a5352805O854922Q205763L623729j679008k497978L71318K908889L285905
9617E720735J758811j062028k850331p67333K793189R97471o741390j1067255
$$ y = [-6981451, -4899818, -6844671, -12944212, -16580159, -13253760, -6162372, -561028, 2981330, 6302241, 8104427, 5154020, -2294625, -10029634, -14613571, -15826775, -14665202, -11826893, -8739695, -7599731, -9101155, -11521311, -12968017, -13395252, -13659553, -13684562, -12464587, -9342570, -4951666, -1385821, -890943, -2932240, -3225831, 1663009, 8685102, 10676121, 5541905, -616972, -1956903, -776999, -2976976, -8374803, -10808179, -7197299, -1683073, -136926, -4154204, -10967188, -16037757, -15352805, -8497883, -292120, 3331609, 1652601, -845377, -474059, 2434830, 5720735, 7479546, 6417518, 3567187, 2799854, 5593043, 6590514, -150876, -11218131]
9609a1218131n551441K933522M290477J2838j269914J421359J650288j842998
9601i574000l418751p91469K469224M353763N558774M145408j659365o302822
9593e219238k689833N345198P117163J671649j339821J705021L421577l57704
9585I654012l985689l639142l344024m509436j721435M975421N951275k114144
9577A266838p928224k494230O255961O299579j43108k596661O38973L111213K415083
9568F825424Q66251j535878m836219m324912K156836O754498J873349o304638
9560A474711n813549K654835O997395K034478m673503n622903k016115J558461
9552c406190K783892P57989l725856o549048m564755o16956J002862J312976K600547
$$ y = [-11218131, -16769572, -13836050, -9545573, -9532735, -10802649, -9381290, -7731002, -9574000, -12992751, -13784220, -11314996, -6961233, -1402459, 2742949, 1083584, -5219238, -7909071, -2563873, 4553290, 6224939, 4885118, 6590139, 10011716, 9654012, 5668323, 2029181, -1314843, -5824279, -7545714, -2570293, 3380982, 1266838, -6661386, -9155616, -2899655, 3399924, 3256816, 660155, 1299128, 4410341, 6825424, 7691675, 6155797, 1319578, -3005334, -848498, 5906000, 7779349, 1474711, -4338838, -1684003, 5313392, 7347870, 2674367, -2948536, -4964651, -3406190, -622298, 135691, -3590165, -10139213, -14703968, -15320924, -14318062, -13005086, -10404539]
9543a0404539J897298l001607n305389K022473J2114436J1397814L24015o356698
9535B687803j791847L762682L94314o830495p567474j235973N125809P263569
9527A808388N213643p9030n448332n378214J072561O792566M886853k736963q878556
9518b747084r541046n279333J800948P945460Q315374K646676k282800n72555
9510B85640M668260N978304K422271n2617J065112N19367n883109j2828621j1269594
9501a5094987j328554O483330M911782m07090K85467O360307Q422123K997737
9493A2630115l262117n243589n680739o258101k579125N453298Q154780N27003
9485C741525o529302j668106P410790M926266p010937j0776766j256977O584722
$$ y = [-10404539, -8507241, -11508848, -16814237, -14791764, -2677328, 8720486, 9044501, 2687803, 895956, 4658638, 5052952, -1777543, -9345017, -10580990, -5455181, 1808388, 7022031, 6943001, 1494669, -3883545, -2810984, 3981582, 8868435, 6131472, -2747084, -12288130, -17567463, -15766515, -7821055, 494319, 3140995, 858195, 285640, 4953900, 10932204, 13354475, 13301858, 14366970, 14886337, 9003228, -3825393, -15094987, -16423541, -9940211, -5028429, -5435519, -5150052, 1210255, 9632378, 12630115, 9367998, 4124409, -1556330, -7814431, -10393556, -4940258, 3214522, 3741525, -2787777, -4455883, 2954907, 7881173, 870236, -9906530, -11163507, -4578785]
9477d578785K355057m484228k155791M861726N706779R50429j265991L88361J296368
9468C073925J176419K821139L782977n90429p303673q081030j713464L757984
9460c076152K474137j951457k822807M91289K874401J044188j970420j022548
9452c959369L296976M205938j423398o363083k150258P118509Q664330m73609
9444H916036q298664n117186K976342M357908j562026o089057m772192r83999
9436a0572838J353069J465321k16522j915337k24440M966607P750540L695251
9428F301651k755439m253732j186945K64689j491748k293699l46562J682671K476561
9419a602553L195062K719165j373465o379229n917856M86363N568729M279119
$$ y = [-4578785, -2223728, -6707956, -8863747, -4002021, 1704758, 2655187, 1389196, 1777557, 3073925, 4250344, 7071483, 10854460, 10264031, 2960358, -5120672, -6834136, -3076152, -602015, -2553472, -5376279, -4884990, -2010589, -966401, -2936821, -3959369, -662393, 3543545, 2120147, -4242936, -6393194, 725315, 9389645, 8916036, 617372, -4499814, -1523472, 2834436, 1272410, -4816647, -9588839, -10572838, -9219769, -7754448, -7970970, -9886307, -10110747, -5144140, 2606400, 6301651, 3546212, -707520, -1894465, -1629776, -3121524, -5415223, -5761785, -4079114, -1602553, 1592509, 4311674, 2938209, -3441020, -9358876, -8872513, -3303784, 975335]
9411I75335j79530k656676k661307j591179J068592M585836M750418j32277m496699
9402c37487k244352L980079N849466P80349n225234o523909m262249j965933M79533
9393i469737M575123P955685O414334P01612l293765k365184j14900r11735l078340
9384D13093j976819K115274M087133J826695r24441j045318q41106l228884n595971
9375e170344l100503L247882O665895L544473j659932k739407j03906P46631j917080
9366d86291l217000N36907N014315L208952l882869p435617k763805M138604N210580
9357C23776J108049j423887k7892J282521k77498k401891k334770r00575k80752
9348d932919q41988j586218j676174p51859P58932J675433J556785J106520J18455
$$ y = [975335, 795805, -1860871, -4522178, -6113357, -5044765, -458929, 4291489, 4159212, -337487, -2581839, 1398240, 7247706, 8028055, 2802821, -3721088, -7983337, -9949270, -9469737, -4894614, 3061071, 9475405, 10177017, 6883252, 4518068, 4403168, 3491433, 413093, -1563726, 551548, 4638681, 6465376, 5540935, 4495617, 3654511, 425627, -5170344, -8270847, -5022965, 1642930, 5187403, 3527471, 788064, 684158, 1430789, -486291, -3703291, -3166384, 1847931, 5056883, 1174014, -6261603, -9025408, -4886804, 323776, 1431825, 7938, -19954, 1262567, 985069, -1416822, -3751592, -4652167, -4932919, -5774907, -7361125, -9037299, -9789158, -9030226, -7354793, -5798008, -4691488, -4573033]
9339d573033k376969m359054j502750N141616P386643J198537n582566m196290
9331h863866J465809J809005k309312k364686J521294J053476l545176k506736
9323a3740192N049893P249608k65304n418627L78469P478274M240703m182031
9315G90793o096935k229027p26666j381815R80325L833197J926906m47769L340793
9306a0198P488396J744001r012059r781312P30460P913266M367648r00191n2822
9297B487189J977851o55253m295571m127114k324117j551469K19598K976462K275061
9288c017363j268728k89989N776311O466605k815966j0580787n851426M463133
9280g118210O542352O81749j692834K451537M651841K77825n058724n744407l168035
$$ y = [-4573033, -6950002, -11309056, -12811806, -7670190, -283547, 914990, -4667576, -8863866, -7398057, -5589052, -7898364, -10263050, -8741756, -7688280, -11233456, -13740192, -8690299, -1440691, -1705995, -7124622, -6746153, 732121, 4972824, 790793, -5306142, -7535169, -8261835, -9643650, -8663325, -4830128, -2903222, -3350991, -10198, 7478198, 9222199, 210140, -9571172, -8840712, -927446, 3440202, 2540011, 2487189, 4465040, 3809787, -485784, -4612898, -6937015, -8488484, -8268886, -5292424, -3017363, -4286091, -4576080, 1200231, 7666836, 4850870, -5729917, -11581343, -7118210, -575858, 105891, -1586943, 864594, 5516435, 5794260, 735536, -5008871, -8176906]
9271h176906m58650J854905K781222L88434l197767k399959L430983P485214M548546
9262F256022j706458m139371j730648L15295j409993m358308m364749j270113
9254a2408323J668497K624592K839577L261061K585848M63266l73386J374204
9246B035336J593231l423740q788578n674023N169225J2008981P232760k780534
9238G372658p220219m465482o70815N81158P65812J258274J620491J775686J631813
9229B649376J55385j936368j521327J327248J191175m384649q848535n319883
9221a6687578K546564N923011L898991K569883L160635R04822m308102o056901
9213h048675j974291K554904L557372L054595K229717j085215n007677l254775
$$ y = [-8176906, -8635556, -6780651, -3999429, -3610995, -6808762, -9208721, -5777738, 1707476, 6256022, 4549564, 410193, -1320455, -1005160, -2415153, -6773461, -11138210, -12408323, -10739826, -8115234, -5275657, -2014596, 571252, 1034518, 661132, 2035336, 3628567, 204827, -8583751, -14257774, -9088549, 2920432, 10153192, 7372658, 152439, -4313043, -4983858, -4402700, -3636888, -2378614, -758123, 1017563, 2649376, 2804761, 868393, -652934, 674314, 1865489, -2519160, -11367695, -16687578, -14141014, -8218003, -4319012, -1749129, 1411506, 2316328, -1991774, -8048675, -10022966, -7468062, -3910690, -856095, 1373622, 288407, -4719270, -7974045]
9205g974045L238086M270763l534925q555033j278914R275873Q335082j799597
9197A977290n843751L65279M896899J99402n660373l488499K834198M245473L69647
9188a04435k694893k885297k456520j316912K243354N854648M945751M8764l446028
9179A88432l171195k332384l263981l140762J127001O741767P515693K084885
9171E749456l550786l278506J283594L255158M13583j766293Q63239L741046M17141
9162G127632o401601p816301j976661L348209K627983n67511j217510j44400J78084
9153d842076N45041J360635K04144k530507k137848J562300J695574l362803m377876
9144a1883416L269055Q225322o813j1205210p894597O311610J0806967k47431
$$ y = [-7974045, -4735959, -465196, -4000121, -12555154, -13834068, -4558195, 3776887, 1977290, -3866461, -3501182, 1395717, 1595119, -4065254, -7553753, -4719555, -474082, -104435, -2799328, -5684625, -8141145, -9458057, -7214703, -1360055, 3585696, 3634460, 188432, -2982763, -5315147, -8579128, -11719890, -10592889, -3851122, 3664571, 5749456, 2198670, -1079836, 203758, 3458916, 3872499, 2106206, 2969445, 6710491, 7127632, 726031, -7090270, -9066931, -5718722, -3090739, -3658250, -4875760, -5020160, -4842076, -4297035, -2936400, -2732256, -5262763, -7400611, -5838311, -4142737, -7505540, -11883416, -8614361, -389039, -395852, -11601062, -19495659, -13184049, -2377082, -2624513]
9136b624513r979056o225593K252405M428946M199191P973988J0119164M101001
9128A4245533l455521l570038l77475k181831n480881k523022K246823p17846
9120a814258p241896m460952P090483J2794403O249693k772460n210795l715243
9112I18975k888948j188432K195840L152822Q01311M61043L543113L692600j771767
9103H916557n727966k584370K827082M232945L566453M316427L165848k963051
9095A5749925q254211o258864j668700l273288q631595p109079K715511R788552
9087f941749O541381j309499m375297j525931K047212L049364J846371j52157
9079h20305j014865Q87908L588497K257256l544058o859769k129635N741669O891868
$$ y = [-2624513, -12603569, -18829162, -16576757, -12147811, -7948620, 25368, 10144532, 14245533, 10790012, 7219974, 6842499, 4660668, -820213, -3343235, -1096412, -1814258, -9056154, -13517106, -6426623, 6367780, 12617473, 9845013, 4634218, 918975, -1969973, -3158405, -962565, 2190257, 2991568, 3452611, 6995724, 10688324, 8916557, 3188591, 604221, 3431303, 7664248, 11230701, 15547128, 18712976, 15749925, 7495714, 1236850, -431850, -3705138, -12336733, -19445812, -16730301, -6941749, -400368, -1709867, -6085164, -7611095, -5563883, -2514519, -668148, -820305, -1835170, -947262, 2641235, 4898491, 1354433, -5505336, -7634971, -1893302, 4998566]
9070D998566N696o082173n101691j052462j06836r55333J023200M162031K606563
9061e02439l267234o000421j630881N114888P899329N501947q0295o141559p772316
9052f878981r21597R344850J0899903K78330j0493210r524642r36900L300158
9044d932089J338052N43224K745162K602087o59205j922998r97092l007302o464039
9035a0754200l051806P215354J2497008O283992k691601m489707k012843k722703
9027B73494m961972k586284K821482M639549K395659R45472J019496p08802l687298
9018A50796l773375r66090K45046j684171l540176k989867q41160K032793N131103
9009f235101O137661L108511j414904k882139j027651K96604r61579l038999l489597
$$ y = [4998566, 5004262, -1077911, -6179602, -7232064, -7338900, -8294233, -7271033, -3109002, -502439, -3769673, -9770094, -11400975, -6286087, 1613242, 7115189, 7034894, 893335, -6878981, -7800578, 1544272, 12444175, 12722505, 2229295, -7295347, -8232247, -4932089, -3594037, -3050813, -305651, 2296436, 1637231, -285767, -1282859, -4290161, -10754200, -13806006, -6590652, 5906356, 12190348, 9498747, 5009040, 2996197, 273494, -4688478, -7274762, -4453280, 186269, 2581928, 3527400, 4546896, 3838094, 150796, -3622579, -4588669, -4343623, -6027794, -9567970, -12557837, -13398997, -11366204, -6235101, -97440, 3011071, 1596167, -1285972, -2313623, -2017019, -2978598, -6017597, -9507194]
9000i507194j045665M066974Q325622O155731k516334r014256o031147J805989
8992g760280M507639J450223P32814M586069N649254J13967n144882l593918O47542
8983A188428O9606m335035n732191k619193n5926p78988j430350J416916N888764
8974f387969P265664L688471j775901m140225j651500J908824J394021k912617
8966b611232n122462j654675L616209M759535J782590m84131J39373J166985M57745
8957B049937j136123k625926m163885m361746q04742M613305N507052j34293n072536
8948f128957k136602M786288N957478L12767l472632r47455K205012J387080Q84859
8939B847838M125520M610728l744275j3133805j0597406K233832J0407381O964689
$$ y = [-9507194, -10552859, -6485885, 1839737, 7995468, 5479134, -3535122, -9566269, -7760280, -3252641, -1802418, -1069604, 3516465, 9165719, 9279686, 4134804, 540886, 1188428, 1258034, -3077001, -8809192, -11428385, -11484311, -12263299, -13693649, -12276733, -6387969, 877695, 4566166, 2790265, -1349960, -3001460, -1092636, 301385, -2611232, -7733694, -9388369, -5772160, -1012625, 769965, 285834, 425207, 1592192, 2049937, 913814, -1712112, -5875997, -10237743, -11042485, -6429180, -922128, -1056421, -6128957, -8265559, -3479271, 2478207, 2790974, -681658, -1629113, 575899, 1962979, 2847838, 6973358, 11584086, 7839811, -5293994, -15891400, -13657568, -3250187, 3714502]
8931C714502P84985M10423K162891J97693k364575q30910P87954l229393q569090
8922f935520o431019K039225O651733K877690k889219l677410m90692J520284
8914g334928M25960j274131k46058L883055P250515N442639m63498m449633l806692
8905e72771k361335k709045j329144L465594N361594k63734o261354l486129L684758
8896d471566L726277k540834k844695N454657J0097984M258784k137799M49488
8888A1992296N183677J296389o910355p087113N26911L732646j594882n597918
8880A541651j195781M714018K740381m339067o190891m06875M390981J211087
8872B465504n470569n916606J517115P908318N498305k276143o104060l376008
$$ y = [3714502, 4499487, 4909910, 7072801, 7270494, 4905919, 4075009, 4862963, 1633570, -6935520, -13366539, -11327314, -4675581, -1797891, -4687110, -8364520, -8855212, -7334928, -6908968, -8183099, -8429157, -4546102, 2704413, 8147052, 7683554, 3233921, -572771, -2934106, -5643151, -6972295, -3506701, 1854893, 1591159, -4670195, -8156324, -4471566, -745289, -3286123, -6130818, -676161, 9421823, 13680607, 11542808, 11992296, 17175973, 18472362, 11562007, 4474894, 5001805, 8734451, 7139569, 1541651, 345870, 5059888, 7800269, 3461202, -2729689, -3136564, 1254417, 2465504, -3005065, -8921671, -7404556, 503762, 6002067, 3725924, -2378136, -5754144]
8864e754144K67560J164040K110641M478692L428983l495888q964427m841317
8856a1605860M789391Q164755K363255l394569k001467K478128L366289J537915
8848E697837J559399L029963K244714o51998k571165l794330o935799r963121
8840a1384500o968713K211401Q883529N764566l244151p703967l192546M606525
8832a1027856P639611L956570j776321l784010o22080L535641L159779j990756
8824i09422n623537k375566M708762P381681K449400m934013q633687p973661
8816a5910043n242094j178990L710137O669578N775082L557703L421300L948329
8808D751002J379423l077891l864167K23215L385653J437579j713245m52259L126894
$$ y = [-5754144, -5486584, -4322544, -2211903, 2266789, 5695772, 2199884, -6764543, -11605860, -6816469, 1348286, 3711541, 316972, -1684495, 793633, 4159922, 5697837, 7257236, 10287199, 12531913, 11879915, 9308750, 5514420, -1421379, -11384500, -18353213, -16141812, -7258283, -1493717, -4737868, -12441835, -15634381, -11027856, -3388245, 568325, -1207996, -4992006, -5614086, -2078445, 1081334, -909422, -6532959, -8908525, -4199763, 3181918, 5631318, 697305, -7936382, -15910043, -21152137, -22331127, -18620990, -11951412, -6176330, -2618627, 802673, 4751002, 6130425, 3052534, -811633, -588418, 2797235, 4234814, 2521569, 2069310, 5196204]
8799E196204K097540l911336o672515j121443N958337M159486n802615j1806320
8791a1902662o076902M327931P083465J165130k601539K535283R585381P867511
8783A1983598j831016q274533m989878J712047K300672k896516n107354k41484
8775g344464N227136L938212j390977k221774K396592L952843k169268q664514
8767f276214o880223J70393K938657K7408j348709J446424K789856R5096r48958
8758g986270L151485O431019K864704l673796n805519l699279k448234k658305
8750a3824195j289272J237069K333726L211736O010406P113253J561400o961588
8742f07465r159131l431982K072579J894087l11848K3748J481522J412774Q90437
$$ y = [5196204, 7293744, 3382408, -3290107, -4411550, 1546787, 5706273, -96342, -11902662, -17979564, -13651633, -6568168, -5403038, -8004577, -5469294, 4116087, 11983598, 10152582, 1878049, -3111829, -1399782, 900890, -1995626, -7102980, -7344464, -2117328, 1820884, 429907, -1791867, 604725, 4557568, 2388300, -6276214, -13156437, -12986044, -10047387, -10019979, -11368688, -9922264, -7132408, -7037312, -7986270, -4834785, 1596234, 4460938, 787142, -5018377, -8717656, -11165890, -13824195, -15113467, -13876398, -11542672, -8330936, -2320530, 4792723, 6354123, -607465, -9766596, -13198578, -11125999, -9231912, -9543760, -9520012, -8038490, -6625716, -5735279]
8733e735279Q40810r29789m416782m473380J539939P468144N694825k025284p092761
8724i129557n893462k944053k169220j227260K907257P369400O885875J831385
8716b369635j943545j420743N7754o70063j192140J294086L362443L05236m522298
8707g098905l350750L038111N025770p50834n331852j421847N225305N491148
8699H26146N82447k361255k252801k409294j849062J927345N154243K669067k324043
8690c7207k918699Q910P41681k59149Q91370J337571l315048o730973M21630J1857239
8680A997325J1304865k078943j1097751o924810o75592k351293n501129k237877
8672a7565205K185563J410338R29892O157537R375927K589552o373347n286536
$$ y = [-5735279, -4894469, -5824258, -10241040, -14714420, -13174481, -5706337, -11512, -2036796, -9129557, -15023019, -17967072, -20136292, -21363552, -18456295, -11086895, -4201020, -2369635, -4313180, -5733923, -5676169, -6346232, -7538372, -6244286, -2881843, -2576607, -7098905, -10449655, -7411544, -2385774, -3136608, -8468460, -9890307, -4665002, 826146, 1408593, -952662, -3205463, -5614757, -7463819, -5536474, -382231, 2286836, -37207, -2955906, -2946996, -2205315, -2464464, -1573094, -235523, -3550571, -10281544, -9859914, 1997325, 13302190, 11223247, 125496, -6799314, -7474906, -9826199, -15327328, -17565205, -15379642, -13969304, -13039412, -6881875, 2494052, 5083604, -1289743, -6576279]
8664f576279K510956M310941j288555m291986n50859M038767M801243K653148
8656E607376j117313m982252m618822R77275M443710J44856n257130k543068M358723
8647b986645M156790l571769q156294m255810K837451P339202Q049446M553443
8639G965814j665561m067913J012489N849537J535772o509626n995002J763244
8631a11246L487861m193328r804560o181629O187J995701K814006N898735P455899
8622A367626M393450M46159j023937k056236l713949k882031R06509L383285L009076
8613C829952K417257J059735l788581p545835j919003R239368J0859348j460089
8605A2692152j3241139j1450093j130391N753379O659243N056662J165805m311167
$$ y = [-6576279, -4065323, 245618, -1042937, -5334923, -5885782, -1847015, 2954228, 5607376, 4490063, -492189, -5111011, -4133736, 309974, 454830, -4802300, -7345368, -2986645, 1170145, -2401624, -10557918, -14813728, -11976277, -4637075, 3412371, 7965814, 6300253, 2232340, 3244829, 9094366, 10630138, 4120512, -1874490, -111246, 3376615, -816713, -10621273, -16802902, -16796715, -14801014, -11987008, -6088273, 1367626, 5761076, 6207235, 5183298, 3127062, -586887, -3468918, -2562409, 820876, 3829952, 6247209, 7306944, 3518363, -4027472, -5946475, 3292893, 14152241, 12692152, -548987, -11999080, -13129471, -7376092, -716849, 4339813, 5505618, 1194451]
8597A194451n854652j503434K139697P87925m65497J598926O03580o442865r428850
8588a7370719n85732R871088P543144l966076r275791m404918J072568J848260
8580a5268176K254149M628130N400276L539795K167836J315229j480696l806839
8572a250296j066248L984709L881094j511873m724339k526806O36827J295045
8564a281887Q89210P98333P13079J650596L958351L984378l11183l435542k33924
8555F731411M107111J832139l545602l174664O81773j519881p780019n915098
8547h582830M515262Q546400n15143r438076n416717N304185R182998M886301
8539H482380K23499j940763l682318l990102j115850J162899j311847m807702
$$ y = [1194451, -4660201, -6163635, -4023938, -3236013, -3701510, -2102584, -1499004, -7941869, -17370719, -17956451, -8085363, -542219, -4508295, -13784086, -18189004, -17116436, -15268176, -13014027, -8385897, -2985621, 554174, 2722010, 4037239, 2556543, -1250296, -2316544, 1668165, 5549259, 4037386, -686953, -3213759, -2576932, -1281887, -392677, 405656, 1118735, 2769331, 6727682, 10712060, 10400877, 6965335, 6731411, 10838522, 12670661, 9125059, 5950395, 6632168, 5112287, -2667732, -8582830, -4067568, 4478832, 3963689, -5474387, -10891104, -5586919, 3596079, 8482380, 8705879, 6765116, 3082798, -907304, -2023154, -860255, -2172102, -6979804]
8531f979804k605820M207234P913661M532631k531152p587191p204806j893262
8523a2148509L411033L474547j10627k86218M569615P236174K899784l075623
8515E970176l995440j733737j154859r20673K183088M843258J796232m648763
8507B339282p656630n583436j540928L207257P939030Q516945L152938j609082
8499H765376K38237L197944j313776r170195q866301q16104K988867p69510k114902
8490g860364L044502M801974k441986q179154k967528M973252L574125k499612
8482g554791o39496O850491O164861l692875p780569O36661Q871427M706300n593433
8473A968576q692441l784456K11118L90930J047518K557677P79936k903954j772846
$$ y = [-6979804, -9585624, -5378390, 2535271, 7067902, 4536750, -3050441, -10255247, -12148509, -8737476, -5262929, -5373556, -5659774, -1090159, 6146015, 9045799, 5970176, 1974736, 240999, -913860, -1834533, 348555, 5191813, 6988045, 2339282, -5317348, -10900784, -12441712, -9234455, -1295425, 7221520, 10374458, 8765376, 9003613, 12201557, 10887781, 1717586, -7148715, -7964819, -4975952, -5745462, -7860364, -4815862, -13888, -2455874, -10635028, -13602556, -8629304, -5055179, -7554791, -8194287, -1343796, 4821065, 1128190, -6652379, -6015718, 2855709, 7562009, 1968576, -6723865, -10508321, -10297203, -9906273, -8858755, -6301078, -5521142, -8425096, -10197942]
8464a0197942M135937N889997m40583o294786l067880M581216N638960j000951
8456g56032n799464l217182J256897R78143j716594j63357N471960P573346J660670
8447E288387o915837r214070l359046M060179O630353M684080K119993K91906
8439C585945j501588j900254J030083M666660L734329j427658l942125l37033
8431C908359L766478J903597l753947o313093m243260j778745j311338j288268
8423i110217q45979j055804j594963r05724K23564n40569k682178l140453q82701
8414b0535024K307046M875025N909249M154511O47827l6826L767975O056063J433368
8405H579214m824080l692702K646574L434321l092720o550938j417051M575151
$$ y = [-10197942, -6062005, -172008, -612591, -6907377, -9975257, -5394041, 244919, -756032, -6555496, -9772678, -8515781, -7537638, -9254232, -9417589, -3945629, 3627717, 5288387, -1627450, -10841520, -14200566, -10140387, -3510034, 1174046, 3294039, 3585945, 2084357, 184103, 1214186, 5880846, 9615175, 8187517, 4245392, 3908359, 7674837, 9578434, 5824487, -488606, -4731866, -6510611, -7821949, -9110217, -9956196, -11012000, -12606963, -13512687, -13289123, -13829692, -16511870, -19652323, -20535024, -18227978, -13352953, -7443704, -3289193, -2641366, -2678192, 1089783, 7145846, 8579214, 3755134, 62432, 2709006, 6143327, 3050607, -3500331, -4917382, -342231]
8397c42231L934873L65739l01756q0559j885452j750952K925973N379480j77413
8388H067702p016276n671230L80097P45482m295417n153076l1125K492395j238993
8379a1720441m348400j991549J205863N52682r26911P31407L210929L037092K215855
8370h033473M012184O148566L931867j871966n145912k205918L529513N280055
8362E644916L04085o953365r614731o073230r89260J804637L714249O520333P525439
8353A883073M054407o69042j685243J53266N78521l75511M45995K030994L29738
8344F746198l702212m389323m01850L005782K075818r52696k735122k912804k068288
8335e334497l50362R35112N35009J2014J164451K054130O54741L2210L105813
$$ y = [-342231, 3592642, 3958381, 3656625, 3576066, 1690614, -60338, 2865635, 8245115, 8067702, 1051426, -4619804, -4239707, -3494225, -7789642, -12942718, -12973843, -10481448, -11720441, -16068841, -18060390, -16854527, -16301845, -17228756, -16497349, -13286420, -10249328, -8033473, -4021289, 2127277, 6059144, 4187178, -958734, -3164652, 364861, 5644916, 5949001, -1004364, -10619095, -16692325, -17681585, -15876948, -12162699, -5642366, 1883073, 5937480, 5268438, 3583195, 3736461, 4314982, 3939471, 4385466, 6416460, 6746198, 3043986, -1345337, -1747187, 1258595, 3334413, 2381717, -353405, -3266209, -5334497, -5684859, -4749747, -4214738, -4202724, -3038273, -984143, -329402, -297192, 2808621]
8326B808621N014334k46299p539995o107645K710780N739983j690438q496554
8318g807213n730689P36349K516516K156370M960989P104558K928543l013834
8310C851589k614995J882187J647041m018403p053885l538455J712829L318277
8302d813815J033862k465903l848123k65387O563230R321530L539852n149255
8294C915991p800136l740312O40387K101373K630302L031957J653376q77169j852638
8285b96869j277204j218478j180752O68635K798110K247911Q2016n43976l44396
8276I34997k109849m399666l430954k93093L83892j473997j317090J918731M164132
8267e622897L190605J116024n48505k307506k718860N45735M735528L661918k873203
$$ y = [2808621, 7822955, 7576656, 36661, -6070984, -3360204, 2379779, 689341, -7807213, -13537902, -12801553, -10285037, -8128667, -3167678, 3936880, 6865423, 3851589, 1236594, 3118781, 4765822, 747419, -6306466, -9844921, -8132092, -4813815, -3779953, -6245856, -10093979, -10359366, -3796136, 5525394, 9065246, 3915991, -3884145, -7624457, -6984070, -4882697, -2252395, 779562, 2432938, 1555769, -296869, -1574073, -2792551, -3973303, -3304668, -506558, 1741353, 1823369, 1279393, 934997, -1174852, -5574518, -9005472, -9298565, -8914673, -10388670, -11705760, -9787029, -5622897, -2432292, -1316268, -1864773, -4172279, -6891139, -6345404, -1609876, 2052042, -821161]
8258h21161p236342l884587L801131Q640568P306367J456814m524848n930407
8250a192465k083832J319633j221674o481872o367329k03522L942503J449009
8242a0839549k691872k425077J414397M880558O517965N836738J980175k655970
8234B017365l123805L27656J120014l282536o345948k778477K504207K208249
8226g353275j876909k755128L38142K393036K162017L073536N250453M367090
8218E598962m52595m168025l320302o74012J70205K37855J795298K892734o1832
8209B018288n278849n921302O95187P642147O156515k249904o767204j927317
8201e632439M483087K780052m326030o414203j537974J897283l48995k269282
$$ y = [-821161, -8057503, -11942090, -8140959, 499609, 7805976, 9262790, 4737942, -1192465, -3276297, -1956664, -3178338, -9660210, -16027539, -16231061, -12288558, -10839549, -13531421, -15956498, -14542101, -9661543, -3143578, 2693160, 4673335, 2017365, -1106440, -778784, 341230, -2941306, -9287254, -12065731, -9561524, -7353275, -9230184, -11985312, -11647170, -9254134, -7092117, -4018581, 1231872, 5598962, 5146367, 978342, -2341960, -3015972, -2845767, -2607912, -812614, 2080120, 2018288, -3260561, -9181863, -8486676, -844529, 5311986, 3062082, -3705122, -5632439, -1149352, 1630700, -2695330, -9109533, -10647507, -8750224, -9099219, -11368501]
8193a1368501O43794L324317P34617k846800j844752K62997k195566n302538j360273
8184a9952705O660235Q151891J912598j643497K371527N317432m25253q527975
8176f135747q367936r33639M101790L361625K229526L497630L145469p17225l187193
8167c005700j028653J133083j034899k811236K213131R425477P770166k914688
8159I746681r555996m484593L271865K217028m237809m574098J943454N117323
8151e56145J024177k712837o14840K659305J977156j02773o1742p6385j945094
8142d09178j769665K457270M620817k88230o353475m990839J265381K875293j407925
8133d000551l457069M48136M428641L236328n28077k241782j878174j756128k481790
$$ y = [-11368501, -10724707, -7400390, -6665773, -9512573, -11357325, -11094328, -13289894, -18592432, -19952705, -13292470, -5140579, -3227981, -4871478, -2499951, 2817481, 2392228, -6135747, -14503683, -15437322, -11335532, -7973907, -5744381, -2246751, 898718, 181493, -3005700, -4034353, -2901270, -3936169, -6747405, -4534274, 4891203, 12661369, 9746681, 190685, -4293908, -1022043, 1194985, -3042824, -7616922, -5673468, -556145, 468032, -2244805, -2859645, -200340, 1776816, 1674043, 1612301, 1535916, -409178, -2178843, 278427, 4899244, 4611014, -1742461, -6733300, -5467919, -2592626, -4000551, -7457620, -7009484, -2580843, 655485, 127408, -2114374, -3992548, -5748676, -8230466]
8124h230466l538901m059731j803210M346634J0038536Q755391J093631m362979
8116B238905j884932M185073N873713J414879m364058o548121m286818n37230
8108c908589N79448j867233l381846P48974P711898R149817K334051n506862o662663
8099h03005k275764J198533R57251p53134j322180K1147K582527L745115N92962
8090C943452n251492p625807l927329N24848L88624j604742k43525K345021M14741
8081a1036209l953659k550278N127882R259806M372047j984264j114771L266012
8073A386566J554040n808955q371065j399092O933638P012126L83339l615025
8065a924428n44313M632017N129032N65256l787148l999117j522198j64782r92332
$$ y = [-8230466, -11769367, -15829098, -17632308, -13285674, -3247138, 5508253, 6601884, 2238905, 353973, 4539046, 10412759, 11827638, 7463580, 915459, -3371359, -3908589, -3329141, -5196374, -8578220, -7829246, -117348, 9032469, 11366520, 5859658, -803005, -3078769, -1880236, -922985, -1676119, -2998299, -2977152, -394625, 3350490, 3943452, -1308040, -8933847, -12861176, -12336328, -11947704, -13552446, -13795971, -11450950, -11036209, -14989868, -17540146, -12412264, -3152458, 1219589, -764675, -1879446, 1386566, 2940606, -2868349, -11239414, -12638506, -5704868, 1307258, 1690597, -1924428, -2468741, 2163276, 7292308, 7857564, 4070416, 71299, -1450899, -1615681, -2608013]
8056b608013k047026k256654k708341l399944j972653K118652N037270L545143
8048d291566L10135n2717J425626j09818m488079o001519k952639p85766k531612
8039a9477955k989573K198722P684766O103202M30387k18697M793767O728430
8031E253049J697775l495208k612144J045515J410715j099009k337960j484729
8023a621996j76564J350560K404580J04481n333084p531163k214621M875916N217132
8014b924759N9724j984122J496237M114685K159064L0784J515716L195919R22093
8005H585341k940602l648604j340851M61802N96887M59752Q71193J955323L604875
7996H605116L574115j166260q114066r090783j257620O445965M587664k857854
$$ y = [-2608013, -4655039, -6911693, -9620034, -13019978, -14992631, -12873979, -7836709, -4291566, -3981431, -4034148, -2608522, -2718340, -7206419, -13207938, -16160577, -16946343, -19477955, -22467528, -20268806, -12584040, -6480838, -6050451, -6269148, -1475381, 5253049, 6950824, 3455616, 843472, 1888987, 3299702, 2200693, -137267, -1621996, -1798560, -448000, 1956580, 2061061, -3272023, -10803186, -13017807, -8141891, -2924759, -2865035, -4849157, -3352920, 761765, 2920829, 2951613, 4467329, 7663248, 8585341, 5644739, 1996135, 655284, 1117086, 1713973, 2173725, 3044918, 5000241, 8605116, 12179231, 11012971, 2898905, -6191878, -7449498, -1003533, 3584131, 726277]
7988G26277m325564J838157N607658J408451m264264m561464k125204j732283
7980g428236j269450K533904N637871K617357l050079l669444M9397M24842l686085
7971g839923m485104J675769P622349O051989L9550k588104n72761J021731k71917
7962F53579j435029K32880K658458J800243k657606n895336l307530K751938M491943
7953g06460o32048m487830Q92665R968164R864398m24957p479202l208723L543508
$$ y = [726277, -3599287, -1761130, 3846528, 5254979, 990715, -3570749, -5695953, -7428236, -8697686, -6163782, -525911, 2091446, -958633, -4628077, -4578680, -4153838, -7839923, -12325027, -10649258, -3026909, 3025080, 3064630, 476526, -96235, 925496, 653579, -781450, -548570, 2109888, 3910131, 1252525, -4642811, -7950341, -5198403, -706460, -1338508, -5826338, -4933673, 5034491, 14898889, 14473932, 6994730, 3786007, 7329515]
$$ [...]
##END NTUPLES=NMR SPECTRUM
##END=
