##TITLE=31Pdec_5A2003-05
 CDCl3, 64 sc
 21.3.2023
##JCAMPDX= 6.0         $$ Bruker NMR JCAMP-DX V2.0
##DATA TYPE= NMR SPECTRUM
##DATA CLASS= NTUPLES
##ORIGIN= UXNMR, Bruker Analytische Messtechnik GmbH
##OWNER= root
$$ XWIN-NMR		Version 3.5
$$ Tue Mar 21 14:08:24 2023 Russian Standard Time (UT+4h)  she@DPX200
##.OBSERVE FREQUENCY= 81.013821
##.OBSERVE NUCLEUS= ^31P
##.ACQUISITION MODE= SIMULTANEOUS
##.ACQUISITION SCHEME= undefined
##.AVERAGES= 64
##.DIGITISER RES= 16
##SPECTROMETER/DATA SYSTEM= spect
##.PULSE SEQUENCE= zgpg30
##.SOLVENT NAME= DMSO
##.SHIFT REFERENCE= (INTERNAL, DMSO, 0, 248.564)
##AUDIT TRAIL= $$ (NUMBER, WHEN, WHO, WHERE, WHAT)
$$ ##TITLE= Audit trail, XWIN-NMR		Version 3.5
$$ ##JCAMPDX= 5.01
$$ ##ORIGIN= Bruker BioSpin GmbH
$$ ##OWNER= she
$$ F:/spectra/data/she/nmr/P31/1/pdata/1/auditp.txt
$$ ##AUDIT TRAIL=  $$ (NUMBER, WHEN, WHO, WHERE, WHAT)
(   1,<2023-03-21 14:06:31.70 +0400>,<she>,<DPX200>,
      <continue with go, POWCHK disabled, PULCHK disabled
       configuration hash MD5:
       00 E9 B6 7A A2 85 ED C7 34 08 36 98 17 FE 4E 26
       data hash MD5: 32K
       DE B5 D8 B9 37 EB 95 17 B6 41 3A 90 E2 E6 72 A8>)
(   2,<2023-03-21 14:06:39.96 +0400>,<she>,<DPX200>,
      <Start of raw data processing
       efp BC_mod = 2 LB = 1 FT_mod = 6 PKNL = 1 PHC0 = -10663.46 PHC1 = -560.59 SI = 64K 
       data hash MD5: 64K
       3F D1 54 07 75 F5 13 F9 22 5C A9 B1 AD 26 5E AC>)
(   3,<2023-03-21 14:07:08.20 +0400>,<she>,<DPX200>,
      <abs ABSG = 5 
       data hash MD5: 64K
       70 26 49 7D E3 47 E2 8D F3 0D EA F8 52 56 9A C3>)
(   4,<2023-03-21 14:07:27.09 +0400>,<she>,<DPX200>,
      <pk PHC0 = 99.43656 PHC1 = 0.05599968 
       data hash MD5: 64K
       70 13 09 4F DF C6 47 13 92 86 F0 6E CB 7F C4 DA>)
(   5,<2023-03-21 14:07:53.04 +0400>,<she>,<DPX200>,
      <pk PHC0 = -72.25692 PHC1 = -12.4 
       data hash MD5: 64K
       FB BD 1E B4 F3 D2 63 98 4A 58 8A E0 8D 3B E4 CC>)
(   6,<2023-03-21 14:07:57.09 +0400>,<she>,<DPX200>,
      <abs ABSG = 5 
       data hash MD5: 64K
       EF 78 54 80 FB 57 28 E1 A2 25 E6 09 6B CC EB E2>)
$$ ##END=
$$ 
$$ hash MD5
$$ 22 F7 39 59 03 BD 18 CB 42 EE 3E C8 4A F2 4B D7
##$RELAX= 
##$RELAX= 
##$RELAX= 
##$RELAX= 
##$RELAX= 
##$RELAX= 
##$RELAX= 
##$RELAX= 
##$RELAX= 
$$ Bruker specific parameters
$$ --------------------------
##$DU= <F:/spectra>
##$EXPNO= 1
##$NAME= <P31>
##$PROCNO= 1
##$TYPE= <nmr>
##$USER= <she>
##$AMP= (0..31)
100 100 100 100 100 100 100 100 100 100 100 100 100 100 100 100 100 100 
100 100 100 100 100 100 100 100 100 100 100 100 100 100 
##$AQSEQ= 0
##$AQ_mod= 1
##$AUNM= <au_zg>
##$AUTOPOS= <>
##$BF1= 81.014009
##$BF2= 200.13
##$BF3= 200.13
##$BF4= 200.13
##$BF5= 200.13
##$BF6= 200.13
##$BF7= 200.13
##$BF8= 200.13
##$BYTORDA= 1
##$CFDGTYP= 0
##$CFRGTYP= 5
##$CHEMSTR= <none>
##$CNST= (0..31)
1 1 145 1 1 1 1 1 1 1 1 1 1 1 1 1 1 1 1 1 1 1 1 1 1 1 1 1 1 1 1 1 
##$CPDPRG= <waltz16>
##$CPDPRG1= <>
##$CPDPRG2= <waltz16>
##$CPDPRG3= <>
##$CPDPRG4= <mlev>
##$CPDPRG5= <mlev>
$$ [...]
##$SUBNAM3= <"">
##$SUBNAM4= <"">
##$SUBNAM5= <"">
##$SUBNAM6= <"">
##$SUBNAM7= <"">
##$SUBNAM8= <"">
##$SUBNAM9= <"">
##$SW= 501.771253377433
##$SWIBOX= (0..15)
0 1 3 0 0 0 0 0 0 0 0 0 0 0 0 0 
##$SW_h= 40650.406504065
##$TD= 32768
##$TD0= 1
##$TE= 0
##$TE2= 300
##$TE3= 300
##$TEG= 300
##$TL= (0..7)
0 120 53 12 22 120 120 120 
##$TP= (0..7)
150 150 150 150 150 150 150 150 
##$TP07= 0
##$TPNAME0= <>
##$TPNAME1= <>
##$TPNAME2= <>
##$TPNAME3= <>
##$TPNAME4= <>
##$TPNAME5= <>
##$TPNAME6= <>
##$TPNAME7= <>
##$TPOAL= (0..7)
0.5 0.5 0.5 0.5 0.5 0.5 0.5 0.5 
##$TPOFFS= (0..7)
0 0 0 0 0 0 0 0 
##$TUNHIN= 0
##$TUNHOUT= 0
##$TUNXOUT= 0
##$USERA1= <user>
##$USERA2= <user>
##$USERA3= <user>
##$USERA4= <user>
##$USERA5= <user>
##$V9= 5
##$VALIST= <valist>
##$VCLIST= <CCCCCCCCCCCCCCC>
##$VD= 0
##$VDLIST= <DDDDDDDDDDDDDDD>
##$VPLIST= <PPPPPPPPPPPPPPP>
##$VTLIST= <TTTTTTTTTTTTTTT>
##$WBST= 1024
##$WBSW= 4
##$XGAIN= (0..3)
0 0 0 0 
##$XL= 0
##$YL= 0
##$YMAX_a= 402
##$YMIN_a= -227
##$ZGOPTNS= <>
##$ZL1= 120
##$ZL2= 120
##$ZL3= 120
##$ZL4= 120
##$ABSF1= 248.5645
##$ABSF2= -253.2056
##$ABSG= 5
##$ABSL= 3
##$ALPHA= 0
##$AQORDER= 0
##$ASSFAC= 0
##$ASSFACI= 0
##$ASSFACX= 0
##$ASSWID= 0
##$AUNMP= <proc_1d>
##$AZFE= 0.1
##$AZFW= 0.5
##$BCFW= 0
##$BC_mod= 2
##$BYTORDP= 0
##$COROFFS= 0
##$CY= -3
##$DATMOD= 1
##$DC= 0
##$DFILT= <>
##$DTYPP= 0
##$F1P= 0
##$F2P= 0
##$FCOR= 1
##$FTSIZE= 65536
##$FT_mod= 6
##$GAMMA= 0
##$GB= 0
##$INTBC= 1
##$INTSCL= 6.047779e-11
##$ISEN= 30
##$LB= 1
##$LEV0= 0
##$LPBIN= 0
##$MAXI= 10000
##$MC2= 0
##$MEAN= 0
##$ME_mod= 0
##$MI= 50
##$NCOEF= 0
##$NC_proc= -12
##$NLEV= 6
##$NOISF1= 182.463
##$NOISF2= 159.3651
##$NSP= 0
##$NTH_PI= 0
##$NZP= 0
##$OFFSET= 248.5645
##$PC= 4
##$PHC0= -10636.28
##$PHC1= -572.9341
##$PH_mod= 1
##$PKNL= yes
##$PPARMOD= 0
##$PSCAL= 0
##$PSIGN= 0
##$REVERSE= no
##$SF= 81.0140089999694
##$SI= 65536
##$SIGF1= 159.3651
##$SIGF2= -187.1042
##$SINO= 113.3802
##$SIOLD= 16384
##$SREGLST= <1H.CDCl3>
##$SSB= 0
##$STSI= 65536
##$STSR= 0
##$SW_p= 40650.406504065
##$SYMM= 0
##$S_DEV= 0
##$TDeff= 32768
##$TDoff= 0
##$TI= <>
##$TILT= no
##$TM1= 0
##$TM2= 0
##$TOPLEV= 0
##$USERP1= <user>
##$USERP2= <user>
##$USERP3= <user>
##$USERP4= <user>
##$USERP5= <user>
##$WDW= 1
##$XDIM= 65536
##$YMAX_p= 228179541
##$YMIN_p= -208781329
$$ End of Bruker specific parameters
$$ ---------------------------------
##NTUPLES= NMR SPECTRUM
##VAR_NAME=  FREQUENCY,     SPECTRUM/REAL,   SPECTRUM/IMAG
##SYMBOL=    X,             R,               I
##VAR_TYPE=  INDEPENDENT,   DEPENDENT,       DEPENDENT
##VAR_FORM=  AFFN,          ASDF,            ASDF
##VAR_DIM=   65536,         65536,           65536
##UNITS=     HZ,            ARBITRARY UNITS, ARBITRARY UNITS
##FACTOR=    0.620285442955139, 1,           1
##FIRST=     20137.2065510682, 0,            0
##LAST=      -20513.1999529968, 0,           0
##MIN=       -20513.1999529968, -208781329,  0
##MAX=       20137.2065510682, 228179541,    0
$$ Real data points
##PAGE= N=1
##DATA TABLE= (X++(R..R)), XYDATA
$$ [...]
45153 -5342202 -2506603 38449 -1641649 -3612070 -368447 5745230 7639073 4414643
45145 4414643 2622525 6085166 10515489 10451679 6599416 3084466 1089527 -1071954
45137 -1071954 -3835868 -5867188 -6542021 -6297616 -5291601 -3650666 -2156460 -1183888 -166771
45128 -166771 621523 -437803 -3443308 -5659250 -5056651 -3075621 -1701613 -360332 1363908
45119 1363908 826613 -3491590 -7147181 -4610294 2062887 5617241 4843002 6480822
45111 6480822 13567663 18649702 13502476 879937 -9156569 -11646948 -9700748 -7103513
45103 -7103513 -4436228 -2482063 -3340638 -6314085 -7210651 -3896164 933592 4304784
45095 4304784 6706885 9040391 9413826 6341873 2524355 1597159 2659862 1920568 -864358
45086 -864358 -1486017 2619801 8440185 10748054 7460702 808786 -5086186 -6830621
45078 -6830621 -3448964 3029768 8804396 10746871 8108112 2713188 -2043738 -3558077
45070 -3558077 -2550778 -2281491 -3947916 -4271919 131118 7093572 10677390 8541290
45062 8541290 4420010 2497621 2297826 1008959 -1244564 -1154802 2929799 7810134 8308852
45053 8308852 3363554 -1915461 -1914089 2163983 3537744 -762955 -5607111 -5557770 -2911493
45044 -2911493 -3112695 -5399272 -4773439 -1755094 -2322057 -7557161 -11207976 -9704856 -6990613
45035 -6990613 -6069977 -3556046 2151959 4485740 -2175876 -12213419 -15514861 -10990393
45027 -10990393 -5558119 -2444767 1059094 5522256 7634875 6899451 6455814 6381363 3437359
45018 3437359 -1267503 -1922242 2216186 3914715 -1400898 -8287497 -9076571 -3996861
45010 -3996861 1170445 3248020 2554293 -651358 -5167208 -6881043 -3261548 1726232
45002 1726232 2192450 -1361586 -3298355 -1671966 -384388 -2133901 -4601102 -5417911
44994 -5417911 -6143632 -8341288 -9567249 -7371237 -4958050 -8080645 -16436615 -22232681
44986 -22232681 -18668157 -7285253 4328377 9826865 7811688 1167044 -4454498 -3541247
44978 -3541247 3961397 10785945 9631337 2508346 -1170487 3348394 10498627 12829308
44970 12829308 10411218 8046724 7085669 5393731 3159970 2845472 4015688 3714759
44962 3714759 2113498 2482585 4834401 5036430 1931619 55447 2573312 6322245
44954 6322245 7384701 7243625 8884240 10275280 7235855 880320 -3373500 -3627009
44946 -3627009 -3087341 -3576431 -2647855 1274768 5464908 7242224 8239005 11072068 14132597
44937 14132597 13213960 7289275 -210016 -5287563 -6291396 -3928635 -1091724 -1858148
44929 -1858148 -7362676 -12809234 -12126860 -6014025 -1435898 -1902355 -2654271 1659728 8497394
44920 8497394 10985386 7472585 2727080 782725 1197334 2071925 2499583 1802751 59209
44911 59209 -512759 1728727 4021134 2171113 -2861070 -6022168 -5866659 -5806218 -6905690
44902 -6905690 -5391899 670479 7826454 12779945 16021505 17411419 14348688 7948276
44894 7948276 4720564 7306545 9492006 6008474 1364141 1992115 4903727 2505987
44886 2505987 -5027100 -10947005 -12921448 -13837109 -13169432 -7195620 1669435 4876924
44878 4876924 -426083 -6787315 -6612082 -1301120 2489794 1217743 -3247332 -6303663
44870 -6303663 -4278508 1805390 6129405 4589257 39578 -2504686 -3212285 -4723796
44862 -4723796 -5200346 -1532091 2566943 479256 -5862712 -7748448 -3572255 -1227250
44854 -1227250 -4565707 -7378260 -4787581 -1430852 -2791867 -6094272 -5998109 -3171532
44846 -3171532 -1020268 1115639 5509281 10484680 12346700 10006923 4267073 -3958438
44838 -3958438 -11766011 -14747435 -12393440 -9140752 -7894364 -7089634 -5687926 -5011373
44830 -5011373 -3686628 1972715 9689789 11343587 5315764 296031 1699993 3202423
44822 3202423 -1390505 -6591088 -4431120 2014894 4176231 1596794 225321 1506002
44814 1506002 2735680 4557921 8686527 11493381 9246481 6575835 9958146 15572592
44806 15572592 14140817 6127880 1338747 3757732 7190082 6695087 4708661 4400694
44798 4400694 5583405 8530062 13647295 16217457 9900116 -2712475 -10870429 -9010641
44790 -9010641 -2270594 2717070 5073774 5961183 5014965 2957358 1728236 609999
44782 609999 -2012559 -3384581 -318075 2401052 -2753069 -12091543 -13485283 -5573297
44774 -5573297 -1766051 -9644630 -18344942 -14867452 -2994946 4216364 3310517 852883
44766 852883 -13051 -2349218 -6812559 -9734299 -9517619 -7971209 -5959043 -3605647 -3355908
44757 -3355908 -6803765 -9971952 -7994381 -3301451 -2643831 -6558207 -8541679 -5254582
44749 -5254582 -1113681 -983846 -3785546 -5874763 -6316875 -5659927 -2679224 3884885 11399862
44740 11399862 14290360 9920673 2524774 -126152 5155649 12893394 14706451 8902347
44732 8902347 1823398 -601757 923410 2884753 5012388 8820042 12628611 12573668
44724 12573668 8085042 2856139 214142 75243 553422 408486 -359374 -908630 -570430
44715 -570430 -225124 -1758638 -5257280 -8204246 -8728037 -7991652 -7857078 -8073365 -7647720
44706 -7647720 -6991836 -6426061 -4589537 -1093391 1170983 -345529 -3477788 -4194112 -2570558
44697 -2570558 -1950144 -3031660 -3351594 -2500803 -2784505 -3685435 -984168 5950500 10737378
44688 10737378 8077678 1954587 651233 5355961 9288037 8009178 4791014 3845776
44680 3845776 3528485 252110 -4540126 -6451905 -5268107 -4521975 -4423169 -1033662 6308349
44671 6308349 12265995 12752793 10035637 7385608 3631726 -2205864 -5428733 -1593793
44663 -1593793 4686768 4443406 -2671367 -7350092 -3470704 4719500 10013838 10429704
44655 10429704 7293271 1369851 -4830228 -5803601 681911 8967485 11703492 8744645
44647 8744645 6061634 7415379 10628204 11107553 6352867 -2123645 -9520642 -11755126
44639 -11755126 -9909311 -8391555 -7934656 -4611103 2175376 6118156 2891028 -2134091
44631 -2134091 -1308061 3543976 4245908 -507727 -3217777 536451 6072320 7948943
44623 7948943 7455422 7728444 7030487 2361611 -3784003 -6086580 -4222952 -2674031 -3097906
44614 -3097906 -2108381 2060924 5187211 2460445 -4194995 -7724839 -4382884 2266633
44606 2266633 6297052 6190307 5447564 7834600 13552092 19504180 21869567 18490955
44598 18490955 10187442 511089 -6280967 -7849325 -5045825 -961723 1672943 2914136
44590 2914136 5128736 9072770 11240719 7565135 -253675 -5429660 -4309307 -478764
44582 -478764 1269138 1067163 767259 -1136467 -5925080 -9034821 -4801892 4387479 10424921
44573 10424921 10487655 8646589 6478497 583321 -8325839 -12530433 -8210295 -2026914
44565 -2026914 -1068884 -2478981 85113 4930685 5550001 2270699 2079704 7440692 12775657
44556 12775657 12859300 8698827 3996835 898541 382621 2201183 3084115 -703177 -7319174
44547 -7319174 -9653544 -3780765 5781785 11247039 9723122 4536800 543899 136760
44539 136760 2568860 5185586 5388711 2357238 -2731843 -7635520 -9804065 -7343361
44531 -7343361 -861638 5854190 8476811 5776686 73306 -5470628 -9087321 -10403177
44523 -10403177 -9403169 -5756684 715555 8359944 12997196 10928559 3467399 -3110527
44515 -3110527 -3367594 2258534 8464864 9944497 5423490 -1219424 -3914477 -741521
44507 -741521 2981133 963462 -5101172 -7228413 -2321312 3604636 4397727 1729090
44499 1729090 726078 2184135 3202684 2008526 -1744007 -8130319 -14682127 -16571694
44491 -16571694 -13081488 -10130876 -12054592 -15085487 -14127952 -11349941 -11249016 -11294699 -6086439
44482 -6086439 1452399 2483692 -3986996 -8530029 -4399844 4177521 9564864 10268292
44474 10268292 9392042 8290805 5788623 1468935 -2892719 -4471982 -1863319 2437666
44466 2437666 3556452 386454 -2336061 -1269091 -154548 -3206045 -6589515 -3783855
44458 -3783855 3148659 6187991 3974610 2499701 3233587 796097 -5490452 -7911050
44450 -7911050 -2383770 4733317 6910470 6470057 7567265 7614441 2781811 -3728561 -6199255
44441 -6199255 -4924575 -3590707 -1974461 2090012 6622334 7947757 6790661 5820254
44433 5820254 3598282 -2460892 -8954044 -9416119 -4036836 89395 -873835 -2838029
44425 -2838029 -749795 4614773 8923717 9802792 7921437 5047933 3016850 3166512
44417 3166512 5175100 6869569 5851437 1372862 -4902003 -9673721 -10515707 -8375215
44409 -8375215 -6673898 -7168375 -7707258 -4989494 1211656 7323270 9210037 6351651
44401 6351651 3192536 4962850 10838735 13451327 8001796 -454290 -3197516 430876
44393 430876 3152465 876789 -2832772 -4059129 -3626395 -3162700 -2383921 -2380150 -5284007
44384 -5284007 -8542484 -6581592 -813603 134163 -5915182 -9766003 -5431815 -272744
44376 -272744 -2026404 -4399394 2724898 14708318 17243951 7694310 -1644130 -1891435
44368 -1891435 2722821 5593133 7224090 9884942 11565868 10233817 7888022 6395162
44360 6395162 4508081 1962299 1143397 1851853 -81940 -5818501 -10468542 -10451441 -8697341
44351 -8697341 -8494939 -7074344 -536468 8145095 11461556 6445723 -2412629 -8474158
44343 -8474158 -8577728 -4517428 -972280 -813521 -1412802 2126117 8990156 11531906 4965285
44334 4965285 -4830186 -7275039 391214 10249958 13162499 7996418 807935 -2698256
44326 -2698256 -2087780 -328699 780030 1483073 1012302 -2990141 -9972167 -14225755 -10911550
44317 -10911550 -2833300 2942658 4179770 4349190 5175259 4767225 4248547 8909161 18902397
44308 18902397 25249360 21083885 12135456 8850818 11264452 10254600 3112009 -1642348
44300 -1642348 1969786 7098199 4067087 -4489579 -6836461 740516 8252794 5898463
44292 5898463 -2778319 -6520322 -1416815 5541548 6924325 3307553 144840 500605
44284 500605 3147615 5202867 4505916 1070513 -2316475 -2369672 920135 4355478 5701420
44275 5701420 5591918 5179295 4936785 6108842 9532678 12329553 10367554 5263843 3477751
44266 3477751 6268209 6799046 808598 -6331032 -8034496 -5356073 -1486278 5268472
44258 5268472 14687964 17874960 8507507 -4111824 -5867177 1531400 4509078 481595
44250 481595 809556 9258697 14298078 8892431 2681151 5345040 10948568 9987470 6100659
44241 6100659 7846194 11944665 8656007 -848060 -5691658 -1701709 4750323 7834697
44233 7834697 6871675 1336463 -8217530 -14914221 -11836601 -3952968 -3375672 -11458288
44225 -11458288 -16221781 -10384667 -1419297 1292684 -98661 1673424 6283782 7747370
44217 7747370 4960613 2483774 2429050 2175354 194897 -1058414 612301 3387752 3719381
44208 3719381 855949 -2541530 -4282857 -5848309 -9976692 -15114769 -15402476 -8492750
44200 -8492750 -526914 772473 -3893290 -7384565 -7047399 -7206869 -9991333 -10837344 -6613596
44191 -6613596 -2054618 -2631863 -5399861 -3604153 1836233 2601235 -5004377 -14610999
44183 -14610999 -18368843 -15817581 -11183791 -6394277 -1540588 703850 -2559825 -7952329
44175 -7952329 -7888777 -1010031 5125570 5096591 3594388 6531270 9239026 2727719 -10224467
44166 -10224467 -16193158 -10409586 -4316531 -8302511 -16075266 -14622243 -3088372 8099913
44158 8099913 12826245 13672649 12628851 7953744 1108252 -2376089 -1226456 -212028
44150 -212028 -1529797 -1543948 1418212 3082922 501271 -2892908 -3316225 -2181036 -1572007
44141 -1572007 605297 6175558 11542849 11998941 8401953 5274329 4400069 3878870 1748533
44132 1748533 -2124824 -5913292 -6072294 -773710 5525818 5297008 -2059092 -8384502
44124 -8384502 -8117066 -6028869 -8903474 -14633736 -16147700 -12743576 -10278607 -11405313
44116 -11405313 -12194011 -8740597 -2281975 2737881 2506017 -3536063 -10995937 -13161421
44108 -13161421 -8600570 -3882769 -5017318 -9083455 -9167426 -4644155 -433182 1671467
44100 1671467 3751945 4977862 1862210 -4136883 -6656494 -3748214 -444506 152592
44092 152592 1645347 6787579 11179258 9377805 3289941 -452005 730080 3216762
44084 3216762 2595616 -1801330 -7153105 -10060423 -9508609 -7423868 -5699933 -3732734
44076 -3732734 -900855 240649 -2893026 -7663036 -8991546 -7084355 -6803533 -8931120
44068 -8931120 -8476485 -3526835 688702 -215662 -3517871 -4945184 -5195261 -6524665 -7604724
44059 -7604724 -6560185 -4940752 -3909411 -702881 5905459 10816790 9276582 4594692
44051 4594692 2611181 1877517 -2873959 -9753380 -11026820 -5408159 -786918 -2945890
44043 -2945890 -8419129 -10947334 -9214058 -5396796 -868956 3560056 6545140 7905339
44035 7905339 9150914 11117886 13226473 14954185 15178399 11215133 2989909 -2978194
44027 -2978194 -59416 7830839 9315232 1246081 -6141200 -3655278 4111745 6240629
44019 6240629 509343 -5836554 -7328556 -5576570 -4319086 -4772908 -6213712 -7347160
44011 -7347160 -6787171 -4630434 -3067489 -3471297 -4201878 -3428551 -2394416 -3390048 -6153517
44002 -6153517 -8752120 -10283108 -10327737 -7911043 -3773872 -1438450 -2909485 -5346555
43994 -5346555 -4964498 -1885381 1920759 6450494 11521288 14093890 12707463 11658887
43986 11658887 15015433 19093943 17636317 12430632 10865475 13645475 13611145 7801675
43978 7801675 1973246 387055 -610954 -4462351 -7169106 -4007019 1991525 4373019
43970 4373019 2264216 -420988 -1442890 -542764 3737464 11712899 18777184 19425654
43962 19425654 14375371 9366124 7657871 7580388 6583541 3908203 24056 -3130385
43954 -3130385 -2428573 2372660 6125783 3921300 -1632508 -3028009 2432098 9502852
43946 9502852 11782741 8176715 2353909 -1108994 213685 4659810 7409156 5285108
43938 5285108 -149281 -5912391 -11347775 -15387236 -13690699 -4375463 5719328 7769283
43930 7769283 3345688 2319694 7715577 11134557 6176028 -1755273 -4187819 -1479925
43922 -1479925 386789 -102784 -237281 -209895 -2652613 -6216726 -6254123 -2227330 964327
43913 964327 82588 -2326482 -2322825 94792 1574923 -546175 -5625670 -9922401 -9459097
43904 -9459097 -3911381 2709103 6153742 5638061 2620708 -1784109 -6055345 -7232954
43896 -7232954 -3913626 902993 2996506 2178970 1769739 3783825 7208464 9991474
43888 9991474 10229139 6815357 1682389 -352755 2785445 6862910 7072046 5013143
43880 5013143 5131525 6445826 4347879 -150820 -237874 6592204 14945602 19818199 21854444
43871 21854444 21779903 16623926 6172480 -2462447 -2560734 3400399 7769006 7662632 5915324
43862 5915324 4471698 2219762 -1292054 -4196284 -4497292 -1748542 2475146 4383417
43854 4383417 730085 -6371557 -10607449 -9688177 -8374836 -10331023 -11992743 -9209683
43846 -9209683 -4901140 -3730592 -3627652 -402701 2820375 117677 -5281152 -3884302
43838 -3884302 5017883 11491015 10100160 6928746 7904241 9694488 7740351 5110049
43830 5110049 6493736 9709069 10214437 9110617 9823954 10969092 9233669 5979532
43822 5979532 4636482 4673538 4249766 5370300 9672371 12487494 8820991 2583615 1499244
43813 1499244 4747566 4867779 1122071 808686 6088000 9702768 7149090 3812226
43805 3812226 5082676 7457028 5503305 979420 -1583066 -2798034 -4897605 -4952126
43797 -4952126 658161 8242478 11184718 10295500 11707978 15292484 13792887 4982586
43789 4982586 -3146525 -2862387 3416243 7708669 6600076 2508173 -2049607 -6793702
43781 -6793702 -11421582 -14602743 -15160227 -12444991 -6536440 143548 3008295 -152151
43773 -152151 -5586970 -7311429 -4207786 -842267 -1272554 -4950036 -9304768 -13068505
43765 -13068505 -15126661 -12977806 -5691425 2893893 7361126 6902622 5227942 4249237
43757 4249237 1654378 -3734287 -7818615 -5675589 1715259 8331218 9807988 6789981
43749 6789981 2615235 358034 1333472 3655756 2867669 -3114632 -10368302 -13401876
43741 -13401876 -12190409 -10631108 -8895641 -3203662 5978845 12092467 11843275 10506185
43733 10506185 13410260 17187424 15291430 8514958 3453153 2673482 3022214 2628634
43725 2628634 2904300 3478784 1681432 -1587536 -1309823 4193638 10219853 12378703 11637744
43716 11637744 10047218 6260305 -602172 -6280214 -5623382 -28441 3698367 1719291
43708 1719291 -2808130 -4439472 -1872955 1281881 1347765 -644646 96 5142635 10066777
43699 10066777 8937136 2990412 -647332 1581143 5831744 7481457 6692679 5264433
43691 5264433 3029357 814917 2174181 7495863 10490484 6079690 -1547017 -4903644
43683 -4903644 -4365897 -6004754 -9925918 -9419632 -2720935 2627657 446929 -5589321
43675 -5589321 -8368913 -7239137 -6769171 -8911078 -10778450 -8554261 -1007774 8742534
43667 8742534 13316659 6672476 -7523546 -16961286 -14018656 -4787912 -595082 -3847491
43659 -3847491 -7678146 -6945254 -2854409 2389523 8340149 12550148 10439322 1711520
43651 1711520 -7669324 -12576649 -13873642 -14010631 -11871804 -6022823 177435 1819210
43643 1819210 -258134 53251 5841635 12680842 13743728 7604210 -321825 -3536780
43635 -3536780 -989468 2373307 1754777 -1557563 -1960771 3058773 9774400 13044654
43627 13044654 11404753 6041362 -1771307 -9250936 -11286567 -5719056 1929599 3824692
43619 3824692 -236694 -2798609 880819 7182840 10406357 10072392 8984043 7611055
43611 7611055 4410547 -54050 -2984886 -2896933 -983682 474484 -484774 -4287316 -8142980
43602 -8142980 -7348295 -783599 6451600 8746932 6839334 5665286 6876779 7883265
43594 7883265 7613784 7912195 8468498 5971412 710055 -1255410 3379156 8618941 6505910
43585 6505910 -1539096 -6577573 -4339400 530309 2945186 4025686 6754587 9980252
43577 9980252 10700976 9135938 7488482 5823885 3121227 678814 110859 -849106 -5433318
43568 -5433318 -10835510 -9901529 -1559474 5996194 5975016 1959117 1240884 3213835 1394939
43559 1394939 -4649708 -7325977 -2313812 5073807 7930615 6297124 3417364 -1260867
43551 -1260867 -9108152 -15694690 -14703815 -8077826 -5218684 -10165750 -15288746 -11228175
43543 -11228175 739311 10331097 10285796 3056963 -3808592 -5715164 -3898097 -2526541
43535 -2526541 -4313223 -8327349 -11092115 -9549447 -3442033 4325663 9419700 9164572
43527 9164572 4746569 -286369 -4139417 -7968138 -12267088 -14655250 -13562244 -11504940
43519 -11504940 -10919783 -9013640 -2294356 4905120 3793939 -5419682 -11084814 -5606103
43511 -5606103 3076632 2281707 -7467997 -13459944 -8280619 1752380 6663045 4474753
43503 4474753 134862 -2035335 -1332958 640414 1195775 -1540210 -5802570 -7052937
43495 -7052937 -3269688 2439346 5768561 5683166 3783148 1719105 864215 1976084 3114842
43486 3114842 490303 -5934551 -10113831 -6745179 1173272 5589758 3536578 -90764
43478 -90764 -178556 2269460 2938913 -40309 -5419299 -11428883 -16422391 -18496901 -17074228
43469 -17074228 -14025742 -11160959 -7749831 -3059817 -50027 -2538448 -8514513 -10820377
43461 -10820377 -6634256 -2278523 -4842638 -11991427 -15309740 -12553971 -10387596 -13553606
43453 -13553606 -17132335 -13601298 -3946828 3360183 3276825 -565959 -1972228 218837
43445 218837 2337769 1412542 -1668544 -4001852 -4189259 -3342577 -2758759 -1687437 1163314
43436 1163314 4300382 4095410 -288004 -4986307 -6175087 -4576189 -3072279 -2016560
43428 -2016560 68095 2834742 4748790 6312525 8839025 10585343 8239496 2443092
43420 2443092 -2183106 -3130687 -2153346 -514611 3349869 9271763 12547755 9093496
43412 9093496 998925 -6001606 -8940337 -9219852 -9472030 -10956154 -12726449 -11831989 -6053544
43403 -6053544 2200676 7007024 5669240 1965489 741514 1972126 2655097 1727117
43395 1727117 -207195 -3491244 -7781476 -9743607 -6784053 -1873214 -164399 -1585204
43387 -1585204 -1630489 658168 1032055 -2290586 -4643828 -1785069 3231231 4216233 615890
43378 615890 -2286880 -1331540 529536 -707446 -4300159 -6519024 -6449962 -6699112 -8205787
43369 -8205787 -7920729 -3905478 35072 -1109774 -5529595 -6229675 -1587676 1118452
43361 1118452 -4029323 -12153781 -13344657 -5506517 3734648 7207250 5406835 2915787
43353 2915787 1632474 -403823 -4942139 -9530558 -8381093 708779 10380318 9595826
43345 9595826 -1630400 -9096116 -2116095 10622966 12134961 1177592 -6764664 -3623154
43337 -3623154 -760634 -10365068 -25629733 -30025102 -20282137 -8939429 -6050866 -8538793
43329 -8538793 -8625039 -4527072 186865 2450518 1828073 -146758 -936450 674412 2890773
43320 2890773 3721468 4729664 8706607 14207523 16416565 13559001 8430376 3260411
43312 3260411 -2362189 -7386607 -8217098 -4547046 -2127521 -5787999 -12322323 -14438115
43304 -14438115 -10397264 -5607894 -4628439 -5314503 -2646538 3667344 7973203 5447147
43296 5447147 -1550294 -5898248 -4451065 -1533587 -1797744 -2562977 2066847 10462627
43288 10462627 13022030 4677833 -7237753 -11653431 -6885518 -651553 620977 -2532350
43280 -2532350 -6473379 -8734052 -8024848 -4441558 -760204 51605 -600830 1323199 5317649
43271 5317649 5610327 -39870 -5489003 -4154023 1752101 4903180 3426930 2023986
43263 2023986 3169202 3200619 -1165423 -7005503 -8631576 -4296777 2616247 7287485
43255 7287485 7063634 3348859 973309 3601308 8889494 10616148 6424717 409082
43247 409082 -3084100 -4291423 -4540085 -2421428 2498087 5852127 3841591 310673
43239 310673 2582365 10866734 17400930 16414155 9757659 1987516 -4600455 -8177249
43231 -8177249 -5965863 1808836 9885854 13140213 11606269 8196632 4206020 -195116
43223 -195116 -3419153 -3717021 -1920064 -542046 -799512 -1854422 -1935820 580511 5526340
43214 5526340 9800389 10218764 8065270 7632588 9286601 8053224 1256519 -6499241
43206 -6499241 -9138797 -6515099 -2737269 -463404 -504397 -3752682 -9108825 -12155647
43198 -12155647 -10210876 -6214991 -3671118 -1259305 2519510 3460521 -2467571 -10357686
43190 -10357686 -11844902 -7878971 -7079177 -11424989 -13129701 -7737966 -1188779 -77703
43182 -77703 -2845873 -5254077 -7514772 -10565752 -11309135 -7524967 -2829195 -1230652 -1091594
43173 -1091594 183300 101653 -4035925 -8317260 -7360315 -3323705 -2473129 -4704403 -3977178
43164 -3977178 1554282 7106752 9288726 9803726 9916373 7455986 1811890 -2839185
43156 -2839185 -2265807 2580447 6946885 7119579 3335910 -457188 -291167 2562665 1933698
43147 1933698 -4716585 -10850949 -8691447 -182046 5839739 5719912 3227878 751256
43139 751256 -3322468 -7698604 -7586066 -3609858 -2725039 -6506519 -7247223 -1085126 3624154
43130 3624154 -1318613 -10549498 -13418326 -10092469 -8941566 -11563516 -11902043 -9079726
43122 -9079726 -9399400 -14045662 -15627845 -10585630 -5457017 -5587782 -5965056 -285811 7219322
43113 7219322 7377760 60022 -5562380 -3773478 1713690 5041183 5244769 3896898
43105 3896898 655570 -5067449 -10439624 -11226080 -7552177 -4805792 -7327720 -12729430
43097 -12729430 -14628742 -10569208 -4454618 -280941 3391557 10047751 18680441 24425398
43089 24425398 24544927 19924110 11596388 566583 -8915973 -11267417 -6321924 204902
43081 204902 4336448 7156607 9064421 6756854 -635127 -7879949 -10534601 -10676389
43073 -10676389 -11048642 -8730399 -968020 7276855 9419485 7775468 9666042 15099189
43065 15099189 17381721 15203030 14334967 16242280 14872293 7875423 1888461 1994871
43057 1994871 3973144 2691983 1043622 3687999 7707982 7113151 2616195 -519905
43049 -519905 -1485600 -3607495 -7100666 -9005598 -8883067 -8004116 -4322429 4441787 13195380
43040 13195380 12857923 2857143 -6728709 -8083118 -4667978 -4014402 -6790328 -7697177
43032 -7697177 -4065529 1135123 3852066 3202005 1173051 -142192 -705563 -2085737
43024 -2085737 -4599494 -5999129 -4642759 -2717909 -3494766 -6072118 -6222725 -2407063
43016 -2407063 2443433 5310734 5778651 4121116 598081 -2685455 -3249941 -2519346 -4384251
43007 -4384251 -8285412 -8577350 -2974147 3278512 4918939 3912205 5154196 8761387
42999 8761387 11334224 11999073 12237006 11649413 8643782 4021424 -382067 -5251804 -11619466
42990 -11619466 -16516793 -15780775 -10574533 -6056013 -3596082 418199 7167752 12024699
42982 12024699 10836899 5661062 1765334 1754325 4597584 7833874 8919757 6809442
42974 6809442 3779414 3318700 5083144 5075530 2285051 1082475 4101085 6786855 3734627
42965 3734627 -2422503 -4376092 -1286021 -70997 -4492054 -9129307 -7543157 -1636936
42957 -1636936 1927532 1693999 2152210 5330085 7314531 4683149 70630 -1386733
42949 -1386733 1562117 6053208 9102594 9106204 5329793 -569804 -3610719 -84715 6776222
42940 6776222 9521594 5752750 955638 373810 1860580 196109 -4143216 -5173623
42932 -5173623 103 7004200 10092375 9360057 9573973 12849608 15115776 10943870
42924 10943870 771191 -8554772 -11044297 -7928732 -5173031 -5597950 -6114737 -3155343
42916 -3155343 1892735 4426005 2206485 -2554212 -5788354 -4949600 -681808 3719628
42908 3719628 5237365 4213005 3459383 4036617 3971698 1971493 -316381 -1514959 -3161356
42899 -3161356 -6364199 -8321056 -5929945 -1270328 724773 -576409 -913416 2144520
42891 2144520 5994141 7437223 6552540 4617164 1630065 -1771519 -2683585 655115
42883 655115 5012725 4558736 -2646852 -12034315 -16794807 -14246456 -7843359 -3095923
42875 -3095923 -1921618 -1791456 -286876 1533687 1611051 679480 984698 2380597 2672283
42866 2672283 1333188 -95793 -1039382 -2153592 -2624024 -780453 2074136 2194607 -1126118
42857 -1126118 -4342833 -5494861 -7233243 -11393039 -14379269 -12004187 -6448170 -3948076
42849 -3948076 -6633996 -10729380 -12506447 -12141469 -11177268 -9655726 -7178374 -4408032
42841 -4408032 -2062091 -61142 1266951 841707 -1032644 -1817366 146939 2841202
42833 2841202 3197322 2028393 3415339 8330730 11831644 9164864 2761991 -433352
42825 -433352 1985678 5571929 6340513 5850100 6620498 6768599 3493705 -897315 -1562530
42816 -1562530 1476666 3473768 2236932 509856 659941 1592955 2073216 2904804 4257921
42807 4257921 4541716 3508259 2971793 3031550 1411527 -1756221 -2709318 -74790 2019767
42798 2019767 123185 -2943708 -2666057 -116864 -129129 -3707643 -6441423 -4273288 1852519
42789 1852519 6957904 6384972 362201 -5088568 -4180918 1020271 2654538 -2061154
42781 -2061154 -7001783 -6792752 -4563784 -5434781 -7684463 -6871335 -4511893 -5122656 -7558156
42772 -7558156 -7313212 -5479317 -6811101 -9768847 -7746228 -939345 2325150 -1617590
42764 -1617590 -6607116 -7763804 -8895752 -13499057 -16463388 -12146889 -4699077 -2046964
42756 -2046964 -3535130 -2065840 3515665 6674721 3893126 -449272 -1644493 -909176
42748 -909176 -1164234 -1189101 2224749 8637954 13807800 14562304 11859156 9141748 8842161
42739 8842161 10639532 12469703 12570056 10324000 6012892 1152440 -1310488 694589
42731 694589 5383925 8627744 9169889 9783109 12031460 13061165 10077797 5157315 2192240
42722 2192240 1322959 468917 597431 4298077 9485249 10143881 4845552 -463273 -909124
42713 -909124 363667 -2251735 -7407661 -8288779 -2749564 3339840 4274995 1717825 795321
42704 795321 2066636 1656573 -1659438 -4289086 -3985223 -4022988 -8055042 -13463526 -14116971
42695 -14116971 -8968843 -3605575 -2592309 -4250573 -4799073 -4103333 -4229543 -4668181 -2874609
42686 -2874609 971961 3114184 930859 -3478073 -5443254 -2704937 2223222 4527369
42678 4527369 2114579 -2075801 -3779735 -2984125 -3487468 -6658372 -9049841 -7952859
42670 -7952859 -5669859 -5115411 -4734490 -2533860 -2032256 -7272591 -13162193 -9313841 4499192
42661 4499192 14900123 11642414 1051513 -3823922 -1201305 -132732 -4854816 -9393062
42653 -9393062 -8567696 -5250533 -3113460 201119 7044425 12535389 10461005 3542966
42645 3542966 765349 5067236 9860329 8562639 2426561 -2711901 -3338063 -87087
42637 -87087 3896602 4621719 366610 -5040720 -5021637 1732590 8943761 10451068 6990071
42628 6990071 2773687 -943467 -4854704 -7225579 -5777745 -2449488 -1061543 -859076
42620 -859076 2376284 8652218 12605168 11224875 7724072 5732433 4312754 1557624
42612 1557624 -949295 -864286 614306 589555 -1551577 -4733157 -8199985 -10042579 -6835113
42603 -6835113 1228759 7594858 6719491 2089167 1029491 2918003 73424 -8733594
42595 -8733594 -13974040 -8922746 -638507 -332564 -7104641 -10034280 -5314390 -1776948
42587 -1776948 -6576585 -13814389 -13747586 -7633870 -4938516 -8114052 -9532635 -4878053
42579 -4878053 -713203 -3843311 -9788412 -8961299 -781351 5864543 5223755 855987
42571 855987 -1416225 -599991 1426261 3958188 6553372 7281733 4609372 -673329 -6487916
42562 -6487916 -10425952 -9730610 -3789506 2941373 4651318 1846864 888381 4477566
42554 4477566 7689038 5804823 702966 -4020698 -8923692 -14968457 -18709856 -17098562
42546 -17098562 -13479272 -12696104 -13193530 -10455750 -5845994 -4735663 -6923449 -6255669
42538 -6255669 -152240 6914971 10269288 9649149 6295215 1159655 -2903066 -2755222
42530 -2755222 -339166 -1315775 -6720369 -10793924 -8797002 -2501636 3419489 5869535
42522 5869535 3278633 -3443697 -8450034 -5369973 3516471 8262645 4027537 -3012954
42514 -3012954 -5472351 -3957283 -2265109 68289 4455599 7694301 6353782 3026702
42506 3026702 2029606 2227304 337033 -1939475 -1087055 471465 -2465969 -7927781 -7568197
42497 -7568197 1754283 13205718 17956516 13520892 4148016 -2536328 154565 11639940
42489 11639940 22072020 21944132 13668635 8031104 9363961 11220266 7952119 2909852
42481 2909852 1488873 2455516 1421361 -1281187 -1568038 1707852 5269529 5549465 1730521
42472 1730521 -3904669 -6863058 -3837628 2911692 7005103 5756389 3795914 6370452
42464 6370452 11673253 13141176 7850543 -291201 -4890683 -2704512 3888524 8597093
42456 8597093 6998206 1790027 59752 4185065 8655841 7879769 3457225 600046
42448 600046 757099 1716568 2049544 1048849 -2918489 -8765590 -9906239 -1635720 9936807
42439 9936807 13567130 7817287 2876278 5637954 10700479 10337555 6300084 4969046
42431 4969046 5762127 2878650 -3228548 -4858867 1089071 7670344 7786358 3809532
42423 3809532 2414358 3911368 3182195 -343350 -869727 3845184 6896674 1111983
42415 1111983 -10019527 -15835430 -11869152 -4433827 -1230947 -2320646 -2687223 188075
42407 188075 4689085 8449849 9973888 8562792 5717960 4980816 7130393 7409448 1839149
42398 1839149 -5029678 -4215113 5404215 14375630 14184656 6783961 25024 -2132259
42390 -2132259 -1364621 -397673 -706717 -2653486 -4596841 -3887699 -1428804 -2171858 -7658799
42381 -7658799 -11899120 -9775796 -5898962 -7989810 -13779478 -13191922 -3623943 5801099
42373 5801099 7180390 2600832 -3063541 -9298181 -14776353 -13551609 -4120608 4269492
42365 4269492 3150623 -2375828 -1847476 3760661 4617978 -765021 -3488442 -388582
42357 -388582 334123 -6227543 -12606455 -11101232 -5849502 -4881673 -7308104 -7032566 -3726142
42348 -3726142 -1062802 1847017 7653917 12048306 8188699 -454558 -1945924 7154163
42340 7154163 15728994 13219998 3383004 -2741616 -2071651 -702520 -2661872 -4769585
42332 -4769585 -3325638 -195394 674988 -469020 -254848 1461787 584178 -4239160 -7323972
42323 -7323972 -2913372 5255304 7010383 -836554 -9786264 -10941957 -5667507 -911000
42315 -911000 1123161 2720797 3721006 2002129 -562464 517419 5066215 8133425
42307 8133425 7194639 4087582 184630 -4250196 -5958973 -1017527 7335808 10052995
42299 10052995 4038683 -3379287 -4497822 -113615 4647931 7678512 9132559 8269223
42291 8269223 5512292 3951105 4827338 4798050 1206795 -3113709 -3620187 298363 6128300
42282 6128300 11373825 13598900 11402928 7870715 8430126 12487070 12646266 5989297
42274 5989297 165483 2958091 11101055 15617370 13699440 8753479 2930684 -2888567
42266 -2888567 -4886845 -74175 7277444 9900908 7036810 3618690 1817024 -143550
42258 -143550 -2408886 -3384841 -3891552 -5199637 -4742642 -352122 3566799 1691221 -2672508
42249 -2672508 -2558264 -202647 -4600435 -16007203 -23666865 -21398400 -15598826 -14148804
42241 -14148804 -16199586 -17185181 -15969808 -12476242 -5612370 1645800 2130023 -5250236
42233 -5250236 -11443146 -9076418 -2662661 -1024141 -4442141 -5896980 -1898244 3901516
42225 3901516 6264804 3417863 -1969703 -4540053 -1491320 2625644 455427 -7422833
42217 -7422833 -11827783 -7456795 18030 2761567 660085 -1750145 -2413529 -1151548
42209 -1151548 2578292 6476490 5265453 -1459246 -6751397 -6355489 -4779253 -5973599
42201 -5973599 -5520132 471527 6084206 4703280 1245872 4412120 11320907 11798314
42193 11798314 5455806 2237599 6132943 9813150 7192297 1554793 -1256849 232665
42185 232665 4888546 10444524 12059834 6571546 -1005030 -2540041 1273649 2114963
42177 2114963 -2474056 -6224129 -6354968 -8360770 -14843032 -19359447 -17012290 -12765518
42169 -12765518 -12646559 -13713363 -9990526 -2832189 2025045 3587284 4640730 4889769
42161 4889769 2296678 -598050 1175430 6589338 8417450 2952089 -4349724 -5149264
42153 -5149264 2128714 11065339 14963605 13707143 11552433 9502056 3979866 -5365118
42145 -5365118 -11451720 -8318860 -550432 2351442 -841564 -2808681 134045 3676568
42137 3676568 4144711 3223311 1896639 -2284358 -8619963 -11523860 -9345886 -7848699
42129 -7848699 -10633594 -13306065 -12081948 -10672259 -12270396 -11887696 -4710425 3704539
42121 3704539 4616796 -479306 -2660323 818487 4688869 6101946 7954826 11286385
42113 11286385 12350865 9522000 7173490 9757406 15451454 17885652 12824338 2871380
42105 2871380 -3907836 -1908292 4610083 5617360 -1512124 -8100008 -6773336 -1805194
42097 -1805194 -1085367 -3600771 -3073142 42677 -320980 -4480204 -5991293 -2037005 3298063
42088 3298063 6782735 9725296 12910559 14482516 14045677 13224637 11748940 8539631
42080 8539631 6262069 8487012 12755088 13186925 9435872 5856434 2885204 -1982448
42072 -1982448 -5420130 -1235617 6960991 7973882 1070553 -601324 9546769 19727879
42064 19727879 17088375 6538559 1521511 3885373 5042148 2166158 863332 3513411
42056 3513411 5771476 4741753 2088816 -1024856 -4780722 -7035689 -5900190 -5016627
42048 -5016627 -8747990 -13125519 -10246463 -1753659 1608670 -3898815 -8521717 -3038474
42040 -3038474 8246539 14216183 11162283 4307933 -1121578 -4241321 -5635591 -5487098
42032 -5487098 -4751222 -4857215 -5715174 -5731279 -3874731 -902241 1121081 429310 -2333873
42023 -2333873 -4006311 -2672046 -925845 -2622608 -6620148 -7358409 -2428061 3934231
42015 3934231 6150356 2878229 -3766606 -10669733 -13665744 -9385908 -320284 5499696
42007 5499696 3489062 -1754190 -3380216 -1892606 -3086935 -8615449 -14040533 -15415567
41999 -15415567 -12613394 -6447118 1936077 7987467 5847021 -3730900 -11800326 -10942934
41991 -10942934 -3639688 2257923 3765452 4336287 6449326 7322909 3375742 -4050557
41983 -4050557 -9857087 -11039823 -9188476 -7167271 -5706194 -4808900 -6302208 -11219630
41975 -11219630 -15148625 -11426362 -1273285 4395135 -1794978 -12453721 -14215117 -5687049
41967 -5687049 1471292 -449825 -5928928 -6771161 -3702594 -2222214 -3466214 -5448354
41959 -5448354 -8245488 -11420625 -10838068 -5192834 -1595516 -6386626 -13610506 -12124669
41951 -12124669 -2444007 3930956 2119344 -254432 2651681 5564643 2402587 -3225212
41943 -3225212 -4879958 -3655873 -4094425 -5142184 -3135440 50343 -153797 -2444157
41935 -2444157 -1661910 1935537 2973824 433975 -425537 2976723 5961147 3650772
41927 3650772 -2035106 -5597389 -5090370 -2953041 -1453156 -278048 1350363 2241569
41919 2241569 495580 -2977650 -4335905 -2052547 -371852 -3753433 -8921202 -8036689
41911 -8036689 -524188 4939835 3245017 806367 5218415 12829885 14321013 9016104
41903 9016104 5123839 6984417 10142926 9633716 6241358 3006485 1019470 352975
41895 352975 887158 1046368 -738040 -3011025 -3182428 -1882736 -1494915 -1310563 1092651
41886 1092651 4286793 3888364 -1126825 -7584645 -12878355 -15777688 -13908450 -6418086
41878 -6418086 1790653 4776135 3539530 2753470 1503936 -3933519 -9356099 -5738584
41870 -5738584 5581828 12089204 7744271 630641 -1344196 -1233201 -3555711 -5172667
41862 -5172667 -3725162 -4806283 -10812398 -12123572 -1476168 10620978 8971376 -2653057
41854 -2653057 -6039294 4842716 16759660 18436822 14691538 14203802 15039728 10620519
41846 10620519 2638840 -785518 3139820 8550827 8606404 2527352 -4678373 -7138136
41838 -7138136 -3066210 3799573 7658727 5608512 -877998 -7938223 -11570593 -9811521
41830 -9811521 -4914870 -1877974 -2601306 -3330278 -334797 4243524 5559126 2929732
41822 2929732 -332330 -2168320 -2695652 -1366530 2302070 5960998 6598663 4969597
41814 4969597 4123539 4321052 3265734 630860 -1566261 -2622517 -3783296 -6044165
41806 -6044165 -10236806 -17289550 -24769260 -25991239 -17835684 -7258890 -3902371 -7542184
41798 -7542184 -9349564 -5022586 193203 193206 -4631144 -10120479 -13047180 -11676288 -6300161
41789 -6300161 -324007 3207661 6180506 11902842 17546937 16007593 5966262 -5398309
41781 -5398309 -10696733 -8601290 -1979198 4676161 6172126 1313516 -3158656 121402
41773 121402 7944062 10146713 4612501 -264001 423759 1404847 -2018041 -6019012 -6168574
41764 -6168574 -4909384 -5268518 -4614056 -925429 1607840 -182875 -2094674 -403752
41756 -403752 130579 -5989296 -14429281 -16631794 -12225409 -7740927 -5946407 -4425998
41748 -4425998 -2642325 -2668422 -3790038 -2874050 420133 3755286 6050460 7071484 5689592
41739 5689592 2867721 2707154 5648579 5439423 -859040 -5306739 -39550 8845153
41731 8845153 8676801 -1311501 -9771322 -10143172 -6544340 -2807949 2590002 8588047
41723 8588047 9712554 5884578 4101766 6271230 5297543 -1577567 -5738062 -1006974
41715 -1006974 4511558 238311 -9723885 -12467648 -6033895 -1760432 -6508995 -12778116
41707 -12778116 -10235854 88431 8323628 8588699 4326854 2165077 4494466 8579606
41699 8579606 10279004 7313817 563630 -6001337 -7636749 -3481084 1333888 1030343
41691 1030343 -3177379 -4519953 -776469 2092828 -397836 -3255456 511044 8327531
41683 8327531 11493756 8195698 4886503 4906940 4273602 663929 -1351373 2248938 8363040
41674 8363040 11494062 10310265 6509615 2025843 208437 4514150 12705557 17557306
41666 17557306 16748312 16280999 19875999 21408464 14219722 2687182 -3107836 -924211
41658 -924211 2869379 3732046 2630122 472117 -3598048 -7845869 -8221294 -4286490 -82219
41649 -82219 1755936 2454642 3171133 2919567 1330237 -156607 -638900 -312358 1412382
41640 1412382 5249381 9555445 11481800 10283081 6866618 1536728 -4261163 -5916059
41632 -5916059 -430586 7812265 11428946 9634272 7896124 8475962 7884253 4469657
41624 4469657 1771051 2364746 4499807 7042740 11624509 17212564 18871152 15513419
41616 15513419 12945934 15079960 17882012 16798559 14427289 14875151 15574074 11723329
41608 11723329 5160231 1598235 1711392 2079492 2855744 6946426 12564645 14070183
41600 14070183 10465184 6544822 5183500 4543865 3305935 2539445 1821765 -313301
41592 -313301 -1398433 2822084 9959939 11604091 4658546 -4379959 -8946979 -9615663
41584 -9615663 -8937963 -6356553 -2623487 -2414944 -6929625 -9804389 -6460290 -1964080
41576 -1964080 -2754187 -5691503 -3412324 3358466 7623563 7702759 8074505 9991288 10251351
41567 10251351 9158175 10821453 14529392 14249588 8549373 3112744 1227808 -237068
41559 -237068 -2608992 -1692827 3248474 4852404 -1713610 -9913010 -10608808 -4694949 81473
41550 81473 698101 -332255 -2495863 -7214202 -11480410 -9703293 -2596999 2569638 2004530
41541 2004530 -173629 650073 3057400 3256987 1241013 7579 812542 1696644 -281981
41532 -281981 -6406904 -14619411 -19979101 -18482037 -11205086 -3626394 -646685 -2987298
41524 -2987298 -7565862 -9963911 -7738979 -3296004 -2110654 -5714551 -8314879 -3945936
41516 -3945936 4642488 8969780 6000753 909102 -1733153 -3461192 -6404650 -8100779
41508 -8100779 -6046472 -3193001 -3769283 -6188459 -5459321 -1523626 294208 -2170328
41500 -2170328 -3844953 513974 8312824 11707949 7225969 -444796 -4784028 -4730496
41492 -4730496 -3739818 -3741056 -3651730 -3592821 -6235170 -11932181 -16063923 -14615538 -9972837
41483 -9972837 -7276743 -6854692 -4942895 -1018009 904664 -1162558 -4304050 -5838892
41475 -5838892 -6812942 -8387315 -8970664 -7490060 -5755508 -4771284 -2276446 2763594 6470557
41466 6470557 4721673 -864445 -5227645 -6014934 -3996600 127041 5072670 7277185
41458 7277185 4844081 1909849 3867620 8876570 9722199 4384522 -1207212 -2544406
41450 -2544406 -2743516 -6150579 -10840452 -12238546 -10719306 -10098633 -10395207 -7939994 -2659552
41441 -2659552 527726 -424999 -382149 5493119 13143176 13749872 5772759 -2387256 -3226461
41432 -3226461 912771 2939415 1478777 1168020 3916555 5762471 3775439 1149174
41424 1149174 2318534 6262853 8221285 6138258 2089509 -1344035 -2888719 -1847332
41416 -1847332 906709 1654223 -2739380 -9704755 -12747825 -9407920 -4283936 -2521884
41408 -2521884 -3256730 -2102999 1945972 5404989 5506315 3579249 2627878 3540394 4746151
41399 4746151 4506302 2541110 -30816 -1530785 -815707 1683951 4094514 4910231 4590671
41390 4590671 4554527 4646077 2993683 -905749 -4421120 -4692913 -2388620 -632207 -760183
41381 -760183 -1362217 -1113595 339162 4301328 11855970 19346568 19556729 11160390 3527040
41372 3527040 6535331 16948494 21171018 12607869 459614 -2020111 6367413 15147605
41364 15147605 16132448 11147111 5627782 468945 -5922449 -10866095 -8666715 558114
41356 558114 8117416 6283504 -1903335 -6578684 -3916406 -242052 -2225766 -7588961
41348 -7588961 -8715987 -2512481 6948371 13741540 14537907 9216380 984628 -4540717
41340 -4540717 -3944809 130536 2398747 1522161 100079 -864269 -2836964 -5039851 -4069090
41331 -4069090 264912 3466902 2945246 1707948 2935278 5378550 7448996 11083092
41323 11083092 16662257 18295093 10797685 -856429 -6043504 -1959903 3895535 5022014
41315 5022014 3140136 2606591 3960848 5934697 8458484 10099015 7253250 -26564
41307 -26564 -5627857 -5326713 -3185845 -4695637 -7292202 -4711881 1581118 3750964 534916
41298 534916 288639 8230005 17897341 19991701 14295958 7407339 2641996 -1741698
41290 -1741698 -6493617 -9537141 -9775743 -8091780 -4675887 602552 5206653 5241122 321030
41281 321030 -5827277 -9680088 -10133433 -7342292 -3164613 -2018532 -6395276 -11266445
41273 -11266445 -8363740 2502935 11751186 12118648 7239612 4509314 4289290 1644058
41265 1644058 -4253598 -8503321 -7470571 -2603182 2624579 5744672 5442671 2314985
41257 2314985 -342375 351332 2808885 2903845 -196343 -3414563 -5162486 -7565517 -11859639
41248 -11859639 -14852940 -12705680 -6769124 -3061818 -5690509 -11981362 -14751944 -9333115
41240 -9333115 1969328 12456518 17123812 15229079 8430292 -412188 -6826689 -7339871
41232 -7339871 -3949235 -2177960 -3047252 -1722989 3233342 5292660 -107236 -6648111
41224 -6648111 -5883814 -880828 -1573480 -8307241 -10685960 -3937530 3890472 4546459 239897
41215 239897 -3198990 -5642053 -8725818 -9270743 -4298905 1692307 1962439 -2407432 -4112237
41206 -4112237 330085 7578845 13040147 14429227 11043595 4166166 -2576551 -6758499
41198 -6758499 -9506640 -11418248 -9546187 -3009649 2031273 -543815 -7050513 -8357591
41190 -8357591 -2920308 1790763 921796 -2012289 -2435827 -1082415 -478983 -513516 -431121
41181 -431121 -969430 -1945460 -1504546 -24315 -1030490 -5748941 -10012093 -9143278 -3469261
41172 -3469261 2844768 6007681 4343847 -1313108 -7391708 -10134927 -9382758 -7507959
41164 -7507959 -4791869 306694 6143532 8190541 5823942 3912741 5425937 7036425
41156 7036425 4634164 -1103343 -7151589 -11584593 -11919120 -5240828 6202639 14382134
41148 14382134 14856204 12366467 12683552 13815931 10987108 5827438 3754436 5368375
41140 5368375 7205912 8423238 10004903 9832298 5684771 997208 194006 427197 -3717608
41131 -3717608 -9112127 -7469431 511707 4924620 2046500 -626428 2198801 5599918
41123 5599918 4654556 2884136 4169470 4987862 2167387 713849 5545079 11914620
41115 11914620 13000683 11454674 13714578 17338618 14573775 5749057 -1472693 -4559455
41107 -4559455 -7080147 -7915665 -1215408 11078126 17934682 14581766 9443514 10491380
41099 10491380 13321590 9647986 855478 -4825049 -4551353 -2933745 -4033736 -7347496
41091 -7347496 -10553401 -11490579 -8444647 -2393673 2211971 2412876 1088198 2867652
41083 2867652 7131102 8919136 6099009 1992407 801477 3232555 7051876 10079499
41075 10079499 12058650 13955196 15121576 12187444 3541827 -5382010 -5873131 3222247
41067 3222247 12805876 14467369 9938050 6048805 4485247 1686639 -3843449 -9462695
41059 -9462695 -12217038 -10639930 -4590398 2819075 5666142 2040316 -2271559 -1744960
41051 -1744960 549628 -1327665 -5506152 -5332879 -1010045 816877 -1357569 -2036885
41043 -2036885 771827 2801865 3357992 7792725 15917351 17667458 7105932 -6882156
41035 -6882156 -11608789 -6676758 -1449259 -1029915 -2829253 -4065165 -4574261 -3348693
41027 -3348693 546305 3587272 290517 -9070384 -17484167 -18612654 -12551160 -4825784
41019 -4825784 -1972787 -6496979 -13719962 -15756897 -10932122 -5937913 -5817132 -6571432
41011 -6571432 -2588699 3319845 4206230 26267 -3178154 -3096274 -2466654 -1894481 639372
41002 639372 3482887 2621075 -289338 732278 5526149 6974010 2696513 -839203
40994 -839203 721733 2605034 -370801 -5065094 -5770635 -3181230 -1722023 -2264411 -3081950
40985 -3081950 -4363190 -6397340 -6526346 -3140511 203694 -287535 -2465764 -2157393 -368910
40976 -368910 -777930 -2413061 -1228784 2461834 4668457 5136967 7225082 9992776 7660146
40967 7660146 -614131 -6776502 -3921791 4031137 7402240 2910782 -3920583 -7411820
40959 -7411820 -7985830 -8717694 -9388309 -7128951 -1832930 2513046 3183408 3057861 6930558
40950 6930558 14337906 19252862 17501502 11598297 6818405 5044314 4617653 4245959
40942 4245959 4312000 5199924 6646270 8408577 9923252 9779831 7069908 2943245 -378821
40933 -378821 -1886342 -2349082 -3062778 -4470770 -5563409 -4910328 -3172133 -3322702 -6019742
40924 -6019742 -6250574 1009555 12005605 16589576 11009797 2919018 928194 4479507
40916 4479507 7745956 8239078 6566459 2414738 -3198960 -5462143 -1835455 2732663
40908 2732663 3061095 2496253 6691947 12154860 10889770 4824836 4393793 11691575 16249510
40899 16249510 11185021 3333905 1746236 4855807 6079303 5230427 6520695 9928701
40891 9928701 12011759 12101806 11228088 7785215 591745 -6115011 -6896846 -2643155 1452037
40882 1452037 3328822 4040200 2912282 -659473 -2549042 1498896 7492757 7304933
40874 7304933 1311267 -1465895 2595052 6343748 4171550 1151628 3766316 8604726
40866 8604726 8430749 4605604 4000202 5874448 2151090 -8214443 -14847526 -10121152
40858 -10121152 -181834 3987057 976288 -2400003 -3028722 -4031266 -6592686 -7363344
40850 -7363344 -5332919 -4227102 -5239535 -3590243 3464417 10281175 9871936 3864847
40842 3864847 -221439 531910 2370289 2035124 144674 -2575796 -6806853 -11057926
40834 -11057926 -11182350 -5481679 2807166 9464921 13039044 13958693 12984831 11551081
40826 11551081 10995270 10653649 8986589 6649712 5853788 6958326 8427851 9225097 8148972
40817 8148972 2932684 -5316149 -9374315 -4333487 3437340 4468032 1680690 6050606
40809 6050606 16172946 16774769 3106784 -8091093 -2540214 9558144 9941676 890670
40801 890670 -389365 9288585 15275041 10392044 5215128 8006446 10910128 5167912
40793 5167912 -2687450 -1097849 8407797 14630995 13409663 10551600 10228261 9719600
40785 9719600 6441858 3470957 5667297 13454841 22021767 25682937 22907590 17230869
40777 17230869 12628917 9161375 5422868 3365645 5829917 9966304 9325301 3503774
40769 3503774 -649257 563373 2725030 1836644 936175 3456231 6164389 4772202
40761 4772202 1687746 1720686 3990257 4733690 4861144 7634165 11211194 10904082 7678706
40752 7678706 7152110 10178871 11254904 7295690 2071517 313876 2373927 6442342
40744 6442342 11665284 16922093 19885710 19463843 17182397 15107255 14077417 14073682 14400319
40735 14400319 13883992 12887828 14016687 18305827 22356490 22659978 21018978 21312166 22421318
40726 22421318 19956486 14542405 12134816 14990965 18236584 17618825 15391176 15521300
40718 15521300 17619553 19190356 20185022 21360505 20910535 16935981 11688090 9465498
40710 9465498 10872182 12471508 12264406 12613639 16429054 22114100 24503094 21305197
40702 21305197 16817008 16907812 21009082 22827747 19897025 17612483 20639519 25166439
40694 25166439 25038106 21474471 19617148 18683816 14619506 10945036 16086671 28530113
40686 28530113 35701888 31710918 25994632 28470444 35609675 38877970 38356562 38435462
40678 38435462 37104097 30755094 24837527 27845853 37201846 42671059 42562007 44595582
40670 44595582 50311255 51184372 43554470 35920748 35761149 38650574 37421983 34452256
40662 34452256 36813967 44402539 50825301 53127700 53747306 54574285 55077382 55590480 57659055
40653 57659055 61282576 65024441 68109161 70025386 69824775 68438267 69484490 74731836
40645 74731836 80906373 84080069 84735515 84990949 83811842 79981587 77675077 82886390
40637 82886390 94371013 103764387 105943463 104641113 105989724 110584235 114752830 116879994
40629 116879994 118908228 122192200 124831998 124534137 123055190 125485329 133786400 142834562
40621 142834562 146006072 144050630 144102582 149146252 153680022 152490770 148406518 146639778
40613 146639778 145958704 141912440 136019359 134641501 139685943 146908563 152981525 157718083
40605 157718083 159325790 154676112 145869396 139961181 139698302 140159000 137008536 132451012
40597 132451012 130015932 128864329 126973134 125229322 124320041 121626211 115430883 108989615
40589 108989615 106543776 107971266 110520605 112903873 114766409 115282182 114996719 115536698
40581 115536698 115139057 109194168 98189611 89339271 86109296 82682905 74971973 70230344
40573 70230344 76403679 86813020 86820743 74183506 61606248 58400354 60455720 61310233
40565 61310233 62882350 69156758 76411624 76990806 69608590 60563832 56250348 57741558
40557 57741558 61375699 62391631 58892605 53055837 47652827 42812627 38683839 38553709
40549 38553709 44078361 49496056 47931100 42927129 44989670 55136115 61331292 55401825
40541 55401825 44528715 39499450 39325986 36134691 29772409 27448519 30975102 33809299
40533 33809299 31422763 27240103 26537342 29852480 34231817 36896888 36109725 31706180
40525 31706180 26337823 23919341 25637013 28723258 29397209 26129762 20758981 17505332
40517 17505332 19627905 25638918 30159556 29714608 25883276 21794125 18493761 16514979
40509 16514979 17447699 21041363 23948928 24498778 25320392 27691063 27394614 21380650 14904478
40500 14904478 15317333 20818224 22576839 17537062 12146371 12606998 17706993 22839977
40492 22839977 25533498 24939721 20763635 15311097 12941796 15214964 19262324 22089365
40484 22089365 23471247 23909335 23312490 22640099 23240291 23706186 21323172 17552151 17474041
40475 17474041 22039665 25575014 23684655 19304458 17429673 17661059 16482313 14396937
40467 14396937 15674160 21330925 26460764 25698881 19241456 12341130 9615762 10621191
40459 10621191 11341849 9705408 7917269 8200661 8580515 6147234 2967041 3993976
40451 3993976 8934944 11261420 7175024 1195984 20929 4215674 9113658 11262197
40443 11262197 10622357 8263789 5299305 3347953 3419684 4532789 4879986 3740927 1448101
40434 1448101 -1055265 -1665928 1731080 7727780 10802578 6736146 -1970176 -7893055
40426 -7893055 -5883335 2166112 9215325 9502556 3914967 -1128007 -974522 2267268
40418 2267268 3860170 3418797 3668852 3760826 160692 -4975176 -3370441 7806393 19712854
40409 19712854 22128617 15677450 8644264 5626010 5576465 7949657 13098519 17517715
40401 17517715 16394701 11877855 11767558 17610486 20581372 13393911 1384407 -3625153
40393 -3625153 2310189 12387523 19052694 21132814 20593386 17971213 14211170 13064346
40385 13064346 16762010 20629621 17026119 5580208 -4604900 -5180952 2014397 8341783
40377 8341783 8514856 3976717 -1763357 -6581954 -8795544 -7037294 -2375247 1961602
40369 1961602 3841929 3685379 3161006 4462243 9551664 16965680 20749802 16899426
40361 16899426 10079988 8886179 14464971 19317737 17958536 12814191 8260100 5266661
40353 5266661 4332661 7046180 11100068 10188875 3497127 -898851 2195887 5849165
40345 5849165 908423 -9418637 -13477057 -7273705 1757181 6300667 6472370 4969503
40337 4969503 2235267 -1265818 -3250944 -2579508 -768491 503109 590550 -1271853 -5010124
40328 -5010124 -8002784 -7717963 -5159192 -2158916 2677111 10114488 14495609 9283359
40320 9283359 -1707141 -6802237 -2151772 3128485 1237462 -2794514 -353109 6109669
40312 6109669 6595300 -581656 -5454962 -325816 10041748 15703774 14230831 11302048
40304 11302048 10994155 11054031 8563852 5535568 5506926 7116949 5433484 -631154 -6243043
40295 -6243043 -6941477 -3647517 20905 2257205 3021515 2542130 2282604 4794280 10046832
40286 10046832 14184564 14251516 11705797 9124477 6614088 4090249 3305509 4026455 2067092
40277 2067092 -4383205 -10054234 -9253917 -3926702 122451 1227442 59121 -5512848
40269 -5512848 -15230006 -19758149 -9989995 7737184 16436960 9574077 -2512185 -8581831
40261 -8581831 -8116970 -4278389 2988435 11002792 12025850 4776827 -271658 4251306
40253 4251306 9931174 4765309 -7630636 -12362474 -4221128 6572217 9514649 5179315
40245 5179315 -183417 -3345533 -4268860 -3183185 -806068 1591295 3956738 6857010
40237 6857010 8967833 8242260 5525253 3701415 3395359 2958955 2310075 2673536 2658967
40228 2658967 -496196 -4887885 -4352237 2650673 9020780 7484896 -26636 -5364882
40220 -5364882 -4424295 -296008 2684035 3502476 2691343 309819 -2201878 -1382406 3807338
40211 3807338 8634590 7329912 898340 -3264329 -451839 5534409 7223031 2002707
40203 2002707 -5788557 -9495686 -5418988 4479675 13265577 14309835 7919402 1085279
40195 1085279 -872380 155985 -183086 -1973197 -2628631 -2189450 -2528036 -3397026 -3606173
40186 -3606173 -4027923 -5176637 -4702880 -2384758 -3813959 -11884457 -18051534 -11705712
40178 -11705712 3209180 11645338 7985930 2003238 2197423 5002531 5188746 5473481
40170 5473481 8619773 10017502 6747506 5390039 11237813 17358234 15179358 9525879
40162 9525879 10780545 16572698 15112367 5499450 636972 7336167 15836234 14632494
40154 14632494 6309234 1480930 3103572 4497575 637699 -4994283 -5640597 -72
40146 -72 6125411 6552937 1802639 -2012376 -890976 3217056 6582057 7775877 6182878
40137 6182878 1284074 -3710352 -2735515 4313851 8800902 4835496 -1712075 -2636087
40129 -2636087 -538255 -3081525 -7876079 -4904089 6170803 12823687 6864465 -4698040
40121 -4698040 -10173436 -6859066 181309 6292155 9270729 8364697 5766930 5384216
40113 5384216 7155979 6738662 3027880 603490 1830768 2585816 -40470 -1859495
40105 -1859495 963860 3935581 923781 -4791497 -4329940 3071442 8080756 4296208
40097 4296208 -3284621 -5723392 -1309229 4607151 8034072 9930668 11684589 11321601
40089 11321601 6772907 835922 -855122 2797537 6395333 5334337 2077315 1868509
40081 1868509 4342131 3972752 -1481297 -7555060 -9207211 -6691927 -3592908 -1876362
40073 -1876362 -962441 156209 1728367 3213981 3493303 1989600 -100267 -753644 715415
40064 715415 3505199 6714699 9311738 9540052 6561778 2399507 367374 1861509
40056 1861509 5842074 9965533 10698618 5099129 -4372582 -9550678 -5502712 2238498
40048 2238498 4322410 -234710 -4157397 -2910223 1071773 4975265 9150570 12604087
40040 12604087 11910408 7463718 4889698 6865340 8658776 5466981 -298283 -3057578
40032 -3057578 -1796680 321360 1498641 2601812 4223625 5270434 4192265 881674
40024 881674 -1909646 -173684 5874286 9677142 5895955 -1580189 -4861106 -3833387
40016 -3833387 -5088475 -9344240 -9406126 -3020715 1991494 248494 -2577458 -334980
40008 -334980 2505046 -918891 -6571721 -4681806 4642606 10674492 6811888 -1817263
40000 -1817263 -6718136 -6020108 -4090650 -4871840 -7619364 -8346675 -5327697 -2382904 -3874513
39991 -3874513 -6919449 -3932323 5923414 14389293 15956613 14799979 15562255 15103791
39983 15103791 10035738 5047757 5128918 5717050 449366 -6423228 -6445121 -1961837 -2540636
39974 -2540636 -8465330 -10780598 -7758420 -7738884 -12900978 -13518928 -4166581 5758822 5539079
39965 5539079 -1610455 -5292492 -3283494 -1178869 -1101245 204252 3705806 6232007
39957 6232007 6406710 6695129 8784074 11053746 11480991 10186897 8442978 7007945 5747249
39948 5747249 3868564 849956 -2303120 -3726777 -3093601 -1810461 -343285 2391692
39940 2391692 5743397 5928002 556324 -6468710 -7429096 795209 11865346 15175138
39932 15175138 6921042 -4859176 -8528894 -2103525 5159750 5665250 3238811 5916543
39924 5916543 13085878 16501578 12565970 6404491 3043751 1145648 -2189570 -5749247
39916 -5749247 -6497341 -3989792 9990 3714308 5756000 6154533 7234719 10129653
39908 10129653 10652525 3843239 -6805007 -11003438 -4813685 4040895 7256414 6055733
39900 6055733 5536918 4982569 733362 -5176829 -6940363 -4089816 -1840035 -2427972 -2226525
39891 -2226525 1385968 5338814 5250065 1369249 -1794080 -135302 6477936 13683056
39883 13683056 15369054 8788842 -2262885 -10291945 -10555151 -4548192 2233591 5370401
39875 5370401 4977811 4563200 6070670 6983980 4176941 -644025 -3071628 -3072412 -4653482
39866 -4653482 -7450159 -5088525 4566973 13683894 14539654 10247608 8511150 8910020
39858 8910020 5213239 -1882229 -4461552 -615774 1793564 -2129395 -6364236 -3881624
39850 -3881624 2451358 5239735 3679772 2304523 2080539 206848 -2621534 -1867086
39842 -1867086 3391337 8290336 8678259 5438381 1439296 -1652517 -2496207 -215299
39834 -215299 3042207 3487823 1215651 416862 2295685 2356537 -2244501 -7210872 -7338833
39825 -7338833 -4296071 -2709685 -1807300 2047611 6294253 3889290 -5139380 -11673048
39817 -11673048 -9661224 -3438849 599180 2955464 6633502 9727910 9156139 7722555
39809 7722555 10167339 14545961 14701940 10112411 6377363 6297748 7091098 6588777 5547211
39800 5547211 3158500 -2791931 -9731613 -11264456 -6919647 -4162676 -7198800 -10546364
39792 -10546364 -8614077 -5190773 -6538273 -9960082 -7672878 136422 4572625 793522
39784 793522 -5529498 -6518456 -1625919 3657777 4953195 2336170 -1124979 -2145819
39776 -2145819 170034 3486406 4962600 4695376 4755462 5207762 3739329 -302781 -4128268
39767 -4128268 -5033552 -3902618 -3790148 -6016871 -8680239 -8589460 -4430509 1528495 5331689
39758 5331689 5830104 6358759 10178803 15090260 15309141 8866306 404753 -4219202 -3638105
39749 -3638105 -245305 3423894 5556304 4797211 2209516 2057322 7098300 13444186
39741 13444186 13827377 6864043 -421855 -1349975 2097818 2879250 -1205874 -5460188
39733 -5460188 -5794275 -3765669 -2605889 -2119589 -609365 607665 -1594177 -7109951
39725 -7109951 -11931358 -12714177 -9788764 -5509941 -1692705 915898 2307730 3001332
39717 3001332 3373369 3232199 2471400 1165189 -1526962 -6429980 -10936023 -9656335 -1848785
39708 -1848785 4539125 1282004 -8975418 -15498951 -13116792 -7228934 -4500282 -4910791
39700 -4910791 -5407196 -5538743 -5654766 -4056966 -43184 3656725 5018238 5906359 7828695
39691 7828695 8412781 6046326 3924499 4466458 3446904 -4037063 -14211824 -18068295
39683 -18068295 -13321976 -6612894 -3812755 -4270170 -5539727 -7773767 -10898838 -12004020
39675 -12004020 -8859707 -3610873 -435969 -734090 -2070095 -1294673 1695628 3290076
39667 3290076 566966 -3329525 -1538622 6683108 12669085 9249213 1111006 -1942652
39659 -1942652 994259 2755999 1346536 2339688 6559431 5768133 -4148612 -14115875
39651 -14115875 -13336177 -4116380 2571663 2523998 1042348 2005844 2688815 626887 -1391913
39642 -1391913 -484563 769095 -1945186 -7362368 -8917913 -2835772 6407063 10579891
39634 10579891 7115665 1645053 146387 1445085 718718 -1893883 -1694454 1930629
39626 1930629 3832208 1957757 1203638 4413916 5869660 144883 -7356373 -6875058
39618 -6875058 1110862 6450395 4246211 504959 835847 1708356 -2305836 -8581563
39610 -8581563 -9818987 -4245233 3038560 7340189 8208039 6573790 2538100 -3056759
39602 -3056759 -7806632 -9815287 -9176151 -7058074 -4842151 -4381297 -7162349 -12001270
39594 -12001270 -14800184 -12368283 -6459097 -2432345 -3048931 -4947844 -3207045 1400364
39586 1400364 2991474 -777888 -4586487 -2967742 1524366 2646195 634729 1285744
39578 1285744 5161183 5612558 59172 -4488438 -2157327 2292148 1665258 -1550064
39570 -1550064 -271098 3705605 2222725 -4056741 -4796737 2995216 8398844 2976683
39562 2976683 -5864613 -6332637 203814 3250821 265542 -1285226 2446368 6562948
39554 6562948 7274166 7836651 11554950 15796287 16377634 12581063 5306530 -4226585 -11414727
39545 -11414727 -10173326 -1841377 3526614 -378380 -7425408 -8324422 -3767014 -1139868
39537 -1139868 -1591444 834554 7637725 12004788 8975358 2914703 978316 3508317
39529 3508317 5176297 3106149 -430049 -2739091 -4443527 -7291993 -10263984 -10096464
39521 -10096464 -5892222 -1332552 -537712 -2760537 -3936760 -3204686 -3944014 -7137030
39513 -7137030 -8327728 -4551339 -206182 -822751 -3742792 -1569340 5807813 9699799
39505 9699799 4969186 -2104557 -1972201 6174994 14643497 17110303 14141736 9634874
39497 9634874 5494827 1064702 -3885555 -7337458 -6789335 -2532087 2039058 4194726
39489 4194726 4848217 6422570 8899358 10048273 8865077 6471468 3979573 1814053
39481 1814053 887613 1874999 3220698 2360905 -748461 -3547620 -4444907 -4124640 -3177692
39472 -3177692 -1067754 1968880 4327516 4999642 4279346 2396251 -521378 -3309880
39464 -3309880 -4982891 -6789083 -10257216 -13343435 -11745809 -4579283 3909521 8607155
39456 8607155 7358648 1361668 -5237937 -7212397 -3481110 568122 105170 -1611984
39448 -1611984 1532203 7502658 8255329 2775996 -1061651 601672 2416816 1034498
39440 1034498 1477692 6358481 8261205 1381868 -7005458 -6701671 -392656 1389132
39432 1389132 -2948506 -5516683 -3096121 -728877 -1381840 -2220625 -1982169 -2636282 -2507438
39423 -2507438 2898502 11215214 13616878 7892878 2235423 2126457 2350703 -2372940
39415 -2372940 -6973819 -3875990 4476297 9103223 7227986 4094639 3766783 4670312
39407 4670312 3815736 171954 -6009451 -12776487 -15544422 -10953146 -2293827 2580506
39399 2580506 24163 -5293432 -6322423 -1788597 3148078 3578076 563707 -578294
39391 -578294 2931944 8044172 10220688 9092903 7508064 6488044 4579591 1699512
39383 1699512 -153129 -316580 -1312 944009 3757182 6528764 4930109 -1036361 -5604493
39374 -5604493 -5115082 -2951988 -3507333 -5605094 -6045863 -5713772 -6929876 -7714547 -4740946
39365 -4740946 -486862 -1056513 -6517454 -9215008 -3869453 4747059 7094800 -265434
39357 -265434 -11388510 -17548739 -15451672 -9075666 -4543933 -4145224 -5802281 -7290575
39349 -7290575 -8738706 -10654638 -11969475 -11513707 -9693926 -7284097 -4178773 -777080
39341 -777080 1040464 -1612 -2625145 -4289820 -3430927 -197732 3225510 3270967 -1068390
39332 -1068390 -5090296 -3319830 2142052 3665695 -324171 -2682312 488149 2865896
39324 2865896 -1483629 -7755338 -8492695 -5908453 -6480417 -8037418 -3799043 3294388
39316 3294388 3230626 -3759202 -5738318 1764919 7740441 3056861 -5294467 -6057266 -1054259
39307 -1054259 -120613 -4388004 -6006844 -2488533 -731114 -5532328 -12209693 -13489199
39299 -13489199 -8495831 -2224973 569161 -1059340 -4535717 -6118663 -4076363 -36103
39291 -36103 3130952 3744020 1170192 -4244120 -9313491 -8889906 -1733396 6497777 9505916
39282 9505916 7920466 6978689 8312746 8764711 6986907 6182469 8866643 12816960 14436690
39273 14436690 13480976 12093535 10882978 8550700 5064495 2932444 4072567 6226579
39265 6226579 4441005 -2903168 -11070672 -13964467 -10949767 -5861564 -452070 6339525
39257 6339525 12301108 11435346 2841267 -5183600 -4893891 855070 3650614 1327902
39249 1327902 -1538259 -2578177 -3823108 -5642372 -5754228 -5020811 -7334774 -11931208
39241 -11931208 -12310504 -5734244 1800039 3431150 -617728 -6292405 -11651374 -15049386
39233 -15049386 -12465580 -3161525 5153465 4136387 -3189194 -5403325 1601453 8896873
39225 8896873 7410388 318636 -2948259 -1218102 -2686628 -11447341 -19905779 -18497670
39217 -18497670 -8706554 -901779 -674693 -3185162 -2081578 1652515 3480356 3911327
39209 3911327 7633552 14974735 19567037 16027997 6536852 -2155667 -6010249 -6001048 -4553554
39200 -4553554 -2020218 2822713 9679592 15271780 15910611 11405498 5217807 700737
39192 700737 -1132408 -160686 3477795 7421248 7873188 4562747 1687676 1410584 417543
39183 417543 -3410453 -5643013 -2467499 1027593 -2226226 -8734404 -8431172 -765524
39175 -765524 3625104 -531354 -5182091 -2274668 4042187 5360344 2067928 486327
39167 486327 1750549 1761617 -276965 -765027 1504112 3228660 1356760 -3782030 -9408279
39158 -9408279 -11676188 -8158277 -1775396 611989 -3168755 -6817457 -4403866 889576
39150 889576 2179208 -438639 -1150820 1789003 4388214 4262258 3369365 3372856 3735435
39141 3735435 4647808 7003608 9317291 9038320 6751472 4988727 3704632 1362802
39133 1362802 -742427 -472180 -69617 -3506086 -9013580 -10349735 -5773571 84737
39125 84737 3752087 6405136 9064009 10187388 9378038 8239306 6608473 3198399 389039
39116 389039 2236661 7000319 8518575 6403202 7310421 13400721 17197909 12321295
39108 12321295 2898677 -2738668 -2600737 -459291 832174 773755 -411269 -980586 1291175
39099 1291175 4412589 2950673 -3501618 -7854076 -5266262 -12379 1733062 529741
39091 529741 46469 126589 -715229 -767431 577202 -1386337 -9387047 -16434779 -13219039
39082 -13219039 -1118273 9295307 11227647 6834738 1203650 -2368757 -2281621 321980
39074 321980 1463027 -79944 264531 5197061 8972285 5576044 -592316 -1235496 1625294
39065 1625294 -1549834 -11779936 -19024237 -16510597 -7835972 1342324 8849680 11710083
39057 11710083 6861521 -829750 -1377079 5780708 10021626 6474612 3833228 9251767
39049 9251767 16440676 17293456 15507906 18079921 21177459 16416366 5726389 -2074716
39041 -2074716 -5716005 -10357215 -14592123 -11489448 -2584216 1706349 -2023322 -5054629
39033 -5054629 -1072685 4255939 3416374 -1717932 -4929399 -5305150 -5422942 -4866313 -1828020
39024 -1828020 2176894 4422904 4901171 3877098 -783122 -8833929 -13809650 -10200031
39016 -10200031 -2227678 921723 -2617983 -6352552 -6225921 -5394093 -6781441 -7579304
39008 -7579304 -4650900 -391787 1090209 147313 -471812 -1233034 -4331980 -7814017 -6588196
38999 -6588196 -138893 5433277 5436894 3227420 5386753 12105850 16356379 12772276 3916801
38990 3916801 -3695836 -7008911 -7286588 -5541781 -1163981 4501282 7089512 4289801
38982 4289801 -206948 -856050 2693346 5807449 5771996 4972635 6250505 8318328 8002554
38973 8002554 5021867 2115502 1403189 2538891 3865413 4004209 2925791 2288366 3564948
38964 3564948 5359636 5011663 4017199 8086979 18370580 25942189 20628690 4278102
38956 4278102 -10320777 -13909461 -8959964 -3047511 -192257 -984990 -5380009 -11136798
38948 -11136798 -13502102 -10721299 -6939902 -5883622 -4813514 735519 8818881 12990527
38940 12990527 11155762 7460492 5506955 4268675 1531842 -2226036 -4626997 -3793408
38932 -3793408 564378 6583514 10781723 10994084 8626249 6626499 6223725 7228224
38924 7228224 9668980 12482711 12304611 6986938 -536274 -4865727 -3728475 1404428
38916 1404428 8015606 12311530 9125282 -2274763 -13657095 -15465852 -9009507 -4699909
38908 -4699909 -7264830 -9443892 -3001052 10010349 20880020 24493990 21669440 14870682
38900 14870682 6574430 317368 -1015108 1641587 4087636 2856970 -1695209 -5642827
38892 -5642827 -5159332 -1147291 1084980 -969081 -2328756 2615105 10383317 11880169
38884 11880169 5329534 -1502373 -3341058 -3889434 -7115655 -9762235 -7833024 -4207494
38876 -4207494 -3526524 -4532364 -4073251 -4391464 -9071751 -14736353 -14380993 -7600536 -733966
38867 -733966 2349238 3376955 4205290 4407597 4490088 6035626 8248127 9084011 9694507
38858 9694507 12811104 16889698 17209943 13171377 9269416 8192127 8183017 8114133 9553201
38849 9553201 11926589 10911768 4570300 -2805852 -5641168 -2930807 2382704 6339968
38841 6339968 4876067 -3651796 -14092940 -16774501 -7946995 4836975 11305769 9863875
38833 9863875 6548718 5001941 2893552 -1722810 -5803724 -5651194 -2653022 -1156813
38825 -1156813 -1892359 -1469616 1002355 1120752 -3771391 -8168017 -4774242 3911437 7626412
38816 7626412 3330475 158535 4980906 10800416 7345476 -2671252 -8088374 -6866383
38808 -6866383 -7569489 -13441707 -16901214 -13076675 -8023710 -7744871 -8033701 -2757332 4515067
38799 4515067 5689857 842775 -2540389 -1118598 755927 -1317949 -6380034 -10786304
38791 -10786304 -12219005 -10737820 -8554990 -8254784 -9383422 -8763060 -6244026 -6677164
38783 -6677164 -12414312 -17337074 -13864896 -3854022 3429148 3372327 145002 -1360234
38775 -1360234 -1654847 -2824736 -3594189 -1683948 1419618 1266245 -4225358 -11606403 -14551361
38766 -14551361 -10115217 -2179679 2802975 3309919 2967620 2989077 -246235 -7090465 -10107766
38757 -10107766 -3925078 4795011 5372896 -1305225 -4383475 156603 4104875 725076
38749 725076 -5300950 -6121266 -1476353 4043394 8232700 10075172 6987883 -104013
38741 -104013 -3547875 1810902 9496165 9230207 1728425 -2551287 1226867 6641588
38733 6641588 6960116 3663262 1003962 -860649 -2700087 -1842561 3190892 7379671
38725 7379671 4764173 -2474389 -6436494 -4537661 -2267138 -3832924 -5649145 -2467965
38717 -2467965 3896169 6671160 3575984 -314123 320958 4617178 7864404 7756992
38709 7756992 5934476 4539657 3667810 2165218 -622032 -3910230 -5297314 -2252428
38701 -2252428 4571295 10197684 9864485 4687019 255131 -853339 -2174375 -7436643
38693 -7436643 -14256647 -16505193 -11711909 -3633602 2049392 2752368 240391 -1445679
38685 -1445679 289602 3686290 4208066 261294 -3967663 -3258931 2216777 7455896
38677 7455896 8709525 6567285 3537599 1078035 -1047338 -4340595 -9936926 -15729570
38669 -15729570 -16894955 -12167038 -7502050 -9001964 -13625885 -12810058 -5212518 948623
38661 948623 13434 -3566922 -3449455 -974449 -1277910 -4654737 -7785607 -10042717 -12377567
38652 -12377567 -12596866 -8231902 -2425827 -555075 -2048974 -1947481 170747 -215335
38644 -215335 -3875987 -5937783 -4036141 -1498286 -403069 1620469 4873970 5120198
38636 5120198 2018446 3060838 12619301 22502024 21413521 10765108 2754021 3579440
38628 3579440 6755129 4627501 -770746 -2521720 223838 1604614 -1726792 -5440214
38620 -5440214 -3438619 3458285 8028652 6116078 2089645 2023161 4205931 1827893
38612 1827893 -5399024 -8966109 -3459471 5081739 7178113 2006809 -3714217 -5796267
38604 -5796267 -5771422 -5818861 -6302291 -7937001 -11366629 -14353561 -13541304 -9261561 -5149686
38595 -5149686 -3287926 -3128871 -4376931 -6880935 -8294852 -6144126 -1814891 1693489
38587 1693489 4967012 9878577 13005640 8277911 -2835640 -10857717 -10553569 -7026460
38579 -7026460 -5980512 -4565870 2152372 10491935 11395212 2729551 -8030492 -13388707
38571 -13388707 -12997971 -10677751 -8896309 -8154983 -8680611 -9979110 -9795719 -5787633 1272355
38562 1272355 6952465 6817745 730533 -7183724 -12911015 -15655697 -16346649 -15418898 -13749886
38553 -13749886 -13420024 -14760413 -14608398 -10763721 -6084418 -3986955 -2173181 3201591
38545 3201591 8523564 5650112 -5211951 -13547455 -12528283 -7621173 -6625725 -7835622
38537 -7835622 -4635417 2892244 8254385 8009500 4615653 1338732 -230508 980554
38529 980554 3863278 3609205 -2678583 -9767763 -9423210 -1556216 5548521 6698084 5476610
38520 5476610 6582483 8232539 6109620 1100821 -1576091 357049 3667088 4435422
38512 4435422 2796290 1938884 3853527 7247564 9237474 8133375 4598257 1169668
38504 1169668 1002292 5545758 12113847 15055311 11296837 3808246 -2312458 -5579964
38496 -5579964 -7192262 -6621483 -2990363 348849 -1226003 -5697341 -5981646 -929456
38488 -929456 2180808 -987099 -5104311 -4375681 -1759747 -2796063 -5711483 -4931782 -613287
38479 -613287 2583494 3463913 4087158 3869955 929203 -2240555 -1299101 2586388 4219698
38470 4219698 2474023 865726 670872 -581553 -4003314 -7949457 -10966986 -11353627
38462 -11353627 -5918667 4758069 12142688 8255612 -2990117 -10497406 -10654093 -8962157
38454 -8962157 -8302538 -5685971 -1332455 -484943 -3496364 -3613132 1962018 7601305 9285290
38445 9285290 10059698 11387554 8574706 555048 -4725098 -1865692 2721465 786824
38437 786824 -5368796 -8767674 -9854514 -13240453 -16789772 -14052528 -5669717 637241
38429 637241 957373 -1342674 -2577823 -2298130 -56768 4709305 8807008 7064835 -509369
38420 -509369 -7521375 -8329579 -3422978 2551462 5337710 3779600 520743 -249365 2509646
38411 2509646 5377658 5321848 3624801 3014014 3551544 3651735 2212220 -2419664 -11481525
38402 -11481525 -20783919 -21578110 -11077934 2134692 8157548 6822716 3389320 -1242507
38394 -1242507 -8123375 -12599820 -8956526 -714491 3313879 2229242 2494263 4603131
38386 4603131 1567792 -7108627 -11212705 -4721554 4441362 6128597 1834345 -676500
38378 -676500 -541261 -2815666 -7629933 -9036715 -4213096 3089758 8745303 12075088
38370 12075088 12466714 7843227 -525233 -5653272 -1635450 8222197 13706739 8963372
38362 8963372 -894994 -5984614 -2799165 3207078 5326799 2623848 -1317258 -3295926
38354 -3295926 -2290724 849652 3118571 1173239 -3977133 -6621469 -3729169 82184
38346 82184 -929838 -4586799 -3643307 3367288 9756366 9508312 3648234 -2980306 -6973651
38337 -6973651 -7448436 -5724024 -4870653 -6363021 -7216067 -4217755 -267994 -1065738 -5448863
38328 -5448863 -5776131 261291 5270730 3328313 -1094353 -1063281 1393964 -521349 -5743871
38319 -5743871 -5711068 2033989 8528209 5473183 -2692328 -4338527 3863613 12780468
38311 12780468 13074050 6725769 2723447 4243141 5738262 2780366 -1340367 -2050838
38303 -2050838 -1631804 -5303608 -11478708 -12201191 -3832110 7576067 13310069 11332613
38295 11332613 7056610 6654493 10518885 12647164 7256537 -3225933 -9355676 -6098709
38287 -6098709 215435 253242 -6256631 -12136272 -13503723 -11975636 -8010045 -344432
38279 -344432 7798387 10238609 7202034 5603362 8020224 9056246 5308530 1004067
38271 1004067 -71225 -555330 -2662798 -2615624 2379596 7985489 9571720 9297034 10227987
38262 10227987 9469216 4273916 -766719 -885828 -460814 -5836049 -12738724 -11368542
38254 -11368542 -2215604 3877038 1686426 -2366968 -1969246 490758 483753 -1087699 -1288985
38245 -1288985 -722088 -1597528 -3964564 -6768834 -9412776 -10264544 -7068855 -692198 4821584
38236 4821584 7417681 8906426 10529470 10549970 7950597 4830414 3134944 2207372 1270368
38227 1270368 1055502 1309002 110556 -2449595 -3290607 -1024418 1728290 2725898 3164251
38218 3164251 3865895 2310317 -2934535 -8016311 -8293637 -4944318 -3016268 -4501151
38210 -4501151 -7443762 -10585785 -14122211 -16070036 -12947299 -5645568 -570265 -2244678
38202 -2244678 -7404573 -9417632 -6959971 -4909380 -6825506 -9984709 -9524797 -5181645
38194 -5181645 -1123385 70387 20507 408189 -653825 -5595571 -12475861 -16229100 -14574538
38185 -14574538 -10055700 -5990487 -2959134 -160723 2059781 2679344 1759579 449683
38177 449683 -42492 1067833 3432695 4704047 2117990 -3659113 -7759897 -6133438
38169 -6133438 -458771 3893135 4086968 1726185 -1021961 -4076424 -7233646 -8159148
38161 -8159148 -4861918 1365913 7546532 12201924 14811355 13871840 8977093 3839644
38153 3839644 2838431 4356056 2434531 -3557728 -6304524 -740300 8172966 12551358
38145 12551358 12150095 11930054 12698371 11531054 9254222 9080102 8431278 1268731 -10152858
38136 -10152858 -15182254 -9736314 -2678491 -2557930 -6302940 -7462634 -7899264 -12545734
38128 -12545734 -18141801 -17147512 -10079873 -4572518 -3366775 -2084319 1090507 2105200
38120 2105200 -969280 -3991608 -3438264 -1408278 -1445050 -3922658 -7585817 -11400006 -12937501
38111 -12937501 -8998759 -196368 8079071 11059438 8658034 3655819 -994965 -2557830
38103 -2557830 50157 4000525 5032442 3319313 3538037 7735119 11451249 9127278
38095 9127278 1268502 -5685091 -5781305 635505 6785948 5902186 -1061367 -6067646 -4141286
38086 -4141286 381693 1241853 -115890 1468416 4134430 627355 -9535251 -17824321
38078 -17824321 -18259668 -13793075 -9025559 -4117498 662553 1530504 -2748797 -6899719
38070 -6899719 -6086856 -2301169 437644 2500257 5564132 7595853 6214110 3468432
38062 3468432 2149858 697318 -2933323 -5486990 -2480010 3971941 7226351 4982740
38054 4982740 1006193 -1156955 -1361081 -323395 1429299 2113843 373389 -1348261
38046 -1348261 1117519 7621512 12886340 12601897 8140977 4615350 5617326 9801823
38038 9801823 11774659 7362367 -1083556 -6478378 -5407701 -2188401 -2392131 -5222970
38030 -5222970 -5823327 -2972027 -142372 362347 253742 1754560 4155041 4790287 2065459
38021 2065459 -2716936 -6025201 -5492153 -3094069 -3189608 -6792748 -10348458 -11221845 -11156001
38012 -11156001 -12429567 -13964183 -13769729 -12093955 -9517760 -5333463 -707221 504650
38004 504650 -2146721 -2877344 2312985 8654813 9338079 5817967 4629539 6362625 5575389
37995 5575389 1117521 -1091706 3061947 10143654 13819974 10761309 1546250 -9435227
37987 -9435227 -14835729 -10632654 -2342639 356137 -4044044 -7622246 -5072048 -392055
37979 -392055 944618 34100 543427 1713456 368151 -3181586 -5637957 -5191451 -2373306
37970 -2373306 1443153 3738597 1667069 -3697093 -6299387 -1769746 6544918 11471200
37962 11471200 10477719 6988521 4513361 3269589 2472183 2332874 2671500 2111694 291462
37953 291462 -635165 1463980 5107856 5966718 2015189 -3250930 -4362417 -316271 4470463
37944 4470463 5880654 4392428 2705355 1845829 1639239 2383262 3134048 664618 -6163241
37935 -6163241 -12655201 -12888528 -6901631 536482 6745520 11966783 14811706 12979100
37927 12979100 8465088 5775250 4190599 -1467165 -10577581 -14562211 -8860342 -613730
37919 -613730 840222 -4069532 -8481373 -9787132 -10031316 -8973923 -4846287 -924956
37911 -924956 -3178779 -10173211 -12621832 -5989114 2427955 3299375 -2296966 -5613783
37903 -5613783 -2940173 520639 -376046 -3569990 -4428731 -3469724 -4639854 -7261109 -5266416
37894 -5266416 3638785 12283886 11450522 1177178 -9284506 -12324213 -9049493 -5143351
37886 -5143351 -3508086 -3098743 -2596518 -2475440 -3789288 -6279110 -7758621 -5538895 382667
37877 382667 5501907 4031424 -4833641 -14801465 -17922001 -12273585 -3899994 -851005
37869 -851005 -4980757 -9972834 -8492150 -863819 5509400 5451117 1477551 -1197986 -1132140
37860 -1132140 536750 3605792 6901408 6488582 1175114 -3228865 -1498013 1791373
37852 1791373 -1518599 -9192624 -10211950 -1298749 7625638 7586120 1437410 -3845954
37844 -3845954 -7479920 -11147833 -11905915 -6762549 -5325 1730417 -960502 -2493636
37836 -2493636 -1974506 -3520512 -7582994 -8711570 -3302431 5093613 9883674 8159416
37828 8159416 2454890 -2399055 -3690671 -2697464 -1793398 -587048 2399494 5140956
37820 5140956 4230587 1888090 4156842 9982193 9833913 -244356 -10870509 -12215331
37812 -12215331 -7670488 -6311718 -7906525 -5762307 -147317 2677095 2604880 5037352
37804 5037352 8593422 5552591 -3916187 -9705792 -7293253 -4459486 -7834769 -12738315
37796 -12738315 -12421550 -8713030 -6693491 -6201611 -5568365 -7044231 -11212845 -12275873
37788 -12275873 -6833010 -1637474 -3873264 -8883887 -7656191 -2440029 -3043154 -9199803
37780 -9199803 -9698361 -1185530 4608072 -1744204 -12652983 -14348546 -5804458 2138132
37772 2138132 2878470 137273 -1388376 -2894453 -6349872 -8508709 -4533802 4731641
37764 4731641 12645714 13598519 8276041 2421179 1342687 5274565 9509316 9430272 5475388
37755 5475388 2167404 2133798 2909954 866467 -3426971 -6122768 -5703522 -4915825 -6457289
37746 -6457289 -9009173 -9197975 -6384504 -3718902 -4254957 -6868257 -6763581 -629132 8758104
37737 8758104 14449808 12869123 7862494 5176281 4584906 1273283 -5457265 -9702703
37729 -9702703 -6747375 727408 6530044 7570622 4299775 -1436634 -5624793 -3142324
37721 -3142324 5689439 12476055 9608163 -510757 -9782594 -14975550 -17976475 -18536205
37713 -18536205 -15022992 -11211742 -12995564 -17451918 -14798672 -3937194 3864682 1782203
37705 1782203 -1720455 3493088 13052854 15574322 10377959 6147796 5243039 1975619
37697 1975619 -3650173 -3278240 5242490 11693130 7841091 -547422 -2827012 2131023
37689 2131023 7829522 10743643 10960918 6558738 -3569413 -13412658 -15352123 -11478362
37681 -11478362 -10923124 -15714439 -18455640 -15897485 -14928043 -20217465 -24784296 -20419197
37673 -20419197 -11039345 -6821830 -9063242 -10087573 -6252539 -1804009 181203 1801924
37665 1801924 3548270 1594467 -4822152 -9931317 -9250062 -5558932 -3385336 -2640604
37657 -2640604 -1860961 -2810045 -6625704 -9173560 -5869652 1188923 5749949 5043255 663038
37648 663038 -5529698 -11315870 -12210322 -5612765 3934889 9022042 8525725 7466919 8152964
37639 8152964 7158327 1954616 -4771009 -9374033 -11777181 -13657344 -15118482 -15042386 -12845633
37630 -12845633 -9022639 -5420363 -4441758 -5827856 -5575219 -1281291 3009272 1740425
37622 1740425 -3579635 -6266283 -4596580 -3774446 -6876320 -10490956 -11751741 -13162994
37614 -13162994 -16348855 -16629864 -9527762 748123 5166194 1037883 -5187660 -6064443
37606 -6064443 -955632 4366362 4122725 -1336906 -5419539 -2667894 3907258 5816100
37598 5816100 -118645 -7824063 -10302422 -7661833 -4182046 -1359604 2213135 6575042
37590 6575042 9682026 9511663 4776387 -3895278 -11418215 -10761137 -1630680 6800045
37582 6800045 6229129 -663348 -5242666 -5123329 -5112700 -7437598 -8036357 -3735920 2329395
37573 2329395 4701123 1706561 -3812134 -7396279 -6099487 -1090085 3041876 3972531
37565 3972531 5340811 11050114 17345840 16239012 7083265 -1413905 -2730805 -261624
37557 -261624 -138999 -1747478 -724444 2260806 2272228 -1396083 -3539029 -750145 4006748
37548 4006748 6338285 6023260 5118436 3602226 573924 -1687563 1078123 9196634
37540 9196634 17156306 19064122 14439870 7470885 2096724 -532383 -1023591 -773400
37532 -773400 -2171473 -7327797 -14920851 -19359009 -15309443 -3937311 6607820 8708052
37524 8708052 3185472 -2362106 -3647780 -4821222 -10751510 -17645857 -17350522 -9827184
37516 -9827184 -3696205 -2796122 -522022 7917245 15657642 14276614 7476619 4951528
37508 4951528 6725213 4718257 -1948605 -5312715 -3076791 -2781818 -8167154 -12416217
37500 -12416217 -10085948 -5895632 -5531706 -6728077 -6393847 -7970628 -13446835 -15809688
37492 -15809688 -8995538 949017 4677829 4036348 6791122 11367216 9463224 2002008
37484 2002008 -624875 4567076 7988992 2625856 -5849122 -9074664 -7870102 -7888669
37476 -7888669 -8939256 -5261942 5328210 16850245 19997384 11099567 -2956533 -10248294
37468 -10248294 -6549075 -132932 -296644 -4591068 -3672764 3849747 9705350 8613555
37460 8613555 4238993 1453594 708617 2115120 7198946 13338014 13683853 6913034
37452 6913034 1104717 3378911 10491885 14006343 10709780 3927995 -1947460 -4514989
37444 -4514989 -3784688 -2470646 -3480478 -5589807 -4747207 -466061 3395746 4981657
37436 4981657 6034143 5814264 173647 -10129838 -16655343 -13505565 -5333017 -480114
37428 -480114 -468796 -996890 382684 2414999 3429015 2791309 1248931 1767716 6542417
37419 6542417 11763345 10492945 2753841 -3475442 -4136968 -4643826 -9221525 -12589900
37411 -12589900 -8904672 -2107597 585274 -99597 778735 2344421 858640 -1095521
37403 -1095521 1736505 6808097 6923347 2761675 2258996 7105893 9527177 4627211
37395 4627211 -2434907 -4721310 -2226453 963267 2796195 3317774 2660849 1611601
37387 1611601 1328723 1202428 -348360 -2818083 -4498015 -5938719 -8720693 -11280133
37379 -11280133 -10214505 -5527982 -427989 3712706 7878019 11422329 12285777 11100440
37371 11100440 10609099 11038010 10130921 7254245 3430156 -1421263 -6692647 -8481534
37363 -8481534 -4516664 96095 -1228297 -6225514 -6865843 -2092433 872290 -1450141
37355 -1450141 -3935748 -1915924 2620390 6128104 7637078 5823224 -435102 -6243043
37347 -6243043 -3590650 6472975 12447150 7484214 -1365000 -3708428 1243571 7376101
37339 7376101 10744974 10145358 4293134 -5288285 -12582221 -13383807 -9827461 -5366664
37331 -5366664 -356760 3926303 3325827 -2199872 -5721475 -3005108 654907 -1104630
37323 -1104630 -6141948 -8605516 -7571279 -4803582 -35237 4767525 2963337 -6882959
37315 -6882959 -14716724 -11438379 -2069497 2868723 3366309 6258766 10372716 8099829
37307 8099829 -487270 -7449968 -9879088 -11197634 -10436818 -2830185 8239618 12527567
37299 12527567 8334224 4818207 6371755 6803155 2832744 997776 5162420 8307417
37291 8307417 4192135 -2125330 -3179214 -501630 674318 985245 3032381 3907799
37283 3907799 62184 -4838951 -4875627 -1321460 65910 -1458902 -1364025 2795946 9016055
37274 9016055 14131068 15691137 13140084 10075941 11464374 15847794 15810452 9689498
37266 9689498 5866811 10072547 15766849 14482874 8895298 6590666 6716840 3347693
37258 3347693 -2114352 -3206340 -599212 -765336 -3730316 -3455976 -192544 -743511 -5105795
37249 -5105795 -4603278 3462088 10345214 9700337 6722955 7458181 8190741 3218655 -3979036
37240 -3979036 -5940349 -2879441 -1005937 -2196648 -2889420 -1723476 -1462811 -3277710
37232 -3277710 -4303708 -1759279 3450504 7336721 5569506 -2656098 -11718627 -13291846
37224 -13291846 -5742592 2856587 4234022 -426630 -4160715 -4576519 -5148546 -7639357
37216 -7639357 -9187672 -7665795 -5204425 -4736259 -6293462 -8179015 -9208798 -8575082
37208 -8575082 -5914943 -2901535 -2584269 -5378634 -7403908 -4991274 76460 2350778
37200 2350778 -12447 -2310481 498300 6277910 7729415 2195437 -4251185 -4848019
37192 -4848019 -1189907 -232332 -4005657 -7412517 -6420219 -3269347 -1540015 -344619
37184 -344619 3239137 8567362 11736070 10556539 6877090 4287159 4600829 5990127
37176 5990127 4421281 -1630174 -8103916 -9454347 -5910664 -3391023 -5384936 -8566232
37168 -8566232 -8217280 -4580971 -1278251 35054 867385 3326672 7848258 11956637
37160 11956637 11240479 4534066 -2118760 -1370719 4981158 7272977 1414975 -5552823
37152 -5552823 -6481900 -3652396 -2402029 -1997524 527902 3085025 2508433 1190398 2187950
37143 2187950 2224650 -2152916 -5938825 -2929296 2136506 -23556 -7012875 -7570594 -476979
37134 -476979 2746514 -3282931 -9243957 -6891151 -1979384 -3876816 -11191588 -15953510
37126 -15953510 -15479214 -12282593 -7515449 -2054572 -60251 -4434309 -11504949 -15653322
37118 -15653322 -16135517 -14734479 -10959514 -5143295 -2032997 -4644303 -7762457 -4559079
37110 -4559079 2427715 4014089 -2524421 -9446706 -8559166 -706987 6050623 5247356
37102 5247356 -1702848 -7224826 -6124803 -1621976 113223 98785 4886158 14275260
37094 14275260 19088953 14618592 7781962 5482701 4338110 -533310 -4567950 -1435695
37086 -1435695 4588870 4844148 416803 -1047577 735960 -467819 -4832908 -6526448
37078 -6526448 -5419948 -7143423 -11521907 -12371802 -9181643 -7326316 -5906889 1912774
37070 1912774 14214446 19159166 12736477 5161368 4210086 4581080 837472 -1120617
37062 -1120617 5112684 14102824 17339896 16472229 17580288 18930292 15030831 7906236
37054 7906236 3987295 3137443 129268 -5388071 -8679198 -7802838 -4891176 -1780484
37046 -1780484 1436 -1727913 -5463779 -5333403 -141431 3208517 1668362 3076734
37038 3076734 12061347 17927541 9628035 -4631353 -8617363 -3731049 -5159186 -14387908
37030 -14387908 -15883364 -4065204 6400487 4535416 -769068 1065190 3866316 -1968674
37022 -1968674 -10287093 -8985040 -766379 1513477 -4566920 -9679060 -9360292 -8027365
37014 -8027365 -7069827 -2348990 4633678 5130621 -3290852 -11245155 -10467290 -4665755 -2276634
37005 -2276634 -4362888 -5353368 -2028432 3281704 6479299 5226258 323370 -4061558
36997 -4061558 -3438361 1653841 5343419 3523709 -819472 -1765657 1872212 5977001
36989 5977001 7281308 6865395 6986342 7077022 4944346 1035689 -986182 956185 3705397
36980 3705397 2547025 -1882388 -3662883 303551 5682973 6877469 4728740 3785475
36972 3785475 3946813 744695 -5744485 -8477081 -2970098 5362916 7861101 3925354
36964 3925354 839410 3275766 7762555 8332626 3685021 -3168954 -9373707 -13569222
36956 -13569222 -14540456 -11916978 -8369475 -8415102 -13530143 -19544461 -20294849 -13819302 -4342145
36947 -4342145 1773518 1663137 -2225091 -5348264 -5635716 -4532229 -3691535 -1995139 2573409
36938 2573409 8589903 11215276 7720397 1147638 -3323328 -4336074 -4502512 -5537967
36930 -5537967 -6179227 -5305927 -4456605 -5696907 -8411113 -9799241 -8229084 -5252894 -4184747
36921 -4184747 -6497480 -9450730 -8364557 -2464151 2789850 1693745 -3903087 -6166169
36913 -6166169 -1445185 4686045 4991819 409536 -1478728 3114780 9252443 9813457
36905 9813457 4042867 -2590305 -5497881 -5182852 -4339610 -3588688 -2158163 -1247564 -3363453
36896 -3363453 -7773341 -9788888 -6715110 -2287027 -2230385 -6581191 -9637505 -7433715
36888 -7433715 -2459675 -469935 -4536285 -12323683 -17631016 -15419599 -7570794 -2512338
36880 -2512338 -6038499 -13712541 -16487539 -12800520 -9415584 -10113101 -10511957 -6709955
36872 -6709955 -2373065 -2437529 -4924936 -4828220 -2493181 -1949553 -3222421 -2561933 672618
36863 672618 3125964 3227899 2659235 1927404 -437292 -3596641 -4283993 -2424994 -2341003
36854 -2341003 -6148799 -9856515 -8867047 -4295493 -453102 1857080 5573284 11298534
36846 11298534 14802985 12325442 6202148 2563182 3845318 6354549 6178230 4634402
36838 4634402 5208493 7229828 6559849 1787500 -4348079 -9388180 -12602356 -12376530 -7820298
36829 -7820298 -3364650 -4823265 -9177861 -6390969 4904799 12332915 6767118 -3891750
36821 -3891750 -6699427 -2197662 71164 -948660 1943013 8897155 11694957 8295166
36813 8295166 5856795 7130994 6246783 1497772 -102219 3578342 3542031 -5413475 -13990824
36804 -13990824 -11873238 -3429424 200161 -1902041 -2115665 1574677 4023606 3382587
36796 3382587 3310962 5301391 6973169 7776164 9226897 9820301 6652746 2058181 1852206
36787 1852206 6411523 9776757 8645611 6515746 7391111 10344542 12172830 11633714
36779 11633714 9572696 7788791 8400320 11588588 14036991 12457826 8067554 4491075
36771 4491075 2471959 576896 -195344 2420383 6536864 7114107 3007994 -1635318
36763 -1635318 -3736823 -4413635 -4840930 -3883835 -1698058 -1275507 -3843594 -6178062 -5135947
36754 -5135947 -2163254 -712732 -1184323 -920184 1823112 5732065 7855025 6293319
36746 6293319 1733902 -3559825 -8206607 -12016293 -13709471 -11150839 -5635019 -2689649
36738 -2689649 -5162472 -8240856 -5808127 394602 3273766 775863 -2075078 -1437367
36730 -1437367 742802 1184591 -713875 -4286843 -8440649 -10442676 -8648875 -6902655
36722 -6902655 -10777908 -18600750 -22272481 -18694263 -14009930 -13822032 -15638302 -15058207
36714 -15058207 -13597573 -15002101 -18023362 -18375816 -15162392 -10784330 -6866271 -4203180
36706 -4203180 -4081344 -5666576 -4839442 109457 4347093 2855578 -1378216 -956982 5327715
36697 5327715 10871639 10206904 4911989 -34079 -1935724 -1435821 -852795 -2499848 -6670166
36688 -6670166 -10700301 -11350975 -7996504 -2489406 2956598 6255438 5556824 1347394
36680 1347394 -2705640 -3498066 -2124984 -1439025 -1272365 831863 4780433 7129664 5529503
36671 5529503 1532117 -1600721 -2176334 -818768 736157 1335887 1528809 2619562 4395711
36662 4395711 5194686 4782731 5065776 6725372 7502386 5672735 2936082 1594353 1083794
36653 1083794 -80505 -1063127 -410417 899352 1247465 1418107 2562570 3040757 1121184
36644 1121184 -909565 233621 2932757 2576858 -1283167 -4714029 -6187942 -8135237
36636 -8135237 -10883789 -10662667 -5960585 -1176489 -888958 -4087846 -7104899 -9016976
36628 -9016976 -10645520 -10802497 -7699492 -3001520 -690217 -1773060 -2921203 -933765
36620 -933765 3445810 6931807 7581802 6368396 5402604 5386707 5181031 3824489 2300219
36611 2300219 2423519 4105579 4837491 2459394 -2160344 -5852362 -6417815 -4714307 -3264074
36602 -3264074 -3098789 -2900371 -1758582 -1427947 -3880617 -7281952 -7397170 -3634638 -484302
36593 -484302 -1143796 -2812647 -1425193 1303022 -142950 -6625406 -12074116 -10804613
36585 -10804613 -4310058 864042 464463 -3782088 -7339653 -8417616 -9189458 -11081944
36577 -11081944 -10796109 -4192457 6193388 11912552 8569314 898446 -4629141 -7628228
36569 -7628228 -10115087 -9836602 -4085549 2642966 2817376 -2698055 -5091003 -604325
36561 -604325 4358624 3753053 537179 397981 2409177 1649432 -2216845 -4698601 -3440202
36552 -3440202 -677751 965243 1392884 1396996 862770 -559337 -2419607 -3643413 -3314930
36543 -3314930 -1563856 135112 331657 -582952 -967982 -303915 472663 921344 1502865
36534 1502865 1959481 1478599 736707 1312004 2518619 1544259 -2260321 -5951722 -7191635
36525 -7191635 -7104836 -7105044 -5679243 -1289046 3315622 3234933 -2109221 -7282902 -6655050
36516 -6655050 -634090 5028208 5801972 2907814 414689 -846542 -3662082 -8626965
36508 -8626965 -11893576 -10970578 -9071787 -9908738 -11312113 -9064806 -4664371 -3120658
36500 -3120658 -4317051 -3381489 472807 2661958 1691860 1387119 2546721 185752 -7018261
36491 -7018261 -11890855 -9009640 -3783951 -4591157 -10225042 -12452791 -8600751 -4427483
36483 -4427483 -4812396 -7456881 -7117967 -2698794 1229161 -782772 -8320360 -13777396
36475 -13777396 -10740943 -3296851 -1801013 -8613391 -14846827 -13844189 -9975308 -9088952
36467 -9088952 -8342911 -3323460 1487129 -842490 -7289267 -9125232 -5569292 -2802467
36459 -2802467 -1409279 3918780 12349660 16068258 13342348 11703850 14793521 16069680
36451 16069680 10421977 3197541 1648782 4456748 5927481 4786620 2654384 -1291717
36443 -1291717 -7709440 -12631815 -11470778 -5229060 1579676 6478006 8712224 7091007
36435 7091007 2923818 1781834 6764806 12361363 10777834 3026243 -2009355 684384
36427 684384 6728342 9416540 7850402 6052264 6749235 8387147 7747113 4273085 911515
36418 911515 -11643 -575078 -4288939 -9661879 -10832760 -6097048 -1559416 -3172603 -8528021
36409 -8528021 -10482620 -6556794 -656979 2821196 2422363 -1783957 -8846462 -16122635
36401 -16122635 -20983210 -23345503 -24153011 -22274974 -16102021 -7731499 -2053712 -1180098
36393 -1180098 -2517636 -2904655 -2187531 -1872322 -2227801 -2028159 -615008 260553 -2879938
36384 -2879938 -11233519 -20077447 -21740679 -14077479 -3803844 910883 -945113 -4637669
36376 -4637669 -7065266 -8504900 -8542353 -5358472 449199 5326803 7097827 7014003 6952178
36367 6952178 7231515 7554377 7531802 6113716 3008824 374511 140600 148312 -3350799
36358 -3350799 -9542686 -13654575 -13929303 -13113810 -12104027 -7895602 -499399 3818698
36350 3818698 881407 -3992313 -2473717 5350856 11541172 11008761 6384177 2486941
36342 2486941 903670 806376 1024040 94834 -2521521 -4396119 -2374539 2425243 5244205
36333 5244205 4257480 2692630 2711564 1416914 -3772929 -9260206 -9303596 -3984892 1507441
36324 1507441 4580802 7252288 10207754 10013137 4510647 -2738105 -6303328 -4835366
36316 -4835366 -712357 4009461 8375967 10893258 10360210 7820134 5149740 2268959
36308 2268959 -1726014 -5212439 -4899486 -562562 3500347 2781105 -2864639 -9183416
36300 -9183416 -11153602 -7332632 -1853425 -786882 -4794681 -7632387 -4976668 -1807161
36292 -1807161 -5388040 -12712843 -12928923 -3459306 4688912 1922789 -6807956 -10037068
36284 -10037068 -5423945 -62808 1069260 -885855 -4095070 -7568231 -8013455 -2794573
36276 -2794573 3736623 4257998 -320087 -1334052 4110597 8297957 5384729 744339
36268 744339 1562097 4581760 1737432 -5647739 -7887680 -2138510 2346714 -2339529
36260 -2339529 -10534796 -10073268 1204055 12227442 12829688 6145292 3155262 7394300
36252 7394300 10810387 5923273 -3589005 -8879265 -8510258 -8370521 -10473342 -9522625 -2173817
36243 -2173817 7099464 12523480 13723414 12405514 8165016 2513748 1686448 8671668
36235 8671668 16047191 14094646 4074895 -3790833 -4492794 -2898524 -4138333 -7012275
36227 -7012275 -8946743 -10745515 -13185092 -14179466 -12676956 -10974226 -10053928 -6968129
36219 -6968129 -399170 5235883 5434445 2137544 354659 1094194 2211404 3733671
36211 3733671 6784839 8458919 3779671 -6487634 -14969829 -16341841 -13029659 -10390964
36203 -10390964 -9638004 -8261899 -5098183 -1672802 785372 2895352 5161318 6173037
36195 6173037 3959443 -1182574 -6168502 -8080996 -7279027 -6394360 -6154480 -4234959 294850
36186 294850 3528864 984221 -5479878 -9059244 -7123480 -4746170 -6747756 -10238496
36178 -10238496 -9529197 -5744257 -5350762 -9389415 -10925601 -5757750 279385 -494900
36170 -494900 -6391336 -9521945 -7725456 -6117258 -7003588 -5900373 -50657 5701876
36162 5701876 5809657 1836961 -1370607 -3169088 -5311124 -6158781 -3341212 -209838
36154 -209838 -2477933 -8747569 -11371193 -7609034 -3152213 -2679140 -3642770 -2668761 -1825189
36145 -1825189 -3794018 -5874937 -4376093 -1325137 -1130052 -3329248 -4529306 -5530847
36137 -5530847 -10151789 -17570623 -21964866 -20385821 -15774376 -11352261 -7191825 -3730024
36129 -3730024 -3395500 -6047797 -7215590 -4322654 -1296106 -3193341 -8645378 -11590049
36121 -11590049 -9175912 -4307283 -1054197 -942742 -3521191 -7113600 -8434253 -4668252
36113 -4668252 2588720 7833213 7740884 4843900 3471377 4166434 4757076 5113874 6757172
36104 6757172 8082263 4819688 -2978031 -8845705 -8314399 -5965263 -9199040 -16968530
36096 -16968530 -20449494 -14709143 -4115274 4670344 9351919 9699777 4592071 -4438459
36088 -4438459 -10975792 -9936899 -3714943 1487129 2885287 1426021 -1557283 -3588848
36080 -3588848 -514637 7616385 13002176 8889729 -252391 -4590167 -3317118 -4471064
36072 -4471064 -10313545 -12898355 -7543771 -1553663 -3473240 -10551196 -14043735 -12076024
36064 -12076024 -9427467 -7528484 -3123372 3196335 4734704 -2229791 -11760606 -14207266
36056 -14207266 -7165576 1938203 4130869 -1420520 -6956081 -5687572 -233313 1053339
$$ [...]
##END NTUPLES=NMR SPECTRUM
##END=
