##TITLE=31Pdec_4xp
 CDCl3
  24 sc
 3.11.2023
##JCAMPDX= 6.0         $$ Bruker NMR JCAMP-DX V2.0
##DATA TYPE= NMR SPECTRUM
##DATA CLASS= NTUPLES
##ORIGIN= UXNMR, Bruker Analytische Messtechnik GmbH
##OWNER= root
$$ XWIN-NMR		Version 3.5
$$ Fri Nov  3 15:48:39 2023 Russian Standard Time (UT+4h)  she@DPX200
##.OBSERVE FREQUENCY= 81.013821
##.OBSERVE NUCLEUS= ^31P
##.ACQUISITION MODE= SIMULTANEOUS
##.ACQUISITION SCHEME= undefined
##.AVERAGES= 24
##.DIGITISER RES= 16
##SPECTROMETER/DATA SYSTEM= spect
##.PULSE SEQUENCE= zgpg30
##.SOLVENT NAME= CDCl3
##.SHIFT REFERENCE= (INTERNAL, CDCl3, 0, 248.564)
##AUDIT TRAIL= $$ (NUMBER, WHEN, WHO, WHERE, WHAT)
$$ ##TITLE= Audit trail, XWIN-NMR		Version 3.5
$$ ##JCAMPDX= 5.01
$$ ##ORIGIN= Bruker BioSpin GmbH
$$ ##OWNER= she
$$ F:/spectra/data/she/nmr/P31/1/pdata/1/auditp.txt
$$ ##AUDIT TRAIL=  $$ (NUMBER, WHEN, WHO, WHERE, WHAT)
(   1,<2023-11-03 15:47:50.45 +0400>,<she>,<DPX200>,
      <created by zg, POWCHK disabled, PULCHK disabled
       configuration hash MD5:
       00 E9 B6 7A A2 85 ED C7 34 08 36 98 17 FE 4E 26
       data hash MD5: 32K
       4B 1B 8C F3 03 83 8E 12 EE 68 35 DC 8A 2D 24 C9>)
(   2,<2023-11-03 15:47:53.37 +0400>,<she>,<DPX200>,
      <Start of raw data processing
       efp BC_mod = 2 LB = 5 FT_mod = 6 PKNL = 1 PHC0 = -10043.3 PHC1 = -1082.109 SI = 64K 
       data hash MD5: 64K
       73 56 DA C2 99 BB 7A 82 F5 46 18 50 D9 FD 44 2F>)
(   3,<2023-11-03 15:48:07.34 +0400>,<she>,<DPX200>,
      <pk PHC0 = -39.04816 PHC1 = 0 
       data hash MD5: 64K
       37 2F 26 A5 9B 05 B2 2D 9A 57 46 67 3D 31 CE 46>)
(   4,<2023-11-03 15:48:11.01 +0400>,<she>,<DPX200>,
      <abs ABSG = 5 
       data hash MD5: 64K
       78 78 B4 ED D2 89 9B C2 CB E8 B6 81 9A 86 49 9D>)
$$ ##END=
$$ 
$$ hash MD5
$$ AE CA C4 D5 2E EB 98 D0 B0 A8 42 27 BE 65 24 EB
##$RELAX= 
##$RELAX= 
##$RELAX= 
##$RELAX= 
##$RELAX= 
##$RELAX= 
##$RELAX= 
##$RELAX= 
##$RELAX= 
$$ Bruker specific parameters
$$ --------------------------
##$DU= <F:/spectra>
##$EXPNO= 1
##$NAME= <P31>
##$PROCNO= 1
##$TYPE= <nmr>
##$USER= <she>
##$AMP= (0..31)
100 100 100 100 100 100 100 100 100 100 100 100 100 100 100 100 100 100 
100 100 100 100 100 100 100 100 100 100 100 100 100 100 
##$AQSEQ= 0
##$AQ_mod= 1
##$AUNM= <au_zg>
##$AUTOPOS= <>
##$BF1= 81.014009
##$BF2= 200.13
##$BF3= 200.13
##$BF4= 200.13
##$BF5= 200.13
##$BF6= 200.13
##$BF7= 200.13
##$BF8= 200.13
##$BYTORDA= 1
##$CFDGTYP= 0
##$CFRGTYP= 5
##$CHEMSTR= <none>
##$CNST= (0..31)
1 1 145 1 1 1 1 1 1 1 1 1 1 1 1 1 1 1 1 1 1 1 1 1 1 1 1 1 1 1 1 1 
##$CPDPRG= <waltz16>
##$CPDPRG1= <>
##$CPDPRG2= <waltz16>
##$CPDPRG3= <>
##$CPDPRG4= <mlev>
##$CPDPRG5= <mlev>
##$CPDPRG6= <mlev>
##$CPDPRG7= <mlev>
##$CPDPRG8= <mlev>
##$CPDPRGB= <>
##$CPDPRGT= <>
##$D= (0..31)
0 1 0 0 0 0 0 0 0 0 0 0.03 2e-05 3e-06 0 0 0 0 0 0 0 0 0 0 0 0 0 0 0 0 
0 0 
##$DATE= 1699012069
##$DBL= (0..7)
120 120 120 11 120 120 24 19 
##$DBP= (0..7)
150 150 150 150 150 150 150 150 
##$DBP07= 0
##$DBPNAM0= <>
##$DBPNAM1= <>
##$DBPNAM2= <>
$$ [...]
##$SUBNAM3= <"">
##$SUBNAM4= <"">
##$SUBNAM5= <"">
##$SUBNAM6= <"">
##$SUBNAM7= <"">
##$SUBNAM8= <"">
##$SUBNAM9= <"">
##$SW= 501.771253377433
##$SWIBOX= (0..15)
0 1 3 0 0 0 0 0 0 0 0 0 0 0 0 0 
##$SW_h= 40650.406504065
##$TD= 32768
##$TD0= 1
##$TE= 0
##$TE2= 300
##$TE3= 300
##$TEG= 300
##$TL= (0..7)
0 120 53 12 22 120 120 120 
##$TP= (0..7)
150 150 150 150 150 150 150 150 
##$TP07= 0
##$TPNAME0= <>
##$TPNAME1= <>
##$TPNAME2= <>
##$TPNAME3= <>
##$TPNAME4= <>
##$TPNAME5= <>
##$TPNAME6= <>
##$TPNAME7= <>
##$TPOAL= (0..7)
0.5 0.5 0.5 0.5 0.5 0.5 0.5 0.5 
##$TPOFFS= (0..7)
0 0 0 0 0 0 0 0 
##$TUNHIN= 0
##$TUNHOUT= 0
##$TUNXOUT= 0
##$USERA1= <user>
##$USERA2= <user>
##$USERA3= <user>
##$USERA4= <user>
##$USERA5= <user>
##$V9= 5
##$VALIST= <valist>
##$VCLIST= <CCCCCCCCCCCCCCC>
##$VD= 0
##$VDLIST= <DDDDDDDDDDDDDDD>
##$VPLIST= <PPPPPPPPPPPPPPP>
##$VTLIST= <TTTTTTTTTTTTTTT>
##$WBST= 1024
##$WBSW= 4
##$XGAIN= (0..3)
0 0 0 0 
##$XL= 0
##$YL= 0
##$YMAX_a= 190
##$YMIN_a= -194
##$ZGOPTNS= <>
##$ZL1= 120
##$ZL2= 120
##$ZL3= 120
##$ZL4= 120
##$ABSF1= 248.5645
##$ABSF2= -253.2056
##$ABSG= 5
##$ABSL= 3
##$ALPHA= 0
##$AQORDER= 0
##$ASSFAC= 0
##$ASSFACI= 0
##$ASSFACX= 0
##$ASSWID= 0
##$AUNMP= <proc_1d>
##$AZFE= 0.1
##$AZFW= 0.5
##$BCFW= 0
##$BC_mod= 2
##$BYTORDP= 0
##$COROFFS= 0
##$CY= -3
##$DATMOD= 1
##$DC= 0
##$DFILT= <>
##$DTYPP= 0
##$F1P= 0
##$F2P= 0
##$FCOR= 1
##$FTSIZE= 65536
##$FT_mod= 6
##$GAMMA= 0
##$GB= 0
##$INTBC= 1
##$INTSCL= 6.047779e-11
##$ISEN= 30
##$LB= 5
##$LEV0= 0
##$LPBIN= 0
##$MAXI= 10000
##$MC2= 0
##$MEAN= 0
##$ME_mod= 0
##$MI= 50
##$NCOEF= 0
##$NC_proc= -12
##$NLEV= 6
##$NOISF1= 182.463
##$NOISF2= 159.3651
##$NSP= 0
##$NTH_PI= 0
##$NZP= 0
##$OFFSET= 248.5645
##$PC= 4
##$PHC0= -10082.35
##$PHC1= -1082.109
##$PH_mod= 1
##$PKNL= yes
##$PPARMOD= 0
##$PSCAL= 0
##$PSIGN= 0
##$REVERSE= no
##$SF= 81.0140089999694
##$SI= 65536
##$SIGF1= 159.3651
##$SIGF2= -187.1042
##$SINO= 113.3802
##$SIOLD= 16384
##$SREGLST= <1H.CDCl3>
##$SSB= 0
##$STSI= 65536
##$STSR= 0
##$SW_p= 40650.406504065
##$SYMM= 0
##$S_DEV= 0
##$TDeff= 32768
##$TDoff= 0
##$TI= <>
##$TILT= no
##$TM1= 0
##$TM2= 0
##$TOPLEV= 0
##$USERP1= <user>
##$USERP2= <user>
##$USERP3= <user>
##$USERP4= <user>
##$USERP5= <user>
##$WDW= 1
##$XDIM= 65536
##$YMAX_p= 392346302
##$YMIN_p= -52519765
$$ End of Bruker specific parameters
$$ ---------------------------------
##NTUPLES= NMR SPECTRUM
##VAR_NAME=  FREQUENCY,     SPECTRUM/REAL,   SPECTRUM/IMAG
##SYMBOL=    X,             R,               I
##VAR_TYPE=  INDEPENDENT,   DEPENDENT,       DEPENDENT
##VAR_FORM=  AFFN,          ASDF,            ASDF
##VAR_DIM=   65536,         65536,           65536
##UNITS=     HZ,            ARBITRARY UNITS, ARBITRARY UNITS
##FACTOR=    0.620285442955139, 1,           1
##FIRST=     20137.2065510682, 0,            0
##LAST=      -20513.1999529968, 0,           0
##MIN=       -20513.1999529968, -52519765,   0
##MAX=       20137.2065510682, 392346302,    0
$$ Real data points
##PAGE= N=1
##DATA TABLE= (X++(R..R)), XYDATA
$$ [...]
40459b875092q65213o82209l48111J0824L47487O19054P34417O34115M03558K42321
40449a778849K81502M49999N50656M52954J85395j28340l69403m82519n11617
40440a350222n82962p82117j028979j135728j003977p02401l47854q305K46855
40431f695690L21292K08046N4968J8349J00563K11997L32746N11619P49091R88619
40421c198400J194497J333214J310614J062164P09877M95430N12226O01202N53208
40412D574032L22547p039l69747p39301j049427j186719j086580q16972n55180
40403i14386m53339m90979m84208k98700l4801P8280k9796j80044j61741M7480
40393b922234L11959M99631N60369N20347M68165M96585N97929O57100N94345
$$ y = [-2875092, -3740305, -4422514, -4770625, -4759801, -4412314, -3793260, -3058843, -2424728, -2021170, -1778849, -1497347, -1047348, -496692, -43738, 141657, 13317, -356086, -838605, -1350222, -1933184, -2715301, -3744280, -4880008, -5883985, -6586386, -6934240, -6942545, -6695690, -6374398, -6166352, -6111384, -6093035, -5992472, -5780475, -5447729, -4936110, -4187019, -3198400, -2003903, -670689, 639925, 1702089, 2411966, 2907396, 3419622, 4020824, 4574032, 4896579, 4889540, 4519793, 3780492, 2731065, 1544346, 457766, -359206, -914386, -1367725, -1858704, -2342912, -2641612, -2676413, -2598133, -2627929, -2807973, -2969714, -2922234, -2610275, -2110644, -1550275, -1029928, -561763, -65178, 532751, 1189851, 1784196]
40384A784196M65580L70560L16148K38252J19854J4558l0820k5156k3716j08193
40374C121263l37561o63431r24059r81037q45693o30051m08510j82196N5513K85605
40364a510157M75035N64937M80742K29975l1527j18773r499J48544K19314J96630
40354F45221J42480R4235O0524L6264k1012j77144m34683o83456p69063o05015
40344a711649k28518K08285M97550M91818K14917j51383m10647m80564m03598
40335a973789k85764k35112l00957m27781m88887l95192j64531J15495L58689
40326c797829N04224N16601M03490K20893L5880j10636k02760k40838k48776k59782
40316c179533k69194k23669q6712R6923K29590K52780J94991J28311Q9225N0398
$$ y = [1784196, 2249776, 2620336, 2936484, 3174736, 3294590, 3309148, 3278328, 3253172, 3229456, 3121263, 2783702, 2120271, 1196212, 215175, -630518, -1260569, -1669079, -1851275, -1795762, -1510157, -1035122, -470185, 10557, 240532, 209005, 90232, 80733, 229277, 448591, 645221, 787701, 881936, 942460, 978724, 957712, 780568, 345885, -337571, -1106634, -1711649, -1940167, -1731882, -1234332, -742514, -527597, -678980, -1089627, -1570191, -1973789, -2259553, -2494665, -2795622, -3223403, -3712290, -4107482, -4272013, -4156518, -3797829, -3293605, -2777004, -2373514, -2152621, -2116741, -2227377, -2430137, -2670975, -2919751, -3179533, -3448727, -3672396, -3759108, -3662185, -3432595, -3179815, -2984824, -2856513, -2767288, -2716890]
40306b716890k4625j06878j12772q997J25091J83295J61644J46535J82462K19888
40296a951247K06809J60390J10940L3331j14918l22829n32892o84771p21010o00078
40286d416275l56202j04874P1264K09918L82516N54467O07127M81031K27196n9772
40276b403604k74541k95320p6565K25406L44496J92943l1741r7721q440O5941
40266b359146L6968n2979j73403l33931m64194m21720j80663R9911K63794L17577
40256c267786L31142K83417J27997n3985j14784m9645j8498j32760l26811m80923
40246c702636n69145o12659n65736l56733k9251K44108L19194K21895J18998J58061
40236d773904L32915M99164N25862M20733K80236J38711n6999l03652m63247m07824
$$ y = [-2716890, -2741515, -2848393, -2961165, -2970162, -2845071, -2661776, -2500132, -2353597, -2171135, -1951247, -1744438, -1584048, -1473108, -1439777, -1554695, -1877524, -2410416, -3095187, -3816197, -4416275, -4772477, -4877351, -4806087, -4596169, -4213653, -3659186, -3052059, -2571028, -2343832, -2403604, -2678145, -2973465, -3050030, -2824624, -2480128, -2287185, -2318926, -2416647, -2425087, -2359146, -2322178, -2375157, -2548560, -2882491, -3346685, -3768405, -3949068, -3849157, -3585363, -3267786, -2936644, -2653227, -2525230, -2579215, -2693999, -2743644, -2762142, -2894902, -3221713, -3702636, -4271781, -4884440, -5450176, -5806909, -5836160, -5592052, -5272858, -5050963, -4931965, -4773904, -4440989, -3941825, -3415963, -2995230, -2714994, -2576283, -2633282, -2936934, -3400181, -3808005]
40226c808005j94256k905Q3664J54398L14881N35482O80427O34826L85752L6414
40216a179322k31868k71794r9938J07077J80330J02952k9587j42263k16153k21486
40206b002052j03475J29271L50994M12568K91504J10022j4030j02459k62909n15203
40196a705769p35068p94885p01292n40214l35449n1935K72333N00940N46104M71682
40186c073553L99526L63182L07943K00711Q5809M9568J62334M17143O76154P21894
40176C10711M50401J6870k81271k83898q2067J42901L07509M16455M54400L87519
40166A839530K50925J40020R0636K9277j25054l55320n79265p47395q55578q83865
40156a196089p90230n76410l08853n2704J75192L64222M64593M29680K86706J27678
$$ y = [-3808005, -4002261, -4005166, -3921502, -3767104, -3452223, -2916741, -2236314, -1601488, -1215736, -1179322, -1411190, -1682984, -1782922, -1675845, -1495515, -1392563, -1422150, -1564413, -1780566, -2002052, -2105527, -1976256, -1625262, -1212694, -921190, -811168, -825198, -927657, -1190566, -1705769, -2440837, -3235722, -3937014, -4477228, -4812677, -4864612, -4592279, -4091339, -3545235, -3073553, -2674027, -2310845, -2002902, -1802191, -1716382, -1666814, -1504480, -1087337, -411183, 310711, 761112, 777982, 496711, 212813, 130746, 273647, 581156, 997611, 1452011, 1839530, 2090455, 2230475, 2321111, 2350388, 2225334, 1870014, 1290749, 543354, -312224, -1196089, -1986319, -2562729, -2871582, -2924286, -2749094, -2384872, -1920279, -1490599, -1203893, -1076215]
40146a076215L6272M4943J42371K85781M12466M67899M20918K49822l9917l50923
40136E93417n08658m26700k34528j47415k06570k40077r9977J58637L76918M77061
40126b57892M76922L96158K49534J07352O9346J61359L00943L71077L09867J51650
40116B336316Q558j7163O4762J48383J73722J94071K49309K43284N2486k70163
40106C183565n11329n27057l65339j44887Q7370L26869N17678N67170M34328J61716
40096C730084j60671m33436n75863n61210m35042k91909k27329k84686m14211
40087C45727m94529m33808k45481N999L00258O27841Q80537Q89348O18934K41523
40077B736349m4134k04501l19593m04301l77483j93212P2520K67946K55424j6539
$$ y = [-1076215, -1039943, -995000, -852629, -566848, -154382, 313517, 734435, 984257, 944340, 593417, 84759, -341941, -576469, -723884, -930454, -1170531, -1270508, -1111871, -734953, -257892, 219030, 615188, 864722, 972074, 1041420, 1202779, 1503722, 1874799, 2184666, 2336316, 2344874, 2327711, 2392473, 2540856, 2714578, 2908649, 3157958, 3401242, 3453728, 3183565, 2672236, 2145179, 1779840, 1634953, 1722323, 2049192, 2566870, 3134040, 3568368, 3730084, 3569413, 3135977, 2560114, 1998904, 1563862, 1271953, 1044624, 759938, 345727, -148802, -582610, -828091, -822092, -521834, 106007, 986544, 1875892, 2494826, 2736349, 2692215, 2487714, 2168121, 1763820, 1386337, 1193125, 1265645, 1533591, 1789015, 1772476]
40067A772476m59418q66130j054468j011328q66742p37898o43872n53386m40001
40058d860767k77639n1109J95690L68327M07435L32636J92885K8360r9056j11834
40048c875072j3075P4120L8832p0434j05839j9714P6067O9004r535m9833l1784
40037c917263o6001k68607o29262j003969j215173j165509q92886n40375k60535
40028i959580j17042n1815O2130L20694P06531J079557J255070J124460P35508
40019d844487K74278m1004q8888Q6051L21102M73843N25675N42995N54746N15701
40009a679988L97838K55285J53272Q0524l390p1364p2075o2727j85651m61615
39999a649891o90581o40012k94352J48564M95738O98803P96016Q07666P22894
$$ y = [1772476, 1313058, 446928, -607540, -1618868, -2485610, -3223508, -3867380, -4420766, -4860767, -5138406, -5189515, -4993825, -4625498, -4218063, -3885427, -3692542, -3664182, -3763238, -3875072, -3888147, -3814027, -3775195, -3845629, -3951468, -3971182, -3895115, -3826111, -3835646, -3885479, -3917263, -3983264, -4251871, -4881133, -5885102, -7100275, -8265784, -9158670, -9699045, -9959580, -10076622, -10128437, -10066307, -9745613, -9039082, -7959525, -6704455, -5579995, -4844487, -4570209, -4611213, -4700101, -4614050, -4292948, -3819105, -3293430, -2750435, -2195689, -1679988, -1282150, -1026865, -873593, -793069, -796459, -867823, -939898, -1002625, -1188276, -1649891, -2340472, -2980484, -3274836, -3126272, -2630534, -1931731, -1135715, -328049, 394845]
39990C94845N43987L12320J03638q520j9674k2481j22396l09569m46347l97785
39980B8018j58175J44433L35863L02106P5974j55718j82092N1518M08813P15800
39970A566540R05556R95102R91031Q89297P32370N78703M08231J30582k81892
39961F915520p20504j041013j206464j284780j321575j269633j057576o90459
39953a676484k60343J13624L30207L30893J45184q9772k22178k28423k14946k48575
39943b020813k48061j06017J34614L18715L69747L37347K52031N3903k79032o30468
39933a818034q61313r64146j008767r72274p35900k71708K40684N24334M17227
39924e449897j1233n06419p89897p34161m22055l8887K85294N19569O64594P12200
$$ y = [394845, 938832, 1251152, 1354790, 1346270, 1326596, 1304115, 1181719, 872150, 425803, 28018, -130157, 14276, 350139, 652245, 728219, 572501, 390409, 441927, 850740, 1566540, 2472096, 3467198, 4458229, 5347526, 6079896, 6658599, 7066830, 7197412, 6915520, 6195016, 5154003, 3947539, 2662759, 1341184, 71551, -986025, -1676484, -1936827, -1823203, -1492996, -1162103, -1016919, -1106691, -1328869, -1557292, -1772238, -2020813, -2268874, -2374891, -2240277, -1921562, -1551815, -1214468, -962437, -908534, -1187566, -1818034, -2679347, -3643493, -4652260, -5624534, -6360434, -6632142, -6391458, -5867124, -5449897, -5461130, -5967549, -6757446, -7491607, -7913662, -7952549, -7667255, -7147686, -6483092, -5770892]
39914e770892O79130O17567N52024M35034K04737j17845m10070n28706m10359
39905d749380j12440K22578M47982M92386L97805K87176K60358K91058K52057
39896b210420R0229m8533M2986L54524O16607O01715L85224K12086J70198J31649
39886C46265q4j39194j65565j07134q9168j66915k87131l75676l93029l26233
39876a703864j88255k0267J43864L03452M52981N45802N38671M53375L49513K50355
39866A125627J43148M2805m763k03k5198j62807l98141o24260p42999p41271o68674
39855b056736n67184m48057l24614k20447j25051J3685K04457L48241L22734J23386
39845b729586j42778l96073o29518p97630p65029m42498Q2508O19576J033458
$$ y = [-5770892, -5091762, -4474195, -3922171, -3487137, -3282400, -3400245, -3810315, -4339021, -4749380, -4861820, -4639242, -4191260, -3698874, -3301069, -3013893, -2753535, -2462477, -2210420, -2120191, -2168724, -2125738, -1771214, -1154607, -552892, -167668, 44418, 214616, 346265, 346181, 206987, 41422, -65712, -154880, -321795, -608926, -984602, -1377631, -1703864, -1892119, -1912386, -1768522, -1465070, -1012089, -466287, 72384, 525759, 875272, 1125627, 1268775, 1311580, 1306817, 1306614, 1281416, 1118609, 720468, 96208, -646791, -1388062, -2056736, -2623920, -3071977, -3396591, -3617038, -3742089, -3728404, -3523947, -3175706, -2852972, -2729586, -2872364, -3268437, -3897955, -4695585, -5460614, -5903112, -5820604, -5201028, -4167570]
39836d167570J268285J282103J069432P32661M26756K17706O7711m2621p1994
39827G82469k0903J6316m2716j68828k75896l25082l25326k77383j84506r8962
39817i20817r4727j87495l20400m35852n33566o47609p80876q69940q13405n44050
39807f148737r0346M19414Q08440R28541P44669L86268Q2075k3517Q499K4422
39797b860272q96N9394K68205M87550N32687L96941K31198J36505P5198k2098
39787f95588j61242l16845m73486n92172o00314m68834k58613m2971J77860M25720
39777c006485O33361O63589M63252J49149r7840k06248k53524l42677m70418n26654
39767b994495m08899j28228J85960L76861L74187K49990J68890K53829M67305
$$ y = [-4167570, -2899285, -1617182, -547750, 184911, 611667, 829373, 897084, 854463, 782469, 761566, 777882, 735166, 566338, 290442, -34640, -359966, -637349, -821855, -920817, -1015544, -1203039, -1523439, -1959291, -2492857, -3140466, -3921342, -4791282, -5604687, -6148737, -6239083, -5819669, -5011229, -4082688, -3338019, -2951751, -2869676, -2893193, -2884694, -2860272, -2861168, -2801774, -2533569, -2046019, -1513332, -1116391, -885193, -748688, -673490, -695588, -856830, -1173675, -1647161, -2239333, -2839647, -3308481, -3567094, -3610065, -3432205, -3006485, -2373124, -1709535, -1246283, -1097134, -1194974, -1401222, -1654746, -1997423, -2467841, -2994495, -3403394, -3531622, -3345662, -2968801, -2594614, -2344624, -2175734, -1921905, -1454600]
39758a454600O20327N19799J30382l94108q30659j040833j029083q86918p08562
39749e074255n56980m70515m55236m63410m14645k63424l1082K37604N09018P17346
39739f265579P35688M81026O0809k59287k78376k1956L26707N94867O95794O23592
39729c306715M61883L62378M20965N64320O16076M80255K14882o1779k66573l43961
39719h58269k42574M1904M18810P30270Q34339O82946L56676J7333k20285l78371
39709A382779n46088p32386q48474q36548p37945o05658m25875j81056O6779K24097
39699c240375K68482K50220K17151J83500J41657N4599j27284l74909n31763m35555
39689c594277q9637L46561P26003R95428J113519J001567O45402J88540j54222
$$ y = [-1454600, -834273, -314474, -184092, -578200, -1408859, -2449692, -3478775, -4365693, -5074255, -5631235, -6101750, -6556986, -7020396, -7435041, -7698465, -7729547, -7491943, -6982925, -6265579, -5529891, -5048865, -4988056, -5247343, -5525719, -5547675, -5220968, -4626101, -3930307, -3306715, -2844832, -2482454, -2061489, -1497169, -881093, -400838, -185956, -247735, -514308, -858269, -1100843, -1058939, -640129, 90141, 924480, 1607426, 1964102, 1981435, 1761150, 1382779, 836691, 104305, -744169, -1580717, -2318662, -2924320, -3350195, -3531251, -3464472, -3240375, -2971893, -2721673, -2504522, -2321022, -2179365, -2124766, -2252050, -2626959, -3158722, -3594277, -3683914, -3337353, -2611350, -1615922, -502403, 499164, 1144566, 1333106, 1178884]
39680A178884k72977k24755j46889j47766k60511m46002o16947o73830n41264
39671b152057k02672K61574O72149Q45165P39038M96673L11141K56208K64317
39662A491536K37691J30004o7620l45200o33241p79375o32061j80131L94026Q11869
39652D27498Q70563N62350O9394l56130n54843n58944n42430o48478q46131r62695
39642b539846q64576n98073l47810k71196l81300n67464o97106o94816n50572
39633g512759k84290O8917M24960O35147N79771L19101J03262J58591M63735P83380
39623d260185R10558Q13940N62807K21871j21854l21279k74099n0633J68446K83033
39613b067395L31192L59225L29624K00159J8651j28234k16385k69336k81667k43760
$$ y = [1178884, 905907, 681152, 534263, 386497, 125986, -320016, -936963, -1610793, -2152057, -2354729, -2093155, -1421006, -575841, 163197, 659870, 971011, 1227219, 1491536, 1729227, 1859231, 1791611, 1446411, 813170, 33795, -598266, -778397, -384371, 427498, 1298061, 1860411, 1929805, 1573675, 1018832, 459888, -82542, -731020, -1577151, -2539846, -3404422, -4002495, -4350305, -4621501, -5002801, -5570265, -6267371, -6962187, -7512759, -7797049, -7728132, -7303172, -6668025, -6088254, -5769153, -5665891, -5507300, -5043565, -4260185, -3349627, -2535687, -1972880, -1751009, -1872863, -2194142, -2468241, -2518874, -2350428, -2067395, -1736203, -1376978, -1047354, -847195, -828544, -956778, -1173163, -1442499, -1724166, -1967926]
39603a967926k28482l48263n89219p70219p29320m97170k23465J1633K18175L65025
39593d759231L60863J99747J7597o2322o3913p2319r2861r0368j01351j72222
39583d836380k09248m3966L12356O08302O22911M08601J86675P9349M4676K4252
39573b802472L4944J10852K42540L93634N21453N73893N18743L83648K23416N3812
39563B54463j26701k57795k42210q0153Q3420Q8748r5550l76218o24863p28305
39553b105164o14409l05883O6129L60480N37453O37630O73741O08933M48254K86887
39543E94051K25860K64968L08265K59979R3811j51544m06690n96889o63354n82431
39533f53974l64689l7152L55628P23194R28491Q61996N37599R9194k81282n03498
$$ y = [-1967926, -2196408, -2544671, -3133890, -3904109, -4633429, -5130599, -5354064, -5342431, -5124256, -4759231, -4398368, -4198621, -4181024, -4243346, -4307259, -4379578, -4472439, -4562807, -4664158, -4836380, -5045628, -5089594, -4777238, -4168936, -3546025, -3137424, -2950749, -2871400, -2826724, -2802472, -2767528, -2656676, -2414136, -2020502, -1499049, -925156, -406413, -22765, 200651, 254463, 127762, -130033, -372243, -452396, -368976, -280228, -375778, -751996, -1376859, -2105164, -2719573, -3025456, -2959327, -2598847, -2061394, -1423764, -750023, -141090, 307164, 594051, 819911, 1084879, 1393144, 1653123, 1746934, 1595390, 1188700, 591811, -71543, -653974, -1018663, -1055815, -700187, 23007, 951498, 1813494, 2351093, 2450287, 2169005, 1665507]
39523A665507n45257m24006j96868L2747J79758K60553L58226M85243N33886M04627
39513B754416J49694n7576q3661N9705K35915K63187J2182m83414r89938j217514
39503F42996j062244o95469l89196k71155k68269k50668j72323o8729K6995J18379
39493b389683K01444K25375J33832m5825j80308j35326Q5057L22107L97620K55825
39483a129882k4437l17201n17816n57383m16259j49089J32021L26730M00217L76288
39473a876811L05151K44282K34471K61993K59044J72933L1151q9188j56224k18304
39463h31502l31213m70841n40529m67003k82871j10151n1418q2470n5614J66225
39453c057387N59511R26521J045865Q52385M87495J85357R5598J82186K75048
$$ y = [1665507, 1120250, 696244, 499376, 532123, 711881, 972434, 1330660, 1815903, 2349789, 2754416, 2904110, 2846534, 2762873, 2822578, 3058493, 3321680, 3333862, 2850448, 1860510, 642996, -419248, -1114717, -1503913, -1775068, -2043337, -2294005, -2466328, -2535057, -2508062, -2389683, -2188239, -1962864, -1829032, -1874857, -2055165, -2190491, -2105434, -1783327, -1385707, -1129882, -1154319, -1471520, -1989336, -2546719, -2962978, -3112067, -2980046, -2653316, -2253099, -1876811, -1571660, -1327378, -1092907, -830914, -571870, -398937, -367786, -456974, -613198, -831502, -1162715, -1633556, -2174085, -2641088, -2923959, -3034110, -3085528, -3167998, -3223612, -3057387, -2497876, -1571355, -525490, 326895, 814390, 999747, 1095345, 1277531, 1552579]
39444A552579K29500M9875j35658k05783j32818M1024K55514M32975M75434L28310
39434B890952N2616k08598l51903l81424l57308l15956k59805j89859j07514N093
39424G76294J65497L42221M58268M68689M17395L81166L54458K29025p8871m95567
39414C018575q21795r06424p72492n77109m75478n17739o28014o63366n38138
39405b881980l24484j92934k16801k79903k32326q8695J9921O5682J68758L85790
39395c576972N67948N22679K58178k9954j92326k54895l12271l80400l99214l30922
39385d128149j98438l3760J69305M27426O98973Q66930Q18087N48594J78569j42602
39375g95065l32529l88110l50600k85604k59344k86618l13801k89614k37981k16554
$$ y = [1552579, 1782079, 1831954, 1696296, 1490513, 1357695, 1398719, 1654233, 2087208, 2562642, 2890952, 2943568, 2734970, 2383067, 2001643, 1644335, 1328379, 1068574, 878715, 771201, 776294, 941791, 1284012, 1742280, 2210969, 2628364, 3009530, 3363988, 3593013, 3514142, 3018575, 2196780, 1290356, 517864, -59245, -534723, -1052462, -1680476, -2343842, -2881980, -3206464, -3399398, -3616199, -3896102, -4128428, -4217123, -4197202, -4131520, -3962762, -3576972, -3009024, -2486345, -2228167, -2258121, -2450447, -2705342, -3017613, -3398013, -3797227, -4128149, -4326587, -4360347, -4191042, -3763616, -3064643, -2197713, -1379626, -831032, -652463, -795065, -1127594, -1515704, -1866304, -2151908, -2411252, -2697870, -3011671, -3301285, -3539266, -3755820]
39365c755820k10972j26429R5863L92288O34827P56096P93232Q17355Q42061Q08068
39355A046569O48863L57392j5971m06914p44172r28298q75424o23394l46474k03469
39345b091292j86514j63789m8359J26928K79366L57618L65513L67867M58902O50267
39335A16507P98849P36886M84180K35692J15623N0694o6008k02537k70968k88394
39325A710524l32523l90739l83629l21702l15685m15438n36717n72565m99174
39316b057648l52311j78934m3488j1532q5768k05728l33225m79664o23516o72803
39306e044617n66358l68692k10006j56214j73440j87053j34348J0219K11352L85177
39296f233980M72262M95531N30047O29630P84651R10885Q71067N77282J21455
$$ y = [-3755820, -3966792, -4093221, -3997358, -3605070, -2970243, -2214147, -1420915, -603560, 238501, 1046569, 1695432, 2052824, 2036853, 1629939, 885767, -42531, -917955, -1541349, -1887823, -2091292, -2277806, -2441595, -2489954, -2363026, -2083660, -1726042, -1360529, -992662, -533760, 116507, 915356, 1652242, 2136422, 2372114, 2487737, 2538431, 2472423, 2269886, 1998918, 1710524, 1378001, 987262, 603633, 281931, -33754, -449192, -985909, -1558474, -2057648, -2409959, -2588893, -2632381, -2643913, -2729681, -2935409, -3268634, -3748298, -4371814, -5044617, -5610975, -5979667, -6189673, -6345887, -6519327, -6706380, -6840728, -6830509, -6619157, -6233980, -5761718, -5266187, -4736140, -4106510, -3321859, -2410974, -1539907, -962625, -841170]
39287h41170k53260l81495l40981l22751l78483l92831k86146j21387K5037J91686
39277c101781M52812P68942R97143J027830Q49544M99719L4092m31312p14977
39268C82012o81697l73401M278K53471L38853L60113L90637L90118K86727Q8480
39258A439591j37713l63981o11110q67509j064845j146746j107599r51204o70836
39249e481952k96282R2121M24665O69591P84263P21512N38238M17249M87541O65850
39239i77204P65626P23638O14624M76353K67819K5868q1152N4134L09242M32238
39229B611186K64358j72934p20078j131166j178764q49011m16567k12616l07434
39220b113026m94215n61508m73678k89839m6581K16591M16548M96082M82790M22112
$$ y = [-841170, -1094430, -1475925, -1816906, -2139657, -2518140, -2910971, -3197117, -3318504, -3293467, -3101781, -2648969, -1880027, -882884, 144946, 994490, 1494209, 1528301, 1096989, 382012, -299685, -673086, -668808, -415337, -76484, 283629, 674266, 1064384, 1351111, 1439591, 1301878, 937897, 326787, -540722, -1605567, -2752313, -3859912, -4811116, -5481952, -5778234, -5686113, -5261448, -4591857, -3807594, -3086082, -2547844, -2130595, -1643054, -977204, -211578, 512060, 1126684, 1603037, 1870856, 1896724, 1815572, 1869706, 2178948, 2611186, 2875544, 2702610, 1982532, 851366, -327398, -1176409, -1592976, -1805592, -2113026, -2607241, -3168749, -3642427, -3932266, -3978847, -3762256, -3345708, -2849626, -2366836, -1944724]
39210a944724L06744J31523l6248j15302j07892p8381o7320q5332j49673k45732
39200b392337k79005j58876O6281K33868K34725R3100j10536l03473l94556k95933
39190c306742m3331J71574J71483k4256k38698l34183l19546k80669k65867k57102
39180d727337k25809j93099k20079l25499m29049m16629k62100l8575J92352M35362
39170f210462O84247Q71749R57294J001619J073683J124964J046331Q29897N79365
39161A958687L54058R4043k60385o32318q38105p42302l82810K9904K49345J78726
39151H843o8768l16574n02186o57318p58379p15744n27366l25513k08341j11294
39141d182640Q0078L58704O21245Q08029R14983Q93387O52932J93024l38542p46325
$$ y = [-1944724, -1637980, -1506457, -1542705, -1658007, -1765899, -1844280, -1911600, -1996932, -2146605, -2392337, -2671342, -2830218, -2763937, -2530069, -2295344, -2202244, -2312780, -2616253, -3010809, -3306742, -3350073, -3178499, -3007016, -3031272, -3269970, -3604153, -3923699, -4204368, -4470235, -4727337, -4953146, -5146245, -5366324, -5691823, -6120872, -6537501, -6799601, -6838176, -6645824, -6210462, -5526215, -4654466, -3697172, -2695553, -1621870, -496906, 549425, 1379322, 1958687, 2312745, 2406788, 2146403, 1514085, 675980, -66322, -449132, -419228, -169883, 8843, -59925, -376499, -878685, -1536003, -2294382, -3010126, -3537492, -3863005, -4071346, -4182640, -4102562, -3743858, -3122613, -2314584, -1399601, -506214, 146718, 339742, 1200, -745125]
39131g45125r05861p86045m35915M49L08182L27312Q9640j85458k61846q2125
39121b676792J91899L41715L06107K25838K72985M63583O59699P25157O34966
39112A145157M47209K26722J5622j58784k76181l14836k50216r1323O8496P5025
39102H86891j57756n24528p63962o63325k54360K02663M49430M42569L29885K47522
39092A95029J97064J18526J832j24945k59019l96922m71856m04281k28995j04641
39082a478208j59416l54369n15963m83161k27626J25076L77729M06337K56267
39073b053334Q4056j632k0620m9029j12278j69232j67480q7799M3547J65359K24229
39062b144213K25944K27708K67862L27821L77960M28212N00248N66618N51741
$$ y = [-745125, -1650986, -2437031, -2872946, -2872497, -2564315, -2237003, -2147363, -2332821, -2594667, -2676792, -2484893, -2143178, -1837071, -1611233, -1338248, -874665, -214966, 510191, 1145157, 1592366, 1819088, 1834710, 1675926, 1399745, 1084909, 834693, 743370, 811866, 886891, 729135, 204607, -559355, -1222680, -1477040, -1274377, -824947, -382378, -52493, 195029, 392093, 510619, 512451, 387506, 128487, -268435, -740291, -1144572, -1373567, -1478208, -1637624, -1991993, -2507956, -2991117, -3218743, -3093667, -2715938, -2309601, -2053334, -1969278, -1970910, -1991530, -2040559, -2152837, -2322069, -2489549, -2577348, -2533801, -2368442, -2144213, -1918269, -1690561, -1422699, -1094878, -716918, -288706, 211542, 778160, 1329901]
39053A329901L94464R7702k68080n85358p23676n96790k25300K44430O02841P05478
39043I75612N79566L99835L28059L68264L90538K83964O2541j58928k51666j54379
39033B823406O6651K34609K08004L7306p5761P09J99671L64394M14567L65485
39023D639041K63381J75175J79293K70687L06586J41113j95637n32913p60150
39014D486576r01996r97029j014373r34869q25650p61464p17366o03765l89525
39005b659461j47378J1382K5107o7431j34797m3405K06925M36674M17051P8544
38995a876789l97686o94420n89716j26176M17262P35895P15879M73126K12284
38986a130341O8957O0350J27360K00242K49905K90551L18957K66297N9476k62609
$$ y = [1329901, 1724365, 1822067, 1553987, 968629, 244953, -351837, -577137, -332707, 270134, 975612, 1555178, 1955013, 2283072, 2651336, 3041874, 3325838, 3388379, 3229451, 2977785, 2823406, 2890057, 3124666, 3332670, 3369976, 3294215, 3294924, 3494595, 3858989, 4273556, 4639041, 4902422, 5077597, 5256890, 5527577, 5834163, 5975276, 5779639, 5246726, 4486576, 3584580, 2587551, 1573178, 638309, -187341, -948805, -1666171, -2269936, -2659461, -2806839, -2795457, -2770350, -2837781, -2972578, -3015983, -2809058, -2372384, -1955333, -1876789, -2274475, -2968895, -3558611, -3684787, -3267525, -2531630, -1815751, -1342625, -1130341, -1061384, -1001034, -873674, -673432, -423527, -132976, 185981, 452278, 511754, 249145]
38976B49145n46282o60038n96907m35137k67773k03490l45278o65811r39222r09249
38966e320042n45615o0413L42124O45377R12743J097696J072133Q25207N27569
38957e03221L55391L12239K80718K10530J76186K44307L62647M32074M41855M59989
38947B772715M96634M50501K24579j40939m79082o19787m96948j78230J74343
38938B203786L98940M33296L26243J46368r4421m06247p41042r87751j043999
38929B35173q76792n36050j36653J98177M18851N66082O73615O76545M71228O4999
38919A755175l86586p04600q10212p23377n04736k43599o3771o7269k37660m12351
38909b398986l87396r2729L17852N79703N58135L69002K34453K46181L22869L75350
$$ y = [249145, -297137, -957175, -1554082, -1989219, -2256992, -2460482, -2805760, -3471571, -4410793, -5320042, -5865657, -5926070, -5583946, -4938569, -4025826, -2928130, -1855997, -1030790, -503221, -147830, 164409, 445127, 655657, 831843, 1076150, 1438797, 1870871, 2312726, 2772715, 3269349, 3719850, 3944429, 3803490, 3324408, 2704621, 2207673, 2029443, 2203786, 2602726, 3036022, 3362265, 3508633, 3414212, 3007965, 2266923, 1279172, 235173, -641619, -1177669, -1314322, -1116145, -697294, -131212, 542403, 1218948, 1690176, 1755175, 1368589, 663989, -146223, -869600, -1374336, -1617935, -1681706, -1748975, -1986635, -2398986, -2786382, -2879111, -2561259, -1981556, -1423421, -1054419, -819966, -573785, -250916, 124434]
38899A24434M19803N01181N88269O05839N21529L42490O9541k73839n92997p82887
38889A523363q39944q49171q55258q14371o90689n25193l59435j50288J62004
38880c398982N20695P65846Q00051O89934N77578N31789N20588M94023M35923
38871A937445L37225J73795o3429l43148o15599q35262r52273r25048p75700n94759
38861b656753m39155k53949L6600L72630N77805N54657L85489K06470O4110m0477
38851a192573m7065J03484L22888M08514K60540o129j99761k36769j52091J832
38841g37130J86466L36963L76509K93889J64664P2047K4787l6169j63619l43639
38831A74768n00045n56981n02493l85230k45321o9956J61670M10811N98546O92142
$$ y = [124434, 544237, 1045418, 1633687, 2239526, 2761055, 3103545, 3173086, 2899247, 2306250, 1523363, 683419, -165752, -1021010, -1835381, -2526070, -3051263, -3410698, -3560986, -3398982, -2878287, -2112441, -1312390, -622456, -44878, 486911, 1007499, 1501522, 1937445, 2274670, 2448465, 2385036, 2041888, 1426289, 591027, -361246, -1286294, -2061994, -2656753, -3095908, -3349857, -3313257, -2940627, -2362822, -1808165, -1422676, -1216206, -1152096, -1192573, -1239638, -1136154, -813266, -404752, -144212, -150341, -350102, -586871, -738962, -737130, -550664, -213701, 162808, 456697, 621361, 693408, 718195, 682026, 518407, 174768, -325277, -882258, -1384751, -1769981, -2015302, -2085258, -1923588, -1512777, -914231, -222089]
38821b22089P29893P47947P27508O47213N50846N06731N04205M40490K27608j15725
38811D744627m88038p89366r67801j017794r65329q40601o43038l50623J2545
38802a305418L39488N08475M85415L40785J87936J33193K42183M73434O47396
38793B052887N71842K41892j38903l70491m30913m03406l14856j42139O7151K00788
38783A333852K20509K03052K18844K50880K67817K93484L38790L27913J82769
38774C637910m0492j87214j91454j61837k46367m53095o46841p03960o25476m93798
38764a12624l60937k15025m3218J15864J98150J65576J6670k15337m34526m87947
38754a373354k82176Q5196L75470M37733L53320L10232L68381M11116L16714J06243
$$ y = [-222089, 507804, 1255751, 1983259, 2630472, 3181318, 3688049, 4192254, 4632744, 4860352, 4744627, 4256589, 3467223, 2499422, 1481628, 516299, -324302, -967340, -1317963, -1305418, -965930, -457455, 27960, 368745, 556681, 689874, 932057, 1405491, 2052887, 2624729, 2866621, 2727718, 2357227, 1926314, 1522908, 1208052, 1065913, 1133064, 1333852, 1554361, 1757413, 1976257, 2227137, 2494954, 2788438, 3127228, 3455141, 3637910, 3597418, 3410204, 3218750, 3056913, 2810546, 2357451, 1710610, 1006650, 381174, -112624, -473561, -688586, -731804, -615940, -417790, -252214, -235544, -450881, -885407, -1373354, -1655530, -1570334, -1194864, -757131, -403811, -93579, 274802, 685918, 1002632, 1108875]
38744A108875j00876k20318k45593j93819p8321N3135J08461K7908j42256k93444
38734B3752l73717m25366m94307n48305n19473l91871j97420M8159L35024N85907
38724a957617O73319N53589L41203K08766K36427L80869N48630O53536O30614
38715B269336M55319J64853j54781m00378m78641l58167j36412j1594j16713l82302
38705H50520o09880o75978o21474n56873n46109n87738o38911o25256m81320k26752
38695d719771K6744J80209K36335K55461K55643K08509J26586R7635J99853M01417
38685b731379N74964O19582N54326M76513M34666L71420K07430m4428k85615m46560
38675b69081n53000o60780p52781p32327n22014j60073K05869M29472M82107M57642
$$ y = [1108875, 1007999, 787681, 542088, 348269, 269948, 323083, 431544, 459452, 317196, 23752, -349965, -775331, -1269638, -1817943, -2337416, -2729287, -2926707, -2878548, -2543524, -1957617, -1284298, -730709, -389506, -180740, 55687, 436556, 985186, 1638722, 2269336, 2724655, 2889508, 2734727, 2334349, 1855708, 1497541, 1361129, 1349535, 1232822, 850520, 240640, -435338, -1056812, -1613685, -2159794, -2747532, -3386443, -4011699, -4493019, -4719771, -4693027, -4512818, -4276483, -4021022, -3765379, -3556870, -3430284, -3332649, -3132796, -2731379, -2156415, -1536833, -982507, -505994, -71328, 300092, 507522, 463094, 177479, -269081, -822081, -1482861, -2235642, -2967969, -3489983, -3650056, -3444187, -3014715, -2532608, -2074966]
38665b074966M55200M72338M37961L40917K84422L88264O45225Q86538Q96628
38656B732527N83549O2486m29895p21371q06950p73410o71731n13181l52916k78131
38646a169023k84165k38748l0775K82726N35483O36709O37457O11067N23956K65732
38636A770419j97002p18608j045163j005805o47530j87394J60743L17678L40722
38627a211940L43338M06840N22245O01882N75568M78176M04964L78061L11590
38618B810724J34779r5926k42527k12277j5909K55343M68771N02746L18964j4200
38608C910488l84867p01407q87711q81442o97728m59216k95152k19985j60119
38599g77139q2708m1605j04416k86292n46632p95357r08981q10221n58539l24497
$$ y = [-2074966, -1619766, -1147428, -709467, -368550, -84128, 304136, 949361, 1835899, 2732527, 3316076, 3378562, 2948667, 2227296, 1420346, 646936, -24795, -537976, -890892, -1169023, -1453188, -1691936, -1722711, -1439985, -904502, -267793, 369664, 980731, 1504687, 1770419, 1573417, 854809, -190354, -1196159, -1843689, -2031083, -1870340, -1552662, -1211940, -868602, -461762, 60483, 662365, 1237933, 1716109, 2121073, 2499134, 2810724, 2945503, 2849577, 2607050, 2394773, 2378864, 2634207, 3102978, 3605724, 3924688, 3910488, 3525621, 2824214, 1936503, 1055061, 357333, -101883, -397035, -617020, -777139, -859847, -901452, -1005868, -1292160, -1838792, -2634149, -3543130, -4353351, -4911890, -5236387]
38589e236387k52653l58706n41526o59742o16980m28978k10208n7869L8054J33003
38579h191992K19136K58498K96825M30005O39899P72561P28473N87803M93355
38570c765437M91520N53221O67125Q12265Q91269Q06648O01497M37372M16583
38561A912063M79924M82757L23590M166l76238o72939p90432p47512o29766m84658
38551d99045k98275o7521J55394L07827L80118M26603N28468P27271R52638J021504
38541C634982P67265K06386m33330q62782r18480o41940k26501J17670K97230
38532A940500L62166L96040M03646L43194K36901J68124J60478J44087Q2824O1189
38522D299149J69816L41304L81974J74146k01469n49098p22423p04736n80063
$$ y = [-5236387, -5489040, -5847746, -6389272, -7049014, -7665994, -8094972, -8305180, -8363049, -8324995, -8191992, -7972856, -7714358, -7417533, -6987528, -6347629, -5575068, -4846595, -4258792, -3765437, -3273917, -2720696, -2053571, -1241306, -350037, 456611, 1058108, 1495480, 1912063, 2391987, 2874744, 3198334, 3202500, 2826262, 2153323, 1362891, 615379, -14387, -499045, -797320, -864841, -709447, -401620, -21502, 405101, 933569, 1660840, 2613478, 3634982, 4402247, 4608633, 4175303, 3312521, 2394041, 1752101, 1525600, 1643270, 1940500, 2302666, 2698706, 3102352, 3445546, 3682447, 3850571, 4011049, 4155136, 4237960, 4299149, 4468965, 4810269, 5192243, 5366389, 5164920, 4615822, 3893399, 3188663, 2608600]
38513B608600m62671m34532n08570o28571p03172o53741m56269j61208J26696
38504a273438L08735L54182L14046K77382L12008M37849O36249Q55303R93859
38495C216175R19692N74306Q0909l14478m70069m88245n71577p68663r41966r70468
38485B65616q74808p18637n04153k39498j4720R9636J78024L50663O10380Q14968
38475c2529Q74543Q26720P15528N16962K37908r903j16051r5660l8787J8626J02763
38464C000120K12352K90833K74170J12979k29319p28780j248935j599270j670902
38455a586752j488990j134966o61843r9656M90441R92341J264125J208446Q49580
38446a67274L45428j03389l71578m47958l97390l15864k82641k87754k13820M0414
$$ y = [2608600, 2145929, 1711397, 1202827, 574256, -128916, -782657, -1238926, -1400134, -1273438, -964703, -610521, -296475, -19093, 292915, 730764, 1367013, 2222316, 3216175, 4135867, 4710173, 4791082, 4476604, 4006535, 3518290, 2946713, 2178050, 1236084, 265616, -609192, -1327829, -1831982, -2071480, -2086200, -1986564, -1808540, -1457877, -847497, -32529, 842014, 1668734, 2384262, 2901224, 3139132, 3129229, 3013178, 2917518, 2878731, 2897357, 3000120, 3212472, 3503305, 3777475, 3890454, 3661135, 2932355, 1683420, 84150, -1586752, -3075742, -4210708, -4872551, -4972207, -4481766, -3489425, -2225300, -1016854, -167274, 178154, 74765, -296813, -744771, -1142161, -1458025, -1740666, -2028420, -2242240, -2201826]
38436b201826M03745O61103O66461M80269K71180J37579P0893M6102P3690J61560
38426G70756K75447L56777L67056L13119K33448J50894M1382j24427l06701m06064
38416A671687l66669k26290l5986K14523N28199P91017Q16800N24603L6335m05738
38406C548481n96845m84579k10396m4429j87036n64992q52508p51161k59549L38160
38396f4854P25725P84037O12629L80720J66590p6999m08196p57567r39056q27608
38386d04579n07657k07458q3537r4540q6273L2749K15655L47137L53337K44921
38376a90245Q6964m6349r8476n1842N1422J24506J05327K2751k0145O3252K74900
38365C22065N43988P75196Q76189P79079M86619J04440k03554l17328k30240l8182
$$ y = [-2201826, -1798081, -1136978, -470517, 9752, 280932, 418511, 489404, 535506, 609196, 770756, 1046203, 1402980, 1770036, 2083155, 2316603, 2467497, 2508879, 2384452, 2077751, 1671687, 1305018, 1078728, 1042742, 1257265, 1785464, 2576481, 3393281, 3917884, 3954219, 3548481, 2951636, 2467057, 2256661, 2212232, 2025196, 1460204, 607696, -143465, -403014, -64854, 660871, 1444908, 2057537, 2438257, 2604847, 2527848, 2119652, 1362085, 423029, -404579, -912236, -1119694, -1203231, -1297771, -1384044, -1351295, -1135640, -788503, -435166, -190245, -103281, -149630, -248106, -299948, -248526, -124020, -18693, 4058, -16087, 47165, 322065, 866053, 1641249, 2517438, 3296517, 3783136, 3887576, 3684022, 3366694, 3136454, 3098272]
38355C098272J20058J31871k3836k51872m12442m56385m76959n89459p64288q25669
38345d50709o34040k39631J57824L63394K83144o5701n53931r58578j072990q53538
38335d024756m38102q638L30080N38183N92897N22372M46699M95967O65173P91634
38325h8491O99707L64308n2523l08339k57580K0022K68186K76776O4517j84208
38315H02375l37541m05846m27379l73733k29577r2070r3515k37379l83651l99972
38305b178288k68097l8342K44215N24555P07790P25168O28640N55011N68068N78791
38295B047511M62942K31656K8630m7478o7170j84723m50457p34899q32797o37257
38285a84042k40047J18681K29406Q3626j34730k42007k19167j68871j53319j27011
$$ y = [3098272, 3218330, 3350201, 3326365, 3074493, 2662051, 2205666, 1728707, 1139248, 374960, -450709, -1084749, -1324380, -1166556, -803162, -520018, -585719, -1139650, -2098228, -3171218, -4024756, -4462858, -4471496, -4141416, -3603233, -3010336, -2487964, -2041265, -1545298, -880125, -88491, 611216, 975524, 923001, 614662, 357082, 377104, 645290, 922066, 986583, 802375, 464834, 58988, -368391, -742124, -971701, -1063771, -1157286, -1394665, -1778316, -2178288, -2446385, -2484727, -2240512, -1715957, -1008167, -282999, 345641, 900652, 1468720, 2047511, 2510453, 2742109, 2770739, 2723261, 2656091, 2471368, 2020911, 1286012, 453215, -184042, -424089, -305408, -76002, 7624, -127106, -369113, -588280, -757151, -910470, -1037481]
38275a037481o823K46138N94639R12105J022598Q46266N18242K75241J92082J13301
38265C676308j10117m04400n68840n20758l53607j97140j23809j72316l45132
38256H80189n51514o38924n33757l13776j20111l8962p9080j99525l18449l43186
38246b257095k46428r5894K1878Q2805J05296Q9632K6230o2828j47785k41949
38236b726138l66503m70608m63641l48635k44969k21481j68072P8566M99330Q68291
38226c563860R76041Q12016N14706K23688K4096m0783J0475R0506J27992J48779
38216f76344K15257L04656L22180K31488R0507n8313k48472m93421o93289p01578
38206a707329m62434n0492L87267O95272P71537O41902M58043L56874L17686K06612
$$ y = [-1037481, -1044304, -798166, -203527, 708578, 1731176, 2577442, 3095684, 3370925, 3563007, 3676308, 3566191, 3161791, 2592951, 2072193, 1718586, 1521446, 1397637, 1225321, 880189, 328675, -310249, -844006, -1157782, -1277893, -1316855, -1395935, -1595460, -1913909, -2257095, -2503523, -2599417, -2577539, -2494734, -2389438, -2299806, -2273576, -2336404, -2484189, -2726138, -3092641, -3563249, -4026890, -4375525, -4620494, -4841975, -5010047, -4931481, -4432151, -3563860, -2587819, -1775803, -1261097, -1037409, -1013313, -1054096, -1043621, -953115, -825123, -676344, -461087, -156431, 165749, 397237, 487744, 429431, 180959, -312462, -1005751, -1707329, -2169763, -2220255, -1832988, -1137716, -366179, 275723, 733766, 1090640, 1408326, 1614938]
38196A614938l2531k80020l55446k06222L8772J95012J93045J27100J36993K48764
38186A680405L46332K97362Q2738j98816m16942m87844m12573k74601j71072j10437
38176C34552k415K12977M50792N45461M26277J91854J1583j6303Q7220K38487
38166B480485L75436M85215N50520N00183K74652m7476k59727k16409L2501L35414
38156D510794O02193Q03082Q75011P54985M96574K37936L5723j71710m13408o02846
38146G128334o58238o19747n76044n34509m42164l03168k01605k08761l12321
38137C271777m38858n20956n43944n38934n27181m83627l83952k71271k18169
38128f55115k20130j95875j14991n1555o7074j05223o2932Q0983K65124M26776
$$ y = [1614938, 1582407, 1302387, 946941, 740719, 779491, 974503, 1167548, 1294648, 1431641, 1680405, 2026737, 2324099, 2406837, 2208021, 1791079, 1303235, 890662, 616061, 444989, 334552, 332137, 545114, 995906, 1541367, 1967644, 2159498, 2171081, 2154778, 2241998, 2480485, 2855921, 3341136, 3891656, 4391839, 4666491, 4619015, 4359288, 4142879, 4175380, 4510794, 5112987, 5916069, 6791080, 7546065, 8042639, 8280575, 8316298, 8144588, 7731180, 7128334, 6470096, 5850349, 5274305, 4739796, 4297632, 3994464, 3792859, 3584098, 3271777, 2832919, 2311963, 1768019, 1229085, 701904, 218277, -165675, -436946, -655115, -875245, -1071120, -1186111, -1237666, -1304740, -1409963, -1472895, -1391912, -1126788, -700012]
38118g00012N20062M99031L68178K32592K19223L46433N23166O56447O93746N88030
38108C946896L25746M003k15682k72610k60084k84001l43234l89471m15533m05829
38098A690201k76555R984K92283L01910m5602n29484q37200q40920o28358l41744
38088a205485p3982J19039K15413K57236L07794L47229K70463K8129k79018m92879
38078e06061n50009m98560m05221l08827k38763j98883j30757L2445K54109L99566
38068b150961L85562K73736J83564J65754K05541K94067M15933M84743L79243
38059F37182Q0200k63248m30799k92025J07964N73065Q55201P86894L86444j42440
38049B298438n33762o21273m25919j18891J03622J46330N6709l8443l7464P8726
$$ y = [-700012, -179950, 319081, 687259, 919851, 1139074, 1485507, 2008673, 2665120, 3358866, 3946896, 4272642, 4276645, 4060963, 3788353, 3528269, 3244268, 2901034, 2511563, 2096030, 1690201, 1413646, 1423630, 1715913, 2017823, 1972221, 1442737, 605537, -235383, -863741, -1205485, -1279467, -1160428, -945015, -687779, -379985, -32756, 237707, 265836, -13182, -506061, -1056070, -1554630, -1959851, -2268678, -2507441, -2706324, -2837081, -2804636, -2550527, -2150961, -1765399, -1491663, -1308099, -1142345, -936804, -642737, -226804, 257939, 637182, 717382, 454134, 23335, -268690, -160726, 412339, 1267540, 2054434, 2440878, 2298438, 1764676, 1143403, 717484, 598593, 702215, 848545, 905254, 866811, 829347, 908073]
38039I08073K61794M41608N61057N94600N49751M41259K57796k1771l50330n69738
38029C074099n12129j85745J75044L06767J65677o4270k04494k50921k90461l37572
38019A875995l31975k47991j11744O9875K94671M68060M23787J01203l53251p13639
38009A474991q69294q59648p63902o15099m06910j38205J54242L97098N31733
38000a094994N71056N73919N56535M80199L48347K49325K43279K49571J20627
37991B297864j80104n25137p40644p38679n53263k99192q8368O3363K47950N42681
37981B6471Q76010J058947R64940O60748L61013K61837L85919N55863N50363L35265
37971F037376J13842R1626K22009K70229J23501o0983n1104J90590M73161N55947
$$ y = [908073, 1169867, 1611475, 2172532, 2767132, 3316883, 3758142, 4015938, 3994167, 3643837, 3074099, 2561970, 2376225, 2551269, 2858036, 3023713, 2959443, 2754949, 2504028, 2213567, 1875995, 1544020, 1296029, 1184285, 1254160, 1548831, 2016891, 2440678, 2541881, 2188630, 1474991, 605697, -253951, -1017853, -1632952, -2039862, -2178067, -2023825, -1626727, -1094994, -523938, 49981, 606516, 1086715, 1435062, 1684387, 1927666, 2177237, 2297864, 2117760, 1592623, 851979, 113300, -439963, -739155, -827523, -764160, -516210, 26471, 902481, 1961428, 2926368, 3587116, 3948129, 4209966, 4595885, 5151748, 5702111, 6037376, 6151218, 6242844, 6464853, 6735082, 6858583, 6797600, 6746496, 6937086, 7410247, 7966194]
37961G966194L25192j42077o25748r06424r20581p71022n74865l52271r9104J03176
37951D002470J46338M6117o0064q6380r7791k02104m01619o03178p36649p98516
37941A208624p88378o74957m62759k54065j86237k92589m50123m84810l27886
37932b713180p0158J22599J44198K3984j04210j14774J402J29514J37151j0590
37922b454064k39981m48841n68676n55808l70858j0128M42294Q22083R72715Q46729
37912a564535N34486J97941l1110j06754n3532P9611K52386M44575O46931Q31380
37902A231379R32203Q82906O83965M12274J51600o1003k10536k76321k74397k89949
37892C182121l93505n22356n10250k63949J24841M61142O04505N28201K72888
$$ y = [7966194, 8291386, 8149309, 7523561, 6617137, 5696556, 4925534, 4350669, 3998398, 3899294, 4002470, 4148808, 4194925, 4134861, 4048481, 3950690, 3748586, 3346967, 2743789, 2007140, 1208624, 420246, -254711, -717470, -971535, -1157772, -1450361, -1900484, -2385294, -2713180, -2783338, -2660739, -2516541, -2492557, -2596767, -2711541, -2710139, -2580625, -2443474, -2454064, -2694045, -3142886, -3711562, -4267370, -4638228, -4648356, -4206062, -3383979, -2411264, -1564535, -1030049, -832108, -863218, -969972, -1023504, -943893, -691507, -246932, 399999, 1231379, 2163582, 3046488, 3730453, 4142727, 4294327, 4233324, 4022788, 3746467, 3472070, 3182121, 2788616, 2266260, 1756010, 1492061, 1616902, 2078044, 2682549, 3210750, 3483638]
37883C483638r3454m63292o85215o26846k76971K12092O13837P90970P71909O61926
37873D388594N12018L13362R2955o0165q7868l4919L199k2837r3003j62435k01465
37862D647436k09751k12104k25621k20138j39637J7076J68423K36119K36469K45687
37852D543959K87128L00674K31694J07256o723j04426k53580m88625p08003p23838
37842C185516m50772l6187K39870K14668k4932k63883l70895l55014k50125l0504
37832A857742L16289O79460Q68288P92862N58726L37399J69303l6150l02619m84088
37822D757212m31748k05206j1313N6711J03899K21644L01399J56954k15576n95903
37812D138073p48262o00674k33297K09151N59605O77076N51299L49736K87739
$$ y = [3483638, 3390184, 2926892, 2241677, 1614831, 1337860, 1549952, 2163789, 2954759, 3726668, 4388594, 4900612, 5213974, 5306929, 5246764, 5158896, 5123977, 5127176, 5104339, 5011336, 4848901, 4647436, 4437685, 4225581, 3999960, 3779822, 3640185, 3657261, 3825684, 4061803, 4298272, 4543959, 4831087, 5131761, 5363455, 5470711, 5463988, 5359562, 5105982, 4617357, 3909354, 3185516, 2734744, 2698557, 2938427, 3153095, 3128163, 2864280, 2493385, 2138371, 1888246, 1857742, 2174031, 2853491, 3721779, 4514641, 5073367, 5410766, 5580069, 5543919, 5241300, 4757212, 4325464, 4120258, 4108945, 4165656, 4269555, 4491199, 4792598, 4949552, 4733976, 4138073, 3389811, 2789137, 2555840, 2764991, 3324596, 4001672, 4552971, 4902707, 5190446]
37803E190446M19456N80415N58124L13388K6501o7871J07885M03995N64975M39471
37793H536785J08183j82372k34110o4948J39876K39316K71450L68988N85248Q49732
37783A0618148J071034J218370J293737J285726J188554J029070Q28229N51502
37775A9084370J48948l36062p24588q08556n26493l5619M08270O52238P19864
37766A8582372P00424O28708N14380M27186M51285N53568N89232M74850K92782
37757B3214787J89010K26485L75707N78800P56301Q07729P00311N46644N19200
37748B7914974O81175R50405J217175J430398J567919J605223J561486J535033
37740C8463788J640453J906670K247939K532674K690677K778696K944782L310270
$$ y = [5190446, 5609902, 6190317, 6748441, 7061829, 7088330, 7020459, 7128344, 7532339, 8097314, 8536785, 8644968, 8462596, 8228486, 8163538, 8303414, 8542730, 8814180, 9183168, 9768416, 10618148, 11689182, 12907552, 14201289, 15487015, 16675569, 17704639, 18532868, 19084370, 19233318, 18897256, 18172668, 17364112, 16837619, 16802000, 17210270, 17862508, 18582372, 19282796, 19911504, 20425884, 20853070, 21304355, 21857923, 22447155, 22922005, 23214787, 23403797, 23630282, 24005989, 24584789, 25341090, 26148819, 26849130, 27395774, 27914974, 28596149, 29546554, 30763729, 32194127, 33762046, 35367269, 36928755, 38463788, 40104241, 42010911, 44258850, 46791524, 49482201, 52260897, 55205679, 58515949]
37732E8515949L885045M603007N406165O248739P043746P691079Q196118Q710758
37724A10300606R404185J0301501J1272922J2164795J2914344J3546201J4085928
37717A93990482J4490218J4668851J4588808J4350814J4127097J4001383J3891396
37710B94109049J3650648J3223711J2667072J2029374J1255365J0222050Q844400
37703C76001669P133177N174724L081459R55273j126552l101024m894873o425629
37695C76798224p660180q690893r735379j1020534j2629652j4435430j6166338
37688B96459818j7551081j8445146j8862045j8890588j8573363j7876023j6788708
37681A69472864j5434146j4033630j2757728j1627545j0551263r426564q224202
$$ y = [58515949, 62400994, 67004001, 72410166, 78658905, 85702651, 93393730, 101589848, 110300606, 119704791, 130006292, 141279214, 153444009, 166358353, 179904554, 193990482, 208480700, 223149551, 237738359, 252089173, 266216270, 280217653, 294109049, 307759697, 320983408, 333650480, 345679854, 356935219, 367157269, 376001669, 383134846, 388309570, 391391029, 392346302, 391219750, 388118726, 383223853, 376798224, 369138044, 360447151, 350711772, 339691238, 327061586, 312626156, 296459818, 278908737, 260463591, 241601546, 222710958, 204137595, 186261572, 169472864, 154038718, 140005088, 127247360, 115619815, 105068552, 95641988, 87417786]
37674H7417786p031696o028996n364216n014364m794257m521909m146270l712143
37666D6803935l270998k869179k561567k366506k237322k134303k088027k126415
37658B7149618k177723k133932j991561j833886j675238j428329j055473o57309
37650A4196167l57038j61748J5473K56769O00710J016151J338375J306042P85527
37641A8996428m2253p98829j214602j269373j077193p58429m40608k46043j75090
37632A2974008o3378K39599O56860R22086Q36816M40151o8079n01938p71378q66306
37622A3798441q24448o97166n07066k48444M9302K87676L71424L04784J78613
37613A2713116O9766j0755q2336j59908k60364l95921n44297o59083p15830p08004
$$ y = [87417786, 80386090, 74357094, 68992878, 63978514, 59184257, 54662348, 50516078, 46803935, 43532937, 40663758, 38102191, 35735685, 33498363, 31364060, 29276033, 27149618, 24971895, 22837963, 20846402, 19012516, 17337278, 15908949, 14853476, 14196167, 13839129, 13677381, 13692854, 13949623, 14550333, 15566484, 16904859, 18210901, 18996428, 18954175, 18155346, 16940744, 15671371, 14594178, 13835749, 13395141, 13149098, 12974008, 12910630, 13150229, 13807089, 14729175, 15565991, 16006142, 15938063, 15436125, 14664747, 13798441, 12973993, 12276827, 11769761, 11521317, 11570619, 11858295, 12229719, 12534503, 12713116, 12782882, 12772127, 12689791, 12529883, 12269519, 11873598, 11329301, 10670218, 9954388, 9246384]
37603I246384n97857l36329M1817M02130O31190P29729P55517P35755O89508O77001
37593A2974845P47615Q69296R73894J033846J022914Q55620M80950J5056l48981
37584A8625055n78597q24336j164363j448467j477582j250571r39260o79313m85447
37575I777119l39426k53903k32108k32529k04335j33388m7328N919j2277j05337
37565H222407k44314l92261n04934n18569l92928j87393m3874n7825j96790l62182
37555E321337m78227m94640l75589j50081P6278K25762L25814M23604M76172M08106
37545E758536K36993M4567j50671l83535o11120p08278o23369m45130k78876j39265
37535B699852n298J00437J44897J35976Q7931r798j37317k13808j87590j15987
$$ y = [9246384, 8648527, 8312198, 8354015, 8756145, 9387335, 10117064, 10872581, 11608336, 12297844, 12974845, 13722460, 14591756, 15565650, 16599496, 17622410, 18478030, 18958980, 18974036, 18625055, 18046458, 17222122, 16057759, 14609292, 13131710, 11881139, 10941879, 10262566, 9777119, 9437693, 9183790, 8951682, 8719153, 8514818, 8381430, 8334102, 8340021, 8327744, 8222407, 7978093, 7585832, 7080898, 6562329, 6169401, 5982008, 5938134, 5880309, 5683519, 5321337, 4843110, 4348470, 3972881, 3822800, 3899078, 4124840, 4450654, 4874258, 5350430, 5758536, 5995529, 6040096, 5889425, 5505890, 4894770, 4186492, 3563123, 3117993, 2839117, 2699852, 2694554, 2794991, 2939888, 3075864, 3163795, 3153997, 3016680, 2802872, 2615282, 2499295]
37525B499295q8716j00875o9162M2604J78456K65268K76754K21743J19162m312
37515C340217j26784k50884l89788n34371o50045o93350o20143m18809j75788
37506e19745o0712j64807l67862m54539l72817k84629l26543m20274m00742k56892
37496c629562j27171q0627l1776R1928K04888J70379O113j01208J3225L36034
37486c147777P05647R49160R86163Q52449O56657M92353L65376K11483r848k54724
37476A806939m28129m49797k84626L9079L99077O04873N28638K28122r9510k98864
37466B045802l60340l43000k56711p4814J60966L18038K89595J14840m5466n8522
37456A790388O4697K02530K51683K03339J04614o173r6230j08667k063J69315
$$ y = [2499295, 2410579, 2309704, 2240542, 2283146, 2461602, 2726870, 3003624, 3225367, 3344529, 3340217, 3213433, 2962549, 2572761, 2038390, 1388345, 694995, 74852, -343957, -519745, -580457, -745264, -1113126, -1567665, -1940482, -2225111, -2551654, -2971928, -3372670, -3629562, -3756733, -3837360, -3869136, -3777208, -3572320, -3401941, -3395828, -3497036, -3483811, -3147777, -2442130, -1492970, -506807, 345642, 1002299, 1494652, 1860028, 2071511, 2061663, 1806939, 1378810, 929013, 644387, 683466, 1082543, 1687416, 2216054, 2444176, 2344666, 2045802, 1685462, 1342462, 1085751, 1010937, 1171903, 1489941, 1779536, 1894376, 1848910, 1790388, 1855085, 2057615, 2309298, 2512637, 2617251, 2611078, 2514848, 2406181, 2404118, 2573433]
37446B573433K64755J82737l4559k35236k81840j43257R5996K91345L32249K21406
37436C267029O1217m8479q0499l9004J05805L84980P38527J005776J033121P89473
37426G217946L90757L0744j36604r7123K6702R5058N9585n8397k47696m91272
37416F789700o90788p16294n78182m70020n60426p72968q38846n60340J3984O43159
37406B258979J066188J153366R78442P66357P14175Q31070R76070J052839J124853
37397A0922339J331144J735816K278954K830532L262647L502973L553948L450232
37389C2868585L193028K761669K200892J641556J189961Q27805M62358M4750m08173
37380D4782431q75106j338095j729422j944660j948421j836682j761331j795533
$$ y = [2573433, 2838188, 3020925, 2986366, 2751130, 2469290, 2326033, 2422029, 2713374, 3045623, 3267029, 3328246, 3279767, 3199268, 3160264, 3266069, 3651049, 4389576, 5395352, 6428473, 7217946, 7608703, 7639447, 7502843, 7405720, 7432422, 7527480, 7587065, 7528668, 7280972, 6789700, 6098912, 5382618, 4804436, 4334416, 3773990, 3001022, 2162176, 1601836, 1615820, 2258979, 3325167, 4478533, 5456975, 6223332, 6937507, 7768577, 8744647, 9797486, 10922339, 12253483, 13989299, 16268253, 19098785, 22361432, 25864405, 29418353, 32868585, 36061613, 38823282, 41024174, 42665730, 43855691, 44683496, 45145854, 45190604, 44782431, 43907325, 42569230, 40839808, 38895148, 36946727, 35110045, 33348714, 31553181]
37372C1553181j876370j870319j704560j455943j301287j348243j514812j601111
37364A8880536j477060j179787q52855o39397o12893p26050q04181o69298l29016
37355A1589999P397J60360J87388K91103N51878Q48720J060226J249461J576385
37346A7522917K063264K523543K734489K628935K288007J786031J108430K37296
37338C2892912p31043j601060k205193k493450k515821k358623k099483j785731
37330A7102508j440975j106871q64513p73782p98357q46162q89108r75329j099732
37321H307679j143259j007478p59532n65859n00916m85612m03486k20782j417
37312C219338J39500J02464j14933l89914n66080n78855m70871l15321j74121
$$ y = [31553181, 29676811, 27806492, 26101932, 24645989, 23344702, 21996459, 20481647, 18880536, 17403476, 16223689, 15370834, 14731437, 14118544, 13392494, 12588313, 11919015, 11589999, 11597396, 11757756, 11945144, 12236247, 12788125, 13636845, 14697071, 15946532, 17522917, 19586181, 22109724, 24844213, 27473148, 29761155, 31547186, 32655616, 32892912, 32161869, 30560809, 28355616, 25862166, 23346345, 20987722, 18888239, 17102508, 15661533, 14554662, 13690149, 12916367, 12118010, 11271848, 10382740, 9407411, 8307679, 7164420, 6156942, 5397410, 4831551, 4330635, 3845023, 3441537, 3220755, 3219338, 3358838, 3461302, 3346369, 2956455, 2390375, 1811520, 1340649, 1025328, 851207]
37303H51207r6724p9565m0878P4209J65150O0675k35585m89290m94427l14459
37293e99687j89143k53246m24796n37190n04802l70124k46973k13618k28461j75107
37283c743147k2107J10590J00564j0997q2505o2904j4973L9540J73660M13683
37273c098596O44624P28779O60208N36016M19038L00809J77176Q6078O0155Q7619
37263F01906J31699J58626J43369Q4236K7785M7924J65995K96277L03025J32516
37253B093358j19886k93355l10220k19268r4749N4695K33211L53493K73182l9910
37243A930551m40362p45920r03778r69608r66182q51441o32904m26793l44344
37234d350781l58014l40733k22062m1573J57496M09382P40744J047559J150958
$$ y = [851207, 754483, 674918, 634040, 708249, 873399, 934074, 698489, 209199, -285228, -599687, -788830, -1042076, -1466872, -2004062, -2508864, -2878988, -3125961, -3339579, -3568040, -3743147, -3765254, -3654664, -3554100, -3565097, -3647602, -3710506, -3725479, -3685939, -3512279, -3098596, -2453972, -1725193, -1064985, -528969, -109931, 190878, 368054, 454132, 514287, 601906, 733605, 892231, 1035600, 1119836, 1147621, 1195545, 1361540, 1657817, 1960842, 2093358, 1973472, 1680117, 1369897, 1150629, 1055880, 1110575, 1343786, 1697279, 1970461, 1930551, 1490189, 744269, -159509, -1129117, -2095299, -2946740, -3579644, -4006437, -4350781, -4708795, -5049528, -5271590, -5313163, -5155667, -4746285, -4005541, -2957982, -1807024]
37225a807024J001861P66583O56461P02258P49101O57749M50823K56281J69412
37216C603505K03899L31906N15351P04330Q45260Q99025Q36058O25061K58882
37207H823277k04700o54455r89685j161631j159330r92493p08707l99439j50380
37198B402457J6010J30323K14359K52359K19865J08471q7929l75448p14413r87154
37188A178900j055351q69337n12888j40261J21136K21193J83401P3971m3638j48295
37178i91169k57566l83170n04281n93104o46464o67311o20852m38229q4819L72645
37168d814320P75490R67156R00085O62333M03018K37169K13256L23344M92459
37159A59990N78632M65610J93805m6723r2366N4962K84707N11434O93242P70897
$$ y = [-1807024, -805163, -38580, 617881, 1320139, 2069240, 2726989, 3177812, 3434093, 3603505, 3807404, 4139310, 4654661, 5358991, 6204251, 7103276, 7939334, 8564395, 8823277, 8618577, 7964122, 6974437, 5812806, 4653476, 3660983, 2952276, 2552837, 2402457, 2418467, 2548790, 2763149, 3015508, 3235373, 3343844, 3255915, 2880467, 2166054, 1178900, 123549, -745788, -1258676, -1398937, -1277801, -1056608, -873207, -799236, -842874, -991169, -1248735, -1631905, -2136186, -2729290, -3375754, -4043065, -4663917, -5102146, -5186965, -4814320, -4038830, -3071674, -2171589, -1509256, -1106238, -869069, -655813, -332469, 159990, 738622, 1204232, 1398037, 1351314, 1258948, 1313910, 1598617, 2110051, 2803293, 3574190]
37149C574190O89646M84379K62859Q4423q0102k45542l38611k78970r7702P5153
37139D129723J31083O4817m5848j08679p0676O3937K43562L87484M10212K74485
37129E480100N2034j02349r2940R116M7035m5897k09230l77851n54654p42598
37119C462766q85785r19771q26613o18938l41696j16973r1660k72023m78714n31101
37109a620508m09023j74160J61113N64797Q68264Q88629O59198L96962K36024
37100A571296J26721O039r2981j56328k60732m26314n07005l52224k0011K77402
37090A65863M03291L81996K93260J83463P3905l1369j60265l39094n40375p03549
37080b72874p88473p59148n51046j44345L32595O63631P36988O15958M10858J74928
$$ y = [3574190, 4263836, 4748215, 5011074, 5095497, 5015395, 4769853, 4431242, 4152272, 4054570, 4129723, 4260806, 4325623, 4279775, 4171096, 4100420, 4164357, 4407919, 4795403, 5205615, 5480100, 5532134, 5429785, 5336845, 5345961, 5392996, 5347099, 5137869, 4760018, 4205364, 3462766, 2576981, 1657210, 830597, 211659, -130037, -247010, -338670, -610693, -1089407, -1620508, -2029531, -2203691, -2042578, -1477781, -609517, 279112, 938310, 1335272, 1571296, 1698017, 1704056, 1611075, 1454747, 1194015, 767701, 260696, -91528, -111539, 165863, 569154, 951150, 1244410, 1427873, 1501778, 1470409, 1310144, 971050, 430675, -272874, -1061347, -1820495, -2371541, -2515886, -2183291, -1519660, -782672, -166714, 244144, 419072]
37070D19072k8572o0524J70925N42416P79719P23377M69177K17576M7385j05224
37060C175327k88319m46039n05908m86864m70494m93175n13501m74905l55617
37051h59495j57646J05772L88735O04828O64890N22677J97296k13971n44775o35191
37041G3120m43106p6146K96570N48059O18233N00264K51787j4209k13638l71117
37031A169817n73084q27190r94015q79017l99086L25253J026770J452810J501887
37022A804145J231220P68678K53495j63661l58624l31024k15995j34511o0467
37013B793256R9231L16576M19010K68360r3995m88581p26120o90357l81263O1756
37003A577873M20559N47683M61201K75520O0419k03616n47482r24627j202313
$$ y = [419072, 390500, 329976, 500901, 1043317, 1823036, 2546413, 3015590, 3233166, 3280551, 3175327, 2887008, 2440969, 1935061, 1448197, 977703, 484528, -28973, -503878, -859495, -1017141, -911369, -522634, 82194, 747084, 1269761, 1467057, 1253086, 708311, 73120, -369986, -446132, -149562, 398497, 1016730, 1516994, 1768781, 1754572, 1540934, 1169817, 596733, -230457, -1224472, -2103489, -2502575, -2177322, -1150552, 302258, 1804145, 3035365, 3804043, 4057538, 3893877, 3535253, 3204229, 2988234, 2853723, 2793256, 2892487, 3209063, 3628073, 3896433, 3802438, 3313857, 2587737, 1897380, 1516117, 1577873, 1998432, 2546115, 3007316, 3282836, 3343255, 3139639, 2592157, 1667530, 465217]
36994D65217j233396r56341m54477P6757M36592N21082L61626R5007j20514k05797
36984a014244j94289j51266p6996O4846K33753L05768K18408O5923m939L7920
36974e15116J00002Q7660j3142j72653l62535n46762o76304p21530o82294n46875
36964d049549k75423J34260N72467Q51922Q45393N90859K53799j5988j93986l63429
36954a649675o04402q96492j111274j096541p94509l03744J81057N11445O74592
36945e089543P50152Q11678Q90362R96712J121986J222271J243259J159669R62523
36936D069069O41405K47403n2843j01243L9531R9268j07089m75405p70761r05947
36926B683388r51177r29989p70782m84922k47494k05560k74960k23220N9982M41226
$$ y = [465217, -768179, -1724520, -2178997, -2102240, -1665648, -1144566, -782940, -687933, -808447, -1014244, -1208533, -1359799, -1436795, -1371949, -1138196, -832428, -614020, -548097, -553036, -515116, -415114, -327454, -340596, -513249, -875784, -1422546, -2098850, -2820380, -3502674, -4049549, -4324972, -4190712, -3618245, -2766323, -1920930, -1330071, -1076272, -1092260, -1286246, -1649675, -2254077, -3150569, -4261843, -5358384, -6152893, -6456637, -6275580, -5764135, -5089543, -4339391, -3527713, -2637351, -1640639, -518653, 703618, 1946877, 3106546, 4069069, 4710474, 4957877, 4905034, 4803791, 4843322, 4942590, 4835501, 4360096, 3589335, 2683388, 1732211, 802222, 31440, -453482, -700976, -906536, -1181496, -1404716, -1344734, -903508]
36916i03508O93874P18807N96313M57138L51303K51994J43712N4139N119j0549
36906B358342J3556J06639K52058L64188L87139L70421L80415L75947K53237j0589
36896D851353l45710o99966j052306j311427j322049j024944n31317j712M61123
36887i76955P62269P82916N09834J29317j23752j89188j76960j84210k19008k77563
36877C6700l70592m50683m17552k45138l5581R8078J49669J79675K08795K07283
36867f39346J60559Q4878k1755j95341m45065o92060q02839p10255m96667l21302
36857d079193k46976j74544J3652K77831M51534M43550L44068L09756L96099N36348
36847a727875O46706P07456P51774Q06627Q50671Q28532P15036N56934M24785
$$ y = [-903508, -209634, 509173, 1105486, 1562624, 1913927, 2165921, 2309633, 2363772, 2368891, 2358342, 2371898, 2478537, 2730595, 3094783, 3481922, 3852343, 4232758, 4608705, 4861942, 4851353, 4505643, 3805677, 2753371, 1441944, 119895, -905049, -1436366, -1438078, -976955, -214686, 568230, 1078064, 1207381, 1083629, 894441, 717481, 533271, 314263, 36700, -333892, -784575, -1202127, -1447265, -1482846, -1384768, -1235099, -1055424, -846629, -639346, -478787, -393909, -415664, -611005, -1056070, -1748130, -2550969, -3261224, -3757891, -4079193, -4326169, -4500713, -4487061, -4209230, -3757696, -3314146, -2970078, -2660322, -2264223, -1727875, -1081169, -373713, 378061, 1184688, 2035359, 2863891, 3578927, 4135861, 4560646]
36838D560646L30234K34274J43589J40542K74437M52949M89450K61616j84302
36829F703435o59869r47409r30459o69152l46579j11986J6499P7823L6879k07119
36819B962063o75055j220290j609944j675403j390669q56587k39631L06282P04892
36810c694342R58351J085308J077802R28075O69402L64107O9506j57542k47962
36801A052705j68824Q588J42852J60374J29244J56499K33747K38798R5014j20282
36791A928715k52278k24418r5224J2135O307j21411k94413l95768l51838j87713
36781B4094J0974J84839L24789M15407L98872K24905p6938l97938o26449p23437
36771b40882p32519p20987p08004o56062n38848l96548k92572k23415j15052P5999
$$ y = [4560646, 4890880, 5125154, 5268743, 5409285, 5683722, 6136671, 6626121, 6887737, 6703435, 6043566, 5096157, 4165698, 3496546, 3149967, 3037981, 3054480, 3132303, 3169182, 2962063, 2287008, 1066718, -543226, -2218629, -3609298, -4465885, -4705516, -4399234, -3694342, -2735991, -1650683, -572881, 355194, 1024596, 1388703, 1458209, 1300667, 1052705, 883881, 892469, 1035321, 1195695, 1324939, 1481438, 1715185, 1953983, 2048997, 1928715, 1676437, 1452019, 1356795, 1368930, 1375237, 1253826, 959413, 563645, 211807, 24094, 35068, 219907, 544696, 960103, 1358975, 1583880, 1506942, 1109004, 482555, -240882, -973401, -1694388, -2402392, -3058454, -3597302, -3993850, -4286422, -4509837, -4624889, -4548890]
36761d548890K92348M30942M45034L63366K24811L4054k04014m27218n26111m32266
36751d347944j90081Q6169L29328N52677P47892Q13042O57804L55310J01530J4136
36741h80137M1122P0188L8813p9484k80635m55177m13711j00859K71065M15739
36731a373076K77608M7689r9738j70184k40273l01290k70435j02599J50319L60771
36721a721208L97893K30172k1410j69855j20414P4437K97229M52372M88800M14646
36711C22662L08707K60952K82534L14193L16414K89054K08539L3520k04879l99252
36701A732444m88261n16925n43859n56310n12663m05255k49514p8362K6549j4932
36691a607088j59880k67060k99520l95124o45637r03699r32377o85621l23629
$$ y = [-4548890, -4256542, -3825600, -3380566, -3017200, -2792389, -2758335, -2962349, -3389567, -3915678, -4347944, -4538025, -4451856, -4122528, -3569851, -2821959, -2008917, -1351113, -995803, -894273, -880137, -839015, -768827, -730014, -809498, -1090133, -1545310, -1959021, -2059880, -1788815, -1373076, -1095468, -1047779, -1147517, -1317701, -1557974, -1859264, -2129699, -2232298, -2081979, -1721208, -1323315, -1093143, -1114553, -1284408, -1404822, -1330385, -1033156, -580784, -91984, 322662, 631369, 892321, 1174855, 1489048, 1805462, 2094516, 2303055, 2336575, 2131696, 1732444, 1244183, 727258, 183399, -372911, -885574, -1290829, -1540343, -1618705, -1592156, -1607088, -1766968, -2034028, -2333548, -2728672, -3374309, -4278008, -5210385, -5896006, -6219635]
36682f219635n114K07383K83432K28976J66091K70022N78839R47661J208346J290639
36672a043360J182916Q87999M67722N8076k04852k43988n5019K46821M13002K37988
36662A947305k01405n93470p35073p26036p59589q34310p84559n26462j60019
36653c373618J37877K27891N0627l34197p37248r42473q53807n32458j19761K47049
36643f230118M94113O53916Q25826J038250J179016J122718Q94098O31520M18583
36634A027922K45517J23198J15374K12966K61169Q2323l51185q85405j282757
36625d50878j341226r99693m02422J64977M71687M94463L71774K40109J51662
36616a299547J18285J53095K33265K66017J52107j03110l70074n13795n30552
$$ y = [-6219635, -6224749, -6017366, -5733934, -5504958, -5338867, -5068845, -4490006, -3542345, -2333999, -1043360, 139556, 1027555, 1495277, 1553353, 1348501, 1104513, 1049494, 1296315, 1709317, 1947305, 1745900, 1152430, 417357, -308679, -1068268, -1902578, -2687137, -3213599, -3373618, -3235741, -3007850, -2957223, -3291420, -4028668, -4971141, -5824948, -6357406, -6477167, -6230118, -5736005, -5082089, -4256263, -3218013, -2038997, -916279, -22181, 609339, 1027922, 1273439, 1396637, 1512011, 1724977, 1986146, 2068469, 1717284, 831879, -450878, -1792104, -2791797, -3194219, -3029242, -2557555, -2063092, -1691318, -1451209, -1299547, -1181262, -1028167, -794902, -528885, -376778, -479888, -849962, -1363757, -1894309]
36607a894309n42570o44792p80367q03946o67132m95521m46938n17163n40582
36598g333320l96045j64242l7532r6352k29518k73719j65262P4840M30542Q73843
36588g316765J279134J462664J357298J090012Q32887O18791L67314O4148j78282
36579d22799k69737k83705l78733n92165p81748p98387o60460m95285l39035r2783
36569e114837K92368O73424Q37385P24292M56639J87091J3461J7095K40540N71832
36559a100710P59250O37689L02009j238j10721l1101J56471L71031N36813N91940
36549B111433N09743K89761m4427m02602o28890o15719m06140j38066Q5367K22393
36539I82853K40358J26812o3301k54570m36384o20528p28773o34488l44535m4298
$$ y = [-1894309, -2436879, -3081671, -3862038, -4665984, -5333116, -5828637, -6275575, -6792738, -7333320, -7729365, -7893607, -7931139, -8027491, -8257009, -8530728, -8695990, -8621150, -8190608, -7316765, -6037631, -4574967, -3217669, -2127657, -1294770, -675979, -308665, -244517, -422799, -692536, -976241, -1354974, -1947139, -2728887, -3527274, -4187734, -4683019, -5022054, -5114837, -4822469, -4149045, -3311660, -2587368, -2130729, -1943638, -1930177, -1913082, -1672542, -1100710, -341460, 296229, 598238, 597000, 486279, 455178, 611649, 982680, 1519493, 2111433, 2621176, 2910937, 2866510, 2463908, 1835018, 1219299, 813159, 675093, 760460, 982853, 1223211, 1350023, 1286722, 1032152, 595768, -24760, -753533, -1388021, -1732556, -1776854]
36529a776854Q9756O0877K113K2153J37240K84375L45247K12787r8979m36684
36519a157969o41622o75574n89987m27836k10070K5358K37322M14358N48212O08607
36509a869201N98201N92588O48123O92175N94532L52417J19825K6986M2146M8502
36499A846294p150r6415j89494k81676l54855l73284l20654j98352J0151L18029
36489C52594O62717R11693R86524R50020R19218R10693Q36146O54305M51216L23099
36479G958225K32891N7683k34499n28074o96916p38983p36879p26026o61627n16947
36469C408848l67396l43285m99600p44401r00633q38658n57805j66048J90985
36460h17993L89957L73618J80902p3744k82127m10349m82001n14886m95815m00335
$$ y = [-1776854, -1687098, -1626221, -1624108, -1601955, -1464715, -1180340, -835093, -622306, -721285, -1157969, -1799591, -2475165, -3065152, -3492988, -3703058, -3677700, -3440378, -3026020, -2477808, -1869201, -1271000, -678412, -30289, 661886, 1256418, 1608835, 1728660, 1755646, 1797792, 1846294, 1839144, 1742729, 1553235, 1271559, 916704, 543420, 222766, 24414, 34565, 352594, 1015311, 1927004, 2913528, 3863548, 4782766, 5693459, 6529605, 7183910, 7635126, 7958225, 8191116, 8248799, 8014300, 7486226, 6789310, 6050327, 5313448, 4587422, 3925795, 3408848, 3041452, 2698167, 2198567, 1454166, 553533, -285125, -842930, -1008978, -817993, -428036, -54418, 126484, 52740, -229387, -639736, -1121737, -1636623, -2132438, -2532773]
36450b532773k13367M9114L11740M63848M57699L57906K41688Q6550j54748l87062
36440a319405m09823j67393J45511L08052L19154L20568L43684K74892O7061j53695
36430b71394k48163k40133k62934l85802n62054p12660p83594p27332n05691j49087
36420d848844K21264M65872N16108L86849J34269j66406m24444n70145o02786
36411d888263n68729m79506k90860J1521L46141O02363P50059Q31900Q61181P91332
36401b032861N98777L43814J24916N821P92R1980K37367L89147N22683O29240
36391I11676O86447O79871O51362O58892O68525N60557K88301l7054k83312m57925
36381D327340o45721q29730q87759p75272o13456n51861o02474o54367o18472
$$ y = [-2532773, -2746140, -2697026, -2385286, -1921438, -1463739, -1105833, -864145, -777595, -932343, -1319405, -1729228, -1896621, -1751110, -1443058, -1123904, -803336, -459652, -184760, -117699, -271394, -519557, -759690, -1022624, -1408426, -1970480, -2683140, -3466734, -4194066, -4699757, -4848844, -4627580, -4161708, -3645600, -3258751, -3124482, -3290888, -3715332, -4285477, -4888263, -5456992, -5936498, -6227358, -6215837, -5869696, -5267333, -4517274, -3685374, -2824193, -2032861, -1434084, -1090270, -965354, -959533, -958741, -866761, -629394, -240247, 282436, 911676, 1598123, 2277994, 2929356, 3588248, 4256773, 4817330, 5105631, 5068577, 4785265, 4327340, 3681619, 2851889, 1964130, 1188858, 575402, 23541, -578933, -1233300, -1851772]
36372a851772n17431m39408m19127l66986j37203L01322P72344J013178Q99675
36363g45408N37261J53436n7770j6745K22444N03933O83176P45793P76312P99746
36353C602178P28571N08905K39679N9224m2241j93588m34545o42965p02294o50694
36343B472230n99906n75287n31929m98655n83101p88354r14884p43093k96580
36334c059559J57441L81474L72575K69140J35542p2335l53061n75512n96816m20702
36324c761813j95334p4074j07827k46823l91236m30684k85168M0667M38560P60112
36314d253620R20767R39846Q76116P44583N23625K35211k7016j72703j86596r5166
36304d94953J02140M01416O95676P88272N63289J16352l28892o18533p45276p58562
$$ y = [-1851772, -2369203, -2808611, -3227738, -3594724, -3731927, -3430605, -2658261, -1645083, -745408, -208147, -54711, -112481, -129226, 93218, 597151, 1280327, 2026120, 2802432, 3602178, 4330749, 4839654, 5079333, 5138557, 5096316, 4902728, 4468183, 3825218, 3122924, 2472230, 1872324, 1297037, 765108, 266453, -316648, -1105002, -2019886, -2762979, -3059559, -2902118, -2520644, -2148069, -1878929, -1743387, -1815722, -2168783, -2744295, -3341111, -3761813, -3957147, -4031221, -4139048, -4385871, -4777107, -5207791, -5492959, -5452292, -5013732, -4253620, -3332853, -2393007, -1516891, -772308, -248683, -13472, -40488, -213191, -399787, -494953, -392813, 8603, 704279, 1492551, 2055840, 2172192, 1843300, 1224767, 479491, -279071]
36294b79071o78093n18329l31746j69896k8120J20280K51152L06502K83693K50661
36284g92967K54839K67146K43352J91419J34847N5885n3603j04502L8248L82865
36274F17529P38960Q61817O59920K55663j25558l10679k67618r2861Q0173J78658
36264B596004K11328K13537K00154J72842J38958J03490O1534J4545j9413k1064
36254C671915J5380P8760J28426R1648q2358l49611n86062o96546o90797o49554
36244I31201o50728p34075q89859j056875j164833j195130j167009j065191q45083
36235g837582n25609k01332P1861L21946N42606O27378N18757L50339L13061M07303
36225e411272M50688L32870J48310N0523P0955J25853J32642P1519k8234j28125
$$ y = [-279071, -957164, -1475493, -1807239, -1977135, -2005255, -1884975, -1633823, -1327321, -1043628, -792967, -538128, -270982, -27630, 163789, 298636, 354521, 300918, 196416, 234664, 617529, 1356489, 2218306, 2878226, 3133889, 3008331, 2697652, 2430034, 2337173, 2417346, 2596004, 2807332, 3020869, 3221023, 3393865, 3532823, 3636313, 3697847, 3712392, 3692979, 3671915, 3687295, 3766055, 3894481, 3986129, 3903771, 3554160, 2968098, 2271552, 1580755, 931201, 280473, -453602, -1343461, -2400336, -3565169, -4760299, -5927308, -6992499, -7837582, -8363191, -8564523, -8492662, -8170716, -7628110, -7000732, -6481975, -6131636, -5818575, -5411272, -4960584, -4627714, -4479404, -4428881, -4357926, -4232073, -4099431, -4027912, -4056146, -4184271]
36215d184271k21172l29771m39691m67296l46157j16505J39585M13536P17889
36206d833853R43398R13705O23734L03034J69009J95628J87321J1081l01411o09852
36196b398206p56796o64895m15140j89397q4541k5344J07772L37094O15420Q94311
36186b579722J077272R97218N76648k2718n30666q38470j035520j192048j234227
36177d782233j071628p46768l90095p5522K22725N44183Q46077J004319R28236
36168c520706O86844M87177M87490O50673Q11254Q48613P50490N59941L44862
36159B106638J96715J68963K11513K31761K13323K03379J92262R1190j60240n31422
36149B924082r34515j234661j247090q66542k49589K47277L89869K56819O5896
$$ y = [-4184271, -4405443, -4735214, -5174905, -5642201, -5988358, -6104863, -5965278, -5551742, -4833853, -3890455, -2976750, -2353016, -2049982, -1880973, -1685345, -1498024, -1486943, -1788354, -2398206, -3155002, -3819897, -4235037, -4424434, -4508975, -4534319, -4426547, -4089453, -3474033, -2579722, -1502450, -505232, 71416, 48698, -481968, -1320438, -2355958, -3548006, -4782233, -5853861, -6600629, -6990724, -7066246, -6843521, -6299338, -5453261, -4448942, -3520706, -2833862, -2346685, -1859195, -1208522, -397268, 451345, 1201835, 1761776, 2106638, 2303353, 2472316, 2683829, 2915590, 3128913, 3332292, 3524554, 3615744, 3455504, 2924082, 1989567, 754906, -492184, -1358726, -1608315, -1361038, -971169, -714350, -648454]
36140f48454q0836j93734k46159j78902k6018R5760J41161J89913L23622N15216
36130a08431O61472O74811N30612K76077J5306j54133k21625k72783m11715o76763
36120C12828j014816j316898j494543j546773j537713j486645j306634q87939
36112a0279133k26891N47660J234414J616368J542527J069051M98777J59213J12526
36103c725488J66841J74332J88786K82955L61085K88415J22124N0883J21578J78030
36093a790459J02500j3953j6656Q7499J43678M6944j52170l18367l39071j76972
36083b427027J02301L32479L42626J08719k00158l59740k82684p3534R1100J22836
36073b243082P3280M8525Q4158J07617K3441j73245l79516m76874m26072k74197
$$ y = [-648454, -729290, -923024, -1169183, -1348085, -1374103, -1278343, -1137182, -947269, -623647, -108431, 553041, 1227852, 1758464, 2034541, 2049847, 1895714, 1674089, 1401306, 989591, 312828, -701988, -2018886, -3513429, -5060202, -6597915, -8084560, -9391194, -10279133, -10506024, -9958364, -8723950, -7107582, -5565055, -4496004, -3997227, -3838014, -3725488, -3558647, -3384315, -3195529, -2912574, -2551489, -2263074, -2140950, -2090067, -1968489, -1790459, -1687959, -1701912, -1718568, -1631069, -1487391, -1440447, -1592617, -1910984, -2250055, -2427027, -2324726, -1992247, -1649621, -1540902, -1741060, -2100800, -2383484, -2457018, -2365918, -2243082, -2169802, -2121277, -2037119, -1929502, -1906061, -2079306, -2458822, -2935696, -3361768, -3635965]
36063c635965r7843M0470J00169O8028k6458j15558j35442p6071Q381M2926o598
36052c833961j10736k13477k80851k97457k27155k4525K84947N70160O96487O63059
36042b773509N89835N60177N33902M45956L27606K59610K41722K01451J31365
36033E18115J14402J67915J54627n8620l97625o34060o30073m39181j67151J49492
36023a222159M75597O95598P10437N78156M55698M01792L20726J15811j73099
36014B358557m11939m94334l92895j49890J28001K97816K66131O0444j97235l79648
36004A085008m19109l30774k09863j76025k67507l90354m04483k56945q501K46274
35994a132279M34383M93252L82118J44974q3466j92588k12322k77157m68259p16039
$$ y = [-3635965, -3733808, -3693338, -3593169, -3525141, -3551599, -3667157, -3802599, -3878670, -3870289, -3827363, -3833961, -3944697, -4158174, -4439025, -4736482, -4963637, -4988162, -4703215, -4133055, -3436568, -2773509, -2183674, -1623497, -1089595, -643639, -316033, -56423, 185299, 386750, 518115, 632517, 800432, 955059, 896439, 498814, -135246, -765319, -1204500, -1371651, -1222159, -746562, -50964, 659473, 1237629, 1693327, 2095119, 2415845, 2531656, 2358557, 1946618, 1452284, 1059389, 909499, 1037500, 1335316, 1601447, 1661891, 1464656, 1085008, 665899, 335125, 125262, -50763, -318270, -708624, -1113107, -1370052, -1378553, -1132279, -697896, -204644, 177474, 322448, 238982, 46394, -165928, -443085, -911344, -1627383]
35984a627383q65604q15540n80524k45761R7920L70403N03409M78095L62779K73250
35974b048956K72942L25235L48428K92631J55882l4449k25163l55007m12661m55845
35964b136963n23736n48533m24200j73125K8936M3389n5417n0130J81299N31379
35954c127101P63072P21609M58077J71892L3921N2376J10186J22808J20346J60843
35944d11971K22294K45472K51946L25965M62592N20900L83648J04364j72665l93703
35934A538842o05562q01560q73770p68967o11642n91776p61051j002309j171049
35925e648844j190283j018314o24633n1683N48041R91844J178618J113414Q60181
35916c841659N00619J11347k52903n42140o71061n46836j82593K48953N33170
$$ y = [-1627383, -2492987, -3308527, -3889051, -4134812, -4036892, -3666489, -3163080, -2684985, -2322206, -2048956, -1776014, -1450779, -1102351, -809720, -653838, -688287, -913450, -1268457, -1681118, -2136963, -2660699, -3209232, -3633432, -3806557, -3777621, -3734232, -3789649, -3839779, -3658480, -3127101, -2364029, -1642420, -1184343, -1012451, -978530, -926154, -815968, -693160, -572814, -411971, -189677, 55795, 307741, 633706, 1096298, 1617198, 2000846, 2105210, 1932545, 1538842, 933280, 131720, -742050, -1511017, -2122659, -2714435, -3475486, -4477795, -5648844, -6839127, -7857441, -8482074, -8533757, -7985716, -6993872, -5815254, -4701840, -3841659, -3341040, -3229693, -3482596, -4024736, -4695797, -5242633, -5425226, -5176273, -4643103]
35907d643103N83957M75247L41035K95044M07407O62601R23083J006369Q33299
35898H84939M67381J4017m49576q34612j027410r86283q06638o27339m93176l49337
35888d208034j42702J11088L31886M10566K81181P100k39848l39812l33194l19847
35878d441616l02721k15265o2850P9371K07111M04248O83091R11395R60046Q45918
35868i31272O63003M40330J50439j82799m67650o22853o17270m57015j96985N1812
35858b170260J94625K33660K27193J81157M5540j83198m27089o11849p27574p82767
35848d020562p58374o46132m85744l18352j35605Q0306K92819M38891N08771N46368
35838d497614N68954N39008M38430L27333K81273K81939K22984M8746j48525k19088
$$ y = [-4643103, -4059146, -3583899, -3242864, -2947820, -2540413, -1877812, -954729, 51640, 884939, 1352320, 1366337, 916761, 82149, -945261, -1931544, -2738182, -3365521, -3858697, -4208034, -4350736, -4239648, -3907762, -3497196, -3216015, -3208915, -3448763, -3788575, -4121769, -4441616, -4744337, -4959602, -5022452, -4943081, -4735970, -4331722, -3648631, -2737236, -1777190, -931272, -268269, 172061, 322500, 139701, -327949, -950802, -1568072, -2025087, -2222072, -2170260, -1975635, -1741975, -1514782, -1333625, -1288085, -1471283, -1898372, -2510221, -3237795, -4020562, -4778936, -5425068, -5910812, -6229164, -6364769, -6284463, -5991644, -5552753, -5043982, -4497614, -3928660, -3389652, -2951222, -2623889, -2342616, -2060677, -1837693, -1788947, -1937472, -2156560]
35828b156560j39631n3130r6118k24130k55365p1851K67442O02387Q05833Q40034
35818d81089P43917O00232M78108L72024K18049r654k51012m34477n57547o43461
35808C5090o48275m87379j71105J42619K78078K18011J26110J84911M12739O46794
35798G37593P12807N99896M45059L55699K99611J91753L5259p7982p5737M5073
35788C269031K51246M72210N61574L57941j44724p23876j092212j140693r91085
35779H19412q17115o57168m25710q6925K29060L18414J11925k38781m97831n42569
35769a787288m10864k01835J0679J88928L32423M81306O60541Q06282Q06280O34805
35759A521257L88868J64405l6027k29719l62983l74792l09010k74618l06764l44621
$$ y = [-2156560, -2296191, -2349321, -2445439, -2669569, -2924934, -2996785, -2729343, -2126956, -1321123, -481089, 262828, 863060, 1341168, 1713192, 1931241, 1921587, 1670575, 1236098, 678551, 35090, -613185, -1100564, -1271669, -1129050, -850972, -632961, -506851, -321940, 90799, 737593, 1450400, 2050296, 2495355, 2851054, 3150665, 3342418, 3377677, 3299695, 3223958, 3269031, 3520277, 3992487, 4554061, 4912002, 4767278, 4043402, 2951190, 1810497, 819412, 2297, -654871, -1080581, -1167506, -938446, -620032, -508107, -746888, -1244719, -1787288, -2198152, -2399987, -2389308, -2200380, -1867957, -1386651, -726110, 80172, 886452, 1521257, 1910125, 2074530, 2038503, 1808784, 1445801, 1071009, 761999, 487381, 180617, -164004]
35749a64004l44988l40884l69026l99330l65352k32732k9465J59875K38551J86632
35739a660723J02956J02078J71444J97588J29489J8547j20797l56211o58390p99858
35729b873877n93879j86924O3218K1734o8371P1014L96998O44601O77205N86875
35719a261406M93101M11589L45489L53529M41608M84058L55783R3826j62011l53108
35709A202458n30310p17039q56147r17855r61844j031815j054268r15865o12076
35700f394761k58521K9572K19733L40171M30130N13308N79064N86993N20787M29559
35690c003965L77546L60025L12736J99660M0757j44191l50158n24300n59245m00293
35680c691428j17292J74671M20274N90748N92518L15527j99993p12703r52216
$$ y = [-164004, -508992, -849876, -1218902, -1618232, -1983584, -2216316, -2245781, -2085906, -1847355, -1660723, -1557767, -1455689, -1284245, -1086657, -957168, -938621, -1059418, -1415629, -2074019, -2873877, -3467756, -3654680, -3591462, -3569728, -3638099, -3567085, -3170087, -2525486, -1848281, -1261406, -768305, -356716, -11227, 342302, 783910, 1267968, 1623751, 1717577, 1555566, 1202458, 672148, -44891, -901038, -1818893, -2780737, -3812552, -4866820, -5782685, -6394761, -6653282, -6623710, -6403977, -6063806, -5633676, -5120368, -4541304, -3954311, -3433524, -3003965, -2626419, -2266394, -1953658, -1753998, -1713241, -1857432, -2207590, -2731890, -3291135, -3691428, -3808720, -3634049, -3213775, -2623027, -2030509, -1714982, -1914975, -2627678, -3579894]
35671c579894q42278n49711l24112k75076k74388q4918L74471Q95521J158808
35662c501577J050952P52913N03534L49504J78727o2356k76744l35754k17296
35653a558097p396J85205K88428K75646J56937l1218k37222m07107n04183n26292
35643b365299m91602m01949k46257n6349P4667O5984p8482k97988n36295p25137
35633e058707p50549n31997j44065K17916M18050M73416M68825M61309M90190
35624c955612N88960P32147Q38123Q72253Q71963Q16961N77449J01500m15185
35615A028559o83278o26509m21460k46225j15899J8460J37301J82478J43382O3480
35605e19711J4469Q3772L11918O08963Q07316Q36724P75605O93572N37451K46158
$$ y = [-3579894, -4422172, -4971883, -5295995, -5571071, -5845459, -5930377, -5555906, -4660385, -3501577, -2450625, -1697712, -1194178, -844674, -665947, -728303, -1005047, -1340801, -1558097, -1565493, -1380288, -1091860, -816214, -659277, -690495, -927717, -1334824, -1839007, -2365299, -2856901, -3258850, -3505107, -3561456, -3486789, -3420805, -3499287, -3797275, -4333570, -5058707, -5809256, -6341253, -6485318, -6267402, -5849352, -5375936, -4907111, -4445802, -3955612, -3366652, -2634505, -1796382, -924129, -52166, 764795, 1342244, 1443744, 1028559, 345281, -281228, -702688, -948913, -1064812, -1046352, -909051, -726573, -583191, -519711, -505242, -421470, -109552, 499411, 1306727, 2143451, 2919056, 3612628, 4150079, 4396237]
35595D396237j02007l58425m79991n44673o19221p01577p79300q47663q58805
35586h95425p45491n39535m01164m64867o74024q18348p40974m78044j81751O1796
35576e877827K92172N55516P92663Q97522Q45564O92468M71597J89784p5113j92608
35566a408262j48068r3787j57273k82520l52887l91874n07816o70634o89010m42174
35556e144305l3249L33140N54831O68527P36900P56785O71392M52783J75856J155
35546h26185N5012L19839O51957Q91331R40967P84050M83405J56557r5503k40482
35536C120948k87699k54515k00267k33615l95761n57332n24187k54974R2863L30621
35526H36082L83510K82153J03805o2782j77245k94363m80276o76288p40970o49453
$$ y = [4396237, 4294230, 3935805, 3455814, 2911141, 2291920, 1590343, 811043, -36620, -895425, -1640916, -2180451, -2581615, -3046482, -3720506, -4538854, -5279828, -5757872, -5939623, -5877827, -5585655, -5030139, -4237476, -3339954, -2494390, -1801922, -1330325, -1140541, -1215654, -1408262, -1556330, -1650117, -1807390, -2089910, -2442797, -2834671, -3342487, -4013121, -4702131, -5144305, -5177554, -4844414, -4289583, -3621056, -2884156, -2127371, -1455979, -1003196, -827340, -826185, -771173, -451334, 200623, 1091954, 2032921, 2816971, 3300376, 3456933, 3361430, 3120948, 2833249, 2578734, 2378467, 2144852, 1749091, 1191759, 667572, 412598, 505461, 836082, 1219592, 1501745, 1605550, 1542768, 1365523, 1071160, 590884, -85404, -826374, -1475827]
35516a475827n42527n25738n22015m02867j83859O676R8748J21366J04424M1102
35506c280517n0869j12470j11610q1309p0780q0926m9756J11570M44888Q69709
35496b412070J189639J214055Q97971L76724j16890l84349l77791k33004j62626
35487h341k75389m98039o72082o91889n42014k60540Q5422M18635O90710Q90634
35477h62893R99400R75198Q14009N84640L60176J42183j08704l93896o65957q71513
35467I72643r73697r64701q91469q32195q03993p27509n28243k39837L9232K54154
35457d695615M07028N04043N58613O16378O99058P35981O23733L53853K8039k39215
35447d08104l79489l66413k40559j26302j27903j94995j73620o422K01000L33530
$$ y = [-1475827, -2018354, -2544092, -3066107, -3468974, -3652833, -3646157, -3547409, -3426043, -3321619, -3280517, -3331386, -3443856, -3555466, -3636775, -3707555, -3788481, -3838237, -3726667, -3281779, -2412070, -1222431, -8376, 889595, 1266319, 1149429, 765080, 387289, 154285, -8341, -283730, -781769, -1453851, -2145740, -2687754, -2948294, -2862872, -2444237, -1753527, -862893, 136507, 1111705, 1925714, 2510354, 2870530, 3012713, 2904009, 2510113, 1844156, 972643, -1054, -965755, -1857224, -2689419, -3493412, -4220921, -4749164, -4989001, -4949769, -4695615, -4288587, -3784544, -3225931, -2609553, -1910495, -1174514, -550781, -196928, -168889, -408104, -787593, -1154006, -1394565, -1520867, -1648770, -1843765, -2017385, -2023807, -1822807, -1489277]
35437a489277L92334M21529L95773K58771K8987k00238l41836l51396k21965j0405
35427a117723J43994R9523j52331m45164n52871l66965J4055L62003N02248M35020
35417a078211K83147J50403O2907J9399K7892Q2239J62376K78304M59307O75554
35407A123317Q28092Q53500P87836O86175N30727K75159n5760l66024n62785n92062
35397C508175m50056k26870r6716j67704l44179m23070l35712k13423j98085k78919
35387G73441l58734l91923l77251k78005o1189J91350L13601K37746Q7577M7040
35377A83653J70822L60197M87085M84593L37863P2983k07932l46262k63156p1582
35367A208264J5348r0087k65728l45705l12085k61340k22069j01901J67736N07699
$$ y = [-1489277, -1096943, -675414, -279641, -20870, 8117, -192121, -533957, -885353, -1107318, -1117723, -973729, -874206, -1026537, -1471701, -2024572, -2391537, -2377482, -2015479, -1513231, -1078211, -795064, -644661, -581754, -562355, -534463, -452224, -289848, -11544, 447763, 1123317, 1951409, 2804909, 3592745, 4278920, 4809647, 5084806, 5029046, 4663022, 4100237, 3508175, 3058119, 2831249, 2734533, 2566829, 2222650, 1799580, 1463868, 1250445, 1052360, 773441, 414707, 22784, -354467, -632472, -693661, -502311, -188710, 49036, 136613, 183653, 354475, 714672, 1201757, 1686350, 2024213, 2097196, 1889264, 1543002, 1279846, 1208264, 1223612, 1133525, 867797, 522092, 210007, -51333, -273402, -375303, -207567, 300132]
35357C00132P51412P85924O08667L04270J6368j09940l9670J06461J77865J54311
35347C055800J19775R8663J8518j43881k82529k93212k11428j40813r7194j6887
35337B106812J06529J90978J71798N1215j69333n11467r25840j245226j301173
35328a525707j067120o52546j91204K25205N45382P61146R08577J013764J033559
35319A051056Q99360O34725L80398K59472K38193J71399n245j76393j81977k5236
35309C245752J17869J04395l0484j73821l08415m94856p11021q24170p53850n78319
35299d06920m27873l28639k06453r334K23434L97282M42547L86959L62082M83811
35289I16896O92098P67366N62741J77769j55419l13408l39064l06068k37217j63423
$$ y = [300132, 1051544, 1837468, 2446135, 2750405, 2766773, 2656833, 2617163, 2723624, 2901489, 3055800, 3175575, 3274238, 3292756, 3148875, 2866346, 2573134, 2361706, 2220893, 2123699, 2106812, 2213341, 2404319, 2576117, 2627332, 2457999, 1946532, 1020692, -224534, -1525707, -2592827, -3245373, -3436577, -3211372, -2665990, -1904844, -996267, 17497, 1051056, 1950416, 2585141, 2965539, 3225011, 3463204, 3634603, 3629358, 3452965, 3270988, 3245752, 3363621, 3468016, 3437532, 3263711, 2955296, 2460440, 1749419, 925249, 171399, -406920, -834793, -1163432, -1369885, -1379219, -1155785, -758503, -315956, 71003, 433085, 916896, 1608994, 2376360, 2939101, 3116870, 2961451, 2648043, 2308979, 2002911, 1765694, 1602271]
35279A602271j64007k96980n28791p54170q53022p34393l94959L4193L50859M40453
35269a298546L62728K73611K90262M32723O35869P77880P43435N26281K68332
35260C012575J49618K21465L64303M10052K85658M0508k24373m21273m96282m49053
35250B893198l60124l54766m80687o25508o07224l61507m472K94968M56202M88822
35240A338902M22424K85543J09952j02437l87509p35886j026004j109133r62396
35231b166544p06544m73247l03154j72523o1875K5077Q0143J11432J51334K25429
35221c290472K95071K71468J36375J3939N2122K51756M89130O89888Q75601J022694
35211H07572R93594O87700K00075k47970n13674o19242o62114o97472p09333o59456
$$ y = [1602271, 1438264, 1141284, 612493, -141677, -994699, -1729092, -2124051, -2089858, -1738999, -1298546, -935818, -662207, -371945, 60778, 696647, 1474527, 2217962, 2744243, 3012575, 3162193, 3383658, 3747961, 4158013, 4443671, 4484179, 4259806, 3838533, 3342251, 2893198, 2533074, 2178308, 1697621, 1072113, 464889, 103382, 98910, 393878, 850080, 1338902, 1761326, 2046869, 2156821, 2054384, 1666875, 930989, -95015, -1204148, -2166544, -2873088, -3346335, -3649489, -3822012, -3883887, -3858810, -3778667, -3667235, -3515901, -3290472, -2995401, -2723933, -2587558, -2573619, -2521497, -2269741, -1780611, -1090723, -215122, 807572, 1801166, 2488866, 2688941, 2440971, 1927297, 1308055, 645941, -51531, -760864, -1420320]
35201a420320n48722m27186l31186k18284j26L49724P47970J065190J206358J137340
35191A560758Q95665O00302L93662L22358K95667J94366O139j63530j93054m6050
35181C866283J98001L98021M62227M13301L18049J71467p8930l90445o06806o38721
35171D112447n86094o03307o99453p60328p24450o23140m50894j22073L76832
35162h0460Q59393J048971Q22465L16026k07817n74484p80320q94470r21920p96536
35152a209152n07429j91996o0716k13838n34297p65054p04686l52082J20034N18709
35142c900507P44136P69091N84132K38057r4894j95342L09L21711N25878N13236
35132d94193L70989K49603K31793K92356L49631L59373L52418L52115K85419O4993
$$ y = [-1420320, -1969042, -2396228, -2727414, -2945698, -2945824, -2596100, -1848130, -782940, 423418, 1560758, 2456423, 3056725, 3450387, 3772745, 4068412, 4262778, 4268917, 4105387, 3912333, 3866283, 4064284, 4462305, 4924532, 5337833, 5655882, 5827349, 5748419, 5357974, 4751168, 4112447, 3526353, 2923046, 2223593, 1463265, 738815, 115675, -335219, -457292, -80460, 778933, 1827904, 2650369, 2966395, 2758578, 2184094, 1403774, 509304, -412616, -1209152, -1716581, -1908577, -1969293, -2183131, -2717428, -3482482, -4187168, -4539250, -4419216, -3900507, -3156371, -2387280, -1803148, -1565091, -1659985, -1855327, -1855018, -1533307, -1007429, -494193, -123204, 126399, 358192, 650548, 1000179, 1359552, 1711970, 2064085, 2349504, 2414497]
35122B414497k32842l88810l07073j67635k11844m34781o01758n39475k97367
35113g67088k5443J92558L50675M53431M94149M66127L70192K36166J32826J07863
35103B011456J13937M8616j17233k98368l98446m09066l87364l78450l84957l78827
35093e78702l18548j80903O099J85155L33078M69742N92845O46225N82579M27643
35083B165213K47484P0269j23447l34345m96138n09368l28300k1922K52454L53462
35073A275362K51434L0969j89793l39085m13710m50880m78416m74471l77249j50902
35063a316741J58015M40189N95685N85902M43552K57142J19741M9000l3060j96202
35053A103223l78902m20896k41409N0478K55837K83073K21301K20308L18120M03602
$$ y = [2414497, 2181655, 1792845, 1485772, 1318137, 1106293, 671512, 69754, -469721, -767088, -792531, -599973, -249298, 204133, 698282, 1164409, 1534601, 1770767, 1903593, 2011456, 2125393, 2174009, 2056776, 1758408, 1359962, 950896, 563532, 185082, -199875, -578702, -897250, -1078153, -1072054, -886899, -553821, -84079, 508766, 1154991, 1737570, 2165213, 2412697, 2482966, 2359519, 2025174, 1529036, 1019668, 691368, 669446, 921900, 1275362, 1526796, 1557765, 1367972, 1028887, 615177, 164297, -314119, -788590, -1165839, -1316741, -1158726, -718537, -122852, 463050, 906602, 1163744, 1283485, 1332485, 1299425, 1103223, 724321, 303425, 62016, 112494, 368331, 651404, 872705, 1093013, 1411133, 1814735]
35043A814735L50097J61388m6852j99383l36628n15438o96571p90912p80621p22994
35033a763179o50855n45038m08214k91040k18748j45614j0801J94556M24957O03902
35023b810074O53293N68563M80577N60340Q10823J020606R97018Q01743O72768
35014C755657P31968Q56995Q54874O84853M64289K99106J68167k4293l19923o50139
35004F821554q98346j003532j004653r97998j054096j154874j193829j056865
34996a542639p38192l75243j34888n5061k4286P4839K30847L25652K67772R0295
34986a880904o3109m1881J90368N15340P57163Q34828Q03846P49105O79624N51240
34976C095620L53044J33673l3642q3832K736J44300J69955l4850l84165o49602
$$ y = [1814735, 2164832, 2326220, 2279368, 2079985, 1743357, 1227919, 531348, -259564, -1040185, -1763179, -2414034, -2959072, -3367286, -3658326, -3877074, -4022688, -4033489, -3838933, -3413976, -2810074, -2156781, -1588218, -1107641, -547301, 263522, 1284128, 2281146, 3082889, 3755657, 4487625, 5344620, 6199494, 6884347, 7348636, 7647742, 7815909, 7791616, 7471693, 6821554, 5923208, 4919676, 3915023, 2917025, 1862929, 708055, -485774, -1542639, -2280831, -2656074, -2790962, -2846023, -2870309, -2795470, -2564623, -2238971, -1971199, -1880904, -1944013, -1985894, -1795526, -1280186, -523023, 311805, 1115651, 1864756, 2544380, 3095620, 3448664, 3582337, 3548695, 3464863, 3467599, 3611899, 3781854, 3747004, 3362839, 2713237]
34966B713237o83774n46870m01282l36758l33154l39956l21198k38534o9519J26507
34956d31301K13919J08977j05175k34050j52318R5264L73934N95337P39947P76221
34946A980755O30267K69195k15480o43616q61465q12853n35046j42221J90166
$$ y = [2713237, 2029463, 1482593, 1081311, 744553, 411399, 71443, -249755, -488289, -557808, -431301, -217382, -108405, -213580, -447630, -599948, -504684, -130750, 464587, 1204534, 1980755, 2611022, 2880217, 2664737, 2021121, 1159656, 346803, -188243, -330464, -140298]
$$ [...]
##END NTUPLES=NMR SPECTRUM
##END=
