##TITLE=31Pdec_4e1303
 DMSO-d6, 24 sc
 14.3.2023
##JCAMPDX= 6.0         $$ Bruker NMR JCAMP-DX V2.0
##DATA TYPE= NMR SPECTRUM
##DATA CLASS= NTUPLES
##ORIGIN= UXNMR, Bruker Analytische Messtechnik GmbH
##OWNER= root
$$ XWIN-NMR		Version 3.5
$$ Tue Mar 14 14:18:52 2023 Russian Standard Time (UT+4h)  she@DPX200
##.OBSERVE FREQUENCY= 81.013821
##.OBSERVE NUCLEUS= ^31P
##.ACQUISITION MODE= SIMULTANEOUS
##.ACQUISITION SCHEME= undefined
##.AVERAGES= 24
##.DIGITISER RES= 16
##SPECTROMETER/DATA SYSTEM= spect
##.PULSE SEQUENCE= zgpg30
##.SOLVENT NAME= DMSO
##.SHIFT REFERENCE= (INTERNAL, DMSO, 0, 248.564)
##AUDIT TRAIL= $$ (NUMBER, WHEN, WHO, WHERE, WHAT)
$$ ##TITLE= Audit trail, XWIN-NMR		Version 3.5
$$ ##JCAMPDX= 5.01
$$ ##ORIGIN= Bruker BioSpin GmbH
$$ ##OWNER= she
$$ F:/spectra/data/she/nmr/P31/1/pdata/1/auditp.txt
$$ ##AUDIT TRAIL=  $$ (NUMBER, WHEN, WHO, WHERE, WHAT)
(   1,<2023-03-14 14:16:46.60 +0400>,<she>,<DPX200>,
      <created by zg, POWCHK disabled, PULCHK disabled
       configuration hash MD5:
       00 E9 B6 7A A2 85 ED C7 34 08 36 98 17 FE 4E 26
       data hash MD5: 32K
       18 EC F2 1A 6D F1 C5 D3 DB 3D FF 35 C7 F2 38 3A>)
(   2,<2023-03-14 14:16:52.89 +0400>,<she>,<DPX200>,
      <Start of raw data processing
       efp BC_mod = 2 LB = 1 FT_mod = 6 PKNL = 1 PHC0 = -11002.73 PHC1 = 171.4102 SI = 64K 
       data hash MD5: 64K
       B7 03 B8 01 9D DD B0 A0 18 46 0D B5 C9 67 83 DD>)
(   3,<2023-03-14 14:17:10.70 +0400>,<she>,<DPX200>,
      <pk PHC0 = -26.77451 PHC1 = 0 
       data hash MD5: 64K
       C6 40 36 BB C0 85 C8 8C 1D 30 75 40 A1 27 B3 75>)
(   4,<2023-03-14 14:17:21.31 +0400>,<she>,<DPX200>,
      <pk PHC0 = 4.000005 PHC1 = 0 
       data hash MD5: 64K
       CD A0 14 2A 4B B1 60 45 79 DA E3 16 EC A7 F0 FF>)
(   5,<2023-03-14 14:17:25.75 +0400>,<she>,<DPX200>,
      <abs ABSG = 5 
       data hash MD5: 64K
       D6 30 62 9B 4E D1 7E 3E 96 F3 7E 64 CD F9 1E 9E>)
$$ ##END=
$$ 
$$ hash MD5
$$ 52 4A E6 8C E3 1E 8A CA F1 71 C8 17 CF 89 79 4D
##$RELAX= 
##$RELAX= 
##$RELAX= 
##$RELAX= 
##$RELAX= 
##$RELAX= 
##$RELAX= 
##$RELAX= 
##$RELAX= 
$$ Bruker specific parameters
$$ --------------------------
##$DU= <F:/spectra>
##$EXPNO= 1
##$NAME= <P31>
##$PROCNO= 1
##$TYPE= <nmr>
##$USER= <she>
##$AMP= (0..31)
100 100 100 100 100 100 100 100 100 100 100 100 100 100 100 100 100 100 
100 100 100 100 100 100 100 100 100 100 100 100 100 100 
##$AQSEQ= 0
##$AQ_mod= 1
##$AUNM= <au_zg>
##$AUTOPOS= <>
##$BF1= 81.014009
##$BF2= 200.13
##$BF3= 200.13
##$BF4= 200.13
##$BF5= 200.13
##$BF6= 200.13
##$BF7= 200.13
##$BF8= 200.13
##$BYTORDA= 1
##$CFDGTYP= 0
##$CFRGTYP= 5
##$CHEMSTR= <none>
##$CNST= (0..31)
1 1 145 1 1 1 1 1 1 1 1 1 1 1 1 1 1 1 1 1 1 1 1 1 1 1 1 1 1 1 1 1 
##$CPDPRG= <waltz16>
##$CPDPRG1= <>
##$CPDPRG2= <waltz16>
##$CPDPRG3= <>
##$CPDPRG4= <mlev>
##$CPDPRG5= <mlev>
##$CPDPRG6= <mlev>
##$CPDPRG7= <mlev>
##$CPDPRG8= <mlev>
##$CPDPRGB= <>
##$CPDPRGT= <>
##$D= (0..31)
0 1 0 0 0 0 0 0 0 0 0 0.03 2e-05 3e-06 0 0 0 0 0 0 0 0 0 0 0 0 0 0 0 0 
$$ [...]
##$SUBNAM3= <"">
##$SUBNAM4= <"">
##$SUBNAM5= <"">
##$SUBNAM6= <"">
##$SUBNAM7= <"">
##$SUBNAM8= <"">
##$SUBNAM9= <"">
##$SW= 501.771253377433
##$SWIBOX= (0..15)
0 1 3 0 0 0 0 0 0 0 0 0 0 0 0 0 
##$SW_h= 40650.406504065
##$TD= 32768
##$TD0= 1
##$TE= 0
##$TE2= 300
##$TE3= 300
##$TEG= 300
##$TL= (0..7)
0 120 53 12 22 120 120 120 
##$TP= (0..7)
150 150 150 150 150 150 150 150 
##$TP07= 0
##$TPNAME0= <>
##$TPNAME1= <>
##$TPNAME2= <>
##$TPNAME3= <>
##$TPNAME4= <>
##$TPNAME5= <>
##$TPNAME6= <>
##$TPNAME7= <>
##$TPOAL= (0..7)
0.5 0.5 0.5 0.5 0.5 0.5 0.5 0.5 
##$TPOFFS= (0..7)
0 0 0 0 0 0 0 0 
##$TUNHIN= 0
##$TUNHOUT= 0
##$TUNXOUT= 0
##$USERA1= <user>
##$USERA2= <user>
##$USERA3= <user>
##$USERA4= <user>
##$USERA5= <user>
##$V9= 5
##$VALIST= <valist>
##$VCLIST= <CCCCCCCCCCCCCCC>
##$VD= 0
##$VDLIST= <DDDDDDDDDDDDDDD>
##$VPLIST= <PPPPPPPPPPPPPPP>
##$VTLIST= <TTTTTTTTTTTTTTT>
##$WBST= 1024
##$WBSW= 4
##$XGAIN= (0..3)
0 0 0 0 
##$XL= 0
##$YL= 0
##$YMAX_a= 4059
##$YMIN_a= -3999
##$ZGOPTNS= <>
##$ZL1= 120
##$ZL2= 120
##$ZL3= 120
##$ZL4= 120
##$ABSF1= 248.5645
##$ABSF2= -253.2056
##$ABSG= 5
##$ABSL= 3
##$ALPHA= 0
##$AQORDER= 0
##$ASSFAC= 0
##$ASSFACI= 0
##$ASSFACX= 0
##$ASSWID= 0
##$AUNMP= <proc_1d>
##$AZFE= 0.1
##$AZFW= 0.5
##$BCFW= 0
##$BC_mod= 2
##$BYTORDP= 0
##$COROFFS= 0
##$CY= -3
##$DATMOD= 1
##$DC= 0
##$DFILT= <>
##$DTYPP= 0
##$F1P= 0
##$F2P= 0
##$FCOR= 1
##$FTSIZE= 65536
##$FT_mod= 6
##$GAMMA= 0
##$GB= 0
##$INTBC= 1
##$INTSCL= 6.047779e-11
##$ISEN= 30
##$LB= 1
##$LEV0= 0
##$LPBIN= 0
##$MAXI= 10000
##$MC2= 0
##$MEAN= 0
##$ME_mod= 0
##$MI= 50
##$NCOEF= 0
##$NC_proc= -6
##$NLEV= 6
##$NOISF1= 182.463
##$NOISF2= 159.3651
##$NSP= 0
##$NTH_PI= 0
##$NZP= 0
##$OFFSET= 248.5645
##$PC= 4
##$PHC0= -11025.5
##$PHC1= 171.4102
##$PH_mod= 1
##$PKNL= yes
##$PPARMOD= 0
##$PSCAL= 0
##$PSIGN= 0
##$REVERSE= no
##$SF= 81.0140089999694
##$SI= 65536
##$SIGF1= 159.3651
##$SIGF2= -187.1042
##$SINO= 113.3802
##$SIOLD= 16384
##$SREGLST= <1H.CDCl3>
##$SSB= 0
##$STSI= 65536
##$STSR= 0
##$SW_p= 40650.406504065
##$SYMM= 0
##$S_DEV= 0
##$TDeff= 32768
##$TDoff= 0
##$TI= <>
##$TILT= no
##$TM1= 0
##$TM2= 0
##$TOPLEV= 0
##$USERP1= <user>
##$USERP2= <user>
##$USERP3= <user>
##$USERP4= <user>
##$USERP5= <user>
##$WDW= 1
##$XDIM= 65536
##$YMAX_p= 529136326
##$YMIN_p= -15648123
$$ End of Bruker specific parameters
$$ ---------------------------------
##NTUPLES= NMR SPECTRUM
##VAR_NAME=  FREQUENCY,     SPECTRUM/REAL,   SPECTRUM/IMAG
##SYMBOL=    X,             R,               I
##VAR_TYPE=  INDEPENDENT,   DEPENDENT,       DEPENDENT
##VAR_FORM=  AFFN,          ASDF,            ASDF
##VAR_DIM=   65536,         65536,           65536
##UNITS=     HZ,            ARBITRARY UNITS, ARBITRARY UNITS
##FACTOR=    0.620285442955139, 1,           1
##FIRST=     20137.2065510682, 0,            0
##LAST=      -20513.1999529968, 0,           0
##MIN=       -20513.1999529968, -15648123,   0
##MAX=       20137.2065510682, 529136326,    0
$$ Real data points
##PAGE= N=1
##DATA TABLE= (X++(R..R)), XYDATA
$$ [...]
##PAGE= N=2
##DATA TABLE= (X++(I..I)), XYDATA
42175 -426091 149344 1097904 1767841 2205080 2333222 1949039 1442822 1511833 2099736 2381977
42165 2381977 1840334 743675 -381050 -1155029 -1291288 -746042 23152 385179 133885
42156 133885 -468308 -987855 -903118 104287 1477959 2014367 1427909 997114 1714152
42147 1714152 2549130 1954147 523102 296557 1532533 2293319 1690998 1302539 2243056
42138 2243056 2970657 1848893 210402 487938 2313265 3092317 2097568 1311142 1920155
42129 1920155 2556642 1947732 1082972 1349762 2238713 2473574 2110403 1903205 1616340
42120 1616340 643680 -433316 -579406 -113133 -170477 -678450 -483203 585640 1358717
42111 1358717 1214790 924399 1255692 1897828 2171050 1893273 1252277 591067 409108
42102 409108 787743 926007 202817 -548309 -105153 987245 957210 -365028 -1063639
42093 -1063639 -16894 1513082 2041782 1950391 2226728 2565212 2174892 1411009 1116193
42084 1116193 1091634 590281 -252221 -692112 -543237 -13169 948310 2039868 2164138
42075 2164138 939660 -85460 699493 2440611 2884047 1662500 668992 1078106 1813978
42066 1813978 1501729 430762 -209447 13973 651585 1202119 1468283 1522855 1640289
42057 1640289 1917598 1965371 1453081 787755 578947 647246 426050 172084 712101 1943675
42047 1943675 2672790 2208344 1198794 584252 536374 754256 1088528 1527283 2062318
42038 2062318 2708990 3251403 3173678 2452802 2003678 2392510 2578728 1313680 -484338
42029 -484338 -523228 1475690 3016742 2166185 17346 -1170840 -860184 -31871 667880
42020 667880 1081716 692546 -746624 -2090803 -1790911 7364 1556150 1790639 1424399
42011 1424399 1487837 1787966 1478088 567917 39597 476510 1216019 1249384 633004 378461
42001 378461 925378 1475817 1228901 537832 157430 27886 -233070 -238990 489195 1191762
41991 1191762 797667 50223 856754 3159900 4374649 2881933 411311 -421964 331180
41982 331180 526419 -685948 -1787557 -1182055 755357 2282305 2263607 1221389 591513
41973 591513 1007783 1551651 1114764 129702 -71174 522342 468128 -732384 -1719301 -1508494
41963 -1508494 -1033787 -1284333 -1398420 -243578 1236585 1165945 -373735 -1425292 -893823
41954 -893823 408537 1360134 1682839 1447810 771716 203882 359321 1034852 1523499
41945 1523499 1673392 1742292 1512492 686598 -47587 411398 1954667 3293240 3550423
41936 3550423 2827856 1471643 2162 -518859 471428 1750471 1612064 386419 -73550
41927 -73550 545847 567689 -576999 -1056277 387968 2149729 2108803 788595 277082
41918 277082 992440 1515750 1177656 895441 1373759 2046635 2185588 1930805 1792962 1891318
41908 1891318 2000793 1825750 1115119 2258 -781078 -575267 348198 1142054 1515121
41899 1515121 1863106 2308917 2400047 1963253 1532841 1525739 1546399 1018387 139543 -345756
41889 -345756 -161900 249271 520246 890975 1663969 2455771 2507742 1789447 1296063 1850789
41879 1850789 2886255 3012591 1817972 458232 141358 621901 813467 452851 213092
41870 213092 219823 -417742 -2054419 -3398767 -2947007 -1071803 444544 840157 1079406
41861 1079406 1863980 2317809 1558392 459657 439077 1107175 786351 -687818 -1386444
41852 -1386444 -39434 2060880 2815053 1929504 737183 165980 36164 -6599 46468
41843 46468 200098 323612 430775 620300 853937 1161367 1756935 2514330 2725620 1951619
41833 1951619 767846 92744 118205 459125 920339 1436391 1666081 1399708 1026649
41824 1026649 903711 700841 135377 -200799 281103 986872 973389 501043 456522 617076
41814 617076 27653 -1047181 -1229815 -252496 558432 384431 -82700 -233981 -501078
41805 -501078 -968244 -647524 755828 1762146 1157630 17810 223899 1747952 2893311
41796 2893311 2703926 1697746 562834 -405167 -656858 370374 2070306 2869547 2076410
41787 2076410 723133 147305 420158 687149 562602 536723 1084574 1875930 2123385
41778 2123385 1554779 700404 117505 -269210 -670863 -690272 154546 1331155 1711355
41769 1711355 1225791 1027870 1612139 1929382 1139679 138198 165957 763771 599650
41760 599650 -153707 23396 1437999 2498719 2165272 1580528 2177265 3227444 2733690
41751 2733690 366693 -1941581 -2534459 -1935360 -1599251 -1725159 -1383049 -377261 307665
41742 307665 134514 -22653 816672 2259550 3170014 3202626 2795945 2101117 1058633
41733 1058633 350310 978662 2661947 3784026 3389984 2276962 1598681 1311881 700527
41724 700527 -304506 -1119885 -1340504 -930605 -15569 963827 1347151 1045605 770761
41715 770761 962348 1070738 567748 75292 560846 1726459 2173823 1212484 -217834
41706 -217834 -605426 546893 2262978 3017684 2207222 796831 258388 869566 1594433
41697 1594433 1683235 1521347 1549424 1352865 590946 -4065 442119 1564364 2288648 2326494
41687 2326494 2193130 2123635 1988086 1992736 2382209 2578512 1701242 -5035 -1230784 -1219443
41677 -1219443 -482915 204968 652255 847553 550664 -220951 -769850 -246043 1484594
41668 1484594 3573043 4727541 4261719 2853926 1964536 2209706 2746255 2618659 2031864
41659 2031864 1623386 1229672 463653 -29337 707249 2101454 2389801 1082360 -189902
41650 -189902 132367 1523429 2317133 1951967 1387850 1560409 2226543 2544782 2371114
41641 2371114 2484158 3363620 4163404 3573201 1653851 -59067 -545814 -423132 -556825
41632 -556825 -673426 -307908 -91741 -724957 -1391949 -747935 935039 2148361 2389975
41623 2389975 2423887 2442784 1726866 341041 -489697 -164459 545503 976824 1418268 1943467
41613 1943467 1754136 441934 -1129733 -1858000 -1491965 -368559 940461 1470368 563362
41604 563362 -909634 -1270348 -342849 323699 -61669 -449980 -40833 277487 -310697
41595 -310697 -878413 -220299 1224050 2288974 2878851 3463140 3720249 3150303 2331653
41586 2331653 2196984 2631504 2962849 3144165 3252440 2633644 982105 -423950 -140032
41577 -140032 1249158 1867583 1127586 101840 -350455 -276943 341269 1624903 2801228
41568 2801228 2696751 1478661 612911 843001 1401338 1452917 1137932 875979 732196
41559 732196 814442 1291993 1686912 1125553 -317548 -1416349 -1334801 -581142 -55989 84849
41549 84849 198575 446259 753261 1014065 1052560 774843 474692 547533 890385 1080716
41539 1080716 1067757 1080527 967911 383220 -397463 -617547 -52323 822833 1648559 2398361
41529 2398361 2834910 2644849 2176832 2170999 2669430 3052786 3169064 3416443 3631318 3055290
41519 3055290 1689919 548005 166876 3907 -216212 215311 1598714 2825089 2770106
41510 2770106 1870647 1301047 1231262 950837 267611 -249419 -189845 391002 1381612 2542799
41500 2542799 3202264 2820702 1834692 1259553 1441382 1787750 1736691 1387975 1056574 748780
41490 748780 366628 97359 260185 827331 1317022 1272066 793836 415888 361307 197141
41480 197141 -466174 -1178257 -1084775 -98799 955796 1453646 1616478 1854182 2076867 2054078
41470 2054078 1971853 2129869 2352888 2161951 1445147 662393 402780 850288 1626796 2166448
41460 2166448 2328646 2466832 2701931 2508812 1535827 483493 366109 1049965 1447641
41451 1447641 1176663 987549 1305623 1429530 713804 -371655 -1018532 -1139495 -966327
41442 -966327 -335861 776197 1581027 1286813 318456 -73619 679155 1909360 2516609
41433 2516609 1895093 328173 -1098696 -1274984 -211392 846344 795446 -182476 -1135967
41424 -1135967 -1434038 -926099 308026 1703689 2268040 1631373 607512 73057 -124424
41415 -124424 -391966 -273357 747301 1858640 1728561 530895 -210036 116320 442038
41406 442038 -137965 -1009176 -1159526 -693970 -446971 -671883 -793369 -139076 1476266
41397 1476266 3521282 4825348 4395787 2548827 806222 309218 732209 1061964 920011
41388 920011 638183 489999 478997 650606 1027454 1330222 1234428 826209 386477 -145287
41378 -145287 -959194 -1660542 -1420136 -110154 1219244 1452932 714553 79437 159187
41369 159187 550374 717242 783644 1117710 1615646 1892730 1905504 1894758 1904940 1832645
41359 1832645 1749538 1651919 1130387 -20197 -1050133 -996295 -149665 225992 -191995 -281036
41349 -281036 651238 1605203 1302576 -28686 -1196068 -1641228 -1537912 -954223 -19284
41340 -19284 549849 215356 -415778 -455738 -200896 -546388 -1258746 -1249586 -510223 -261660
41330 -261660 -918381 -1363021 -793435 16117 57523 -392334 -457225 -4679 559305 1114563
41320 1114563 1585399 1519525 820022 353479 843864 1573777 1265971 55487 -551120
41311 -551120 222140 1420905 1843584 1630432 1702577 2185234 2250804 1465241 559830 531939
41301 531939 1333227 1855083 1166581 -493599 -1947815 -2088755 -728109 1206629 2263471
41292 2263471 1644261 -14587 -1328411 -1702013 -1692733 -1722224 -1268824 47017 1343408
41283 1343408 1467230 679928 234860 475126 558934 103636 -173039 222490 781366 1057364
41273 1057364 1412437 2007727 2064276 1051092 -168472 -383116 320480 909182 921209
41264 921209 631707 108749 -734449 -1290447 -652159 974236 2269429 2516329 2400430
41255 2400430 2666549 2854493 2124872 794420 139413 734451 1703919 1848476 1082925
41246 1082925 416205 652555 1448155 1794613 1289754 642398 768300 1570729 1976696
41237 1976696 1296519 243175 222491 1632388 3284678 3771739 3093498 2453845 2577132
41228 2577132 2897229 2630998 2005268 1858673 2412438 3089532 3393647 3361866 3198420 3005912
41218 3005912 2861087 2667860 2028152 825919 -189465 -144564 656384 1025928 606766
41209 606766 334196 852647 1461313 1265452 532860 88969 4373 -216589 -586491 -682438
41199 -682438 -470750 -257031 -29691 347722 500196 -21125 -760436 -725047 223976 1200608
41189 1200608 1585330 1587263 1379317 727241 -96128 -74715 1115549 2264325 2136658 1170509
41179 1170509 613007 509991 -69269 -989270 -852752 708698 2022276 1591728 194423
41170 194423 -428276 -82563 159210 167147 865713 2148474 2544301 1528663 524191
41161 524191 695454 1211623 909648 390899 873389 1872670 1839056 659493 -267632 -337341
41151 -337341 -382263 -846168 -959272 -204939 781068 1340032 1635946 1847898 1658963 1128265
41141 1128265 997983 1503093 1855820 1530373 1122977 1335839 2028011 2837539 3772288
41132 3772288 4612246 4764841 4311297 4075591 4058280 3176361 1389049 512898 1630451
41123 1630451 3130040 2947561 1533798 748257 844329 688461 278874 697062 1726398
41114 1726398 1792105 553413 -411948 13942 1102020 1749737 1796001 1340317 210026
41105 210026 -1255262 -2132954 -2197970 -2139954 -2110462 -1364216 148338 1209289 1052293 394287
41095 394287 41215 -239138 -636905 -468250 466569 926058 -42567 -1417081 -1668224
41086 -1668224 -1076491 -1011498 -1523067 -1429721 -602748 -333144 -1101585 -1584641 -620674 1026267
41076 1026267 1786808 1358947 669033 250301 -247185 -960797 -1253834 -705564 22903
41067 22903 41010 -364791 -47263 1193410 2007648 1220700 -516764 -1566786 -1365739
41058 -1365739 -763086 -503517 -344755 194611 1039645 1795846 2194896 2108949 1627617 1191338
41048 1191338 1104787 969737 314719 -300340 181909 1533814 2144941 1201612 -83231
41039 -83231 -151574 858204 1640074 1643434 1477167 1706989 2137051 2271794 1943331 1479344
41029 1479344 1481845 2225025 3145533 3368601 2882082 2550433 2721632 2644086 1758162 728731
41019 728731 453600 729697 743146 352713 41492 21524 190809 583392 1090217 1168685
41009 1168685 652956 393936 1154171 2270735 2455220 1609184 737676 307873 -48160
41000 -48160 -263043 328334 1551555 2053607 1055306 -446421 -905717 -33495 1221249
40991 1221249 2004601 2273590 2433466 2719723 2907719 2536953 1549751 576548 243512
40982 243512 383630 458420 553402 1178213 2129770 2490222 1972258 1368862 1274366 1188488
40972 1188488 434245 -738224 -1582837 -1816304 -1543293 -795055 151045 494527 -202171
40963 -202171 -1163057 -1283550 -670306 -405067 -827825 -1035590 -329460 747260 1340092
40954 1340092 1553899 2057198 2800703 2953373 2110542 871118 -16343 -530044 -980311
40945 -980311 -1134774 -402945 1105332 2351599 2552912 2158709 2106216 2343162 1842430
40936 1842430 237614 -1292617 -1343281 -57127 1151016 1487822 1550396 2015845 2441016
40927 2441016 2033928 1052908 532291 815406 1293272 1627720 2200982 2990513 3048476 1903230
40917 1903230 679945 758064 1798683 2277341 1717344 1093820 1007396 876268 353166
40908 353166 174736 793369 1300356 775035 -138149 -170357 659604 1287828 1319955 1196250
40898 1196250 895172 -65246 -1219300 -1213576 190466 1408223 1118609 84585 -79996
40889 -79996 753534 1282916 855463 303227 519007 1147242 1227797 610990 88877 226201
40879 226201 595329 391932 -456836 -1142427 -929450 61779 1208094 2233839 3290290
40870 3290290 4240722 4387561 3245672 1365604 -2174 -119175 576366 1087342 934549
40861 934549 418255 -48470 -446169 -811527 -783246 25308 1314987 2285831 2572846 2482393
40851 2482393 2218735 1554917 597212 158304 710897 1479589 1375627 521313 -20787
40842 -20787 136500 332086 154538 105553 619472 1310280 1742761 2192559 2897922 3143522
40832 3143522 2066020 186886 -805406 16075 1785541 2980102 2984485 2174003 1038100
40823 1038100 -80846 -637235 -133064 1033709 1600369 815535 -555364 -1126511 -588672
40814 -588672 96350 154870 -42363 268179 1116997 1871392 2078332 1800532 1325690 914086
40804 914086 692522 530357 191558 -215186 -265970 62360 158345 -332884 -838861 -643544
40794 -643544 47358 484171 476132 356013 141584 -342978 -677535 -256902 454189 231452
40784 231452 -1025533 -1870910 -1366255 -467284 -444170 -823138 -173778 1507481 2594456
40775 2594456 2099557 957748 587909 1043014 1277797 783354 208296 372976 1181513
40766 1181513 1758667 1524672 920279 939981 1963133 3247264 3760282 3376524 2929901
40757 2929901 3081234 3524508 3534366 2981187 2404890 2232178 2405721 2804145 3450830 4024812
40747 4024812 3737421 2316967 775249 388053 984634 1134632 203987 -742706 -598657
40738 -598657 150881 346737 45959 328738 1470609 2501024 2689547 2417059 2270755
40729 2270755 2210603 2072207 2054005 2121793 1650838 385048 -778843 -746819 371994 1562366
40719 1562366 2318608 2920441 3410510 3264129 2353228 1452627 1274992 1526353 1505250 1281480
40709 1281480 1554833 2412759 2995605 2688892 2031456 1869974 1981788 1303624 -466895
40700 -466895 -2217675 -2642181 -1578096 166976 1745491 2539776 2064483 415908 -1366078
40691 -1366078 -2136580 -1840686 -1273189 -770398 29507 1045935 1364024 524130 -505312
40682 -505312 -390744 866693 1967940 1916831 995591 139363 -127092 77978 462114
40673 462114 888849 1262817 1381936 1146484 842796 896576 1251229 1368045 1089716 1033585
40663 1033585 1593117 1990861 1238727 -104790 -295089 1139000 2394244 1626135 -636251
40654 -636251 -2314709 -2467016 -1926276 -1449330 -639884 821152 2031672 1920388 869458
40645 869458 283569 710262 1320530 1357031 1191301 1495855 2082730 2263500 1939966 1586191
40635 1586191 1388245 1174932 1049073 1208268 1175021 245629 -1104620 -1405752 -242693
40626 -242693 1043700 1399485 1540686 2298057 2737845 1635430 -14085 -27691 1672506
40617 1672506 2896107 2512158 1876584 2313532 3121839 3150348 2707752 2569413 2381118
40608 2381118 1499312 445405 100077 221587 123738 92264 668584 1166954 550737 -589697
40598 -589697 -640533 552902 1474467 1315524 903058 913541 843314 466728 759090 2237869
40588 2237869 3572053 3221103 1749208 1098687 1841105 2495566 1740856 190641 -587386
40579 -587386 -162769 357848 -85624 -1069750 -1181713 118349 1560389 1420349 -315418
40570 -315418 -1757515 -1293971 628118 2346035 3025363 3039568 2640604 1451257 -388192
40561 -388192 -1640544 -1392725 -413480 -90779 -410846 -207859 671621 951686 166454
40552 166454 -187738 1092500 2666705 2324834 317300 -878879 -92217 1170415 1367998
40543 1367998 1066968 1378159 1846826 1462424 702741 790714 1459040 1274662 119249
40534 119249 -420839 438165 1323233 731046 -689051 -1010152 351387 2001594 2502057
40525 2502057 2002224 1589692 1653758 1605737 1107806 782988 1254331 2036630 2178382 1746401
40515 1746401 1665575 2046463 1876321 848220 279660 1245543 2732634 2874338 1420560
40506 1420560 -260820 -1163266 -1260759 -495732 1239245 3008974 3255856 1770620 58774
40497 58774 -636968 -507989 -42201 865045 1970346 2223860 1294425 451195 764493 1384658
40487 1384658 945724 -107984 -192400 827016 1412069 791165 67006 425545 1503490
40478 1503490 2225856 2318626 2202495 2034964 1662355 1183469 906430 911561 1092374 1424055
40468 1424055 1823117 2002441 1862996 1762141 1956152 2064895 1650863 1092660 1153599 1734191
40458 1734191 1877729 1208993 529573 519329 630331 67993 -680412 -360715 1139662
40449 1139662 2464723 2586886 1997793 1673505 1675916 1456696 955401 589874 477576 436808
40439 436808 590605 1223507 2085316 2553364 2542920 2572891 2802197 2725566 2133248 1694731
40429 1694731 2063936 2880895 3272101 3059780 2831268 2893088 2806591 2158719 1325292 1081385
40419 1081385 1589776 2102093 1785608 757844 114439 743780 2144665 2763158 1762370
40410 1762370 174878 -213499 965134 2300962 2616030 2486957 3039599 3932289 3834865
40401 3834865 2751703 2291840 3092687 3498678 2017690 -74232 -302387 1430794 2769614
40392 2769614 2353931 1359180 1122327 1175738 692221 229608 555105 953249 384149 -509062
40382 -509062 -336203 588530 611090 -510403 -1061281 37387 1694997 2384840 2088872
40373 2088872 1655158 1275921 654953 45668 90974 861189 1795801 2490928 3003146 3456776
40363 3456776 3795086 3922331 3804446 3399326 2628293 1473372 178910 -625166 -319350
40354 -319350 887080 1868051 1823950 1327857 1461730 2187336 2537801 2352961 2595567 3566071
40344 3566071 4018391 2907890 1136055 463508 1173737 1948521 1919727 1729147 2278953
40335 2278953 3300413 3743376 3148705 2038301 1062578 313477 -331686 -614710 -156292
40326 -156292 761900 1253088 911865 374369 393727 771008 769744 288848 -60851 96650
40316 96650 559112 1060987 1431168 1305190 484953 -369879 -270040 690966 1273605 710303
40306 710303 -394096 -1056009 -977137 -283554 876050 1958644 2144764 1486793 1144754
40297 1144754 1781670 2532085 2374756 1697898 1462041 1534341 1122452 383821 224198 690562
40287 690562 923277 717561 786431 1236671 1091838 -140338 -1504772 -1841774 -1118873
40278 -1118873 102535 1651738 3352947 4338721 3830457 2374018 1399766 1556826 2158162
40269 2158162 2299480 1916140 1593866 1792114 2429158 2950250 2728505 1642209 274214
40260 274214 -672088 -1067638 -1201156 -1119921 -623389 133650 617199 634650 564286 683959
40250 683959 804175 816444 1018922 1508134 1823621 1705713 1639330 2009447 2290487 1900025
40240 1900025 1324501 1343652 1558829 994525 -38735 -187454 723762 1286205 732798
40231 732798 -15072 -192625 -445046 -1199871 -1358101 -61242 1518753 1817217 1282967
40222 1282967 1375039 2004467 1929601 1109823 601048 438216 -257946 -1178908 -1041548 -56387
40212 -56387 75589 -905816 -1168562 90908 1066268 173015 -1392560 -1520196 -249278
40203 -249278 660836 320292 -566933 -974948 -447422 776475 1751974 1553768 541227
40194 541227 57845 484826 818559 661775 1017611 2241489 2955505 2266912 1358184
40185 1358184 1302499 1006386 -649049 -2103888 -1015929 2078412 4464255 4995225 4720529
40176 4720529 4247253 3108478 1724419 1389963 1912420 1606095 194075 -526482 335727
40167 335727 1293952 1046271 539787 1102230 2108469 2084499 1070973 413986 848447
40158 848447 1953770 3005093 3415513 2804747 1496342 615499 1006949 2300624 3471785
40149 3471785 3956901 3858203 3475181 3023916 2556716 2014884 1605350 1871694 2784923 3143280
40139 3143280 1943824 181472 -55779 1546269 2928567 2356312 445228 -1080098
40131 -1080098 -1447034 -942679 -64989 591327 487283 -40633 105200 1201674 2107905
40122 2107905 1917964 1245161 1029274 1014865 475468 -274651 -248451 714193 1777913 2242081
40112 2242081 2145241 1920004 1894716 1922517 1390350 116397 -819834 -132808 1681942 2703639
40102 2703639 2249931 1661991 1849591 1853033 940674 292508 916885 1482382 355592 -1369606
40092 -1369606 -1279291 588506 1833826 1363767 611511 887665 1677762 2097396 2189592
40083 2189592 2125387 1672556 1074514 1074678 1564490 1586381 1113983 1285885 2279052 2608407
40073 2608407 1482795 323405 671979 1795783 1795456 295028 -1312717 -1788174 -1054701
40064 -1054701 313461 1558128 1940503 1349044 537494 183485 115984 46629 416045
40055 416045 1630905 2986818 3395958 2900832 2466266 2447118 2265457 1579931 829597
40046 829597 502878 650994 1206556 2017159 2488098 2035134 1098661 867562 1637668 2236597
40036 2236597 1606807 277508 -429074 -142842 446390 961473 1828407 3178106 4073335
40027 4073335 3479251 1718571 333233 395801 1354389 1798975 1154061 256770 220980
40018 220980 1045280 1649205 1240508 294188 -74987 490272 1282739 1689377 2069657 2954345
40008 2954345 3774105 3307013 1483082 -196314 -522844 -52751 31206 -197460 201566
39999 201566 1156688 1493457 857184 399794 1010234 1965089 2101263 1430578 689823 44244
39989 44244 -672721 -966383 -180573 1204278 1994528 2043060 2393186 3424180 4080122 3545267
39979 3545267 2607359 2428544 2738885 2358197 1059759 -259805 -1080040 -1667911 -1863473
39970 -1863473 -810206 1430617 3126317 2838770 1449677 963025 1677853 2036928 1330773
39961 1330773 876095 1748342 2782645 2183065 254409 -994943 -576082 666784 1835549
39952 1835549 2946837 3823540 3603775 2149312 738242 436392 719806 589362 104725
39943 104725 -208693 -543883 -1118836 -1076622 379004 2215514 2591766 1482983 625086
39934 625086 802741 972319 456161 171613 836761 1601732 1643309 1714360 2652261 3480634
39924 3480634 2736944 994953 214222 804865 1134273 143817 -1173549 -1450687 -749812
39915 -749812 91526 892657 1975177 3189686 3966762 4066197 3660466 2886065 1824526
39906 1824526 788177 194741 185852 587337 1133156 1579720 1792673 1878732 2028353 2114075
39896 2114075 1741444 882509 138617 81888 566513 997705 1103668 1102441 1190427 1223459
39886 1223459 996379 614870 406993 502851 669022 672617 683357 1034575 1590520 1762382
39876 1762382 1344815 902192 966723 1282563 1361042 1364286 1697747 2021422 1600275 596213
39866 596213 52210 419085 986151 1062128 884416 965705 1287615 1573756 1704425 1499074
39856 1499074 800177 124935 395289 1548441 2301450 1890594 1131862 1041211 1377230
39847 1377230 1481450 1599442 2168608 2607916 2211169 1639131 2015582 2939510 2985193 2007290
39837 2007290 1337918 1634081 2087006 2003104 1690736 1430263 990515 611043 1066494 2203139
39827 2203139 2760828 2262028 1715621 1767400 1656065 951005 757951 1807838 2698637
39818 2698637 1775213 -214646 -1220689 -981012 -974416 -1547582 -1264491 504146 2284694
39809 2284694 2660400 2232866 2333440 2884497 2840783 2159830 1991312 2884125 3818012 3443916
39799 3443916 1798439 304565 125116 878603 1263292 817264 513972 1296748 2511460
39790 2511460 2541192 938464 -849960 -1193973 -152355 845619 858207 375371 396775
39781 396775 1087843 1708223 1674025 1210567 800476 419253 -200421 -759117 -533058 540109
39771 540109 1545137 1695512 1247566 913146 867222 893977 1095526 1732536 2551355 2967814
39761 2967814 2886553 2743969 2743177 2615956 2198836 1732841 1503269 1606580 2090558 2862029
39751 2862029 3438166 3304404 2609740 2025476 1823678 1606335 1080035 543111 346949
39742 346949 381768 457475 775082 1551274 2394261 2506458 1523053 -58640 -1258611 -1330615
39732 -1330615 -250664 1311723 2534722 3081020 3245996 3505537 3950760 4147369 3579217
39723 3579217 2346013 1347240 1454765 2460402 3261877 3225320 2816892 2602562 2319506
39714 2319506 1554841 742379 646420 1268342 2114173 3094162 4113122 4227631 2666528
39705 2666528 599628 266688 1979607 3504080 3053878 1478703 610555 782406 1173093
39696 1173093 1508486 1991056 2262176 1867472 1327650 1436750 1809166 1405326 309552
39687 309552 -277815 232612 1278252 2302402 3232864 3714094 3139563 1812263 972425
39678 972425 1213442 1813946 2068235 2292937 2912346 3426736 3070946 1918987 657688
39669 657688 -274506 -762781 -728671 -366835 -229921 -472685 -409669 549122 1894058 2651052
39659 2651052 2740027 2906002 3391461 3511371 2750678 1618344 1007026 1086028 1250594 1002412
39649 1002412 478908 69849 -151196 -345860 -418955 -19791 861105 1696735 2109629 2390599
39639 2390599 2901435 3300196 3013608 2313953 2159761 2904986 3870563 4324918 4184048
39630 4184048 3578067 2539294 1468261 1100481 1469626 1586953 764877 -336574 -643427
39621 -643427 -105252 535018 947456 1360885 1784786 1903292 1651478 1254229 797010 316852
39611 316852 156560 656440 1627365 2610578 3407401 3833458 3346536 1713154 -152474
39602 -152474 -843921 3371 1395016 2109768 1673079 500522 -314182 273317 1971676
39593 1971676 2975086 1991990 94219 -555585 458758 1525799 1442006 682123 78143
39584 78143 -290658 -416652 106021 1221250 2136481 2447914 2522853 2361785 1340016 -340425
39574 -340425 -1300737 -901420 -198345 -60871 250755 1394212 2241566 1560868 336598
39565 336598 483361 1907702 2825841 2641594 2466082 2777537 2600833 1459857 355553
39556 355553 71252 -9692 -535691 -894969 -315702 663749 911912 378904 120198 858507
39546 858507 2187265 3146532 3219440 2787672 2665895 3036957 3056263 1990673 509100
39537 509100 19454 760660 1557402 1693272 1918678 2976442 4086049 3877910 2327623
39528 2327623 784714 243404 414405 558412 541199 755791 1368270 2021196 2297216
39519 2297216 2275198 2415069 2872597 3197341 2900632 2073576 1185313 567471 435576 1002415
39509 1002415 1993949 2445829 1782554 836298 860054 1693366 2021200 1476326 1209391 2031269
39499 2031269 3261070 4037042 4554843 5095805 4922857 3421906 1649463 1334691 2551387
39490 2551387 3606127 3276058 2122434 1408991 1615084 2354949 3082034 3431734 3256695
39481 3256695 2702962 2121979 1764196 1645579 1666563 1679329 1520385 1203308 999942 1119433
39471 1119433 1430340 1718449 2011205 2316598 2257015 1472056 355701 -143809 350980
39462 350980 1117998 1210826 585257 -5993 -92277 20679 -51306 -73056 341960 858305
39452 858305 749661 162885 225827 1448148 2735805 2724902 1565696 514535 165235
39443 165235 132103 259137 914919 1959099 2556039 2350342 1864935 1426558 702163 -315281
39433 -315281 -921936 -842521 -733608 -916299 -640867 576800 1854348 2157271 1813969
39424 1813969 1794737 2165536 2312113 2106079 1776168 1149114 111379 -644406 -439587
39415 -439587 249190 549169 601799 1035535 1578224 1612472 1645660 2542835 3546263 2982223
39405 2982223 1073210 51724 930149 2084513 1964264 1389161 1788546 2655563 2487264
39396 2487264 1314083 515473 591277 766370 644728 720368 1126091 1239249 873508 715610
39386 715610 1121814 1474024 1302031 1185755 1815927 2799026 3201033 2863383 2376929 2028759
39376 2028759 1637341 1323719 1498252 1928436 1778390 1012555 834831 1934816 3046923
39367 3046923 2423122 395636 -863028 -244165 946494 1049138 268635 -76629 352330
39358 352330 742436 632384 461777 687866 1256680 1971358 2622189 2753687 2084390 1214282
39348 1214282 1103215 1681368 1814450 987233 201511 595114 1787064 2394042 1900804
39339 1900804 1183356 1119874 1423955 1266631 607965 286883 814743 1647041 1925554 1531409
39329 1531409 983339 623078 497015 817386 1719424 2544514 2309732 1207274 703419
39320 703419 1574239 2715711 2720032 1867326 1467759 1744849 1652695 681118 -372177 -628217
39310 -628217 -140609 616899 1443563 2192262 2502491 2214236 1691563 1445283 1681952 2318659
39300 2318659 3128388 3794325 4086866 3999401 3549971 2690764 1690548 1193606 1397045
39291 1397045 1593063 1187182 733912 1098282 1959879 2220849 1709825 1306057 1387909 1418968
39281 1418968 1280145 1712104 2913469 3828904 3540104 2497831 1692633 1373889 1289221
39272 1289221 1478761 2010611 2420819 2212150 1634111 1343463 1508483 1757750 1821663 1782749
39262 1782749 1806277 1921279 1992673 1826478 1462715 1271744 1448318 1638877 1588224 1805445
39252 1805445 2719931 3477272 2838515 1282678 738437 1838902 2956331 2686361 1800437
39243 1800437 1653745 2019404 1940581 1660788 2039244 2752677 2803719 2406627 2623522 3283717
39233 3283717 3065801 1843483 1189911 1951779 2872986 2557753 1556636 1323269 1954197
39224 1954197 2288731 1854476 1399241 1439634 1448654 941886 470588 739597 1255437 886712
39214 886712 -244581 -527996 918900 2672501 2667165 1007164 -114465 649298 2151982
39205 2151982 2470428 1238238 -402290 -1353877 -1269992 -325274 861584 1448505 1229220
39196 1229220 946036 1179975 1451072 1138967 703230 983043 1695690 1787646 1111513 574039
39186 574039 580438 514079 28286 -266358 96789 624422 834933 1263942 2608984 4296159
39176 4296159 4828849 3571353 1527080 181501 17319 407439 655517 723973 911162
39167 911162 1190079 1226168 960979 778237 988127 1474762 1980783 2386264 2551850 2328663
39157 2328663 1980194 2081973 2584475 2507621 1212843 -423885 -912425 -39134 966466
39148 966466 1160964 972540 1312847 2246252 2966272 2797624 1897641 1022133 694717 667276
39138 667276 404499 60968 391488 1408457 1897319 1025093 -191008 -106461 1207700
39129 1207700 2110395 1828728 1368983 1662246 2167245 2097132 1933814 2609273 3805994
39120 3805994 4216873 3323473 2006761 1340631 1426792 1556615 1124065 268563 -222557
39111 -222557 265433 1354566 1983196 1746404 1484742 2087520 3114103 3319717 2428117
39102 2428117 1591447 1835421 2641031 2591251 1234993 -202091 -166289 1375583 2768788
39093 2768788 2472205 796741 -450021 35556 1779917 3301856 3744227 3495459 3445310
39084 3445310 3920398 4327801 3794215 2256751 816028 662736 1677545 2577530 2541775
39075 2541775 2096278 2107646 2537224 2734067 2476754 2072351 1763296 1711076 2273138 3503425
39065 3503425 4535667 4338753 3136549 2250007 2365425 2767783 2554934 1776335 933402
39056 933402 180084 -302408 148576 1804111 3586578 3965987 2751807 1169993 169658
39047 169658 -458214 -1084442 -1299671 -588316 611284 1239254 840409 -51532 -643374
39038 -643374 -532184 293562 1535911 2499855 2410853 1240594 4404 -209526 515717
39029 515717 1067054 758625 162206 193766 847292 1389462 1474442 1312686 904479 66614
39019 66614 -681387 -366084 839384 1365780 414820 -639862 -177228 1200313 1633774
39010 1633774 883347 415964 741633 674936 -276545 -709602 478163 2232734 2923450
39001 2923450 2564660 2169152 1960481 1691517 1866997 2993326 4139638 3901477 2543220
38992 2543220 1623138 1636455 1628535 1154329 912314 1096256 790788 -289213 -906402 -101326
38982 -101326 1247117 1701644 1240879 894946 1067195 1312591 1381976 1444591 1464780 1292608
38972 1292608 1305642 2071869 3275110 3792464 3148041 2245513 2205231 2925755 3366196 3025839
38962 3025839 2471292 2301189 2240227 1717760 919082 597024 981986 1572199 2030932 2553315
38952 2553315 3140228 3261671 2651135 1804261 1242008 874702 546875 527055 850966 840314
38942 840314 27576 -957608 -1144532 -395341 770203 1874472 2355829 1605343 58844
38933 58844 -598981 545582 2184417 2561457 1856418 1391447 1348051 1021453 602542 690775
38923 690775 578208 -747265 -2203752 -1656237 647111 2207320 2115026 2114354 3206142
38914 3206142 3924546 3157498 2158592 2202767 2417327 1669082 732301 769962 1256710 1205233
38904 1205233 1057534 1623878 2423753 2725161 2941887 3387175 3077745 1604090 730649
38895 730649 1965983 3772335 3593044 1752360 826310 1675318 2628047 2474842 1896483
38886 1896483 1692285 1646009 1574164 1831847 2364122 2580134 2382844 2168456 1868514 1230443
38876 1230443 859223 1587546 2944459 3668740 3616391 3678720 3911410 3367885 1906256
38867 1906256 596680 60143 -182550 -422624 -207162 537061 1074606 1022365 892824
38858 892824 1070898 1188143 911441 575726 697442 1416151 2496849 3366969 3322069 2327878
38848 2327878 1364144 1320852 1926695 2417185 2647349 2723981 2306579 1341957 730731 1069707
38838 1069707 1529791 1279045 1069269 1821252 2620275 2077068 850962 586482 983298
38829 983298 443430 -692385 -308761 1887723 3582895 3272826 2122537 1656180 1719256
38820 1719256 1610266 1376585 1133843 701329 515883 1293695 2393732 2348407 1392767
38811 1392767 1391384 2737169 3594775 3023551 2512836 3249562 4050242 3466348 2100816
38802 2100816 1343599 1340539 1518371 1685625 1522633 517798 -611617 -185595 1729866
38793 1729866 2826636 1950321 887716 1314814 2159102 1849004 1110508 1325047 1884877
38784 1884877 1534659 842102 965070 1315155 852985 412079 1165110 1962868 1035327
38775 1035327 -552339 -185673 2025635 3346298 2760812 2183366 2876360 3513479 2766499
38766 2766499 1421466 707226 424331 -8121 -158870 516651 1492342 1958881 1973792
38757 1973792 2007298 2075076 2015987 1998218 2160907 2261808 2099529 1823991 1571053 1279619
38747 1279619 1045846 1157006 1647315 2273012 2914790 3493072 3589919 2812589 1530908
38738 1530908 643969 586376 1045507 1537281 1735614 1448998 910016 894039 1854739 3077111
38728 3077111 3373666 2524445 1400636 803195 825682 1226103 1745639 2089009 2130254 2078640
38718 2078640 2066249 1858550 1417418 1338385 2128537 3388883 4291497 4539172 4365094 4036217
38708 4036217 3845267 4016257 4119057 3349216 1986091 1556871 2646351 3639526 2911816
38699 2911816 1274730 683115 1337661 1896884 1999967 2525228 3486450 3737613 3049833
38690 3049833 2642481 3145692 3625189 3219135 2362658 1802456 1617406 1705570 2038462 2019644
38680 2019644 918167 -576226 -688526 850272 2034933 1395041 151229 235847 1377575
38671 1377575 1884443 1593525 2063473 3820261 5207981 4668623 2939983 2001907 2470618
38662 2470618 3079856 2660731 1697243 1463266 2175699 2776233 2505848 1931014 2019268 2722113
38652 2722113 3069481 2457253 1299463 440728 328473 782488 1311284 1642424 2014130
38643 2014130 2753334 3535758 3526284 2495259 1302439 886688 1213114 1632466 1820921
38634 1820921 1869198 1856302 1854563 2017992 2260667 2265240 2127503 2363527 2901068 2910841 2211020
38623 2211020 1850076 2441823 2943984 2273095 1237488 1402254 2643967 3381257 2885931
38614 2885931 1881288 1083424 610180 687907 1499540 2391799 2577854 2462115 2842556
38605 2842556 3096533 1967447 91494 -332674 1206091 2617375 2274943 1144163 870455
38596 870455 1436262 1961678 2427329 3193742 3840454 3841609 3644378 3884718 4182680 3811487
38586 3811487 2975055 2392358 2159892 2000135 2071852 2506958 2663937 1951802 1015964 984383
38576 984383 1779407 2281991 2040093 1686571 1615030 1386235 811761 643355 1492282 2628234
38566 2628234 2653695 1323159 98064 579164 2589468 4216492 3895061 2114548 709200
38557 709200 729248 1610026 2346570 2665879 2744166 2524187 1954050 1468168 1530444 1858995
38547 1858995 1723178 1014541 482941 750328 1512841 2020556 2083298 2156204 2425539 2324924
38537 2324924 1363743 119106 -273657 372455 1049608 1092382 1172928 2149911 3589857
38528 3589857 4324832 4090998 3648690 3467959 3313042 3146564 3398201 4014786 4111926 3090759
38518 3090759 1559520 684182 947592 1839545 2492302 2414185 1794135 1153079 593503
38509 593503 -319152 -1583558 -2156301 -1127064 768775 1848989 1710398 1639637 2509673
38500 2509673 3425155 3172883 2100433 1544353 1886939 2233237 1918548 1384495 1288676
38491 1288676 1437238 1147791 394458 -6174 523787 1508298 2063839 2078472 2164398 2518977
38481 2518977 2604067 2207949 2041812 2689099 3546058 3564826 2720648 2001840 2095715 2714686
38471 2714686 3149356 2994946 2411375 2002251 2225510 2688853 2496085 1605212 1142697
38462 1142697 1815557 2787807 2935217 2464291 2268471 2349481 2100547 1657425 1631260 1805107
38452 1805107 1459730 852561 1019767 2084614 3005586 3085033 2597008 1910770 1173180
38443 1173180 893800 1617534 2880647 3627703 3749020 4056255 4699993 4872720 4216444
38434 4216444 3315230 2683832 2443212 2921017 4169737 4986292 4095489 2350639 1865270
38425 1865270 2763731 2972690 1757161 1009855 1909685 2747855 1878975 734749 1535889
38416 1535889 3483894 3900721 2442668 1533968 2590919 4139648 4268916 3144797 2191957
38407 2191957 2029731 2242740 2503458 2934414 3481894 3622444 2963989 1909043 1367375
38398 1367375 1704759 2298773 2426052 2226193 2265613 2500735 2442846 2111044 1907957 1709114
38388 1709114 1129279 605980 981673 1940089 2231595 1718385 1735171 2921719 4164551
38379 4164551 4400013 4057404 3861589 3601331 3123880 3199880 4129170 4670791 3774460 2385648
38369 2385648 2054654 2611857 2791544 2439771 2376944 2522775 1980725 937122 779143
38360 779143 2010775 3411403 3698494 2967508 2092031 1640323 1838669 2798805 4188932
38351 4188932 5167908 5192608 4700978 4648000 5422559 6416233 6692369 5991014 4917722 4107133
38341 4107133 3540647 2990912 2700616 2939045 3192288 2736454 1926655 1856023 2646090 3213261
38331 3213261 2973794 2569846 2499414 2313022 1811206 1770387 2588645 3315994 3031136 2236296
38321 2236296 1882787 1905064 1768239 1620401 1783047 1876513 1625450 1806407 3103084 4591042
38311 4591042 4722137 3499522 2440250 2566081 3500969 4368333 4579585 3903208 2685937
38302 2685937 1866530 1966709 2289366 1881320 982736 697979 1488613 2761245 3693775
38293 3693775 3814171 3142009 2400716 2581630 3618206 4139964 3319310 2162441 1961983
38284 1961983 2333130 2126586 1562293 1808784 2821016 3330958 2972455 2764229 3213348
38275 3213348 3442314 2722941 1640408 1092100 1095085 1248809 1631562 2524065 3649963
38266 3649963 4264859 3890914 2737264 1509193 860659 911859 1311624 1739195 2060304
38257 2060304 2030454 1454889 810931 956981 1846935 2319987 1673864 630745 150205
38248 150205 198458 446847 1183927 2495250 3441192 3263569 2661125 2638688 2865986 2565699
38238 2565699 2252365 2891442 3864659 3656589 2393080 1834339 2713596 3806409 3970904
38229 3970904 3558596 3358531 3517384 3982125 4787371 5451207 5196628 4139836 3202056
38220 3202056 2655580 2003201 1465455 2017986 3467348 4153872 3435760 2895125 3851369
38211 3851369 5047853 4402573 2125340 357142 178376 683801 958140 1327705 2242903
38202 2242903 3236832 3704454 3857077 4214224 4744739 5113295 5261617 5153692 4486518
38193 4486518 3413553 3053545 4212919 5839390 6031723 4709254 3862905 4617862 5527775
38184 5527775 4850872 3168844 2155063 1762814 664752 -999555 -1527354 -384177 1055436
38175 1055436 1891575 2787444 3980964 4224224 2871871 1368986 1299236 2227362 2776962
38166 2776962 2738376 2811014 3174631 3531569 3830248 3997345 3748592 3384457 3697167 4387311
38156 4387311 3973534 2183890 850934 1260625 2283404 2541839 2629398 3385545 3787646
38147 3787646 2854832 2091825 3367365 5506784 5841754 4399635 3628421 4320924 4752956
38138 4752956 3955561 3081367 3073968 3392789 3616522 4192144 5027353 5230068 4721759 4372598
38128 4372598 4254226 3570621 2546267 2428310 3261247 3600537 2872964 2139702 2076222
38119 2076222 2087172 1897268 2104662 2630160 2546282 2009761 2378539 3767985 4560242 4145885
38109 4145885 4033474 5179145 6263289 5929684 4892464 4375317 4102804 3394794 2866802
38100 2866802 3457675 4824977 6059940 7009878 7719429 7652967 6703743 5932712 6071023
38091 6071023 6290090 5675744 4878825 4947619 5471910 5360699 4705280 4373801 4341394 3938850
38081 3938850 3384547 3547785 4250358 4191854 2851279 1428857 1411782 2769508 4032542
38072 4032542 4008868 3096609 2666788 3237804 3881387 3807516 3698272 4458298 5334891 4821737
38062 4821737 3160965 2200912 2671999 3420436 3714765 4372889 5796880 6728670 6160419
38053 6160419 4992574 4502507 4425563 3882878 3114335 2891908 3069193 3046830 2988551 3354317
38043 3354317 3839271 3920187 3909982 4410942 5216290 5700469 5796494 5747660 5480386 5038377
38033 5038377 4961861 5379743 5442399 4557989 3456255 3091333 3271814 3374233 3540641 3975067
38023 3975067 3911805 2737339 1487834 1651718 2889649 3533503 3104330 2672263 2733541
38014 2733541 2491881 1675295 1464644 2748888 4586157 5379391 4886132 4166460 3971362
38005 3971362 4040743 3871603 3468765 3192664 3281478 3691646 4149001 4213095 3567750 2545088
37995 2545088 2153983 3081414 4656632 5420193 4949158 4416772 4845198 5568685 5345753
37986 5345753 4410823 4146125 4886028 5406722 4835051 3850050 3508378 3892573 4520837
37977 4520837 5253921 6109035 6776941 6953218 6732288 6226120 5239922 3771297 2444977
37968 2444977 1996485 2503970 3355338 3801964 3515548 2865049 2597385 2980121 3492109
37959 3492109 3719509 4102337 5134638 6273468 6541517 5901982 5072889 4267205 3226353
37950 3226353 2327969 2437827 3572863 4724876 5091991 4688579 3937659 3504348 4069585
37941 4069585 5249848 5456801 4150337 3250376 4405247 5881386 4874477 2309316
37933 2309316 1948942 4504250 6324189 5145544 3544403 4494126 6577777 6575021 4623060
37924 4623060 3543015 4274466 5108764 4965981 4661935 4877237 5138390 5145984 5378082 5998440
37914 5998440 6442958 6326810 5792162 4969555 4001538 3450049 3753300 4422115 4634478
37905 4634478 4459603 4677777 5552581 6553758 7184825 7421126 7385697 7073639 6379423
37896 6379423 5271222 4180936 4054960 5284287 6680937 6615693 5283456 4524624 5104275
37887 5104275 5736018 5430769 5079980 5581433 6018670 5301661 4376909 4955983 6766392
37878 6766392 7839066 7192219 5704797 4522780 3989814 4110047 4806907 5549095 5657419
37869 5657419 5164074 4718771 4624548 4561487 4269939 3979951 4065947 4563010 5091727 5223359
37859 5223359 4970487 4749940 4691886 4425529 3967193 4131430 5224076 6075502 5620244
37850 5620244 4754021 5015811 5998340 6042531 5149009 4906161 5573157 5753298 5255300 5590133
37840 5590133 6932794 7330385 6032428 4962434 5477455 6209789 5788364 5239125 5701113
37831 5701113 6033295 4974561 3757963 4176451 5601868 6222012 5866043 5415924 4759913
37822 4759913 3556046 2792562 3364779 4211407 3990046 3463087 4078687 5364009 5986900
37813 5986900 6261594 7200090 8115073 7711188 6723279 6862478 7737350 7406953 5642599
37804 5642599 4199107 4034717 4481387 4966790 5435437 5294431 4052884 2840937 3286340
37795 3286340 5059755 6436571 6970624 7589295 8348579 8287434 7473729 7136493 7650929
37786 7650929 8168861 8243259 8154934 7789599 6869822 6052713 6117113 6444150 6056133 5597753
37776 5597753 6245885 7202016 6647617 4930627 4293148 5352282 6305944 5993958 5444224
37767 5444224 5789145 6670525 7371748 7822367 7972055 7727361 7781976 8869011 10025813
37758 10025813 9423466 7177877 5449006 5385548 5905899 6004745 6243105 7108160 7741749
37749 7741749 7424331 6875011 6942432 7138900 6555010 5397364 4675292 4897211 5720234
37740 5720234 6471497 6647525 6288108 5989646 6162920 6420032 6222110 5832431 5926078 6570632
37730 6570632 7347089 8106882 8805599 9036205 8624020 8237904 8511131 9054221 9224013
37721 9224013 9226018 9466420 9543004 9001310 8353300 8156720 7874964 6953687 6219086 6758444
37711 6758444 8121231 9068407 9385570 9510447 9183347 8076588 7022814 6976102 7432887
37702 7432887 7437562 7316813 7749418 8051555 7265015 6078721 5708391 5748190 5224233 4864527
37692 4864527 5955650 7695508 8234833 7840041 8381280 9923745 10493481 9334464 7941064
37683 7941064 7548052 7747972 7902974 7993853 7824816 7124897 6531662 6861288 7538559 7390713
37673 7390713 6687675 6638916 7233582 7414150 7027796 6800339 6825208 6843074 7352379 8579004
37663 8579004 9230282 8357571 7422500 8144686 9432187 9213265 8224902 8755772 10406675
37654 10406675 10613326 9027308 7838489 7825087 7647031 7211880 8082279 9989928 10488007
37645 10488007 8964026 7756132 8287264 9142289 9048290 8836029 9235561 9418329 8994090
37636 8994090 9042941 9971338 10519725 9932738 9120433 8897039 9025164 9483197 10560458
37627 10560458 11357022 10500264 8676008 8039264 8859883 9344062 9006935 9326697 10606761
37618 10606761 11214151 10650181 10409322 10934410 10660538 9106492 8096508 8787630 10089880
37609 10089880 11018650 11984897 12846892 12464378 11210019 11112601 12380758 12605076 10654413
37600 10654413 8560267 8165874 8670199 8989190 9790391 11393833 12166227 11012813 9449662
37591 9449662 9337130 10228964 10564208 9996501 9199420 8694284 8879667 9960986 11232747
37582 11232747 11730570 11741952 12089436 12167390 10838885 9023761 8799616 9997757 10497021
37573 10497021 9933925 10085085 11365144 12163787 12093984 12629320 13893410 14063353 12725510
37564 12725510 11705826 11857429 12096951 12151633 12992431 14073961 13658080 12377584 12723665
37555 12723665 14432346 14455212 12296072 11042905 11999169 12788734 12232671 12464110 14284538
37546 14284538 15027386 13444043 12370254 13802466 15346414 14507362 12845894 12819821 13771826
37537 13771826 14036513 14055662 14574074 14530559 13391660 12900647 14047185 14971506 14217567
37528 14217567 13376646 14196766 15669196 16156061 15894830 15499439 14598479 13630268 14152690
37519 14152690 15816890 16086338 14426393 13447263 14436595 15398063 15084763 15059657 15983505
37510 15983505 15963031 14594174 14457969 16407721 17627489 16709319 16267446 17929628 19204378
37501 19204378 18227041 17238829 18224978 19315554 18724454 18145098 19018215 19548216 18671637
37492 18671637 18776645 21086701 22596491 21186227 19567473 20389477 21593724 20607234
37484 20607234 19143280 19685275 20908355 20699915 20255952 21256595 22345074 22080793 21951190
37475 21951190 23024984 23315308 21823316 21208461 23026843 24569093 23957043 23829850 26142887
37466 26142887 28018372 26955846 25490527 26227359 26850951 24753773 22216505 22242931 23447868
37457 23447868 23632128 24117539 26036216 26832416 25043230 23938931 25815065 27518229
37449 27518229 26353806 25283938 27187691 29191680 28120848 26474136 27449434 29079271
37441 29079271 28848340 28997453 31629598 33764438 32879742 32005220 33750577 35020891 33356294
37432 33356294 32337998 34671504 36410830 34468587 33093723 36057521 39373585 39007049
37424 39007049 38619660 41952411 44877693 43273298 41454315 44146701 47403527 46374234
37416 46374234 44691011 47081651 50277650 50422479 51429143 56616160 60783088 60285803
37408 60285803 61346011 68067808 72934713 70563560 69200536 75884099 82736630 82101865
37400 82101865 81820456 89683837 97277672 97135874 100079540 114811971 127427942 125568736
37392 125568736 124575590 140635444 158192288 160779780 172365679 215696749 241910530
37385 241910530 168507262 -526893 -153824577 -199199493 -161445399 -122525034 -112386756
37378 -112386756 -104878788 -86782064 -74656383 -74269510 -70108612 -56457541 -45657103
37371 -45657103 -43176940 -40144013 -32398332 -26101330 -23343137 -19321875 -13759490 -10801880
37363 -10801880 -9136421 -4648744 146901 605804 -422540 2150848 6180310 7764804
37355 7764804 9705668 15187176 20348110 21976795 24402860 30539732 35498416 36805275
37347 36805275 40082785 47263089 51788631 52583265 58070008 69406384 77086244 81010409
37339 81010409 92726443 110066539 115715434 111149523 120454937 146585869 162779817
37332 162779817 168180099 201531908 258156992 244698183 87059485 -143560578 -290292824
37325 -290292824 -291479902 -229822740 -197818388 -193390683 -175313318 -148511466 -142224310
37318 -142224310 -149567231 -142652094 -122851066 -112041176 -110981798 -103882265 -91606804
37311 -91606804 -87390609 -88993759 -83860755 -74287411 -72051027 -74914505 -71656023 -64196512
37303 -64196512 -63099734 -66593947 -64367542 -57452328 -55291158 -57215895 -54823277 -49150262
37295 -49150262 -48436378 -51789468 -51057352 -46359857 -44787065 -46093706 -43965046 -39292835
37287 -39292835 -38539626 -40842773 -39709515 -35702695 -35020659 -37233778 -36474249 -33183647
37279 -33183647 -32937513 -34996141 -33478409 -28874440 -27380076 -29523530 -29913229 -27677570
37271 -27677570 -27142965 -28621276 -28080728 -25595493 -25127150 -26430536 -25768471 -23857685 -24600153
37262 -24600153 -26866588 -26066825 -22961055 -22383085 -24065118 -23328541 -20267285 -19653162 -21989290
37253 -21989290 -23032502 -22139970 -22890341 -25265080 -25253826 -22678179 -21701294 -22979720 -22753824
37244 -22753824 -20432598 -19808214 -21751308 -22575555 -20809088 -19240202 -19194335 -18751068 -17492250
37235 -17492250 -17295013 -17786350 -16603844 -14543439 -14797663 -16830793 -16807665 -14419717 -13405866
37226 -13405866 -14829636 -15719686 -15026522 -15103691 -16434743 -16564651 -15241176 -15118766 -16337174
37217 -16337174 -15816175 -13059862 -11336889 -11828504 -11809309 -10064420 -9030936 -9877041 -10234924
37208 -10234924 -8671053 -7046136 -6649468 -6082735 -4688486 -4140332 -4881241 -4693978 -2607346
37199 -2607346 -821885 -953821 -1400946 -239832 1665876 1815875 -1554261 -8657720 -17510708
37190 -17510708 -24104401 -25758865 -24241035 -23126025 -22826569 -21356019 -19071056 -18550443
37182 -18550443 -19902764 -20334846 -18793132 -17227477 -16755360 -16271455 -15467996 -15647654 -16801677
37173 -16801677 -17212039 -16591661 -16404732 -16621343 -15523971 -13252287 -12089746 -12536187 -12481034
37164 -12481034 -11098852 -10253266 -11002586 -11770789 -11140929 -9837498 -8967507 -8599437 -8683864
37155 -8683864 -9179621 -9060358 -7464957 -5679215 -5511385 -6182034 -5648155 -4307272 -4031588
37146 -4031588 -4211167 -2684482 -232083 171259 -1357971 -1552104 426416 2057427 2770283
37137 2770283 4855165 7350848 4464141 -6547129 -19990951 -27964729 -29101169 -27774043
37129 -27774043 -27166488 -26905060 -26120496 -25209805 -24591763 -23991411 -23139833 -22035202 -20741377
37120 -20741377 -19555700 -18810743 -18220525 -17291860 -16418617 -16358774 -16709875 -16427096 -15755245
37111 -15755245 -15856276 -16561084 -16503326 -15584653 -15182699 -15671883 -15898995 -15463739 -15335991
37102 -15335991 -15741592 -15567356 -14419665 -13278870 -12640929 -12009725 -11628456 -12562209 -14500761
37093 -14500761 -15580862 -15078948 -14367456 -14564612 -15053849 -14925438 -14198114 -13146369 -11982304
37084 -11982304 -11397136 -11807382 -12154161 -11271700 -10146630 -10630648 -12220201 -12685300 -11777372
37075 -11777372 -11464612 -12295749 -12518049 -11376715 -10383062 -10471532 -10633956 -10309074 -10457099
37066 -10457099 -11193190 -10959995 -9325984 -8204547 -8905344 -10121380 -10216054 -9542784 -9140446
37057 -9140446 -8914242 -8457574 -8182253 -8475787 -8977675 -9426855 -9942371 -10093921 -9240206
37048 -9240206 -8013027 -7693514 -8006153 -7598250 -6779961 -7288160 -8976271 -9494741 -8067123
37039 -8067123 -6895284 -7678689 -9226187 -9839062 -9782203 -9943755 -10059457 -9756350 -9683888
37030 -9683888 -10285988 -10854356 -10762047 -10268076 -9524241 -8378278 -7532675 -8007107 -9112401
37021 -9112401 -9086798 -8074700 -8055704 -9366439 -9986416 -9026713 -8174360 -8663763 -9469183
37012 -9469183 -9577780 -9438132 -9134233 -7907718 -6557177 -7259981 -9719489 -10749023 -9273808
37003 -9273808 -8261198 -9607707 -10741963 -9152650 -6939495 -7321845 -9312468 -9730275
36995 -9730275 -8518124 -8110001 -8824447 -8719009 -7368295 -6383915 -6463750 -6792365 -7085908
36986 -7085908 -7673162 -7930288 -7095022 -6235078 -7000962 -8794421 -9527163 -8827951 -8133235
36977 -8133235 -7920942 -7320606 -6353793 -6116523 -6622956 -6757402 -6545806 -7198069 -8580132
36968 -8580132 -8975521 -8003038 -7534924 -8681022 -9832658 -9119973 -7302728 -6538956 -7178634
36959 -7178634 -7537833 -6666101 -5744459 -6187277 -7430931 -7685072 -6563648 -5723483 -6445017
36950 -6445017 -7694709 -7678751 -6551640 -6036257 -6661151 -7176686 -6899279 -6741859 -7223809
36941 -7223809 -7246707 -5994587 -4592834 -4513480 -5421576 -5955008 -5763214 -5446888 -5208165
36932 -5208165 -4909204 -4953486 -5810132 -6922448 -7179304 -6379375 -5458885 -5372167 -6215619 -7197630
36922 -7197630 -7216213 -5959472 -4566504 -4416520 -5168620 -5154304 -3972958 -3216842 -3966911
36913 -3966911 -5127362 -5308004 -4936953 -5138377 -5692316 -5683790 -5355077 -5714699 -6755678
36904 -6755678 -7455572 -7308497 -6762859 -6379776 -6435520 -7019931 -7765139 -7914097 -7329805 -6845929
36894 -6845929 -6974982 -7083250 -6635432 -6293068 -6685957 -6975869 -6003211 -4288653 -3513946
36885 -3513946 -4293970 -5657383 -6530021 -6643127 -6135714 -5317715 -4826659 -5152532 -5947627
36876 -5947627 -6403825 -6215940 -5670416 -5051000 -4535147 -4408451 -4767269 -5170313 -5067959
36867 -5067959 -4438014 -3714790 -3367632 -3730222 -4777025 -5849821 -6160492 -5793805 -5590383
36858 -5590383 -5847920 -5936258 -5491323 -5091200 -5273831 -5701787 -5822453 -5634989 -5353470 -5023214
36848 -5023214 -4827658 -4999560 -5157437 -4639976 -3728938 -3449650 -3911555 -4163277 -4045023
36839 -4045023 -4592175 -5937055 -6540897 -5606727 -4633907 -5129448 -6160756 -5885515 -4463565
36830 -4463565 -3633767 -4085670 -5014564 -5842486 -6635722 -6966939 -6052572 -4289029 -3316571
36821 -3316571 -4062414 -5595086 -6376018 -6079381 -5739437 -6310388 -7409904 -7721084 -6729490
36812 -6729490 -5635995 -5947969 -7455468 -8489830 -8077067 -6825454 -5710247 -5131912 -5234654
36803 -5234654 -5865618 -6054695 -4930995 -3387950 -3297815 -4762820 -5903733 -5850689 -5896899
36794 -5896899 -6799242 -7114364 -5708954 -4035949 -4048354 -5267889 -5820901 -5276646 -4611811
36785 -4611811 -4263033 -4008596 -4057690 -4576061 -4777455 -4075448 -3469799 -4142542 -5278501
36776 -5278501 -5033945 -3294752 -1746586 -1357434 -1421733 -1196809 -1053752 -1634730 -2824232
36767 -2824232 -3902722 -4258649 -3936302 -3685892 -4094963 -4580274 -4079715 -2927465 -2758594
36758 -2758594 -4016025 -5034815 -4511856 -3385289 -3072775 -3341138 -3407412 -3722519 -4849477
36749 -4849477 -5768275 -5314842 -4404418 -4743875 -5991999 -6317428 -5378438 -4643520 -4861818
36740 -4861818 -5194601 -5004085 -4758399 -4852651 -4965149 -4888776 -4839766 -4760046 -4318726 -3663396
36730 -3663396 -3285147 -3240279 -3333365 -3783923 -4809388 -5874420 -6242415 -5902259 -5188543
36721 -5188543 -4129864 -3040239 -2881698 -3886833 -4680979 -4086549 -2960040 -2802604 -3420135
36712 -3420135 -3622320 -3436341 -3717025 -4160975 -3787703 -3092013 -3604360 -5280941 -6285347
36703 -6285347 -5593670 -4097899 -2902560 -2184304 -2019740 -2719441 -3879387 -4477589 -4351875
36694 -4351875 -4405882 -5065994 -5700166 -5790264 -5502317 -4882724 -3702242 -2405128 -2077276
36685 -2077276 -3065445 -4509300 -5475194 -5726834 -5321451 -4418687 -3622430 -3559714 -3923368
36676 -3923368 -3765498 -2891045 -2172772 -2326747 -3067901 -3641746 -3670698 -3375493 -3259431 -3488836
36666 -3488836 -3524819 -2856908 -2115428 -2474745 -3693954 -4050746 -2814843 -1350269 -922319
36657 -922319 -1019124 -1000727 -1637921 -3373295 -4740394 -4538174 -4080214 -4999402 -6188567
36648 -6188567 -5547388 -3661148 -2825502 -3130746 -2582664 -841963 198428 -317645 -1200162
36639 -1200162 -1766072 -2701632 -3936493 -4253407 -3617618 -3483727 -4175020 -4311604 -3481718
36630 -3481718 -3108788 -3885444 -4633660 -4563438 -4438707 -4611181 -4141198 -2905546 -2389398
36621 -2389398 -3206432 -3908646 -3514941 -3189109 -3974960 -4773468 -4239444 -3135591 -3099801
36612 -3099801 -4214299 -5258387 -5453504 -4827186 -3755220 -2989508 -3115861 -3390394 -2456720
36603 -2456720 -775546 -604829 -2696460 -4850773 -4930693 -3550781 -2427740 -1825194 -1290222
36594 -1290222 -1342676 -2489345 -3704096 -3756128 -3167919 -3175175 -3634921 -3696755 -3721103 -4611443
36584 -4611443 -5738874 -5451393 -3569324 -1754353 -1289927 -1804597 -2338751 -2565430 -2721428
36575 -2721428 -3127685 -3948926 -4919467 -5373146 -4988444 -4287951 -3958624 -3961717 -3752199 -3087909
36565 -3087909 -2240602 -1686615 -1824035 -2626140 -3451797 -3691343 -3623391 -3957641 -4548910 -4477442
36555 -4477442 -3504005 -2437474 -1868589 -1574378 -1374032 -1459064 -1659777 -1573082 -1601871 -2519052
36545 -2519052 -3812988 -4060916 -3268463 -3032447 -3862120 -4354764 -3849001 -3708056 -4692854
36536 -4692854 -5225382 -4003376 -2386852 -2095254 -2252507 -1189198 157512 -529631 -2978803
36527 -2978803 -4376172 -3372560 -1627895 -1050162 -1580901 -2244164 -2621153 -2591226 -1968186
36518 -1968186 -1055018 -577204 -666721 -793893 -871377 -1393515 -2255907 -2528034 -1843866 -1125088
36508 -1125088 -1392896 -2490768 -3443782 -3633282 -3243430 -2833547 -2742109 -2845081 -2905688 -3150623
36498 -3150623 -4117440 -5701977 -6846996 -6645213 -5383275 -4034062 -3102249 -2469427 -1992427
36489 -1992427 -1702987 -1702787 -2255925 -3553102 -5007187 -5430242 -4499418 -3400161 -3284284
36480 -3284284 -3715805 -3536651 -2733156 -2360597 -2867121 -3543337 -3652910 -3291419 -3033767
36471 -3033767 -3312654 -4154188 -5063623 -5252221 -4387162 -3011607 -1966474 -1675970 -2188687
36462 -2188687 -3351817 -4549488 -4891110 -4222972 -3433080 -3243979 -3310249 -3060968 -2710229
36453 -2710229 -2711977 -2919862 -3112906 -3653343 -4671261 -5273224 -4694399 -3713896 -3702779 -4607951
36443 -4607951 -5102708 -4538591 -3564449 -2909949 -2696924 -2929888 -3560667 -4020197 -3731563
36434 -3731563 -3135111 -3153552 -3609427 -3381685 -2345936 -1854692 -2728985 -3932090 -4076251
36425 -4076251 -3363156 -3035719 -3473932 -3896036 -3734784 -3308369 -3006706 -2643685 -2010079
36416 -2010079 -1502503 -1642290 -2222014 -2513009 -2326905 -2333102 -3099782 -4234898 -4811061 -4362338
36406 -4362338 -3170266 -1890971 -1240953 -1641746 -2667809 -3220472 -2834372 -2393291 -2816121
36397 -2816121 -3507939 -3158819 -1771564 -649707 -440541 -521422 -479069 -808885 -1704816
36388 -1704816 -2420944 -2446248 -2251867 -2311554 -2416393 -2492031 -2978764 -3777295 -3957171 -3239078
36378 -3239078 -2637854 -2827243 -3015941 -2392587 -1564920 -1454639 -1763677 -1738429 -1585048 -1875871
36368 -1875871 -2290134 -2197783 -1875098 -1943736 -2182362 -2067681 -1921290 -2306778 -2806062 -2640399
36358 -2640399 -2082883 -2021338 -2456077 -2620746 -2321585 -2033105 -1915684 -1817519 -2008771 -2835828
36348 -2835828 -3805892 -4005056 -3327518 -2483613 -1979152 -1801926 -1835914 -1946897 -2021510 -2365617
36338 -2365617 -3365051 -4324567 -3817622 -1966089 -948955 -2012188 -3432872 -3110333 -1766313
36329 -1766313 -1443467 -2031937 -1894349 -1181218 -1590905 -2967405 -3110408 -1459743 -234852
36320 -234852 -980826 -2368155 -2594858 -1892245 -1310913 -831484 -174870 -1039 -725191
36311 -725191 -1275959 -580814 530830 367051 -1207011 -2674340 -2920449 -2361709 -2151443
36302 -2151443 -2982203 -4555022 -5768855 -5640923 -4340260 -3026052 -2555688 -2841791 -3496287
36293 -3496287 -4295708 -4799544 -4431796 -3407668 -2800257 -3185443 -3909653 -4159047 -4024072
36284 -4024072 -3967211 -3941810 -3701259 -3446536 -3509036 -3750972 -3813433 -3670222 -3515424 -3342231
36274 -3342231 -2930874 -2076920 -799488 342009 288988 -1465502 -3832756 -4926503 -4131164
36265 -4131164 -2684066 -2005307 -2215043 -2599542 -2772234 -2908845 -3362094 -4353194 -5572247
36256 -5572247 -6019461 -4957996 -3123527 -2112258 -2353019 -2647003 -2062423 -1241878 -1233493
36247 -1233493 -1953187 -2570086 -2720180 -2596225 -2367212 -2136162 -2007773 -1741201 -923536
36238 -923536 80052 101075 -1295585 -2940589 -3412373 -2661039 -1638415 -973939 -779830
36229 -779830 -1140475 -1892457 -2374253 -2251498 -2170613 -2742045 -3345760 -2986160 -1999427 -1704020
36219 -1704020 -2378884 -2789555 -2033955 -835480 -427224 -880804 -1275169 -1175002 -1197988
36210 -1197988 -2019878 -3300860 -3977931 -3547048 -2662161 -2214079 -2123983 -1602106 -537184
36201 -537184 110085 -387411 -1471887 -2129532 -2316802 -2805708 -3757170 -4237622 -3408047
36192 -3408047 -1710441 -484424 -540203 -1402652 -2033812 -2090793 -2130045 -2505305 -2588292 -1654321
36182 -1654321 -228535 368615 -87030 -306274 521405 1283410 478860 -1437833 -2553452
36173 -2553452 -2203782 -1794491 -2485844 -3299990 -2559376 -512364 754348 -11684 -1760268
36164 -1760268 -2729927 -2634872 -2558300 -3191568 -4048215 -4319097 -3762253 -2670856 -1590099
36155 -1590099 -1184214 -1740519 -2580284 -2583414 -1588754 -636478 -485489 -684727 -710305 -1155911
36145 -1155911 -2715481 -4512489 -4776238 -3180969 -1340912 -725846 -1100550 -1445080 -1492590
36136 -1492590 -1664497 -2089405 -2454321 -2583050 -2561546 -2383867 -1949030 -1418634 -1194235 -1385461
36126 -1385461 -1509519 -974240 93766 726851 103263 -1412710 -2599138 -2786339 -2477163
36117 -2477163 -2441317 -2799889 -3307273 -3827900 -3983999 -3073844 -1212440 40701 -692277
36108 -692277 -2672505 -3884091 -3621570 -2976010 -2753273 -2379201 -1344820 -411903 -510750
36099 -510750 -1339961 -1957565 -2132859 -2266572 -2443991 -2410383 -2218586 -2163278 -2207873 -2070855
36089 -2070855 -1769010 -1558948 -1456262 -1323264 -1345060 -1857094 -2640274 -2910737 -2253367 -1225279
36079 -1225279 -739610 -1034329 -1531817 -1620800 -1272501 -891657 -905627 -1601009 -2944207 -4263639
36069 -4263639 -4539689 -3550288 -2408186 -2272188 -2782638 -2669662 -1771810 -1304982 -1994230
36060 -1994230 -3186613 -4170768 -4996298 -5360940 -4250774 -1849492 -387807 -1487757 -3719911
36051 -3719911 -4561871 -3908096 -3609588 -4144534 -4127824 -3120443 -2545401 -3215533 -3994328
36042 -3994328 -3819411 -3347705 -3503315 -3786055 -3256422 -2231655 -1832859 -2425270 -3379051
36033 -3379051 -3929942 -3677490 -2713359 -1725407 -1496258 -1994475 -2494129 -2695550 -2945017
36024 -2945017 -3239731 -3040126 -2368287 -2009317 -2145634 -1854824 -617469 617872 650187
36015 650187 -394423 -1393284 -1582712 -1033162 -281989 66418 -184339 -533140 -476908 -441570
36005 -441570 -1178106 -2294534 -2557534 -1805133 -1262559 -1604757 -2043055 -1859265 -1499910
35996 -1499910 -1438811 -1217655 -451486 311511 508751 291139 -290404 -1565117 -3005892
35987 -3005892 -3180331 -1932281 -1155166 -2150446 -3590432 -3564016 -2398561 -1769613 -2005209
35978 -2005209 -2065780 -1515219 -803683 -103659 549872 455492 -812465 -2079264 -1850135
35969 -1850135 -667322 -543962 -2104595 -3835019 -4260327 -3459948 -2273283 -1330786 -1134050
35960 -1134050 -1910134 -3013488 -3375969 -2812161 -2135276 -1913797 -1915225 -1831926 -1731709 -1646281
35950 -1646281 -1404444 -1024327 -779835 -867822 -1370269 -2319772 -3397647 -3931756 -3670630
35941 -3670630 -3160123 -2927101 -2837593 -2687966 -2683279 -2802358 -2571696 -2071320 -2095361 -2588780
35931 -2588780 -2250257 -714877 350366 -263403 -1243443 -999230 -488553 -1462288 -3069023
35922 -3069023 -2988736 -1314009 -407728 -1070579 -1714489 -1510592 -1511154 -2125740 -2228579 -1591099
35912 -1591099 -1611484 -2605387 -2857004 -1600541 -564322 -1078086 -1900813 -1657983 -1335547
35903 -1335547 -2266172 -3391343 -2876879 -1208819 -320112 -459147 -240834 597292 699226
35894 699226 -570538 -2105092 -2742147 -2668001 -2751125 -3377604 -4254530 -4826783 -4777810 -4364560
35884 -4364560 -4040006 -3658180 -2698919 -1438860 -888035 -1170830 -1200661 -602405 -519385 -1497297
35874 -1497297 -2105115 -1168128 24877 -323316 -1474527 -1352896 -85980 194598 -1032161
35865 -1032161 -1814194 -923925 403515 769163 592514 634535 301438 -1065605 -2454242
35856 -2454242 -2369002 -1098421 -373083 -1059286 -2338300 -3053230 -2926633 -2410030 -2036739
35847 -2036739 -2071877 -2410919 -2711930 -2703631 -2254514 -1261507 44419 732563 -85718 -1888830
35837 -1888830 -2951827 -2403189 -1289715 -987918 -1393522 -1564051 -1393451 -1450955 -1634718
35828 -1634718 -1344741 -844310 -1055774 -1854946 -1944617 -864294 185175 257444 203647 1208879
35818 1208879 2677234 2925855 1565551 -122400 -1068539 -1440928 -1685082 -1731399 -1571107
35809 -1571107 -1650449 -2124530 -2442268 -2231231 -1991507 -2350998 -3145903 -3778015 -3986486 -3709256
35799 -3709256 -2727681 -1199066 -137840 -495927 -1893596 -2992790 -3051055 -2453389 -1831063
35790 -1831063 -1411200 -1249732 -1366604 -1508316 -1391546 -1291930 -1777648 -2743639 -3363278 -3198695
35780 -3198695 -2742202 -2613868 -2802526 -2957415 -2862323 -2360196 -1399261 -432605 -131347 -388576
35770 -388576 -359165 76512 -203334 -1823883 -3485795 -3456962 -2038980 -1216171 -1896614
35761 -1896614 -2816820 -2523501 -1291611 -424783 -491310 -1023221 -1430349 -1493373 -1307280 -1338752
35751 -1338752 -2158437 -3473715 -3866463 -2397787 -227936 447255 -863488 -2388955 -2590862
35742 -2590862 -2004089 -1831815 -1856147 -1097327 105987 329425 -660444 -1481326 -1434420 -1698159
35732 -1698159 -3240195 -4769948 -4281729 -2079880 -658088 -1461616 -3130251 -3494826 -2294705
35723 -2294705 -1072098 -939581 -1417053 -1460649 -874225 -315838 -262442 -467536 -487698 -362844
35713 -362844 -486502 -990594 -1627180 -2205548 -2739453 -3113606 -3042087 -2521626 -1934249 -1525612
35703 -1525612 -1203604 -1037896 -1400737 -2241623 -2772337 -2417682 -1648318 -1282023 -1353448 -1350936
35693 -1350936 -1223908 -1329136 -1540271 -1281858 -525722 -13139 -273829 -948607 -1256540
35684 -1256540 -755374 385153 1470467 1683145 819080 -438717 -1337320 -1895506 -2456050
35675 -2456050 -2806424 -2534627 -1963216 -1744357 -1655074 -911272 247784 510545 -576734
35666 -576734 -1746580 -1711532 -829363 -348988 -717435 -1401605 -1856060 -1938229 -1750739 -1677297
35656 -1677297 -2186483 -3036223 -3116159 -1767179 57867 680038 -351905 -1765462 -2020328
35647 -2020328 -875172 479292 609422 -762545 -2430470 -2932583 -2063811 -802753 81902
35638 81902 546277 399708 -847258 -2678326 -3323577 -1940195 -192930 -305243 -2053931
35629 -2053931 -3183888 -2592813 -1482522 -1126604 -1112649 -573741 108626 -40841 -967533
35620 -967533 -1711204 -1771153 -1392674 -743777 203810 977673 753691 -480632 -1631902
35611 -1631902 -1804209 -1374650 -1307997 -1837002 -2393674 -2566290 -2486639 -2374082 -2313957 -2472016
35601 -2472016 -2885904 -2987668 -2089970 -606603 8313 -933865 -2300715 -2587670 -1826200
35592 -1826200 -1146863 -889323 -313688 837592 1636230 1217697 -34815 -989878 -978404
35583 -978404 -245346 398530 226806 -727497 -1636259 -1891638 -1923907 -2387351 -2875450 -2462972
35573 -2462972 -1373320 -841750 -1188585 -1402336 -1035695 -1036339 -1897416 -2387373 -1336624 369473
35563 369473 953770 179772 -721660 -1010851 -949205 -684427 4679 908106 1483265 1737382
35553 1737382 2000176 1920017 792483 -1086887 -2471666 -2702969 -2270693 -1794610 -1456260
35544 -1456260 -1526127 -2307917 -3235857 -3107435 -1722844 -386513 -224811 -807840 -1034185
35535 -1034185 -632475 -60925 477685 1048518 1299081 600485 -1027506 -2633788 -3193983
35526 -3193983 -2617133 -1816953 -1754319 -2385763 -2719485 -2058067 -904933 -281313 -419232
35517 -419232 -682278 -617717 -424412 -372280 -393570 -364151 -265820 9837 532652 998142
35507 998142 1026766 743654 494087 117540 -747888 -1708469 -1848861 -1036480 -178546 -49221
35497 -49221 -624854 -1575009 -2460085 -2453010 -1088527 506627 468618 -1290030 -2761782 -2579245
35487 -2579245 -1611262 -1084714 -746679 -102252 62382 -943066 -2003576 -1735526 -888481
35478 -888481 -1271047 -2847629 -3882615 -3647906 -3002307 -2430861 -1580218 -857136 -1372420
35469 -1372420 -2827731 -3434471 -2610308 -1892029 -2340139 -2894913 -2435002 -1723921 -1843920
35460 -1843920 -2143748 -1438791 -202231 169828 -413125 -846687 -679394 -381141 -175961
35451 -175961 -9197 -287056 -1200476 -1658827 -507387 1315302 1515649 -483659 -2788062
35442 -2788062 -3686389 -3502962 -3229149 -2855663 -2063843 -1367514 -1341788 -1468180 -911190 14417
35432 14417 204534 -658925 -1804082 -2499569 -2667567 -2414497 -1754388 -993722 -794093 -1492410
35422 -1492410 -2574617 -3038526 -2286965 -726400 494380 548505 -183658 -600842 -373507
35413 -373507 -429977 -1529271 -2862885 -2883706 -1374748 184057 490996 -136213 -631999
35404 -631999 -787279 -1167032 -1738243 -1573345 -198064 1467889 2061394 1327343 196841
35395 196841 -497058 -808832 -1164150 -1592378 -1737201 -1368506 -685849 -220194 -408894 -1069423
35385 -1069423 -1452109 -1200723 -1053989 -1934524 -3437941 -4138353 -3559243 -2814620 -2857896
35376 -2857896 -3170726 -2919201 -2365315 -2113535 -1889599 -1307161 -1012861 -1584101 -1996231
35367 -1996231 -973659 590736 619205 -845399 -1540475 -515010 543872 316893 -91047
35358 -91047 549177 1243671 523881 -1003923 -1807522 -1930840 -2312032 -2544931 -1552515 2018
35348 2018 206002 -1248071 -2667033 -2929396 -2632430 -2462793 -2219430 -1875817 -1948451 -2267864
35338 -2267864 -1925946 -1015933 -857386 -1787892 -2357892 -1710052 -1177258 -2146775 -3662882
35329 -3662882 -3816919 -2581029 -1476829 -1039636 -534336 1735 -544173 -2193388 -3169216
35320 -3169216 -2272708 -680187 -279601 -1138018 -1839740 -1739550 -1502397 -1544684 -1322089
35311 -1322089 -547700 3030 -371360 -1106684 -1161155 -546369 -199476 -542865 -1041060 -1184451
35301 -1184451 -1094866 -999622 -843188 -682801 -818088 -1207967 -1329646 -943400 -471390 -318647
35291 -318647 -371650 -476441 -802413 -1354827 -1735820 -1788097 -1843753 -1954786 -1657619 -995792
35281 -995792 -866098 -1622424 -2239235 -1780351 -836256 -424165 -323474 152864 498458 -209926
35271 -209926 -1335857 -1331326 -312831 -157827 -1701346 -3502406 -3994332 -3417990 -2857919
35262 -2857919 -2567413 -2137065 -1458826 -721044 -36556 404699 391302 199960 339436 578922
35252 578922 138573 -877420 -1288909 -531490 501421 866862 779283 716333 342650 -754371
35242 -754371 -2040703 -2685711 -2661256 -2403904 -1969166 -1305062 -789142 -666053 -456539 247573
35232 247573 860707 533965 -547314 -1422942 -1636641 -1473479 -1156523 -611146 44277
35223 44277 463011 560266 554446 523562 291878 -258270 -980614 -1487665 -1348562 -571254
35213 -571254 116656 -14849 -651746 -780843 -185459 286060 231489 424579 1407846 2333220
35203 2333220 2110405 980808 -545 -465992 -761497 -976759 -967307 -1011324 -1478030 -2064006
35193 -2064006 -2216771 -2065623 -2058905 -1946024 -1141122 -19171 209443 -850033 -2065352
35184 -2065352 -2082262 -860336 369795 439477 -559247 -1323412 -775416 498174 793960
35175 793960 -438073 -1650174 -1224029 271850 917522 99653 -922542 -1029172 -521428
35166 -521428 -83376 360496 1033187 1341268 450125 -1412826 -2969091 -3283929 -2686951
35157 -2686951 -2129442 -1976508 -1817709 -1372625 -1056718 -1354435 -2020982 -2422398 -2455220 -2511757
35147 -2511757 -2612403 -2287272 -1446298 -701469 -561188 -818917 -968172 -790147 -407167
35138 -407167 -173131 -477762 -1161978 -1349082 -592671 118020 -447388 -1820815 -2444703
35129 -2444703 -2078081 -1905448 -2140207 -1555328 1587 774226 -97793 -964516 -390047
35120 -390047 344488 -608477 -2480274 -3002418 -1685283 75265 1328555 1977401 1594957
35111 1594957 -47669 -1745832 -2121665 -1667694 -1649378 -1628174 -325345 1526013 1748438
35102 1748438 140473 -1122090 -779759 110974 459519 572269 736595 500502 31287
35093 31287 203766 717790 181415 -1278652 -1727498 -633996 -29119 -1172980 -2343061
35084 -2343061 -1666637 -164585 80099 -774227 -1039449 -388650 121594 188594 412465
35075 412465 731611 480652 -226597 -636060 -595176 -379683 251394 1450938 2229351 1551728
35065 1551728 147692 -380425 -45266 -359585 -1714868 -2657547 -2182263 -1120534 -578904
35056 -578904 -429575 -230123 -383978 -1223528 -1844332 -1182078 207393 741260 87928
35047 87928 -366484 395531 1511872 1440871 -22576 -1698715 -2594817 -2694248 -2312322 -1543533
35037 -1543533 -548217 307606 885342 1267907 1132920 -59409 -1831398 -2557450 -1379933
35028 -1379933 457724 1153989 633925 183271 291916 239287 -298020 -620024 -212481
35019 -212481 551533 1180744 1538818 1360190 344692 -1013163 -1738460 -1809837 -2223882
35010 -2223882 -3324288 -4216193 -4269224 -4008390 -3938578 -3700038 -3150653 -3089883 -3894105 -4458353
35000 -4458353 -3681772 -2222639 -1534455 -1736474 -1723274 -1029216 -286114 76902 351934
34991 351934 589247 200474 -991895 -2053678 -1927041 -813512 -15795 -372025 -1225479
34982 -1225479 -1226054 -12127 1326892 1557531 575181 -911905 -2335345 -3259860 -3027839
34973 -3027839 -1470735 266286 722937 -66064 -783514 -790250 -655559 -662764 -242318 630164
34963 630164 861980 -110420 -1212992 -1211279 -455866 -225769 -959499 -1994838 -2619714 -2675437
34953 -2675437 -2442265 -2395409 -2735034 -2946376 -2374741 -1354449 -969712 -1496932 -2009663
34944 -2009663 -1817354 -1300177 -954093 -653432 -300467 -171084 -189889 70207 335372 -157409
34934 -157409 -1068730 -1121189 -327184 -221710 -1096769 -1076421 750815 2311892 1460678 -828517
34924 -828517 -2227381 -2496393 -2862334 -3216941 -2525713 -1258361 -840940 -1108759 -744345
34915 -744345 47108 -202389 -1369497 -1698566 -856028 -523277 -1395399 -2018357 -1511952
34906 -1511952 -1172229 -2060851 -2930892 -2186111 -533904 4177 -1073105 -2363021 -2580786
34897 -2580786 -1815523 -986422 -882530 -1616137 -2497960 -2623986 -1899386 -1191138 -1240477 -1809174
34887 -1809174 -2135038 -1855580 -1257084 -894490 -1066003 -1432593 -1267832 -402842 345002
34878 345002 159893 -690284 -1371304 -1685872 -1935910 -1933771 -1217344 -181030 49056 -970261
34868 -970261 -2485047 -3504147 -3601224 -2897554 -2044978 -2057571 -3254158 -4502549 -4462512
34859 -4462512 -3422750 -2834452 -3134017 -3272498 -2543375 -1666777 -1659333 -2533632 -3488855 -3747171
34849 -3747171 -3065246 -1982516 -1444460 -1609242 -1493867 -598043 -85561 -1020911 -2208204
34840 -2208204 -1666261 170570 899809 -229636 -1445082 -1539630 -1452747 -1976398 -2203660
34831 -2203660 -1534789 -1220897 -2347802 -3879670 -4290827 -3797688 -3410164 -2989924 -1901370
34822 -1901370 -602007 37274 195755 403409 213617 -858348 -1839274 -1463547 -313210
34813 -313210 -69822 -947223 -1575108 -1324979 -1062136 -1414637 -1841994 -1853924 -1868534 -2266233
34803 -2266233 -2546316 -2054650 -959325 -34685 165578 -295924 -839289 -793993 -66429
34794 -66429 629439 540526 -204935 -781197 -647997 -15258 530863 551313 61661 -421453
34784 -421453 -332680 269760 781913 921078 1049908 1463853 1915912 2078304 1876938 1180174
34774 1180174 -87941 -1311098 -1604231 -1179879 -1150049 -1530177 -902824 1063504 2344377
34765 2344377 1261141 -861607 -1547049 -682786 -137341 -512287 -570939 176234 557974
34756 557974 -126132 -917585 -831293 -230744 58947 -215313 -1078476 -2476206 -3603131
34747 -3603131 -3346472 -1968470 -1121641 -1568317 -2129857 -1656151 -790811 -765326 -1473582
34738 -1473582 -1890799 -1657714 -1153244 -573772 11981 127870 -599647 -1654671 -2134860
34729 -2134860 -1782308 -918925 180809 1154976 1320789 467799 -471329 -417731 457968
34720 457968 1147867 1279832 1249234 1163421 745239 226161 240638 704632 824790 444127
34710 444127 331978 728019 641969 -656755 -2234427 -2518485 -1362905 -238919 -444599
34701 -444599 -1777507 -3030944 -3309381 -2708552 -1988817 -1734895 -1790979 -1558434 -835495
34692 -835495 -124110 -13034 -544846 -1337051 -1972562 -2051077 -1309189 -114832 554956 191465
34682 191465 -497465 -555768 -201745 -417595 -1225559 -1448957 -502826 558321 408471 -850929
34672 -850929 -2064746 -2533097 -2370721 -1799551 -975435 -318792 -167815 -153382 326332 1060256
34662 1060256 1260880 863654 687770 1088839 1352618 856641 40815 -346245 -298143 -191943
34652 -191943 49044 650731 1234009 1201574 702718 426513 470723 159146 -896388 -2167058
34642 -2167058 -2831977 -2580568 -1667082 -592827 153618 436298 618744 969963 983057
34633 983057 -61262 -1761886 -2651219 -1997075 -813586 -461921 -904604 -1184156 -1091150
34624 -1091150 -1213328 -1510177 -1112533 178629 1311508 1463690 1192397 1387250 1834747
34615 1834747 1714911 966859 159198 -630040 -1695199 -2600779 -2391676 -1132640 -184829
34606 -184829 -476497 -1321645 -1506253 -885340 -296603 -368330 -987293 -1629253 -1782952 -1329641
34596 -1329641 -768254 -667501 -745336 -190592 795366 731962 -1116159 -3275999 -3703557
34587 -3703557 -2378118 -1115429 -1064578 -1592147 -1684714 -1327639 -1117429 -1268117 -1425292
34578 -1425292 -1114373 -253796 551028 469853 -432992 -1025299 -642322 -128133 -396975 -692910
34568 -692910 241332 1728607 1771864 148745 -1078682 -635438 330331 544930 606669
34559 606669 1303821 1624885 315196 -1737298 -2678588 -2519603 -2752437 -3550485 -3511133
34550 -3511133 -2264301 -1240162 -1287325 -1386117 -623841 157723 -111409 -835361 -822274 -352116
34540 -352116 -568566 -1266848 -997741 534103 1753898 1434306 293351 -490069 -1211263
34531 -1211263 -2748704 -4406213 -4336140 -2243605 -177648 1063 -1214396 -2165314 -2341836
34522 -2341836 -2304525 -2004217 -745865 1196364 2333595 1777681 328162 -736475 -1168322
34513 -1168322 -1506722 -1927129 -1969197 -1216113 88278 1044221 822305 -309514 -981229
34504 -981229 -364441 514813 79066 -1411619 -2122563 -1423613 -841498 -1600592 -2718083
34495 -2718083 -2667043 -1739265 -1337543 -1692134 -1779724 -1172513 -613009 -770695 -1453207 -2065727
34485 -2065727 -2078785 -1180567 265089 1088967 427049 -1163153 -2352107 -2559521 -2182776
34476 -2182776 -1718824 -1481087 -1792190 -2508915 -2686817 -1715722 -459056 -173333 -654206
34467 -654206 -775360 -596715 -1287162 -2821467 -3493071 -2355410 -685922 -160134 -762837
34458 -762837 -1450429 -1838372 -2124320 -2114903 -1513305 -751139 -521018 -758347 -941043 -1109838
34448 -1109838 -1694304 -2495425 -2767392 -2375438 -2070835 -2371027 -2767096 -2392363 -1135144
34439 -1135144 232502 899793 783501 473411 536440 976645 1404712 1560133 1445772
34430 1445772 1085114 515170 -3975 -174360 -81023 -4274 188587 874443 1775197 1954923
34420 1954923 1103434 144848 -19045 217383 -82854 -821936 -1029598 -474852 -78914
34411 -78914 -463509 -946204 -506578 787879 1889076 2018005 1319356 420619 -213468
34402 -213468 -484573 -546984 -579227 -541209 -203860 440603 934084 807921 259078 47699
34392 47699 602741 1471561 1823876 1334933 414451 -281134 -379250 23707 465791 447006
34382 447006 -165150 -1061268 -1872177 -2464238 -2760936 -2597501 -2077372 -1780602 -2104542 -2553697
34372 -2553697 -2291289 -1372469 -756263 -962151 -1416626 -1433935 -1156095 -1027340 -937575 -561405
34362 -561405 -135241 -142159 -421530 -323999 263475 677257 348655 -579274 -1590202 -2297058
34352 -2297058 -2490966 -2112474 -1400367 -830225 -729616 -1047590 -1500732 -1797917 -1766170 -1432611
34342 -1432611 -956612 -401514 251858 758731 624719 -226626 -1131152 -1466183 -1476586 -1788804
34332 -1788804 -2329926 -2385906 -1645162 -495202 721824 1980602 2922517 2750700 1287292
34323 1287292 -420763 -1162501 -926620 -655276 -846782 -1028743 -669416 -58499 54336
34314 54336 -542875 -1251795 -1397794 -951205 -350589 166571 687605 1126265 1113735 651182
34304 651182 420321 919138 1537007 1164182 -242309 -1366865 -1121927 -27134 479410
34295 479410 -177132 -1187380 -1578677 -1357026 -1144332 -1129436 -961774 -592217 -569232 -1221017
34285 -1221017 -2029686 -2287447 -2069097 -2006427 -2273580 -2397118 -2014865 -1213628 -136234
34276 -136234 1036204 1640056 933485 -693567 -1704238 -1175523 37437 491991 -47185
34267 -47185 -697536 -880468 -836904 -940028 -1243860 -1681334 -2142088 -2351218 -2077427 -1432801
34257 -1432801 -735114 -263744 -293084 -913120 -1560436 -1341607 -258551 543980 297982
34248 297982 -366383 -626514 -826435 -1557436 -2136258 -1422092 237024 1339356 1365084
34239 1365084 1132819 1035715 466293 -711015 -1590105 -1676520 -1644333 -2016399 -2251105 -1867370
34229 -1867370 -1424641 -1555176 -1915987 -1949080 -1880357 -2073268 -2111331 -1503708 -744864 -670412
34219 -670412 -1155659 -1422609 -1341980 -1438762 -1744807 -1636090 -905579 -175213 -43320 -474464
34209 -474464 -1206621 -2101036 -2789714 -2604338 -1408585 -152911 25920 -797576 -1413768
34200 -1413768 -1103816 -626078 -1100391 -2295696 -2819985 -2029284 -906945 -678121 -1304401
34191 -1304401 -1973892 -2429288 -2912189 -3207005 -2810034 -1966791 -1524043 -1630427 -1521321
34182 -1521321 -842958 -291499 -497923 -1019957 -1001701 -331347 383171 669661 598836 515457
34172 515457 601923 599123 8427 -1149608 -1978040 -1656438 -606190 23895 -24494 75937
34162 75937 688789 1003625 336381 -754358 -1302698 -1213930 -1044024 -1054960 -1181626 -1518268
34152 -1518268 -2132198 -2628577 -2494306 -1752410 -871164 -212213 76845 -134378 -840428
34143 -840428 -1680387 -2116072 -1802328 -797328 319982 623004 -300553 -1546228 -1604722
34134 -1604722 -174574 1350824 1601328 832397 286265 494673 914309 928063 468593
34125 468593 -293736 -1252507 -2196488 -2721794 -2549957 -1855691 -1178039 -958778 -1157630 -1414919
34115 -1414919 -1595573 -1889060 -2246116 -2179095 -1516917 -909383 -1003496 -1517068 -1806239 -1911656
34105 -1911656 -2161570 -2156561 -1300391 -124091 190083 -409759 -811730 -539597 -217697 -84481
34095 -84481 433233 1263001 1359738 464115 -306981 -365288 -589567 -1414293 -1620090 -402551
34085 -402551 799152 259402 -1309714 -1820433 -875786 70827 188708 39799 -47275
34076 -47275 -599151 -1654145 -2217902 -1624853 -499738 108955 -86513 -588492 -792702
34067 -792702 -537835 -285849 -661332 -1548207 -2009768 -1494646 -613852 -197883 -188425 -149418
34057 -149418 -211128 -590749 -758402 -169461 585527 509187 -192633 -409072 62900 172736
34047 172736 -778631 -2167476 -2919126 -2611991 -1544500 -329560 438058 586354 488618
34038 488618 491992 464148 246530 89157 115453 -100827 -768336 -1291771 -1259081 -1354620 -2225326
34027 -2225326 -3010807 -2342513 -559186 448928 -296408 -1700287 -2113717 -1112988 415488
34018 415488 1230630 705306 -513108 -883954 331932 1952580 2182955 804973 -752784
34009 -752784 -1302755 -973726 -552598 -599699 -1131863 -1518484 -945663 410698 1198852 620054
33999 620054 -383898 -648239 -599038 -1167727 -1739466 -1032723 440486 828069 -203199
33990 -203199 -1049983 -829299 -517420 -940754 -1431556 -1256630 -896671 -1061873 -1602897 -2102962
33980 -2102962 -2530613 -2755664 -2394986 -1571984 -892110 -427186 232153 826525 614978
33971 614978 -167625 -486914 -312938 -621337 -1327277 -1088929 274287 1132921 679737
33962 679737 261094 932324 1599025 1106404 441672 967237 1800056 1045933 -1157837
33953 -1157837 -2812376 -2848210 -2023746 -1283464 -780575 -500868 -570355 -854643 -1127799 -1494214
33943 -1494214 -1918304 -1790655 -854463 -39819 -301553 -1065953 -1016751 -117039 427412 137021
33933 137021 -93432 445287 1150137 1046462 173884 -521432 -419720 47671 -2768 -675036
33923 -675036 -977552 -93101 1308434 1737629 797180 -439899 -1022923 -1060045 -838987
33914 -838987 -223103 545065 646563 84509 171047 1623955 3120921 2884232 1015166
33905 1015166 -833666 -1563537 -1404934 -1054661 -959173 -1117019 -950439 132816 1571560
33896 1571560 1870285 598031 -821809 -1083291 -653898 -538825 -639807 -564943 -817491
33887 -817491 -1640824 -1815610 -409073 1215166 1117583 -216240 -718672 -57899 211158
33878 211158 -349732 -326471 935258 2175415 2347426 2049848 2068872 2091501 1673239 1117366
33868 1117366 647323 -54269 -813001 -695723 505450 1617801 1596430 711695 -281004
33859 -281004 -1070306 -1376724 -827480 70833 -2179 -1354425 -2601078 -2630728 -2166136 -2401141
33849 -2401141 -3100479 -3220034 -2650297 -2145275 -2040114 -2131997 -2409906 -2850283 -2834456 -1858921
33839 -1858921 -671144 -650258 -1968382 -3222285 -3122469 -1923556 -892028 -762741 -1058305
33830 -1058305 -854033 -9742 574534 73274 -1142571 -1938861 -1839282 -1393523 -1136118
33821 -1136118 -973626 -846622 -1162312 -2025971 -2687143 -2409358 -1473624 -725282 -460654
33812 -460654 -326777 -57650 235945 353459 166858 -338653 -882641 -1024302 -800765 -872618
33802 -872618 -1606758 -2367463 -2277867 -1457843 -892525 -1123902 -1637084 -1645830 -1032035 -270560
33792 -270560 302917 803537 1329849 1446990 540612 -1175494 -2436312 -2207274 -970548
33783 -970548 -130615 -260220 -687641 -838968 -1031982 -1557723 -1882969 -1481562 -822074 -710313
33773 -710313 -1044363 -1023591 -358289 477837 1037029 1188311 712208 -568371 -2122741
33764 -2122741 -2930443 -2675333 -2134183 -2019159 -1986154 -1334282 -293574 139918 -348105
33755 -348105 -809150 -253539 1006855 1794955 1667120 1402231 1728911 2213100 1955747
33746 1955747 1005437 324718 398998 649309 491650 299293 735522 1527657 1645951 707575
33736 707575 -429708 -749217 -314814 572 -217300 -508145 -439645 -299737 -477445 -639753
33726 -639753 -223104 488342 640800 214597 194385 965352 1483057 764707 -555584 -1114164
33716 -1114164 -718925 -266648 -85855 381421 1206872 1519042 826353 -168472 -601341
33707 -601341 -532411 -441053 -282076 286534 1133477 1736573 1848540 1632674 1285692 886468
33697 886468 502574 155235 -244952 -732538 -1152149 -1349001 -1424997 -1679213 -2272549 -2936107
33687 -2936107 -3069301 -2351579 -1291984 -799937 -1058282 -1323155 -1131950 -1039988 -1578317
33678 -1578317 -2180139 -2041249 -1471789 -1280286 -1264462 -640975 298033 486633 15741 76603
33668 76603 675689 197423 -1967829 -3975806 -3871509 -2147277 -716299 -321663 -294694
33659 -294694 -177399 -219987 -573886 -1046792 -1475722 -1664715 -1353879 -809548 -792376 -1341456
33649 -1341456 -1478926 -880226 -729034 -1811622 -2922750 -2668757 -1818057 -1986338 -2779995
33640 -2779995 -2469491 -1115205 -560039 -1162575 -1071821 474680 1497550 295561 -1769730
33631 -1769730 -2234707 -956931 227422 391391 203396 96416 -484418 -1808792 -3137203
33622 -3137203 -3674309 -3425291 -2828800 -2202895 -1805383 -1886213 -2349694 -2646736 -2213605 -944306
33612 -944306 685390 1794158 1617458 242504 -1228383 -1593600 -700806 468488 828902
33603 828902 207058 -558692 -440979 718231 1955364 2222654 1611436 1081167 984860
33594 984860 615548 -476811 -1538789 -1649136 -1059368 -671881 -684328 -722969 -940609 -1789348
33584 -1789348 -2783966 -2752038 -1553360 -377666 80166 543051 1544317 2056596 915666
33575 915666 -1091923 -1914973 -817537 890029 1724027 1578409 1173418 874532 537514
33566 537514 -21443 -797424 -1509299 -1593613 -716600 568249 1148194 545835 -579820
33557 -579820 -1217458 -877354 305759 1733810 2505793 2077602 967290 196235 -81274
33548 -81274 -604124 -1518748 -1931785 -1398998 -745075 -668594 -632096 -142844 -70534 -1307194
33538 -1307194 -2909275 -3180041 -2154369 -1378106 -1465571 -1598421 -1448882 -1772281 -2683599
33529 -2683599 -3044678 -2285116 -1404738 -1346575 -1619423 -1404043 -887769 -554213 -176677 447086
33519 447086 646161 -129028 -1137469 -1227190 -375284 539933 967082 850817 196322 -625047
33509 -625047 -744540 67720 738903 384602 -192995 270017 1346314 1486520 502618
33500 502618 -85690 641981 1730918 1831846 918088 10707 -106939 488374 1046643
33491 1046643 803762 -157687 -854670 -705176 -482144 -1161631 -2249713 -2392588 -1408975
33482 -1408975 -415670 9672 366962 795612 638350 -101279 -367496 162869 321296
33473 321296 -578469 -1350650 -788370 217059 -32759 -1366401 -2046071 -1439750 -711064
33464 -711064 -729436 -840942 -245376 636781 954699 748827 635365 652428 252543 -666133
33454 -666133 -1364734 -1067756 101692 1131359 1070557 16300 -944030 -995849 -679577
33445 -679577 -1215094 -2665256 -3467866 -2350573 -231639 638231 -637633 -2588862 -3224053
33436 -3224053 -2128101 -363136 957973 1341895 762205 -245331 -592640 333446 1668710
33427 1668710 1920429 879857 -143673 -164916 270271 98782 -786233 -1584750 -1588408 -713265
33417 -713265 514591 1216280 901210 150645 -41624 293220 205644 -451774 -620554 126510
33407 126510 678229 243493 -143433 739973 2197826 2632439 1868813 913190 103471
33398 103471 -752409 -938091 461864 2535568 3195284 2051642 856097 811819 1226546
33389 1226546 1243670 1097816 1009865 559296 -45126 280870 1528196 1961498 588577
33380 588577 -1180019 -1610111 -1060239 -884083 -1081018 -703577 187195 653872 536063
33371 536063 480634 581094 319822 -273305 -572328 -389927 -96045 146068 384643 376156
33361 376156 -9974 -160765 541786 1579438 1851415 1167545 264505 -403599 -867203
33352 -867203 -886212 -179310 656998 666514 77707 166579 1343568 2508420 2689111 2236008
33342 2236008 1831834 1334906 436494 -297362 -87764 663861 637284 -646261 -2066512
33333 -2066512 -2260613 -1278864 -382738 -370926 -746183 -755740 -615598 -1019235 -1782253 -1935648
33323 -1935648 -1230566 -590842 -712553 -1081510 -929343 -413650 -176795 -339449 -622556
33314 -622556 -952011 -1282128 -1319953 -1061329 -1060236 -1525442 -1776408 -1300380 -622715 -296145
33304 -296145 136875 1094923 1716946 1046918 -226700 -766586 -751666 -1285733 -2082015 -1842006
33294 -1842006 -890276 -1105781 -2722852 -3484056 -2008366 44690 585814 99884 286186
33285 286186 1111654 1301288 885139 1036359 1674277 1403324 91495 -473092 719902
33276 719902 2140386 1826345 196025 -616758 236542 1329064 1037792 -501828 -1974590
33267 -1974590 -2612985 -2638566 -2432272 -2098086 -1777756 -1644632 -1458227 -812351 -49678 -175993
33257 -175993 -1402776 -2488236 -2241688 -1136849 -573015 -926274 -1335135 -1254213 -1128399
33248 -1128399 -1352145 -1528246 -1206022 -698479 -671057 -1244767 -1811482 -1582978 -331145
33239 -331145 1162047 1579399 451667 -1105213 -1578152 -798619 121186 347602 -2202
33230 -2202 -584624 -1218155 -1475533 -894148 146812 644735 343861 27274 177933 328734
33220 328734 182991 351422 1201567 1767247 802922 -1388989 -3027073 -2780006 -1160447
33211 -1160447 99519 -119654 -1229481 -1796980 -1415217 -1094337 -1482101 -1630769 -513595
33202 -513595 1025541 1327433 507697 276421 1237421 2188799 2337636 2301834 2378183 1769128
33192 1769128 416353 -271809 302698 652171 -428289 -1834864 -2065658 -1652151 -1882830
33183 -1882830 -2426861 -2240921 -1746343 -1926855 -2104169 -923518 1000410 1797347 1403359
33174 1403359 1456228 2121367 1591731 -686735 -2662086 -2564090 -1227234 -392854 -308700
33165 -308700 -258254 -137628 -149045 114579 973482 1680514 1278347 45171 -844792 -854247
33155 -854247 -561146 -778499 -1697041 -2763123 -3160250 -2643629 -1940722 -1903633 -2339263 -2362288
33145 -2362288 -1844859 -1541359 -1634468 -1317734 -300960 398276 -60605 -1004734 -1319928
33136 -1319928 -1099696 -1173439 -1529971 -1372259 -553273 109697 54274 -316914 -363612 -44454
33126 -44454 234737 210783 -45227 -314784 -455068 -531031 -756195 -1218058 -1690279 -1812131
33116 -1812131 -1433728 -732972 -42311 385486 466656 198764 -406245 -1163724 -1601133 -1367941
33106 -1367941 -808314 -657783 -1001938 -1127137 -741013 -603752 -1278971 -1962750 -1563053
33097 -1563053 -456956 31472 -336780 -524252 -72846 237070 -71452 -293212 124497
33088 124497 464741 -137653 -1190634 -1392834 -338718 1020105 1441252 518463 -1023915
33079 -1023915 -1912468 -1498629 -494591 -184871 -926508 -1985546 -2765510 -3318406 -3538791
33070 -3538791 -2914793 -1526886 -372930 -127210 -325752 -278915 -6051 243873 533213
33061 533213 677390 39551 -1338557 -2226966 -1728900 -603117 -129822 -324584 -326802 19230
33051 19230 180923 184335 595602 1314653 1505854 876720 119443 -139496 -101924 -259833
33041 -259833 -646263 -890350 -708890 -197477 224811 199583 -170918 -505400 -713187 -943462
33031 -943462 -979665 -432563 298967 232084 -607137 -896536 -65568 529188 -369084 -1732498
33021 -1732498 -1624564 -85391 1090612 1154763 1142940 1678411 1837616 881350 -297086
33012 -297086 -417242 375240 847158 344375 -578128 -939705 -298411 914993 1794097
33003 1794097 1776045 1046624 43978 -1065714 -2045809 -2241958 -1331460 -97172 369555
32994 369555 -10461 -604226 -1291374 -2237882 -2718264 -1672710 346102 1254496 85420
32985 85420 -1629724 -1883094 -634425 587876 759983 151236 -462873 -563540 -101706
32976 -101706 494348 690927 501433 447876 704177 785218 323727 -406791 -1025339 -1511770
32966 -1511770 -1840216 -1783756 -1467890 -1488191 -2020058 -2383237 -1971743 -1115771 -588823 -742296
32956 -742296 -1461363 -2368536 -2719453 -1867247 -360584 221710 -745595 -1849850 -1423519
32947 -1423519 195821 1199338 684083 -552616 -1356617 -1308324 -539925 506594 972398
32938 972398 108764 -1749172 -3320401 -3759256 -3453659 -3274814 -3483483 -3625160 -3207130
32929 -3207130 -2250845 -1274505 -766025 -641371 -426920 -84134 -216170 -1061327 -1723622
32920 -1723622 -1106447 562919 1873260 1913019 1147342 500759 236435 67928 -133813
32911 -133813 -212023 -81984 141612 321057 420496 500232 665870 965641 1318340 1597802
32901 1597802 1728224 1602324 1037954 28561 -1026799 -1569875 -1380783 -724497 -68774
32892 -68774 246023 203806 125481 306332 486524 -18551 -1342272 -2522503 -2467303 -1367625
32882 -1367625 -574345 -965599 -1934263 -2236653 -1470386 -382824 91898 -194681 -533801
32873 -533801 -79756 1291358 2680419 2793291 1125286 -1358392 -2878053 -2424876 -750802
32864 -750802 394905 92945 -909904 -1343640 -1024606 -829610 -1261723 -1761642 -1592925
32855 -1592925 -752219 326120 1361153 2040631 1818290 628923 -521978 -508215 433485
32846 433485 938347 357973 -346703 85599 1537965 2653144 2430075 1225739 157546
32837 157546 -156101 -65439 -219302 -706294 -1054187 -951394 -620819 -408046 -362408 -433868
32827 -433868 -717154 -1127414 -1125401 -287721 950780 1648284 1490849 1099092 1061227 1115438
32817 1115438 628197 -364304 -994124 -497092 871800 1986873 1932872 873209 -251565
32808 -251565 -815202 -1025203 -1288277 -1460975 -1134083 -464964 -183184 -646917 -1300643 -1350721
32798 -1350721 -762608 -252375 -308767 -555341 -315343 353874 599140 -116381 -1209292
32789 -1209292 -1654479 -1227340 -566912 -124861 293435 830221 1093758 740193 44573
32780 44573 -507216 -799435 -891332 -677317 -218181 -39083 -526154 -1230856 -1282714 -380469
32770 -380469 986280 2095447 2430381 1873852 914812 390994 574493 790528 371366
32761 371366 -406934 -880124 -1029340 -1227991 -1354116 -1059163 -684387 -924400 -1627247 -1887416
32751 -1887416 -1407950 -870358 -815807 -1023998 -1173896 -1262746 -1165661 -661200 -154582 -453412
32741 -453412 -1456918 -1992650 -1437350 -588619 -322824 -303070 140322 614799 212139 -968927
32731 -968927 -1874012 -1926443 -1540346 -1211981 -876319 -352506 133296 177699 -272850 -816016
32721 -816016 -990960 -745930 -412829 -125012 460992 1468729 2123117 1512703 -36486
32712 -36486 -1218405 -1475700 -1508958 -1834599 -1975955 -1621120 -1419947 -1774624 -1871560 -989800
32702 -989800 91440 201337 -409547 -663739 -497106 -694043 -1253061 -1364474 -848140
32693 -848140 -246696 358777 1199152 1629060 739237 -758498 -1038733 57532 563608
32684 563608 -592256 -1919193 -1813609 -1000735 -1003315 -1512081 -1149766 -36322 390754
32675 390754 -145750 -325493 522473 1318530 935825 -178179 -800573 -576376 -134956
32666 -134956 27338 136534 642240 1478399 2006957 1759358 1102490 811220 952777 745555
32656 745555 -234871 -1352155 -1863884 -1918665 -1937198 -1632922 -570900 723587 1225843
32647 1225843 772793 57217 -512987 -997744 -1194249 -807043 -247244 -175485 -343056 -58282
32637 -58282 340718 -39409 -677181 34311 1987259 2813945 1220915 -855109 -957022
32628 -957022 407715 860138 -197018 -1081356 -623573 530153 1508317 2334981 3013363
32619 3013363 2950580 1983970 968789 728710 1139222 1634486 1904942 1779419 1157500
32610 1157500 400354 108005 206599 -71727 -1030916 -2034181 -2458699 -2393139 -2077820 -1432980
32600 -1432980 -561303 6778 25335 -162818 -399749 -1010845 -1892162 -2200439 -1617341 -1075415
32590 -1075415 -1403463 -2017366 -1910625 -1248593 -843728 -591846 249928 1482372 2017252
32581 2017252 1549040 916738 587416 9735 -1057944 -1705819 -1141405 -18925 376364
32572 376364 -152558 -603830 -209975 664411 1062064 450633 -814980 -1785975 -1733021 -896611
32562 -896611 -337703 -805135 -1837490 -2263180 -1577951 -543303 -298020 -1069187 -1996573
32553 -1996573 -2218605 -1867264 -1762807 -2251358 -2727634 -2442315 -1462868 -547860 -255104
32544 -255104 -495941 -890242 -1233095 -1540858 -1812285 -1836088 -1287393 -173393 843047
32535 843047 936979 102581 -770527 -1078007 -1243811 -1765745 -2060264 -1193896 429809 1223037
32525 1223037 510419 -518161 -532991 54040 -175741 -1440724 -2328041 -1718349 -334777
32516 -334777 159682 -760341 -1936808 -2111613 -1510793 -1389306 -2199429 -2852888 -2068836
32507 -2068836 -27844 1750161 1993121 789887 -714831 -1373540 -917814 -144267 -115155
32498 -115155 -927373 -1586805 -1454529 -1264020 -1930980 -2837535 -2515971 -952294 184819
32489 184819 -44843 -616160 -451949 -216670 -948615 -1941800 -1650751 -211610 700061
32480 700061 504712 457878 1330531 2027374 1453968 380577 129614 397531 -41254 -1024991
32470 -1024991 -1164645 -272029 169012 -523688 -950545 101350 1433695 1022568 -935811
32461 -935811 -2309143 -2169887 -1889401 -2706959 -3793283 -3673286 -2461616 -1496923 -1352924
$$ [...]
##END NTUPLES=NMR SPECTRUM
##END=
