##TITLE=31Pdec_4e1303-05
 CDCl3, 24 sc
 14.3.2023
##JCAMPDX= 6.0         $$ Bruker NMR JCAMP-DX V2.0
##DATA TYPE= NMR SPECTRUM
##DATA CLASS= NTUPLES
##ORIGIN= UXNMR, Bruker Analytische Messtechnik GmbH
##OWNER= root
$$ XWIN-NMR		Version 3.5
$$ Tue Mar 14 14:08:30 2023 Russian Standard Time (UT+4h)  she@DPX200
##.OBSERVE FREQUENCY= 81.013821
##.OBSERVE NUCLEUS= ^31P
##.ACQUISITION MODE= SIMULTANEOUS
##.ACQUISITION SCHEME= undefined
##.AVERAGES= 24
##.DIGITISER RES= 16
##SPECTROMETER/DATA SYSTEM= spect
##.PULSE SEQUENCE= zgpg30
##.SOLVENT NAME= CD3CN
##.SHIFT REFERENCE= (INTERNAL, CD3CN, 0, 248.564)
##AUDIT TRAIL= $$ (NUMBER, WHEN, WHO, WHERE, WHAT)
$$ ##TITLE= Audit trail, XWIN-NMR		Version 3.5
$$ ##JCAMPDX= 5.01
$$ ##ORIGIN= Bruker BioSpin GmbH
$$ ##OWNER= she
$$ F:/spectra/data/she/nmr/P31/1/pdata/1/auditp.txt
$$ ##AUDIT TRAIL=  $$ (NUMBER, WHEN, WHO, WHERE, WHAT)
(   1,<2023-03-14 14:07:27.15 +0400>,<she>,<DPX200>,
      <created by zg, POWCHK disabled, PULCHK disabled
       configuration hash MD5:
       00 E9 B6 7A A2 85 ED C7 34 08 36 98 17 FE 4E 26
       data hash MD5: 32K
       B4 E6 7E CA 0B 76 FD 4E 9D 7C A4 B6 FB 57 65 FF>)
(   2,<2023-03-14 14:07:31.75 +0400>,<she>,<DPX200>,
      <Start of raw data processing
       efp BC_mod = 2 LB = 1 FT_mod = 6 PKNL = 1 PHC0 = -11022.66 PHC1 = 182.4102 SI = 64K 
       data hash MD5: 64K
       78 C4 CF DA DD 82 4E 07 41 E3 9F EC DB 95 DB 00>)
(   3,<2023-03-14 14:07:48.82 +0400>,<she>,<DPX200>,
      <pk PHC0 = 19.92724 PHC1 = -11 
       data hash MD5: 64K
       5D 27 95 06 33 FE 64 D2 BD 3A A3 42 41 CC 39 30>)
(   4,<2023-03-14 14:07:56.35 +0400>,<she>,<DPX200>,
      <abs ABSG = 5 
       data hash MD5: 64K
       DF 1A D5 9F 97 BD C2 76 2E E3 2E 65 3E 81 A2 99>)
$$ ##END=
$$ 
$$ hash MD5
$$ 3D BB B1 82 15 B5 37 06 68 7E 3D C8 47 64 72 71
##$RELAX= 
##$RELAX= 
##$RELAX= 
##$RELAX= 
##$RELAX= 
##$RELAX= 
##$RELAX= 
##$RELAX= 
##$RELAX= 
$$ Bruker specific parameters
$$ --------------------------
##$DU= <F:/spectra>
##$EXPNO= 1
##$NAME= <P31>
##$PROCNO= 1
##$TYPE= <nmr>
##$USER= <she>
##$AMP= (0..31)
100 100 100 100 100 100 100 100 100 100 100 100 100 100 100 100 100 100 
100 100 100 100 100 100 100 100 100 100 100 100 100 100 
##$AQSEQ= 0
##$AQ_mod= 1
##$AUNM= <au_zg>
##$AUTOPOS= <>
##$BF1= 81.014009
##$BF2= 200.13
##$BF3= 200.13
##$BF4= 200.13
##$BF5= 200.13
##$BF6= 200.13
##$BF7= 200.13
##$BF8= 200.13
##$BYTORDA= 1
##$CFDGTYP= 0
##$CFRGTYP= 5
##$CHEMSTR= <none>
##$CNST= (0..31)
1 1 145 1 1 1 1 1 1 1 1 1 1 1 1 1 1 1 1 1 1 1 1 1 1 1 1 1 1 1 1 1 
##$CPDPRG= <waltz16>
##$CPDPRG1= <>
##$CPDPRG2= <waltz16>
##$CPDPRG3= <>
##$CPDPRG4= <mlev>
##$CPDPRG5= <mlev>
##$CPDPRG6= <mlev>
##$CPDPRG7= <mlev>
##$CPDPRG8= <mlev>
##$CPDPRGB= <>
##$CPDPRGT= <>
##$D= (0..31)
0 1 0 0 0 0 0 0 0 0 0 0.03 2e-05 3e-06 0 0 0 0 0 0 0 0 0 0 0 0 0 0 0 0 
0 0 
##$DATE= 1678788446
##$DBL= (0..7)
120 120 120 11 120 120 24 19 
##$DBP= (0..7)
150 150 150 150 150 150 150 150 
##$DBP07= 0
##$DBPNAM0= <>
##$DBPNAM1= <>
$$ [...]
##$SUBNAM3= <"">
##$SUBNAM4= <"">
##$SUBNAM5= <"">
##$SUBNAM6= <"">
##$SUBNAM7= <"">
##$SUBNAM8= <"">
##$SUBNAM9= <"">
##$SW= 501.771253377433
##$SWIBOX= (0..15)
0 1 3 0 0 0 0 0 0 0 0 0 0 0 0 0 
##$SW_h= 40650.406504065
##$TD= 32768
##$TD0= 1
##$TE= 0
##$TE2= 300
##$TE3= 300
##$TEG= 300
##$TL= (0..7)
0 120 53 12 22 120 120 120 
##$TP= (0..7)
150 150 150 150 150 150 150 150 
##$TP07= 0
##$TPNAME0= <>
##$TPNAME1= <>
##$TPNAME2= <>
##$TPNAME3= <>
##$TPNAME4= <>
##$TPNAME5= <>
##$TPNAME6= <>
##$TPNAME7= <>
##$TPOAL= (0..7)
0.5 0.5 0.5 0.5 0.5 0.5 0.5 0.5 
##$TPOFFS= (0..7)
0 0 0 0 0 0 0 0 
##$TUNHIN= 0
##$TUNHOUT= 0
##$TUNXOUT= 0
##$USERA1= <user>
##$USERA2= <user>
##$USERA3= <user>
##$USERA4= <user>
##$USERA5= <user>
##$V9= 5
##$VALIST= <valist>
##$VCLIST= <CCCCCCCCCCCCCCC>
##$VD= 0
##$VDLIST= <DDDDDDDDDDDDDDD>
##$VPLIST= <PPPPPPPPPPPPPPP>
##$VTLIST= <TTTTTTTTTTTTTTT>
##$WBST= 1024
##$WBSW= 4
##$XGAIN= (0..3)
0 0 0 0 
##$XL= 0
##$YL= 0
##$YMAX_a= 3195
##$YMIN_a= -3244
##$ZGOPTNS= <>
##$ZL1= 120
##$ZL2= 120
##$ZL3= 120
##$ZL4= 120
##$ABSF1= 248.5645
##$ABSF2= -253.2056
##$ABSG= 5
##$ABSL= 3
##$ALPHA= 0
##$AQORDER= 0
##$ASSFAC= 0
##$ASSFACI= 0
##$ASSFACX= 0
##$ASSWID= 0
##$AUNMP= <proc_1d>
##$AZFE= 0.1
##$AZFW= 0.5
##$BCFW= 0
##$BC_mod= 2
##$BYTORDP= 0
##$COROFFS= 0
##$CY= -3
##$DATMOD= 1
##$DC= 0
##$DFILT= <>
##$DTYPP= 0
##$F1P= 0
##$F2P= 0
##$FCOR= 1
##$FTSIZE= 65536
##$FT_mod= 6
##$GAMMA= 0
##$GB= 0
##$INTBC= 1
##$INTSCL= 6.047779e-11
##$ISEN= 30
##$LB= 1
##$LEV0= 0
##$LPBIN= 0
##$MAXI= 10000
##$MC2= 0
##$MEAN= 0
##$ME_mod= 0
##$MI= 50
##$NCOEF= 0
##$NC_proc= -7
##$NLEV= 6
##$NOISF1= 182.463
##$NOISF2= 159.3651
##$NSP= 0
##$NTH_PI= 0
##$NZP= 0
##$OFFSET= 248.5645
##$PC= 4
##$PHC0= -11002.73
##$PHC1= 171.4102
##$PH_mod= 1
##$PKNL= yes
##$PPARMOD= 0
##$PSCAL= 0
##$PSIGN= 0
##$REVERSE= no
##$SF= 81.0140089999694
##$SI= 65536
##$SIGF1= 159.3651
##$SIGF2= -187.1042
##$SINO= 113.3802
##$SIOLD= 16384
##$SREGLST= <1H.CDCl3>
##$SSB= 0
##$STSI= 65536
##$STSR= 0
##$SW_p= 40650.406504065
##$SYMM= 0
##$S_DEV= 0
##$TDeff= 32768
##$TDoff= 0
##$TI= <>
##$TILT= no
##$TM1= 0
##$TM2= 0
##$TOPLEV= 0
##$USERP1= <user>
##$USERP2= <user>
##$USERP3= <user>
##$USERP4= <user>
##$USERP5= <user>
##$WDW= 1
##$XDIM= 65536
##$YMAX_p= 504221770
##$YMIN_p= -57490636
$$ End of Bruker specific parameters
$$ ---------------------------------
##NTUPLES= NMR SPECTRUM
##VAR_NAME=  FREQUENCY,     SPECTRUM/REAL,   SPECTRUM/IMAG
##SYMBOL=    X,             R,               I
##VAR_TYPE=  INDEPENDENT,   DEPENDENT,       DEPENDENT
##VAR_FORM=  AFFN,          ASDF,            ASDF
##VAR_DIM=   65536,         65536,           65536
##UNITS=     HZ,            ARBITRARY UNITS, ARBITRARY UNITS
##FACTOR=    0.620285442955139, 1,           1
##FIRST=     20137.2065510682, 0,            0
##LAST=      -20513.1999529968, 0,           0
##MIN=       -20513.1999529968, -57490636,   0
##MAX=       20137.2065510682, 504221770,    0
$$ Real data points
##PAGE= N=1
##DATA TABLE= (X++(R..R)), XYDATA
$$ [...]
41878D493882K480079P44207k336555m170821l064710r92401m31114n80933L58661
41869c499705J417642O60399j091801j570321o01173M43395J120418J337694K97070
41860a486382j421858j112605J795678L366625O16332l182198k905929P16266
41852c614071K524400Q14097j047739n68540Q06846J008705P7338r60219j157345
41843b116528L89656L068781L878117R69150k764718l045546m14814P87227p51105
41834B20j810263l42497J568102J596927L52401p49179j576777j820447m06969
41825c188482K043182K838079R65428j080622q54127P08228J150486k5731j366093
41816A190348j706597j108657l77153l00313o18894N9950K023219K888246O38731
$$ y = [4493882, 6973961, 7718168, 5381613, 1210792, -1853918, -2846319, -3277433, -3858366, -3499705, -2082063, -1421664, -2513465, -4083786, -4684959, -4241564, -3121146, -1783452, -1486382, -2908240, -4020845, -2225167, 1141458, 1757790, -1424408, -4330337, -3614071, -1089671, -275574, -1323313, -1891853, -1085007, -76302, 1036, -959183, -2116528, -1726872, 1341909, 5220026, 6189176, 3424458, 378912, -35902, 751325, 220, -1810043, -2152540, -584438, 1012489, 1364890, 615711, -961066, -2781513, -3188482, -1145300, 1692779, 2658207, 1577585, 723458, 1431686, 2582172, 2556441, 1190348, -516249, -1624906, -2002059, -2302372, -2921266, -2861316, -838097, 2050149, 2688880]
41807B688880k380219j874940J810552L489830P82726k162376j153524J575116
41799B776045J262324j613429k247582O93053K999711J498841j327317j432724
41791B608922Q59772J876855K00824j753988j808253r77022j135682j687956o75104
41782b491632J665311K821912J591792l82652j216920r48998l02741O31408J274041
41773B641521K60526k016282k622186m2103K922276K799396L54979j087106p69485
41764B441536n12535o64800Q2468J231024P72645r07802j241700L6815M77938
41755A715589m49319m57629Q36679P31445j338404j930491N22460K323857M29303
41746B383490k141436j080411K067674K390072o82951l052468k446936o70499
$$ y = [2688880, 308661, -1566279, 244273, 3734103, 4516829, 2354453, 1200929, 2776045, 4038369, 2424940, 177358, 870411, 3870122, 5368963, 4041646, 2608922, 3468694, 5345549, 5546373, 3792385, 1984132, 1007110, -128572, -1816528, -2491632, -826321, 1995591, 3587383, 3204731, 1987811, 1038813, 736072, 1367480, 2641521, 2902047, 885765, -1736421, -1778524, 1143752, 3943148, 4298127, 3211021, 2441536, 1929001, 1264201, 1346669, 2577693, 3350338, 2442536, 1200836, 1237651, 1715589, 1266270, 808641, 1645320, 2376765, 1038361, -892130, -369670, 1954187, 2383490, 242054, -838357, 1229317, 3619389, 2936438, -116030, -2562966, -3233465]
41738c233465M52119J165005J428354K55576j702247k030806o4033J978338K207998
41729D56839J164725L3751r34562j439424p76773N61173Q61746l27219j469251
41720a868995j503718j071595n29176R26092K882885K907146J50897k245569j015027
41711a367060K249915K924620k52879l555591l468624q77510J120803J472853
41703a753473J402068J632903J463797M24413p55903j168888p43264j3277L55539
41694H43915k49052j730412k628064j251604J936553M094006L095837J50469j720105
41685B541543j300521j11759L6162q25574j344493n88484J041474K130098J479629
41676C058075m74331j726383q89124R76738J619492M33503j031071j277546m07009
$$ y = [-3233465, -2781346, -1616341, -187987, 67589, -1634658, -3665464, -3729497, -1751159, 456839, 1621564, 1655315, 720753, -718671, -1495444, -934271, -72525, -399744, -1868995, -3372713, -4444308, -4973484, -4047392, -1164507, 1742639, 1893536, -352033, -1367060, 882855, 3807475, 3554596, -995, -3469619, -4347129, -3226326, -1753473, -351405, 1281498, 2745295, 3169708, 2413805, 1244917, 501653, 488376, 843915, 594863, -1135549, -3763613, -5015217, -3078664, 1015342, 4111179, 4261648, 2541543, 1241022, 1129263, 1165425, 339851, -1004642, -1593126, -551652, 1578446, 3058075, 2583744, 857361, -31763, 944975, 2564467, 2997970, 1966899, 689353, 282344]
41667B82344O33557J224331J243859R51436Q39124R04596L38880j152534k282563
41658B983030j798101n73120l08803o87555j03767J104128R81583l67382o89524
41649E40489J51651m94631k920328l178896Q17872M814122L737867q25190l144101
41640e01145j687875j09282n03624p41433P29206J942572J022417p47183j383093
41631a979440j013194n13374J77892P49789k548j638955j534276J054152K916783
41622a783171J494803q40488m47223J579669J235077j477805k189182O80065K979930
41613A231675J165786k142571k152365R93822K840953J267382j202989j802615
41605A99078q87578L6096P99095J455944R18249j197216k853961j970629L88152
$$ y = [282344, 915901, 2140232, 3384091, 4335527, 5174651, 6079247, 6418127, 5265593, 2983030, 1184929, 611809, 303006, -384549, -488316, 615812, 1597395, 1230013, 540489, 692140, 197509, -2722819, -5901715, -5083843, -269721, 3468146, 2642956, -501145, -2189020, -2298302, -2801926, -3543359, -2814153, -871581, 150836, -596347, -1979440, -2992634, -3506008, -3328116, -2578327, -2580875, -4219830, -5754106, -4699954, -1783171, -288368, -1128856, -1576079, 3590, 1238667, -239138, -2428320, -1748255, 1231675, 2397461, 254890, -1897475, -903653, 1937300, 3204682, 2001693, 199078, -688500, -652404, 146691, 1602635, 2520884, 1323668, -1530293, -3500922, -3112770]
41596c112770J371855L34073p42366n50127J16777L93120N31412N57837j01438
41587a201627r24070l64054J411190K035677N02643r71851l66079R65834P50078
41578A837741m24408n07355K19302j45370j367126j269757M00615J390037O42068
41569G75747k36100Q166L49056l26621j266600j306283n43362M45477J428337
41560f72183J734769M60066j588529k010587m7619K049968K125972Q42141l7650
41551B856348k46561k45737L63986J611402J805588k69585k824662l040380r19233
41542i08834J010503J323395Q31866L86836k07140r20422j073167n62457o2413
41533a81833J74529M29312N07253r935o54458o41834l07975m45151n84253K06655
$$ y = [-3112770, -1740915, -1406842, -2149208, -2699335, -2582558, -2189438, -1658026, -1100189, -1201627, -2125697, -2489751, -1078561, 957116, 1459759, 487908, 121829, 1087663, 1837741, 1413333, 905978, 1125280, 979910, -387216, -1656973, -1256358, 133679, 775747, 539647, 547813, 896869, 570248, -696352, -2002635, -2545997, -2100520, -672183, 1062586, 1522652, -65877, -2076464, -2124083, -74115, 2051857, 2893998, 2856348, 2609787, 2364050, 2728036, 4339438, 6145026, 5875441, 3050779, 10399, -908834, 101669, 1425064, 2256930, 2643766, 2436626, 1516204, 443037, -119420, -181833, -7304, 422008, 929261, 919326, 264868, -376966, -684941, -1130092, -1714345, -1507690]
41523a507690J139178N50962j105891j588089m76464J76554m64175m90156J208021
41514b557750K539441J410925q26193j533681p53138m00582o37644J07152J844815
41505h06655K426079O72539j823963k675569j277111R42278K005531J107830n01343
41496F9616p54918N01436J027250m79655j951134q10661J828314K458635K78095
41487B166978j819804j589849l8982J014027J380998J376368N93959p47114j227776
41478A108805m66208l9683o82481o66694J049437K163666K75025k731692k813488
41469b803313L29016K764527J949777k02540p68436K59446R43821M39994n86719
41460B325573j455940j896662j565645l34731J113578J688492Q71251q46385k229634
$$ y = [-1507690, -368512, 182450, -923441, -2511530, -2987994, -2811440, -3275615, -3765771, -2557750, -18309, 1392616, 566423, -967258, -1720396, -2120978, -2758622, -2651470, -806655, 1619424, 2291963, 468000, -2207569, -3484680, -2542402, -536871, 570959, 69616, -685302, -183866, 843384, 363729, -1587405, -2398066, -569752, 1888883, 2166978, 347174, -1242675, -1281657, -267630, 1113368, 2489736, 3083695, 2336581, 1108805, 642597, 602914, -79567, -746261, 303176, 2466842, 2741867, 10175, -2803313, -2474297, 290230, 2240007, 2037467, 1269031, 1528477, 2472298, 2912292, 2325573, 869633, -1027029, -2592674, -2927405, -1813827, -125335, 745916, -100469, -2330103]
41451b330103k131926o48705P00761O62431j62682l89912p5128l13476p82224
41442e470964K18749K689950M012823K405369m30284j766465j527794j481164
41434a349780j791488r16404J201856K356355J289392k64279j03540J147406R85786
41425B555304j147495k741657j513757J341908K481707P39847j303840p75772
41417c63755J582663K421288L50975k231332k418026m31268J135926Q13904l71131
41408D89244p61992r0132O69009P57055M39325L92556N67040J43009j078444j870386
41398c43716j092845M15150Q14496j0471m20445R9799J14501r77069j614875r18315
41388c933790n29589j533738j757343Q96034M121682L935421Q75476o22932Q59954
$$ y = [-2330103, -4462029, -5110734, -4409973, -3747542, -3910224, -4300136, -4375264, -4688740, -5470964, -5252215, -2562265, 1450558, 3855927, 3425643, 1659178, 131384, -1349780, -3141268, -4057672, -2855816, -499461, 789931, 525652, 422112, 1569518, 2555304, 1407809, -1333848, -2847605, -1505697, 976010, 1715857, 412017, -363755, 1218908, 3640196, 3991171, 1759839, -658187, -1089455, 46471, 860375, 489244, -272748, -362880, 306129, 1063184, 1502509, 1895065, 2462105, 2605114, 1526670, -343716, -1436561, -1021411, -206915, -217386, -637831, -538032, -423531, -1400600, -3015475, -3933790, -4463379, -5997117, -7754460, -6858426, -2736744, 1198677, 2074153, 1451221, 2311175]
41379B311175J763409k87965k497877j519778J227061J996530K21149j650303
41371A563401k282423k173079j226913J028298L036932K265574q16126k582116
41363a186452j077558J297203J273856r09797k282325j214235R33713J913004
41355a252591J074281m07428j102484p71683k67943j28189K27102J361660K348076
41346A080801J554383r07644k614546j499183J423174K880108J030704k200138
41338G47659l055897l40914K811173K519615p88087k613583l68722K806581K184761
41329C902586j858504m208517k089028J295034J601191o14920j219153J269002
41321a922309L597232K392753j248480l258762j835101N26840O29145j147181
$$ y = [2311175, 4074584, 3786619, 1288742, -231036, 996025, 2992555, 3213704, 1563401, -719022, -2892101, -4119014, -3090716, -53784, 2211790, 1395664, -1186452, -2264010, -966807, 307049, -602748, -2885073, -4099308, -3165595, -1252591, -178310, -585738, -1688222, -2459905, -2727848, -2856037, -2628935, -1267275, 1080801, 2635184, 1727540, -887006, -2386189, -963015, 1917093, 2947797, 747659, -2308238, -2649152, 162021, 2681636, 1893549, -720034, -1088756, 1717825, 3902586, 2044082, -2164435, -4253463, -2958429, -1357238, -1972158, -3191311, -1922309, 1674923, 4067676, 2819196, -439566, -2274667, -1747827, -1118682, -2265863]
41313b265863j639398M03525K452676J898886k03791r72034p0447K62672p92131
41304i25905j368891j86985J388425J653968Q90136J24321n89057j271524j116369
41295a401881k16O83606K48600R7474J141728J700859K65863j402745q61377O69787
41285A141698l836k636672l515177j105071J746454K161780P58122l84538o02266
41276b439506j01720J084198K106443J404068p22643j722362n04230O45912k96293
41267e46133j740470j168130O72396J116983p1398p04700M1615P34512N78173
41258a087152N48523J141124J231227K8830j490855j973122j323054l15725M69618
41249b770586Q15410P31074N10580L92214J78980k18015k04269O36837J479012
$$ y = [-2265863, -3905261, -3501736, -1049060, 849826, 646035, -325999, -396446, -133774, -925905, -2294796, -2481781, -1093356, 560612, 1450748, 1575069, 986012, -285512, -1401881, -1402097, -718491, -469891, -372417, 769311, 2470170, 2736033, 1333288, 471911, 1141698, 1137862, -1498810, -5013987, -6119058, -4372604, -2210824, -1452702, -1837240, -2439506, -2541226, -1457028, 649415, 2053483, 1330840, -391522, -895752, -249840, -546133, -2286603, -3454733, -2782337, -1665354, -1736752, -2441452, -2399837, -1665325, -1087152, -538629, 602495, 1833722, 1862552, 371697, -1601425, -2924479, -3240204, -2770586, -1955176, -1224102, -713522, -321308, -142328, -360343, -564612, 72225, 1551237]
41240A551237J172790k3408q09141p16150l98975l25131n08472j174499k070932
41231c302681j558715J387960M371998L584463o15839l115773p98462K841410
41223B794361K563203j215810l475492k070085n5424r3139n52677Q18525K544671
41214A258133J863299l90935r27046O11571J017384j192114l213345k287135J25182
41205c135006Q46782k36071o57147M35201J420350J234737O13610J42015n48024
41196A16447j230531r46002O6962M14562N1028M80550J781906J930942J83794
41187B849658j376299j120633k56483k29534k37774N77126R10519k25551j108758
41178b17729k39831N58909p09496k057769m61050K633278L170631R15208o25643
$$ y = [1551237, 2724027, 2700619, 1891478, 1175328, 776353, 451222, -57250, -1231749, -3302681, -4861396, -3473436, 898562, 4483025, 3867186, 751413, -47049, 2794361, 5357564, 4141754, 666262, -1403823, -1459247, -1552386, -2105063, -1286538, 1258133, 3121432, 2730497, 1803451, 2415022, 3432406, 2240292, -973053, -3260188, -3135006, -2288224, -2524295, -3181442, -2746241, -1325891, -91154, 522456, 664471, 116447, -1114084, -2060086, -1993124, -1578562, -1527534, -1046984, 734922, 2665864, 2849658, 1473359, 352726, 96243, -133291, -371065, 206061, 1116580, 891029, -217729, -457560, 101349, -608147, -2665916, -3126966, -493688, 2676943, 3592151, 2966508]
41169B966508k85350l63061j436638j105739J022962J969586O79182M8964J514732
41160E011146K157016m936k155488j590065n45858j967687l809269k413494Q70935
41151d447700J687784j61266q60717O45697J344199Q9145k76307J648110K780773
41142B449718N66681k465813k371426L03531J655663K39396j516995j454371k95049
41133b888665M74993Q71265J279002R31052o36927j763912n09825K053864K746257
41124B557104P57713j196635j105317m61380j089884j704385l84654J513841J395367
41115B81770K0397J67532J491381J062753j083796j657547j2371N75342j030938
41106a85477j527438P01911K097723o3872k617155j593387J384125K311469J243466
$$ y = [2966508, 2681158, 2318097, 881459, -224280, 798682, 2768268, 3447450, 3496414, 5011146, 7168162, 7163226, 5007738, 3417673, 2871815, 904128, -2905141, -5318635, -4447700, -2759916, -2921182, -3781899, -3136202, -1792003, -1702858, -1979165, -331055, 2449718, 3016399, 550586, -1820840, -1517309, 138354, 377750, -1139245, -2593616, -2888665, -2413672, -1542407, -263405, 667647, 30720, -1733192, -2243017, -189153, 2557104, 3314817, 2118182, 1012865, 551485, -538399, -2242784, -2627438, -1113597, 281770, 302167, 469699, 1961080, 3023833, 1940037, 282490, 270119, 845461, -185477, -1712915, -1011004, 1086719, 1022847, -1594308, -3187695, -1803570, 507899, 1751365]
41097A751365P43269O08311p63906j905277m58963J749768J086813j628264k435918
41088a252802q32900K27504Q2896N48262R79847q67355l245141k059834J537267
41079d882256K016404j033442j630437K163162M186918M56912l670940k066316
41071d459995K442265L354589Q62218j32566Q96330L70506j720914j601746J031400
41062A042087J960348m76053k695905j725137P28334J741009J101144Q2752p81973
41053I76606j156285m89238N82866M25423j088474k128279j593826l74391N06263
41044d339335R89711Q82681j18655q90011J88050K149213K006771n45150j872012
41035a548737L61162L329074K965175k73152k586004k518148k076687k426515
$$ y = [1751365, 2494634, 3102945, 2339039, 433762, -25201, 1724567, 2811380, 1183116, -1252802, -2085702, -1858198, -1775302, -1227040, -247193, -1114548, -4359689, -6419523, -4882256, -2865852, -3899294, -5529731, -3366569, 820349, 1277261, -2393679, -4459995, -2017730, 1336859, 2199077, 2066511, 2962841, 3333347, 1612433, 10687, 1042087, 3002435, 2526382, -169523, -1894660, -1166326, 574683, 1675827, 1758579, 976606, -179679, -668917, -86051, 339372, -749102, -2877381, -4471207, -4845598, -4339335, -3349624, -2466943, -2585598, -3475609, -3287559, -1138346, 868425, 323275, -1548737, -1187575, 2141499, 5106674, 4833522, 2247518, -270630, -2347317, -4773832]
41027d773832j947903L89218K570514K376980P67093J34511L65995o69145k930162
41018c716731l436823p49070K250854K123478j84701p89282J395037L239249K162720
41009B294731k72104q94162P15356K107682J357430q71012k392524j821185K3476
41000B47688Q57635m07500k000376j514676M08961O82791j469113k818797p20162
40991f733549K764181L631062J445240n16699p4962J365474J339087n38855k515385
40982A65594k716251q94344J280481J824959O89294k77756m805M40064K1088l43294
40972A85030L90918J105955K32537j256425j057066O61184J199651o46614k685186
40963a870016k223653N62152K926294K521163k16014k375754j698315M85996P83775
$$ y = [-4773832, -6721735, -6332517, -3762003, -1385023, -617930, -483419, -117424, -786569, -3716731, -7153554, -7902624, -5651770, -3528292, -3712993, -4502275, -3107238, 132011, 2294731, 2022627, 1128465, 1843821, 3951503, 5308933, 4437921, 2045397, 224212, 247688, 1105323, 697823, -1302553, -2817229, -2408268, -1725477, -3194590, -6013387, -6733549, -3969368, -338306, 1106934, 590235, 515273, 1880747, 3219834, 2680979, 165594, -2550657, -3445001, -2164520, -339561, 349733, 71977, 67172, 507236, 528324, 185030, 575948, 1681903, 1914440, 658015, -399051, 262133, 1461784, 815170, -1870016, -4093669, -3531517, -605223, 1915940, 1699926, -675828, -2374143, -1888147, -1104372]
40954a104372j323406k382511l31013J822895O58571j758195r54753K376167L075909
40945G9292j43738k430399m53499K498016J905673j258839k671030r90950J391223
40936b074251K433074K164933J119421l95270j667946j929099j162730J89521
40928a322347J522674J663913j95946k524157k514778j17907J464894O51527j05056
40919a477183J114655J926972k10664k801675j660712K124549L410702Q12895
40911C239539j453815l11233J910388J710646m59035j666949r02160K83123L85152
40902B735656n06210j257534q94224L70187J178634P04503j76919m15226n51350
40893A187517j231235j104593J096068L217324J984857j467862k475755k9633
$$ y = [-1104372, -2427778, -4810289, -5141302, -3318407, -2659836, -4418031, -5372784, -2996617, 79292, -64446, -2494845, -2948344, -450328, 1455345, 196506, -2474524, -3465474, -2074251, 358823, 2523756, 3643177, 3247907, 1579961, -349138, -1511868, -1322347, 200327, 1864240, 1668294, -855863, -3370641, -3488548, -2023654, -1372127, -1477183, -362528, 1564444, 1353780, -1447895, -3108607, -984058, 2426644, 3239539, 1785724, 1474491, 3384879, 5095525, 4636490, 2969541, 2067381, 2350504, 2735656, 2229446, 971912, 77688, 447875, 1626509, 2331012, 2154093, 1738867, 1187517, -43718, -1148311, -52243, 3165081, 5149938, 3682076, 1206321, 1176688]
40885A176688J357955j113169l844138k572947R81399K359678J396887J259599
40877A001952K263705J742788n36201j742128j037539p32530j563751j192387
40869a796091J082179K212561K81891j991765j396254R28661J794479Q90441K08058
40860B214160J85458k51730q22766l45719M43788k89468j900774j637542R07292
40851a497301K641881J352160j228631k132781r76764M67685R64542M80998o46192
40842e74403j619345j121383J097348L123132K794877M21015j625464j805168
40834F90609p92311q6359l07433r61509j099476j08714J571121K543564J777167
40825C226659k37252k015462k488980j538972K89029J930404K221255J072790
$$ y = [1176688, 2534643, 1421474, -2422664, -4995611, -4014212, -1654534, -257647, 1001952, 3265657, 5008445, 4472244, 2730116, 1692577, 960047, -603704, -1796091, -713912, 1498649, 1780540, -211225, -1607479, -678818, 1115661, 2006102, 2214160, 2399618, 2147888, 1325122, 979403, 1423191, 1133723, -767051, -2404593, -1497301, 1144580, 2496740, 1268109, -864672, -1841436, -1373751, -409209, 71789, -574403, -2193748, -3315131, -2217783, 905349, 3700226, 4121241, 2495777, 690609, -101702, -188061, -495494, -1457003, -2556479, -2665193, -1094072, 1449492, 3226659, 2989407, 973945, -1515035, -3054007, -2764978, -834574, 1386681, 2459471]
40817B459471j43451k21158L43181L98363Q2219K83277N94822k92169j972670
40808A531885k101004K95805K857417K611288k58663k709194k503077m65022Q92920
40799A52355K61155j170549j205095O09225K219834J685076j41594r68261o44269
40790G97877j143140k685060k636364K38993K962112K264970m56978j130763J034746
40781g53607K773624J750282p57717k553572l049334k306085k04332K196529K741075
40772a63137J045825n97528m79766K93128K16041q3970L65560N23400q12845k281609
40762a974901j779362l8217L99735p09370j010992O26750K553018K948652J782120
40753B797433j97562k246256k987445j277843J552516K488622P63199j089536
$$ y = [2459471, 2316020, 2094862, 2438043, 2836406, 2918625, 3201902, 3796724, 3504555, 1531885, -569119, -273314, 2584103, 5195391, 4936728, 2227534, -275543, -740565, 152355, 413510, -757039, -1962134, -1352909, 866925, 2552001, 2410407, 1442146, 797877, -345263, -3030323, -5666687, -5427694, -2465582, -200612, -657590, -1788353, -753607, 2020017, 3770299, 3012582, 459010, -2590324, -4896409, -5100741, -2904212, -163137, 882688, 285160, -194606, 98522, 314563, 230593, 596153, 1119553, 306708, -1974901, -3754263, -3792480, -3392745, -4102115, -5113107, -4486357, -1933339, 1015313, 2797433, 2599871, 353615, -2633830, -3911673, -2359157, 129465, 892664, -196872]
40745a96872j085726l71424n07317n92921O23089J697922M80092j925651k285097
40736d163905j35985J423464M42841j071216m47051J588754K138590L91407j441088
40727a274189j410418l12462j47773j187720j749142o33113J328994K493571K314446
40718e77806J405059L56789n98490j130009j016826o54295m41177L5136J056704
40709a564915J454160Q08j937231j433533J622829L569712J858729j277136k179067
40700A14356r63383n22249j425487j222959J017664K682510J405249j408948k580112
40691b903359j292698M71660R49645M58570K19711M79386M26505l52044j027566
40682b570190n62155P67850J689402J713807J489310J166760o5863k032907k816423
$$ y = [-196872, -1282598, -1654022, -2161339, -2754260, -2131171, -433249, 46843, -1878808, -4163905, -4299890, -2876426, -2433585, -3504801, -3951852, -2363098, -224508, 166899, -1274189, -2684607, -2997069, -3144842, -4332562, -6081704, -6714817, -5385823, -2892252, -577806, 827253, 1184042, 585552, -544457, -1561283, -2215578, -2656755, -2621619, -1564915, -110755, -109947, -2047178, -3480711, -1857882, 1711830, 3570559, 2293423, 114356, -849027, -1371276, -2796763, -4019722, -3002058, -319548, 1085701, -323247, -2903359, -4196057, -3724397, -2774752, -2316182, -2096471, -1617085, -1190580, -1542624, -2570190, -3132345, -2364495, -675093, 1038714, 2528024, 3694784, 3628921, 1596014, -1220409]
40673a220409j388151M60300O40142j16096P9533O62859m02952k563632k819704
40664f668110k63404K481289L090867K148821J073792J23602l90844M52774K015775
40655D064562J834790o64923k480641j183041J261198J282644j191302k995403
40647g2116k127072M41556K680361L163600J394103j604582l430876k646371m91792
40638b693189R88032J509174J750783J370197p7166j362440j092179j20253o3610
40629B09349l52601M77776J403926J71759k351469k750980m27279J284544M37108
40620a897867o76580K21809J601511J114384k97451k93091P70057Q02865j48396
40611A197241j98038P31417O55133q99350j846804q57458N50977L98239r66662
$$ y = [-1220409, -2608560, -2148260, -1508118, -1624214, -1544681, -881822, -1284774, -3848406, -6668110, -6931514, -4450225, -1359358, 789463, 1863255, 1986857, 1596013, 2048787, 4064562, 5899352, 5234429, 2753788, 1570747, 2831945, 4114589, 2923287, -72116, -2199188, -1757632, 922729, 4086329, 5480432, 3875850, 444974, -2201397, -2693189, -1705157, -195983, 1554800, 2924997, 2847831, 1485391, 393212, 272959, 209349, -143252, 334524, 1738450, 1910209, -441260, -3192240, -3619519, -2334975, -1897867, -2574447, -2352638, -751127, 363257, 65806, -227285, 542772, 1345637, 1197241, 999203, 1730620, 2385753, 1486403, -360401, -1217859, -666882, -268643, -1235305]
40602a235305j785048j449819p83904m00460o2952M64505Q99668R12492N44713
40593b896110P6372j17330L72604J494247K208323J222633j186832k729465j516429
40584c071987J286607K519149J013639r09932p73700O93890J095427J26515m59604
40575A520004j93311n23710j684248j641794M71023K236703J319952q47653j230353
40566e73387K35537J073423N77171M56835J034411K22219k440476l831269j596562
40557d842098J830310K381347Q9308j385599k94650J331695J527474R91612Q22087
40548B451486L63673r81938j868310r45697P37642J243728N27208k33665r91072
40539C03055k221014k784056j107703J666523K497926Q22351n52211K24306J440947
$$ y = [-1235305, -3020353, -4470172, -5254076, -5654536, -5717488, -5252983, -4353315, -3440823, -2896110, -2819738, -2937068, -2564464, -1070217, 1138106, 2360739, 1173907, -1555558, -3071987, -1785380, 733769, 1747408, 837476, 63776, 757666, 1853093, 1979608, 1520004, 1326693, 802983, -881265, -2523059, -2052036, 184667, 1504619, 656966, -573387, -337850, 735573, 1312744, 1769579, 2803990, 3026209, 585733, -3245536, -4842098, -3011788, -630441, -541133, -1926732, -2221382, -889687, 637787, 1629399, 2451486, 2815159, 1833221, -35089, -980786, -243144, 1000584, 1527792, 1294127, 303055, -1917959, -4702015, -5809718, -4143195, -1645269, -822918, -1375129, -1150823, 290124]
40530B90124R76812l53944o53208k26510n25511j051525q0076J915838K231073
40521B523073k08745l005292l246266j021750R79763P68681p90736j103422J006224
40512d098470L499480L203751j37816l117909k802630l05978J248211J137539
40504a373822J163161J918013J680379l90407k329857j955011K09193J940291
40496H61940K122358J267190J42611p75391j017196n11358k3418k76436q82418
40487I07882r68227n42816l13555l74678j41169L96414M52544j78360n24564J32184
40477a154345J014306R58376K67722K91101J227240J627721N30380j062606j671179
40468B028716j351038j085534r21653k07324O84827N76393m64901r20819p6974
$$ y = [290124, 1266936, 912992, 259784, 33274, -492237, -1543762, -1623838, 292000, 2523073, 2314328, -690964, -3937230, -4958980, -3979217, -3210536, -4001272, -5104694, -4098470, -598990, 2604761, 2466945, -650964, -3453594, -3759572, -2511361, -1373822, -210661, 1707352, 3387731, 2997324, 667467, -1287544, -1078351, 861940, 2984298, 4251488, 4394099, 3618708, 2601512, 2090154, 2066736, 1790300, 907882, -60345, -603161, -916716, -1291394, -1432563, -1036149, -583605, -761965, -1286529, -1154345, -140039, 818337, 1086059, 1377160, 2604400, 4232121, 4762501, 3699895, 2028716, 677678, -407856, -1329509, -1536833, -852006, -275613, -740514, -1661333, -1738307]
40459a738307J010765J310101J067941O60987j72512j079385p77647P74720J520412
40450B577075J44806j687431j689567k28005P10280O36307M52330K14805n69164
40441E61436j089027k00669J161349J086364p6058k74716N67525M35013r24398
40432A246819j245340K01335R51670o27535k429331j848805K72751J303303P65330
40423a409803K12654L10604L90847K75139M63288Q18780P51764M32237M11659
40414B657169M54098J26302L7288R32409J933322J391499n52233j919501j660950
40405C399403r44259j091752j526170p86996J072019K202017J190257j053570
40397B460949k154278j008706Q55699J148410l11446j488536r28623M34323Q36465
$$ y = [-1738307, -727542, 582559, 1650500, 2311487, 2138975, 1059590, 281943, 1056663, 2577075, 2721881, 1034450, -655117, -883122, -172842, 463465, 915795, 1130600, 561436, -527591, -728260, 433089, 1519453, 1443395, 1168679, 1736204, 2171217, 1246819, 1479, 202814, 1154484, 526949, -1902382, -3751187, -3478436, -2175133, -1409803, -1197149, -886545, -495698, -220559, 242729, 1061509, 1813273, 2245510, 2657169, 3111267, 3237569, 3274857, 4207266, 6140588, 7532087, 6979854, 5060353, 3399403, 2455144, 1363392, -162778, -949774, 122245, 2324262, 3514519, 2460949, 306671, -702035, 153664, 1302074, 990628, -497908, -1426531, -992208, -155743]
40388a55743J36908k82473L12962R86888N33190p07942j090117J14203J318229
40379A166105M53542j818539k331686J98978K738352J897264j012159j830919
40371e39062J34911J296407k11530j596984k92401J736750J410866m41603q89400
40362F07954J35587L02819p90094j337305q14826l14199K91677J938082L135696
40353C155391J127257k940589m097495o10891K777772J407913k583818l585186
40345e349646m79549K553192K318434M2977j521084j339779J18904J865416K458486
40336F67351J119572o75952o41286R15715J342372j72365j286784n08583K89577
40327A049617o83665j770188p25794J091488Q07096r98034j182360O21622J548658
$$ y = [-155743, -18835, -301308, 11654, 998542, 1531732, 823790, -266327, -152124, 1166105, 1619647, -198892, -2530578, -2331600, 406752, 2304016, 1291857, -539062, -404151, 892256, 680726, -916258, -1208659, 528091, 1938957, 1497354, 607954, 743541, 1046360, 256266, -1081039, -1895865, -2210064, -1918387, 19695, 3155391, 4282648, 1342059, -2755436, -3366327, -588555, 819358, -1764460, -5349646, -5829195, -3276003, -957569, -914592, -2435676, -3775455, -3656551, -1791135, 667351, 1786923, 1110971, 469685, 1385400, 2727772, 2555407, 1268623, 760040, 1049617, 365952, -1404236, -2130030, -1038542, -231446, -1229480, -2411840, -1790218, -241560]
40318b41560O03111J16859J032182Q10946j855559l880517k236894J254184K784979
40309a612269J932698Q13767j36576j708600k645169j021759J636285J723463
40301a018160q54732k346213r06378J122555J627335J637060K221812J969324
40293C452603j42284k109631j707950M6732O37911k57699j010607p90636r4189
40284a975750N92619J021023Q47686L11814L13941Q76083Q41177L6909m9812R63521
40274C779211J034129r12399k326030n16718K659354K854454n28349l391439k666700
40265a4487j25121P71480l24456r01034L12479J551769P99650j006545j113921
40256e0186Q25150J699014n78218l335050k517595J197316L107951J329238r19483
$$ y = [-241560, 361551, 478410, 1510592, 2321538, 465979, -3414538, -5651432, -4397248, -1612269, 320429, 1134196, 997620, -710980, -3356149, -4377908, -2741623, -1018160, -1872892, -4219105, -5125483, -4002928, -2375593, -738533, 1483279, 3452603, 3310319, 1200688, -507262, -460530, 177381, -80318, -1090925, -1881561, -1975750, -1383131, -362108, 485578, 797392, 1111333, 1987416, 2828593, 2865502, 2815690, 3779211, 4813340, 3900941, 1574911, 1058193, 3717547, 6572001, 6043652, 2652213, -14487, -139608, 631872, 307416, -593618, -281139, 1270630, 2070280, 1063735, -50186, 774964, 2473978, 1895760, -1439290, -3956885, -2759569, 348382, 1677620, 758137]
40247G58137r02104k02146p83321j045825Q24641K625923J331248j578893k242482
40238a214822n05943M62437j33691O3556J638100K130416N49588q21345m87186
40229A681110q9997r97164j671991n53091R98555R41283j93958n77733j65510
40220f28496k71590r88721j074155K0369J564180K652421K687472J266535j124956
40211D103059k714610k123814l38986L26451o23054j134935L42252K327207K181409
40202B344979q0837j653715q96544M42265J33582j085267j038977P2294J76627
40193a585593p18118k69862J956021L199350J768312l87744j110846j128618j528478
40184A94424j105152Q41078J782728k87747k582843j216192K362429L254159O52593
$$ y = [758137, -143967, -346113, -1129434, -2175259, -1350618, 1275305, 2606553, 1027660, -1214822, -1720765, -1258328, -1392019, -1328463, 309637, 2440053, 2989641, 2168296, 1681110, 1591113, 593949, -1078042, -1631133, -632578, 308705, 114747, -462986, -628496, -900086, -1888807, -2962962, -2942593, -1378413, 1274008, 3961480, 5228015, 4103059, 1388449, -735365, -1074351, -747900, -1370954, -2505889, -2163637, 163570, 2344979, 2264142, 610427, -286117, 156148, 289730, -795537, -1834514, -1762220, -1585593, -2303711, -2573573, -617552, 2581798, 4350110, 3962366, 2851520, 1722902, 194424, -910728, -69650, 1713078, 1425331, -1157512, -2373704, -11275, 3242884, 3895477]
40175C895477j384555p93186j56938j328762k014149n79K769445L074601R86419
40166E047773q89220j134144m63467l2571k80111p79413o03960L90155Q44872
40157B099914j30533r20792L26482J956218O12882l082394m470889j571023J895755
40148c284380K066161O5919r05293n64944n36751o63471K98084J676134J667142
40139a81399L69525n00466l29928J03474M37081Q33852Q90019K45222l51404k46511
40129A269465l04362j313872j917211l49075K329620L114890J133082j341766
40121B620771k205073j834541j458589j024454J06268J435939J703081P43550
40113H6952j10637J79069Q83984N84585n70438q52521M41256J666492J116470
$$ y = [3895477, 2510922, 1717736, 1560798, 232036, -1782113, -1782692, 986753, 4061354, 5047773, 4158553, 3024409, 2560942, 2528371, 2248260, 1468847, 864887, 1255042, 2099914, 1969381, 1048589, 1375071, 3331289, 3944171, 861777, -3609112, -5180135, -3284380, -1218219, -1152300, -2057593, -2622537, -3159288, -3822759, -3524675, -1848541, -181399, 188126, -312340, -642268, -538794, -101713, 732139, 1622158, 1867380, 1515976, 1269465, 965103, -348769, -2265980, -2615055, -285435, 2829455, 3962537, 2620771, 415698, -1418843, -2877432, -3901886, -3795618, -2359679, -656598, 86952, -23685, 155384, 1039368, 1623953, 1053515, 200994, 642250, 2308742, 3425212]
40104C425212n36096j518397j612095j664540j400447j08085J111953N50527q95245
40095b647213p27819Q57674J051658o57507j332613M07570J956485J232832O3650
40086B04717N00332J056380j89414j555622n25729J551607J420300p99796k050447
40077c87672j198196Q4324P63120J352121J559636K77337j811163k402277q24312
40068b587082J086754J629329Q67634l52070j220459j017640r083K75906o70906
40059a997617q82584J086555L070193K112833p08930j733800l47671N98832j27880
40050A069931o27776P8271M35614j51909L987J241132J220077q39168k009414
40041D20745j89852K198817J888420k96468j207877k17760Q01331J006868J049985
$$ y = [3425212, 2889116, 1370719, -241376, -1905916, -3306363, -3414448, -2302495, -1751968, -2647213, -3375032, -2517358, -1465700, -2123207, -3455820, -3048250, -1091765, 141067, 204717, 705049, 1761429, 1572015, 16393, -509336, 1042271, 2462571, 1662775, -387672, -1585868, -1501544, -738424, 613697, 2173333, 2450670, 639507, -1762770, -2587082, -1500328, 129001, 996635, 644565, -575894, -1593534, -1602617, -1326711, -1997617, -2880201, -1793646, 1276547, 3389380, 2680450, 946650, 598979, 1197811, 1069931, 442155, 520426, 956040, 804131, 808118, 2049250, 3269327, 2430159, 420745, 230893, 2429710, 4318130, 4021662, 2813785, 2596025, 3397356, 4404224, 5454209]
40032E454209Q24388l71604j772607j791304o41995r6636n97242o81463M54107
40023G79853J627126J397303j81152j895214k501855j480560M05482J424515O92476
40014B67974o00716p61346J13546O75098N98402O36298O97693j39238j511066
40005b3355j677578j90365J161565R89237K26228K43767N76651Q4288q03239q25219
39995b38020j68027j22614p59695q17348j7957L14282m76137j055928m8976J782247
39985a608173K467268J402643m9239m27898J22332K48159p53081j773069j076618
39976a447676J143118K297208N87964k051309k082746O54314K426768Q54498j719648
39967F62491j791382M02715J942734J799104J510403J836474J599090J37601j472233
$$ y = [5454209, 6278597, 5906993, 4134386, 2343082, 1701087, 1604451, 1007209, 325746, 779853, 2406979, 3804282, 3623130, 1727916, -773939, -2254499, -1849017, -424502, 267974, -332742, -1094088, -980542, -305444, 292958, 929256, 1626949, 1487711, -23355, -1700933, -1891298, -729733, 259504, 485732, 729499, 1306150, 1390438, 587199, -238020, -406047, -528661, -1288356, -2105704, -2123661, -1809379, -2285516, -3341444, -3390420, -1608173, 859095, 2261738, 2212499, 1784601, 1906933, 2155092, 1402011, -371058, -1447676, -304558, 1992650, 2580614, 529305, -1553441, -899127, 1527641, 2382139, 662491, -1128891, -726176, 1216558, 3015662, 4526065, 6362539, 7961629, 8099230, 6626997]
39958F626997k245553k394253k081730r44807N20402R12505N8246m58433K45075
39949B38449R25227K25367j268403k020685j478713j65757J082978J328941J97169
39940i35427j073656o63088J130083J897878O38342p03008m43310J84973n18269
39931d85482j492644o78372J201582J448160m15965j911264j278458M06523J376260
39922a829660J456032J270543P21005m83837j634044j560089j47717J446450K036421
39913A275104J378981l380j373785j938019j067573Q69389K164546J397456m12750
39904B289969p15357Q33707J351580r52368l274434j864347J903928K815828o06624
39895A781882l647224k058245K074491L598187J204072j682445j806844M96754
$$ y = [6626997, 4381444, 1987191, -94539, -1039346, -518944, 393561, 451807, -6626, 238449, 1163676, 1389043, 120640, -1900045, -3378758, -3544515, -2461537, -1132596, -935427, -2009083, -2672171, -1542088, 355790, 994132, 291124, -152186, 32787, -485482, -1978126, -2656498, -1454916, -6756, -422721, -2333985, -3612443, -3205920, -1829660, -373628, 896915, 1617920, 1134083, -499961, -2060050, -2207767, -761317, 1275104, 2654085, 2650705, 1276920, -661099, -1728672, -859283, 1305263, 2702719, 2289969, 1574612, 2408319, 3759899, 2807531, -466903, -2331250, -427322, 2388506, 1781882, -1865342, -3923587, -1849096, 1749091, 2953163, 1270718, -536126, -39372]
39887c9372K467690J965232n16724k286081j485248L38083J70214j968154k801580
39878d155940o84813J957680K329682Q38452n84333j228720r42431O75798K424760
39869F30135J563706j914116l869833j696098J412820J272022q95208j005852
39861d502424J091266K068863J046868K62190M02156o9458r80849l35570J473304
39852D56346J578804m47149j534178m1353J816862J696938J33658j301850j948128
39843D09950j272711Q82706K503864J080286k026487k440707O92578K804465N86323
39834C220267l036995l486917j082066M72626P3539r9999R58328J479600J54620
39825a346997j563653j402048P48271K664730K324064K38262j037193M845J810654
$$ y = [-39372, 2428318, 4393550, 3876826, 1590745, 105497, 443580, 613794, -1354360, -4155940, -4840753, -2883073, -553391, 285061, -299272, -1527992, -2470423, -1794625, 630135, 2193841, 279725, -3590108, -5286206, -3873386, -2601364, -3496572, -4502424, -3411158, -1342295, -295427, -33237, 368919, 299461, -681388, -1016958, 456346, 2035150, 1588001, 53823, 12470, 1829332, 3526270, 3659928, 2358078, 409950, -862761, 19945, 2523809, 3604095, 1577608, -863099, -170521, 2633944, 3220267, 183272, -3303645, -4385711, -3913085, -3839546, -3939545, -2981217, -1501617, -1346997, -2910650, -4312698, -3564427, -899697, 1424367, 1662629, 625436, 630281, 2440935]
39816B440935J806383o9052j432228r37187J54486K89842k50094l76748K2222
39807A648559K96772J59509j54194l11336j05780L29596N78985N84074O85941
39798C712126N35399q64340k978836l154271j07836L319991L359151L72371j883922
39789B309833j419734L08510J439188J538832N24211j422864k785537k133228
39781a640789n41727j05181m96811J41336J524937J804438J232883J453390J628137
39772E000613l22073k852405k250662P04649J195001j421220k034678J291186
39764f89589L260100Q4514l623496k052964K403915L228465R0403j562558K98126
39755A436916J944288Q07203q92312p04635K06566k83969j662907j827413k49922
$$ y = [2440935, 4247318, 4178266, 2746038, 1808851, 1963337, 2253179, 2003085, 1626337, 1648559, 1945331, 2104840, 1950646, 1639310, 1533530, 1863126, 2442111, 3026185, 3712126, 4247525, 3383185, 404349, -2749922, -2857758, 462233, 3821384, 4193755, 2309833, 890099, 1198609, 2637797, 4176629, 4700840, 3277976, 492439, -1640789, -2182516, -2287697, -2784508, -2643172, -1118235, 686203, 1919086, 3372476, 5000613, 4678540, 1826135, -424527, 280122, 1475123, 53903, -1980775, -689589, 2570511, 2655025, -968471, -3021435, -617520, 2610945, 2701348, 1138790, 1436916, 3381204, 4188407, 3296095, 2591460, 2798026, 2514057, 851150, -976263, -1226185]
39746a226185J375178J226998m68357j512967l95790J463999J488302k49451j192457
39737E09270n04575k14765j217093j376856N47317K216505J443937j22906O9427
39728A350261J196597Q27728q19606j496712n19531R24863J903545J942870N30435
39719E840450j528855j973600l00330R80171L55901j12148J167564J786450n66811
39710E648792l278797k455491O75437J660431k55820j740610j098822P7311O33495
39701a34074J094979J259304K47572j109265j234431p60267j294771k012995j004520
39692d948468Q60360J255403O98913J333121K250709P95232j907839j912354Q19546
39683g55377J954209n9824j653869n32359O80103m69379k033039j432545J81201
$$ y = [-1226185, 148993, 1375991, 907634, -605333, -1001123, 462876, 1951178, 1701727, 509270, 4695, -210070, -1427163, -2804019, -2256702, -40197, 1403740, 1280834, 1350261, 2546858, 3374586, 2554980, 1058268, 538737, 1463600, 3367145, 5310015, 5840450, 4311595, 2337995, 2037665, 3017836, 3373737, 3261589, 4429153, 6215603, 5648792, 2369995, -85496, 589941, 2250372, 1994552, 253942, -844880, -767569, -134074, 960905, 2220209, 2467781, 1358516, 124085, -636182, -1930953, -3943948, -4948468, -4088108, -2832705, -2133792, -800671, 1450038, 2245270, 337431, -1574923, -755377, 1198832, 1139008, -514861, -1047220, -367117, -836496, -2869535, -4302080, -4120879]
39674d120879L67209n68294p02598M25618J953625L041119K688573L53111k205207
39665A232277k214065J8330J168577j0820j039848l81408P5498q88319j180191
39656c219969M81079J479110l40821k394888j223839J864390K981534J631188
39648A257784M86604M41468j24638j594724k206417j054390P42814J964854K148641
39639B061996Q33089j711000l282462j754754J684142L567998K570981P23683
39631D693673j9125j57322q50453j696176j529233l05218Q79778J105289L88307
39622B509520m40002l98874N73465J156774j1510k340814l438841j790205J229064
39613b951423K685427J310636j203499k270743j215337M61485J185609Q04532
$$ y = [-4120879, -3753670, -4321964, -5024562, -4598944, -2645319, 395800, 3084373, 3437484, 1232277, -981788, -963458, 205119, 194299, -845549, -1226957, -1151459, -2039778, -3219969, -2738890, -1259780, -1600601, -3995489, -5219328, -3354938, -373404, 1257784, 1744388, 2185856, 2061218, 466494, -1739923, -2794313, -2051499, -86645, 2061996, 2895085, 1184085, -2098377, -3853131, -2168989, 1399009, 3969990, 4693673, 4674548, 4517226, 3666773, 1970597, 441364, 136146, 1015924, 2121213, 2509520, 2069518, 1670644, 2244109, 3400883, 3389373, 1048559, -2390282, -4180487, -2951423, -265996, 1044640, -158859, -2429602, -3644939, -3183454, -1997845, -1193313]
39605a193313N5003l76250M0081J353843K342120J301389j433627l059696j719739
39596b690189Q47526J695039N84349m57949n34066m42209m14333J37438P23529
39587e50865J49078j032058q51814R12674K214360J835296Q07209K83422K16663
39578C983965N93162J602878K056253K38139k840442l731133j269259J552165
39570B185728J815363L01740p30347r73975j274390j419848q81919k73480k25476
39561a476604j53712L43170M14727k31970k55022Q92359J373105j07752j588379
39552g90078n75932J858615K412009K46788k131049k401524p55201J191220K088047
39543A142895J497413J31310o78838n58998n40860j219736j560376n78868R49288
$$ y = [-1193313, -1138310, -1514560, -1474479, -120636, 2221484, 3522873, 2089246, -970450, -2690189, -1842663, -147624, 436725, -21224, -555290, -997499, -1411832, -1274394, -550865, -401787, -1433845, -2285659, -1372985, 841375, 2676671, 3483880, 3767302, 3983965, 4577127, 6180005, 8236258, 8474397, 5633955, 1902822, 633563, 2185728, 4001091, 4302831, 3572484, 2598509, 1324119, -95729, -977648, -1251128, -1476604, -1630316, -1287146, -872419, -1104389, -1359411, -467052, 906053, 798301, -790078, -1366010, 492605, 2904614, 3151402, 1020353, -1381171, -2136372, -945152, 1142895, 2640308, 2771618, 2092780, 1533782, 992922, -226814, -1787190, -2366058, -1416770]
39534a416770J673976J445382P45231l54929j388249j105969N70239J648687Q03746
39525B621344m47295j74619Q41710O19382o85103j367389j132294j017028j101847
39516a843139o78897j00417j69728l00706M24831J075893K74627q90635k47297
39507b455468J513088J452533q11380k123054n21902J879353K143270L74704j221624
39498B29520j432789o21962N81241J729090K287319J849033L88773j734130l407568
39489a31473k908254J25824L114568K849223l72179k869646k327754l34328O84805
39480b169214Q20868J319279J707223O36596j265556j774222l24855J084046Q12983
39471H47148j81144j05106P38036L90192j483398k461999n71569K475969L041165
$$ y = [-1416770, 257206, 1702588, 2447819, 2092890, 704641, -401328, 168911, 1817598, 2621344, 2174049, 1999430, 2841140, 3460522, 2775419, 1408030, 275736, -741292, -1843139, -2522036, -2622453, -2792181, -3092887, -2668056, -1592163, -1317536, -2208171, -2455468, -942380, 510153, -301227, -2424281, -2946183, -1066830, 1076440, 1451144, 229520, -1203269, -1825231, -1243990, 485100, 2772419, 4621452, 5010225, 3276095, -131473, -3039727, -2913903, 200665, 3049888, 2677709, -191937, -2519691, -2854019, -2169214, -1348346, -29067, 1678156, 2314752, 1049196, -725026, -1049881, 34165, 847148, 666004, 560898, 1298934, 1689126, 205728, -2256271, -2827840, -351871, 2689294]
39462B689294L77742k306271k238069n44802R1633m88260m04015P43190J441766
39453f37792J128667Q85970R33393l2559k043689k772987q56399J569592J689467
39444a36337N5274n21298N79066J049401m03673j863310j137800R14127J743826
39435B79276Q02330q1557K05557N10023m65995j967361k183409o44861J362163
39426b183834K323397J692730M1405j282651j155002P584N85257L2604k80542
39417b19052M91570Q62792n41980k107236j408947O20426R33539m96588n31228
39408b396704J524314K221096k99053k664680j315956J822350K335230o8111j828104
39399f69618j274523j82841J37269O45553J887352K482153J323518p49575k242911
$$ y = [2689294, 3067036, 760765, -1477304, -2022106, -1930473, -2418733, -2822748, -2079558, -637792, 490875, 1376845, 2310238, 2277679, 233990, -2538997, -3395396, -1825804, -136337, -81063, -602361, -23295, 1026106, 622433, -1240877, -2378677, -1464550, 279276, 1081606, 1000049, 1205606, 1715629, 1249634, -717727, -2901136, -3545997, -2183834, 139563, 1832293, 1873698, 591047, -563955, -556371, 28886, 61490, -219052, 272518, 1135310, 593330, -1513906, -2922853, -2302427, -1368888, -1865476, -2396704, -872390, 1348706, 1049653, -1615027, -2930983, -1108633, 1226597, 1158486, -669618, -1944141, -2126982, -1989713, -1344160, 543192, 3025345, 4348863, 3599288, 1356377]
39390A356377k426087j213621P35294J696567M27321j800898k434166j004337
39382d663550N17086P82964M72039L71827J89606j28889J22487Q41865Q26871
39373f67694j51104p08074j15000N36376L81142K14834O79717P34741n02452j776895
39363a374409j330367M04723J426217Q93940k15983p34487l11040P36389J424238
39354I19221N49958j606617k735880j232654J166047J512568Q2715P8242K424352
39345A157952L759854J351966k413371l216745r96441L86374p44134j734843m00602
39336b849990J445135J239011k32625o14404M6867M8862n10181j18673R87370
39327e58628J151919N02400O86304J392323M99689j750207k208773K82679K646686
$$ y = [1356377, -1069710, -2283331, -1548037, 148530, 575851, -1225047, -3659213, -4663550, -4146464, -3363500, -2891461, -2519634, -2330028, -2458917, -2336430, -1494565, -667694, -818798, -1526872, -1641872, -1105496, -724354, -509520, 170197, 904938, 402486, -1374409, -2704776, -2300053, -873836, 20104, -195879, -930366, -1241406, -505017, 919221, 1469179, -137438, -2873318, -4105972, -2939925, -1427357, -1344642, -1266400, 1157952, 4917806, 6269772, 3856401, 639656, -356785, 29589, -714545, -2449388, -2849990, -1404855, -165844, -398469, -1012873, -966006, -917144, -1427325, -1545998, -558628, 593291, 1095691, 1781995, 3174318, 3674007, 1923800, -284973, -2294, 2644392]
39318B644392K012441l35598j466290q94702m5476L71557L88657q8837m15959
39309B170185O92999K615798K607287p4049k366048j908697n83977q26559j318375
39300A008564L2549J442156N9906k381800j665201J972726L892855K065264n57924
39291E869095j253136q24567o01919q88J331249K013362J157362k50593j232115
39282F207850j854550j801462m15961J263647J197227k89385o41163O99456J279439
39273E645098l2142q68508O97248K781406K462687o5760k218382k452386j208818
39264D740443M19131J430888J177034M44r98563j316073j293269r01789M05082
39255C663328K367086L728953L660865K400436O57906o67137q76860o75430j686889
$$ y = [2644392, 4656833, 4321235, 2854945, 1960243, 1914767, 2286324, 2674981, 2586144, 2170185, 2863184, 5478982, 8086269, 8012220, 5646172, 3737475, 3153498, 2326939, 1008564, 1041113, 2483269, 2543175, 161375, -1503826, 468900, 4361755, 6427019, 5869095, 4615959, 3791392, 3189473, 3188585, 4519834, 6533196, 7690558, 7439965, 6207850, 4353300, 2551838, 2135877, 3399524, 4596751, 4307366, 3666203, 4365659, 5645098, 5612956, 4744448, 5441696, 8223102, 10685789, 10620029, 8401647, 5949261, 4740443, 5159574, 6590462, 7767496, 7767940, 6769377, 5453304, 4160035, 3258246, 3663328, 6030414, 9759367, 13420232, 15820668, 16478574, 15811437, 14934577, 14259147, 12572258]
39246A2572258l407287k767562J015313L799985K187730q28002m79867J950395
39238A4042963J787198l69282L09023L770831M748439K204087J219852L772939
39230C1486050N649335N101908O254429J0265313J1736739Q928219Q854254J5702074
39222A03978321K2971461K5870262L2944693N2501590P2008650O5885244K6212046
39215D02372267k4333808n3879461n0056819k6067582l492655R158167K2633436
39208B76333545M9378108P8226846P5913145K4370126m9392377r5334782r1899602
39201B67595009o2116239l8308379k7975018k1070006j4093600j2014485j4511440
39194G7505842j5006927j1494099q030933o443256m668181k486009j831141k048822
$$ y = [12572258, 9164971, 6397409, 7412722, 11212707, 13400437, 12572435, 12092568, 14042963, 15830161, 15460879, 15769902, 19540733, 24289172, 26493259, 27713111, 31486050, 37135385, 42237293, 48491722, 58757035, 70493774, 79421993, 88276247, 103978321, 126949782, 152820044, 185764737, 238266327, 310274977, 376160221, 402372267, 378038459, 324158998, 274102179, 248034597, 244541942, 253700109, 276333545, 325711653, 403938499, 479851644, 504221770, 454829393, 359494611, 267595009, 205478770, 167170391, 139195373, 118125367, 104031767, 92017282, 77505842, 62498915, 51004816, 42973883, 36530627, 31862446, 29376437, 27545296, 25496474]
39186B5496474r86986M8352j744074m718413m677197j946026o33579j330091p25187
39177H783273J398623J215426j951163l576849j209890J547850J046227j052062
39169F201435j581135j114215j717396k399175p83348K297506L502717J706005
39161F112394p95049j658533q97258K18659R16777J105385Q67595L60671j02650
39152F127991j98717N7040J54888k85687o05657L02085J939585K020750l46657
39143I165621k569484j757243Q73127J466794q19816k639849j504869R03005J733725
39134D851011P35114o35173j647551j930816o12159J953954L191555J471134r74263
39125F402806r03577J138415J838550M26607m28388N23780Q55528j236414l272974
$$ y = [25496474, 24509488, 24557840, 22813766, 18095353, 13418156, 11472130, 10838551, 9508460, 8783273, 10181896, 11397322, 9446159, 5869310, 4659420, 6207270, 7253497, 6201435, 4620300, 3506085, 1788689, -610486, -1393834, 903672, 4406389, 6112394, 5317345, 3658812, 2761554, 2980213, 3896990, 5002375, 5869970, 6230641, 6127991, 5929274, 5986314, 6141202, 5855515, 5249858, 5551943, 7491528, 9512278, 9165621, 6596137, 4838894, 5712021, 7178815, 6358999, 3719150, 2214281, 3117286, 4851011, 5586125, 4950952, 3303401, 1372585, 760426, 2714380, 5905935, 7377069, 6402806, 5499229, 6637644, 8476194, 8902801, 8474413, 8998193, 9853721, 8617307, 5344333]
39116E344333j936932J482648K339682q80773m264919l608936L17551L251885
39108B044539K843115O16641r84685j411384j301797p15476M79147J290891L83232
39099C244223j745228k731195j110885J750561L206823K274981L20581q85507
39091D324354j005870r03530j090797r23946L93799K166917K359486J02065k546616
39082B875862k705719m88916R99925Q5251j002052L68582K885284L010508L65187
39073F393912j577877o73321Q36846j8028k393725l032795j057523J065557J167044
39064G10090q9259p34367l5364J156842J623113P84130q20474j725346q83586
39055a4221R46024J899868J305904L42194K1788l12672j533850k708993k014598
$$ y = [5344333, 3407401, 4890049, 7229731, 6348958, 2084039, -1524897, -1207346, 2044539, 4887654, 5504295, 4519610, 3108226, 1806429, 1090953, 1570100, 2860991, 3244223, 1498995, -1232200, -2343085, -592524, 2614299, 4889280, 5209861, 4324354, 3318484, 2414954, 1324157, 400211, 794010, 2960927, 5320413, 5422478, 2875862, 170143, -318773, 681152, 766403, -235649, 132933, 3018217, 6028725, 6393912, 4816035, 4142714, 4979560, 4961532, 2567807, -464988, -1522511, -456954, 710090, 620831, -113536, -148900, 1007942, 2631055, 3415185, 2594711, 869365, -14221, 931803, 2831671, 4137575, 4479769, 4501557, 4188885, 2655035, -53958, -2068556]
39046b068556N25047K606413K322234L07892j272914j196868j28660M06804m34360
39037A067032j909118k102901P1495K972826L405321N92984k135098j262567K056856
39028B756830L327378Q48017k174366k561619j406702j290003j646509j74951
39020b321925K374978K622074r2708k262296j220017J293179K139638J013249
39012C546172k09132n41392l52498k677K61761r597o05687n57754P0423j42230
39002A457389j332338j413151N03314J961387Q44560r21953m49374J161466P72024
38993B583324j081373q47877J829905L080618Q66027j987332k353812q97874K54680
38984A446286Q80020J600365J971153J627831J217912N92677j525897m433275
$$ y = [-2068556, -1543509, 1062904, 3385138, 3693030, 2420116, 1223248, 1094588, 1501392, 1067032, -842086, -2944987, -2873492, 99334, 3504655, 4097639, 1962541, 699974, 2756830, 6084208, 6932225, 4757859, 2196240, 789538, -500465, -2146974, -2321925, 53053, 2675127, 2582419, 320123, -899894, 393285, 2532923, 3546172, 3337040, 2795648, 2443150, 2440473, 2702234, 2692637, 2086950, 1529196, 1599619, 1457389, 125051, -1288100, -784786, 1176601, 2021161, 1099208, 649834, 1811300, 2583324, 1501951, 654074, 2483979, 5564597, 6430624, 4443292, 2089480, 1191606, 1446286, 2326306, 3926671, 5897824, 7525655, 8743567, 9336244, 7810347, 3377072]
38976C377072m829449j589138J610182J268580q39129r28965O24205N50076j189102
38967a945668j197224J371136L028918J427221r79337p68698J490495K475012
38959D901855Q82964j229448j456016K16062J796692J560594k97296j962551j889078
38950B523778m19360O30841P3660j159050r59191J274606L254078K130131j532551
38941E816942l662299j810923J272626J530938l51164l58187J932617K432830
38933F803380m60268k759709j300238J142681Q43739n30421O81947L211402K886565
38924A0519078J30765l22890K915765N888317N717981M267310M105958N189974
38916C8412258P202483J1023332J5438777J5809616R017384k186402j1847333
$$ y = [3377072, -1452377, -3041515, -1431333, -162753, -1001882, -1930847, -1306642, -756566, -1945668, -3142892, -1771756, 1257162, 2684383, 1705046, 936348, 2426843, 4901855, 5784819, 4555371, 3099355, 3315417, 5112109, 6672703, 6375407, 4412856, 2523778, 2104418, 2735259, 2808919, 1649869, 690678, 1965284, 5219362, 7349493, 5816942, 2154643, 343720, 1616346, 3147284, 2796120, 2437933, 4370550, 6803380, 6343112, 3583403, 2283165, 3425846, 4269585, 3739164, 4421111, 7632513, 10519078, 10649843, 10326953, 13242718, 19131035, 24849016, 29116326, 33222284, 38412258, 45614741, 56638073, 72076850, 87886466, 96903850, 94717448, 82870115]
38909H2870115j6197109j5200436j1126449p273904n989391o205732m703685r77193
38901A5196216J529835M66447j885116k222705q68457k29163p03120r50121p02443
38892I631373n79390l14650L38156J61423j566945k933210j891581K44816O73297
38883C763289n67023j202378p64021o09027n33186Q03446K209560R54816j991214
38874B064262k226636J052927K910642K70226k744358j224934K359468J980930
38866D442527k001017l170342O23813L769249J839269j689532j476764J406352
38858C743555K250603P92740Q03226K876323L468873J435766J73658J910250M587469
38849B2042463O216033P752680R421761R125723P850704J1366825K0997757K6862289
$$ y = [82870115, 66673006, 51472570, 40346121, 33072217, 27082826, 20877094, 16173409, 15196216, 16726051, 17192498, 15307382, 13084677, 12216220, 11987057, 11283937, 10333816, 9631373, 9051983, 8737333, 9075489, 9236912, 7669967, 4736757, 2845176, 3089992, 3763289, 3196266, 1993888, 1229867, 620840, 87654, 891100, 3100660, 4055476, 2064262, -162374, 890553, 3801195, 4071421, 1327063, 102129, 2461597, 4442527, 2441510, -728832, -105019, 3664230, 5503499, 3813967, 2337203, 3743555, 5994158, 6786898, 7590124, 10466447, 13935320, 15371086, 15544744, 17454994, 22042463, 28258496, 36011176, 45432937, 54558660, 62409364, 73776189, 94773946, 121636235]
38841A21636235J7898018k733058j9655940k3139090j8114762j3934043j2333200
38834D9624160r650504n417716k821129k993874l883708m077385m078569m080626
38826A2620649l338764j784129k97186M88351L59277p88030k192284k223390n49077
38817B295417Q33468K51377j159129j298293k27978M69247M30515N14284P60308
38808B869216M38812k13022j76639N75591J044437P66129Q4867q26507j925972
38799B636912k584755k106949p43133O42160J405293J044569n93501k186477j543764
38790d029645J304056L221958J965879n04711r40708M22261Q09679l64543r74741
38781I09485k20865M6666j279175k534303j803485M39037K283429K625068J703032
$$ y = [121636235, 139534253, 136801195, 117145255, 94006165, 75891403, 61957360, 49624160, 39973656, 34555940, 31734811, 28740937, 24857229, 20779844, 16701275, 12620649, 9281885, 7497756, 7200570, 7688921, 8048198, 7260168, 5067884, 2844494, 2295417, 3128885, 3380262, 2221133, 922840, 694862, 1164109, 1594624, 2108908, 2869216, 3308028, 3095006, 2918367, 3493958, 4538395, 5304524, 5389391, 4562884, 2636912, 52157, -2054792, -2797925, -2155765, -750472, 294097, -299404, -2485881, -4029645, -2725589, 496369, 2462248, 1957537, 1016829, 1439090, 2248769, 1884226, 909485, 688620, 735286, -543889, -3078192, -4881677, -4442640, -2159211, 465857, 2168889]
38772B168889N07099J12271O76910J034361K31822q93056r64720l31074l34335
38763B208167q29126n60113K66517K20786n18790k40940R55153P49138j408226
38754H42566k664353q81730J906185K363204N44772o61042J12465J205104O58780
38745C425951j261621k581679j783485O25623K365516J628350o46837j589369
38737A82449P912J985572J643089o86266k204539j326498N56912J097392j58734
38728A097289j363738o00885J677878K816100J064777j846050k455574k8540K256734
38719B617991J424209j378217k571710r21312J243641J521905L44400l38378N2714
38710A995243M21813O0129l35314N7377Q82567J212545Q21490Q1304r56097k352906
$$ y = [2168889, 2675988, 2788259, 3465169, 4499530, 4731352, 3838296, 2873576, 2542502, 2208167, 1379041, 818928, 1085445, 1306231, 787441, 546501, 1501654, 2250792, 842566, -1821787, -2703517, -797332, 1565872, 2110644, 1449602, 1562067, 2767171, 3425951, 2164330, -417349, -2200834, -1575211, 790305, 2418655, 1771818, 182449, 190361, 2175933, 3819022, 3132756, 928217, -398281, 158631, 1256023, 1097289, -266449, -867334, 810544, 3626644, 4691421, 2845371, 389797, 361257, 2617991, 4042200, 2663983, 92273, -829039, 414602, 1936507, 2280907, 1942529, 1995243, 2417056, 2477185, 2141871, 2199248, 3081815, 4294360, 5115850, 5197154, 4241057, 1888151]
38700A888151l346474k833919j028635M76749O85390J73884k66628o53978q58766
38691e764226r8758J570345K595896J983190P58613J25163l76100j267792j308521
38682a782190N24884K526905K311088M78517m23582P3382K00927o34012j259729
38673B016190j391316j838946k060558o60704J453093J690402p099r17789m6564
38664a763291P16611O38915J278287K397120J233769k159927l481227r22650J227660
38655h34733m81591k522264j87013M038719L948272o47736l897530k850291n10522
38646c944689K03872P9095K69367J69661r0307P89009K017035J068782j456832
38637h95007j555723J856139M463279K758477r78900k671553k117547j526476
$$ y = [1888151, -1458323, -4292242, -5320877, -4844128, -4158738, -3984854, -4251482, -4905460, -5764226, -5862984, -4292639, -1696743, 286447, 1045060, 1170223, 794123, -473669, -1782190, -1257306, 1269599, 3580687, 4059204, 3635622, 3709004, 3909931, 3275919, 2016190, 624874, -1214072, -3274630, -3935334, -2482241, -791839, -798938, -1716727, -1763291, -1046680, -407765, 870522, 3267642, 4501411, 2341484, -1139743, -2062393, -834733, -1316324, -3838588, -4025601, 13118, 3961390, 3313654, -583876, -3434167, -3944689, -3740817, -3661722, -3392355, -3222694, -3313001, -2523992, -506957, 561825, -895007, -2450730, -594591, 3868688, 6627165, 5648265, 2976712, 859165, -667311]
38629f67311j154965N7149J395267J356338N28742M68986O69072m71350k325098
38620a43170k524428o16802J201430J200955Q4854m37810L06959J527870J784645
38611B384503M45307j263817j515762n19987k82990j088405o25644J799560K917519
38602B250284J84623l434742l156991M74666K363389M61625j722349r54249J371976
38593b161768K323473J623207P10694O5691m54973m13897K63685N86790J38144
38584B681046p9597L66755K63358r79611j832613j049373K02398M14081K26466
38575B12910Q13095J377386N92553p56752r90331l29283q2478p4003N62131J015046
38565B340274R2019r38608k1601J669795J002654j773259k805126n67706J755223
$$ y = [-667311, -1822276, -1765127, -369860, 986478, 1515220, 1984206, 2653278, 2181928, -143170, -2667598, -3284400, -2082970, -882015, -797161, -1234971, -928012, 599858, 2384503, 2829810, 1565993, 50231, -469756, -752746, -1841151, -2466795, -667235, 2250284, 2434907, -999835, -4156826, -3682160, -1318771, -857146, -2579495, -3533744, -2161768, 161705, 1784912, 2495606, 2561297, 2106324, 1692427, 1956112, 2542902, 2681046, 2601449, 2968204, 3231562, 2251951, 419338, -630035, -427637, -13556, 212910, 1026005, 2403391, 2995944, 2239192, 1248861, 919578, 837100, 763097, 1325228, 2340274, 2432293, 1493685, 1472084, 3141879, 4144533, 2371274, -433852, -1001558, 753665]
38556G53665J288263o40845j582546j688379j894320j293788P19065K049709Q67807
38547a421369q80849k63663J817368K137247M47038m99125K11648N94121k21142
38538A921274n97516J45737K59947j108632k078746j168122K77291O03394N23331
38529a222042J201580J618244K72730j811403k262648q36321N20162P17588N60405
38520a241705P22594N89304l67978j412916j447255m02677P26698R15264N6053
38511a862618q92686q41431J62730R71273Q81048N48149Q69647J558632J561592
38502B956336N39031p36888j265632o80098M54546Q98902j63110j906587k433853
38493b337353j083487O00213R19945K40027J28969R14686J387320P84918j33394
$$ y = [753665, 2041928, 1401083, -181463, -1869842, -3764162, -5057950, -4338885, -2289176, -1421369, -2302218, -2565881, -748513, 1388734, 1835772, 1336647, 1548295, 2142416, 1921274, 1323758, 1469495, 1729442, 620810, -1457936, -2626058, -2348767, -1745373, -1222042, -20462, 1597782, 1870512, 59109, -2203539, -3039860, -2519698, -1802110, -1241705, -519111, 70193, -297785, -1710701, -3157956, -3560633, -2833935, -1918671, -1862618, -2755304, -3596735, -3434005, -2462732, -1581684, -1033535, -163888, 1394744, 2956336, 3495367, 2758479, 1492847, 812749, 1267295, 2166197, 2003087, 96500, -2337353, -3420840, -2820627, -1900682, -1660655, -1531686, -617000, 770320, 1555238, 1421844]
38484A421844k77940L06017O02337k3095r18591p90937N52260J489553M39029
38475B800477j742975k499819r73380Q37903J038287L36363K74212M22417o62940
38466a69455k457943k660230m65432K094826K628826J103720m30505k57912J193108
38457E79003J896034P53126p29758l43679J406175J737611k0487j034934M51631
38448D694722J834795K14412k497663k306686L65723J237801j016565k874075
38440c47536j646141Q99223J963873J332855J5816j558913k344439p71235K117894
38431c38603K721482J40156j827011m53597J516988N90598j526333j056194J149964
38422I17450J166425r60904j171866J459555K788442K65677k957447k959727o05523
$$ y = [1421844, 1143904, 1449921, 2052258, 2029163, 1110572, 319635, 871895, 2361448, 2800477, 1057502, -1442317, -2415697, -1577794, -539507, -203144, 71068, 493485, -169455, -2627398, -5287628, -5753060, -3658234, -1029408, 74312, -356193, -614105, 579003, 2475037, 3228163, 2498405, 2154726, 3560901, 5298512, 5278025, 4243091, 4694722, 6529517, 6743929, 4246266, 1939580, 2305303, 3543104, 2526539, -347536, -1993677, -1094454, 869419, 2202274, 2218090, 659177, -1685262, -2456497, -338603, 2382879, 2523035, 696024, 242427, 1759415, 2350013, 823680, -232514, 917450, 2083875, 1122971, -48895, 1410660, 4199102, 4464779, 1507332, -1452395, -2057918]
38413b057918O55312O9847l57052L13677R02012M79901l76178q39709q94025q39870
38403b944003o15778M4357J074412J867559J752164Q53403J30792Q2714q9004
38394B156616j180515k351751k037267k70344J288362J648605J372011R92265
38386A617982J48331j147025j840221j320965m53981k14648k18081M16849J451832
38377a559927J837335J272952M88547J8194m66524j275624j733429q91827P18820
38368a591483J084476n69556j881618p8977L554349M498462J162566k497270k409036
38359A271913J17189J100870n2271q13729m31516m39374q11928J36961J813249
38350A891364J467621r95918k365130j360333m69479j051799q34586J436862K892185
$$ y = [-2057918, -1402606, -1332759, -1689811, -1376134, -474122, 5779, -370399, -1210108, -2104133, -2944003, -3559781, -3515424, -2441012, -573453, 1178711, 2032114, 2162906, 2245620, 2156616, 976101, -1375650, -3412917, -3683261, -2394899, -746294, 625717, 1617982, 1766313, 619288, -1220933, -2541898, -2995879, -3210527, -3428608, -3011759, -1559927, 277408, 1550360, 2038907, 2057101, 1590577, 314953, -1418476, -2310303, -1591483, -507007, -1076563, -2958181, -3037158, 517191, 5015653, 6178219, 3680949, 1271913, 1389102, 2489972, 2437701, 1623972, 1192456, 753082, -58846, 78115, 1891364, 3358985, 2363067, -2063, -1362396, -1831875, -2883674, -3718260, -2281398, 610787]
38341F10787J137777j457581j537320q518J26263j063747j177739K07594J429685
38332a732799J727656J349206j0396k051682k669892p99715J190627R38732k2662
38323b080925P56933J901326O82798j521643j183024J012537J050665j383018
38315g64351k186974J77863K207692J292425o02875j101180r66821j220449n67008
38306c731678J611847K903308J340846j225655j839866n26330O25010P21176L20580
38297A99238j50684m77375k96768J62313J85402l704M30137R28405J30180j237584
38287a30440q94569R72395J447882l26859j551135m74429P59403P574j383199
38278a573377j334972l66766K12070O90652J261101P45893p24427p74706J132956
$$ y = [610787, 1748564, 290983, -1246337, -1254855, -1128592, -2192339, -3370078, -3162484, -1732799, -5143, 1344063, 1333667, -718015, -3387907, -4187622, -2996995, -2058263, -2080925, -1323992, 577334, 1260132, -261511, -1444535, -431998, 618667, -764351, -2951325, -2773462, -565770, 726655, 123780, -977400, -1944221, -3164670, -3731678, -2119831, 783477, 2124323, 898668, -941198, -1467528, -842518, -121342, 199238, 48554, -428821, -725589, -563276, -377874, -381578, 48559, 976964, 1107144, -130440, -1025009, -52614, 1395268, 1068409, -482726, -957155, -197752, -190178, -1573377, -2908349, -3275115, -3063045, -2372393, -1111292, -365399, -1089826, -1864532, -731576]
38269g31576K014953L75518q28817N71744J759677L4897j841553m74558J530948
38260B411233k01123l645607l186130R16090K852701P31510j130828o6572J260893
38251e7833O36326m9486Q32340J539950O03697n97893r96571j604644k284866
38242a978980r94400J636507J501644k329049m566111j159912L939047M164462
38234B13208j24189k627361m83352K407228J889925q50772j979607n48659R87588
38225a115991P12172m23103n04150N11544J062598N64429O8849R1602k72901j089976
38215c94927o26381J517661K512169K37618k780709k760668m38400N20278k82366
38206b495725k4600J560007J589498l44129j124397J85161O74753p49485j191883
$$ y = [-731576, 1283377, 1658895, 830078, 1401822, 3161499, 3196396, 1354843, 880285, 2411233, 2210110, -1435497, -4621627, -3705537, -852836, -121326, -1252154, -1318726, -57833, 578493, 529007, 1361347, 2901297, 3504994, 2907101, 1910530, 305886, -1978980, -2973380, -1336873, 164771, -2164278, -6730389, -7890301, -3951254, 213208, 89019, -2538342, -3021694, -614466, 1275459, 424687, -1554920, -2103579, -1115991, -403819, -826922, -1331072, -819528, 243070, 807499, 876348, 967950, 695049, -394927, -1021308, 496353, 3008522, 3246140, 465431, -2295237, -2733637, -2213359, -2495725, -2520325, -960318, 629180, 285051, -839346, -654185, 20568, -728917, -1920800]
38197a920800N25549J194746p67186j762570O79627K822443P37664k625189j912519
38188c028235K004888L638980J332381j429639k197024j895389j319620J8380
38180b875278J348924R63502o26089j231503o33925l77922k50978J324100L396924
38171A037755K921861k65093k541874j695434J58267K53722r30204j144876K13994
38162a991882J801541K277714J425381m964j011485j291847j330244j185002j53473
38153a464261J538261K121058P76357o85512m10509O45378M53485q90236j852887
38144B31134j900460j045353J237050M049214M148225L11551l399604k708077
38136I23680L72616P13183j762637k507048k25142J599198J340460J390498K486004
$$ y = [-1920800, -1395251, -200505, -967691, -2730261, -2050634, 771809, 1509473, -1115716, -3028235, -1023347, 2615633, 3948014, 2518375, 321351, -1574038, -2893658, -2875278, -1526354, -562852, -1188941, -2420444, -3054369, -3432291, -3683269, -2359169, 1037755, 3959616, 3694523, 1152649, -542785, -384518, -130796, -1061000, -2205876, -1991882, -190341, 2087373, 3512754, 3507790, 2496305, 1204458, -125786, -1310788, -1464261, 74000, 2195058, 2971415, 2285903, 1875394, 2520772, 2974257, 2084021, 231134, -1669326, -2714679, -1477629, 2571585, 6719810, 7031361, 3631757, 923680, 1296296, 2009479, 246842, -2260206, -2485348, -886150, 454310, 1844808, 4330812]
38127D330812J783270j291008k786444o71889J406302R6021k349054k360683p40947
38118b583620j27993j48065P67279J502890M02342r18219j3624J873397J708896
38109B463283k95738j383312r37947p38338j187158q42517M78038J210967P06216
38100e26506r2740m98912n42895m5184Q53596J020678Q0757l38663P94177J609114
38090B313422K31887j621611j157144P57093J066672j94689k12863J350620J716323
38081D249710J3980j233343o65387j75289r43275j092109O36801K119171J232861
38072D143120o35140j062804m08578m84401j158224j034631k91703j70966m62725
38063a566052k2112P37917L22848j040230j374089N0673J643511J815354P20434
$$ y = [4330812, 6114082, 4823074, 2036630, 1364741, 2771043, 2867064, 518010, -1842673, -2583620, -2711613, -2859678, -2092399, -589509, -187167, -1105386, -1119010, 754387, 2463283, 2167545, 784233, -153714, -892052, -2079210, -2921727, -2443689, -1232722, -526506, -619246, -1118158, -1661053, -1706237, -852641, 168037, 248794, -89869, 704308, 2313422, 2545309, 923698, -233446, 523647, 1590319, 1395630, 1182767, 2533387, 4249710, 4263690, 3030347, 2364960, 2189671, 1246396, 154287, 791088, 2910259, 4143120, 3507980, 2445176, 2036598, 1552197, 393973, -640658, -932361, -1103327, -1566052, -1588164, -850247, -527399, -1567629, -2941718, -2891045, -1247534, 567820, 1288254]
38054A288254p29519k018123k607519j805429J00233J612736J722557J012109
38046a424701M52481M8359n28287r02922o72561l63986m84871k54832J174753
38037b956567K623942J956714n52855k031339j033755L32246j32422j088421J8551
38028b863906K297019K320028m16371k282275p78237J896271K321717N80825p92220
38019B282851r04873r15336j248581j031825j32578M78406M90613M44721J23868
38010d12734j154632k375912j316970J855891L696958J835042j482494k296033
38002a650884k94312J162890P5148j702950j657744r3787J023541J116687J013461
37993a007950Q91233L49088J17483J292475K654075J408534k312050m353995k020797
$$ y = [1288254, 558735, -1459388, -4066907, -5872336, -5772103, -4159367, -2436810, -1424701, -972220, -923861, -1452148, -2355070, -3027631, -3391617, -3876488, -4131320, -2956567, -332625, 1624089, 1071234, -960105, -1993860, -1661614, -1794036, -2882457, -2863906, -566887, 1753141, 1336770, -945505, -1723742, 172529, 2494246, 3075071, 2282851, 1377978, 462642, -785939, -1817764, -1950342, -1471936, -981323, -536602, -412734, -1567366, -3943278, -5260248, -3404357, 292601, 2127643, 645149, -1650884, -1945196, -782306, -707158, -2410108, -4067852, -4161639, -3138098, -2021411, -1007950, -116717, 232371, 349854, 1642329, 4296404, 5704938, 3392888, -961107, -2981904]
37984b981904J640710K004827l66352r72336J274193K450030K56949k115342j129055
37975F1720J578753K057707M2426j484850j316453r70113j130754o00619Q54952
37966i07231J541682N89858n73133m97305L00132O12252L78320J84584j7532n97647
37956A013980j195648r18709M13144J672467J395403m52340j987507j459428L55315
37947a163323J109562L56594J27208J268864J607288m07782k479609j675214P89930
37938d66482J327744m14986j370882k16651J030943J013931R48282J479519J075977
37929D407395q06680j980736r18055O53668N87220m95580r32087q57787j095941
37920a438583j061046j06230O32070R3670m43330O08854K157766K051995O32000
$$ y = [-2981904, -1341194, 663633, 297281, -675055, 599138, 3049168, 3306117, 1190775, 61720, 1640473, 3698180, 3740606, 2255756, 939303, -30810, -1161564, -1762183, -907231, 634451, 1224309, 651176, 153871, 454003, 1066255, 1444575, 1629159, 1611627, 1013980, -181668, -1100377, -687233, 985234, 2380637, 1928297, -59210, -1518638, -1163323, -53761, 302833, 430041, 1698905, 3306193, 2898411, 418802, -1256412, -466482, 861262, 446276, -924606, -1141257, -110314, 903617, 1851899, 3331418, 4407395, 3600715, 1619979, 701924, 1355592, 1942812, 1447232, 515145, -342642, -1438583, -2499629, -2605859, -1973789, -1880119, -2323449, -1714595, 443171, 2495166, 3127166]
37911C127166k8931L49711K42681o38722j036664p40991q89839j598091j714418
37902b928098j089252p13049m41097Q89417K718277K835165R60015m02560J71902
37893B000720Q86024J5115j083501m13758J104012J034439p84917k294198k382035
37884a918099j753872j008577j8678Q11919O80365l670P8513R46164J177727M31361
37874e76847K42921J405064K281874J141979j129780k316072j984699j482555
37866b418115j258275k56736J709004K859737J728278o77959k114938j755151
37858b184155n72196L53969P92935Q69274O59001L42909N0173m24971j140608
37849a253669j440749o50320P94693J744454J764109J287875N15019o89440j773009
$$ y = [3127166, 3098235, 3447946, 3690627, 3051905, 2015241, 1274250, 384411, -1213680, -2928098, -4017350, -4730399, -5171496, -4282079, -1563802, 1271363, 2231378, 1828818, 2000720, 2886744, 2901859, 1818358, 1404600, 2508612, 3543051, 2758134, 463936, -1918099, -3671971, -4680548, -4699226, -3887307, -3206942, -3210612, -3132099, -2185935, -1008208, -576847, -333926, 1071138, 3353012, 4494991, 3365211, 1049139, -935560, -2418115, -3676390, -3933126, -2224122, 635615, 2363893, 1685934, -429004, -2184155, -2756351, -2402382, -1609447, -740173, -81172, 261737, 311910, -113061, -1253669, -2694418, -3344738, -2550045, -805591, 958518, 2246393, 2761412, 2071972, 298963]
37840B98963j714052n96204K91034L14791J27346K8341n96213j412277p03406
37831c961677J736829L215594J806113k54063L10431K415274J916781j792294
37823E392988m343116k716825M74067J212261j95591n45075R09398J828116R09797
37814B926020l86502n18920J28073N49948N91129L67291l19445j235907j555998
37805E45689j097460o60688n55563K6991J346041J968035N65585j835414k818499
37796b515283j597556K17656J004329J008353J241243J565234J066227r8970o43188
37787A248045j91499j7481q71281j316070J45647K062844J476493j494674l104677
37778b062653j194209J477894J242603j096849j836520j61048J145438O57550
$$ y = [298963, -1415089, -2011293, -1720259, -1405468, -1278122, -1249781, -1845994, -3258271, -3961677, -2224848, 990746, 2796859, 2542796, 2853227, 5268501, 7185282, 5392988, 1049872, -1666953, -1192886, 19375, -176216, -721291, 188107, 2016223, 2926020, 2539518, 2020598, 2148671, 2698619, 3289748, 3657039, 3337594, 2101687, 545689, -551771, -1212459, -1768022, -1741031, -394990, 1573045, 2138630, 303216, -2515283, -4112839, -3895183, -2890854, -1882501, -641258, 923976, 1990203, 1891233, 1248045, 1056546, 1039065, 167784, -1148286, -1002639, 1060205, 2536698, 1042024, -2062653, -3256862, -1778968, -536365, -1633214, -3469734, -3630782, -2485344, -1827794]
37770a827794L11697J431173K077246L86984j936163j956805J92657J711442R73050
37761A363487r91804k279839j841823j937J571678J267290j41165k4659K028168
37752I49396K785021J37705k938798k429149M49630J173984o95989q75464K306436
37743H62772M749897K844449j091629k578137j263489j70080n84828j035806m72186
37734A260963L92595O96014L27023o05391j680736j920815r00631M36060J088021
37725i06897J216012J062117N2061j595336j912570J89033K637177K774994J124743
37716D641334J39917J62712m97742j915276k102370n25901P80566M26622m29572
37707F80290m04865k7431l12638q61487p02832Q5287O73737O17709J1749p46967
$$ y = [-1827794, -1516097, -84924, 1992322, 2379306, 443143, -1513662, -1321005, 390437, 1363487, 371683, -1908156, -3749979, -3751916, -2180238, -912948, -1054113, -1078772, 949396, 3734417, 3872122, 933324, -1495825, -1046195, 127789, -568200, -1443664, 862772, 5612669, 8457118, 7365489, 4787352, 3523863, 3353783, 2768955, 1733149, 1260963, 1653558, 2349572, 2676595, 2071204, 390468, -1530347, -2430978, -1994918, -906897, 309115, 1371232, 1423293, -172043, -2084613, -1895580, 741597, 3516591, 4641334, 4781251, 4943963, 4446221, 2530945, 428575, -97326, 683240, 1109862, 680290, 275425, 247994, -64644, -926131, -1628963, -1543676, -869939, -252230, -240481, -987448]
37697i87448r59730k23195P51850Q59566K34567M1883N31368O30759j98181r98534
37687c17095p52461K28417Q31346L71342q44061j590682p06267J252699K115471
37678E88709R84063j65680M78561J372740J82956j706690j040903J405215J323418
37669C422389j945166l483296k27070L933920L712276k33647l167860k996722
37661i85176j312505M39369J893416J954108j44390k387182j945847N54807J778210
37652a55190O23369n66309o590J145431J127596J6822r84091j062971j12279J156212
37642A182000J375681R2306j204169j062892l25715n26871r97134j21043J193886
37633c93951M20283k201371l339143j285100J800499L201713K651404J165448
$$ y = [-987448, -1947178, -2170373, -1418523, -558957, -324390, -282507, 248861, 879620, 681439, -317095, -1069556, -841139, -9793, 361549, -482512, -2073194, -2779461, -1526762, 588709, 1572772, 1407092, 1885653, 3258393, 3441349, 1734659, 693756, 2098971, 3422389, 1477223, -2006073, -2233143, 1700777, 5413053, 5179406, 2011546, -985176, -2297681, -1858312, 35104, 1989212, 1844822, -542360, -2488207, -1933400, -155190, 468179, -98130, -104720, 1040711, 2168307, 2185129, 1201038, 138067, 25788, 1182000, 2557681, 2649987, 1445818, 382926, 57211, -469660, -1466794, -1587837, -393951, 26332, -2175039, -5514182, -6799282, -4998783, -1797070, 854334, 2019782]
37625B019782n68304j557683o78892J284879J934295O57381m93226l07859j61597
37616B128776r03164r32387N52243J202103p79612k926656j900888J016719J606566
37607i36300p89128k289424l98707K518651K997122J083327o41365r42940p78348
37598a77112r68639r60926j87834O58887N59512k21060m58832J71587O86226N70068
37588c28123O28465J161991P99009j128428k394932o41446K485658L132720J027066
37579D741980j79591R93779J441654j034920l663834l049213m75649O18424R6653
37570e10717K97869J456760J767878R28847O9878q75849k233102k152536Q67307
37561c83665L896712K614091j757431l455419p03165J839380O63154j541970j037290
$$ y = [2019782, 1451478, -106205, -785097, 499782, 2434077, 3091458, 2598232, 2290373, 2128776, 1225612, 293225, 845468, 2047571, 1267959, -1658697, -3559585, -2542866, -936300, -1725428, -4014852, -4413559, -1894908, 1102214, 2185541, 1544176, 601236, -177112, -1145751, -2106677, -2294511, -1635624, -1076112, -1297172, -1756004, -1584417, -898191, -328123, 300342, 1462333, 2261342, 1132914, -1262018, -1903464, 582194, 3714914, 4741980, 4562389, 5556168, 6997822, 5962902, 2299068, -750145, -1225794, -607370, -510717, -212848, 1243912, 3011790, 3940637, 4010515, 3134666, 901564, -1250972, -383665, 3513047, 6127138, 4369707, 914288, 211123, 2050503, 2713657, 1171687, 134397]
37552A34397J129307J829430R47448J24543q28931k476659k916866m03107K679766
37543B19328K458463o03457k315780r11612J031271J065515q0587p34858p18739
37534e90456m10277L98054J485089J726427P13284m39858o99545l61756j07011
37525A713951j2158r4061o52649j402849j323900q6045J226204J424489N26022
37516A319004o54293j406959j257461j24416J168066J437452P14739L17915P67117
37507B281164P71138o76547k232168j822438J48068J080771o0798j148250j56107
37498a815167J507362R75089j409612k015386P79319L673150K781209q04022k528015
37489A143927p66990J370740J030022n84435q05803M48016J235396P06788l21338
$$ y = [134397, 1263704, 3093134, 4040582, 4165125, 3336194, 859535, -2057331, -2460438, 219328, 2677791, 2074334, -241446, -1153058, -121787, 943728, 863141, 128283, -590456, -1000733, -602679, 882410, 2608837, 3322121, 2882263, 2182718, 1820962, 1713951, 1701793, 1607732, 955083, -447766, -1771666, -1857711, -631507, 792982, 1319004, 664711, -742248, -1999709, -2124125, -956059, 481393, 1196132, 1514047, 2281164, 3052302, 2375755, 143587, -1678851, -1530783, -450012, -510810, -1659060, -1815167, -307805, 667284, -742328, -2757714, -1978395, 1694755, 4475964, 3671942, 1143927, 376937, 1747677, 2777699, 2193264, 1387461, 1835477, 3070873, 3777661, 3456323]
37480C456323j033218j229872r11112m44235m44888o87464k93165L28846l76964
37471a635749j979779j627298J322055L040538O50974k641596j929344J743439
37463c056760K996391N14601j511756o19190O47337N2749p79797l52466k81139
37454b390030j523308j699408N72423K307597Q14891j420159o30679J976263K316842
37445C24432N8282j372915n12384O56497O51059J55423k55486p63159p46466L38108
37435a466609Q03817j220114l798174k931026J403304M644713L874879J128882
37427B439672o05726j225084j726315j734571q91114k40448k45609M13161K182366
37418a633668K940502J093274j495540j955064l55158R89587R59537K04510p44335
$$ y = [3456323, 2423105, 1193233, 282121, -162114, -607002, -1294466, -1587631, -1258785, -1635749, -3615528, -5242826, -3920771, -880233, -229259, -2870855, -4800199, -3056760, -60369, 454232, -1057524, -1676714, -1029377, -976628, -1756425, -2108891, -2390030, -3913338, -5612746, -5040323, -2732726, -1917835, -3337994, -3968673, -1992410, 324432, 382714, -990201, -1502585, -846088, -195029, -39606, -295092, -1058251, -1804717, -1466609, -662792, -1882906, -5681080, -8612106, -7208802, -2564089, 1310790, 2439672, 1833946, 608862, -1117453, -2852024, -3743138, -3983586, -4229195, -3816034, -1633668, 1306834, 2400108, 904568, -1050496, -1405654, -416067, 543470, 747980, 3645]
37409C645j732890j952199p05386J026248J466267L68512q49656j035788k04974
37400c616221J070549J991000J676234J72803j069398q31431K22359O38470L39321
37391E93686L55112Q58797R96964N26425J39797Q3114j90151p48850q17129r5328
37381A702437O04660N76416K23102K29954L79090o3551j063280j649081j154136
37372b14389j16294M53721M15889M21313M45611n53393k726890m015348k272079
37363h161859J533478L896965K887894K37591j180564n81114P25246J293375O21283
37354A272295p84280j667106j135952R8593O10785M54128Q46853J504097O41641
37345A841054j546331k136823J40820K419807J916602J63709M6348Q12410j99703
$$ y = [3645, -1729245, -3681444, -4386830, -3360582, -1894315, -1525803, -2375459, -3411247, -3616221, -2545672, -554672, 1121562, 1294365, 224967, -606464, -384105, 254365, 593686, 948798, 1807595, 2804559, 3330984, 3470781, 3553895, 3363744, 2614894, 1797765, 1702437, 2307097, 2883513, 3106615, 3336569, 3715659, 3652108, 2588828, 939747, -214389, -330683, 123038, 538927, 960240, 1405851, 852458, -1874432, -5889780, -8161859, -6628381, -2731416, 156478, 394069, -786495, -1367609, -642363, 651012, 1272295, 488015, -1179091, -2315043, -2216450, -1605665, -1151537, -304684, 1199413, 1841054, 294723, -1842100, -1701280, 718527, 2635129, 2798838, 2845186, 3657596, 3457893]
37336C457893k358288k515619l91027J065454P16573M69211J012627O16465p69789
37327A303500n35782J757827K758113Q46052q19508J69878Q97565j759011m790265
37318a71631l151021J770621L604075N49190k200603o89231K220441J913868j192241
37309B653468l079834j966118L27478J603551J388470L79920l75548r4949P44717
37300A581155N78369j083276k473992j725401N30528J985570J570357L16167l79531
37291H99946k06661K75106M65811K76480J82989M86248N18395n50292j971231
37282C76791j860123K4860J532520J191278L44129O75737J320047O11060p33941
37273C482358q97192l85609j041602k205055j412252R81160J679900j81995j395604
$$ y = [3457893, 1099605, -1416014, -1807041, -741587, -25014, 444197, 1456824, 2073289, 1303500, 767718, 2525545, 5283658, 6129710, 5310202, 5480080, 6377645, 4618634, -171631, -3322652, -1552031, 2052044, 2601234, 400631, -288600, 1931841, 3845709, 2653468, -426366, -2392484, -2065006, -461455, 927015, 1306935, 931387, 836438, 1581155, 2159524, 1076248, -1397744, -3123145, -2592617, -607047, 963310, 1279477, 899946, 693285, 968391, 1434202, 1710682, 1893671, 2379919, 2898314, 2348022, 376791, -1483332, -1458472, 74048, 1265326, 1609455, 2285192, 3605239, 4216299, 3482358, 2585166, 2199557, 1157955, -1047100, -2459352, -1478192, 201708, 19713, -1375891]
37264a375891m1421J277764Q9827j526581o23472J285086P52646j504622j589966
37255c256630J103119K823292J280815j349512k263931j544206m75347P68454
37247b913946K023598J972909k5863k376350k965642j417853J156681L321645
37239a224821L587971J239342k129074l454938j677415R56678J915148J242213
37231D55104M94956L85903O00590O13003k74294k293500l838715k558979J110779
37222e305153L526747K409567j32719r12627p827M50865J08357K54140Q90342
37213A281692O64508o51327j848580k154471j587256n1075K001006K750117J066234
37204A470848j214463j395321J76912Q10714k50463j037224m78913N9335m05528
$$ y = [-1375891, -1417312, -139548, -49721, -1576302, -2199774, -914688, -162042, -1666664, -3256630, -2153511, 669781, 1950596, 601084, -1662847, -3207053, -3682400, -2913946, -890348, 1082561, 1056698, -1319652, -4285294, -5703147, -4546466, -1224821, 2363150, 3602492, 1473418, -1981520, -3658935, -2702257, -787109, 455104, 950060, 1335963, 1936553, 2549556, 2275262, -18238, -3856953, -6415932, -5305153, -1778406, 631161, 498442, -414185, -422012, 28853, 137210, 391350, 1281692, 1946200, 1294873, -553707, -2708178, -4295434, -4346509, -2345503, 404614, 1470848, 256385, -1138936, -962024, -151310, -401773, -1438997, -1917910, -1858575, -2264103]
37195b264103p66010j39098L52662l48383j114797l14734J470926K062117N70868
37186d90552j557412k319118j198031O49697J854445K162486K114224J732049
37178B947788M99957j163578j749468p51600M01423N45366M30949Q03002N84846
37169B548685r46187j859528k66792J946284J458323j061458j604412R35593K928704
37160D079212J431024j847256l460629k424413l4864K117177K551423N70300k077994
37151I03980k345387k451J620574L97901j502504j108778J020987K161639J378310
37142B524271q6416j067506j152596k18863J012660J035745m21924j662833j490827
37133a528289q22438n87932l3264J242365J722098N63752l35723O14747J570130
$$ y = [-2264103, -3030113, -3169211, -2816549, -3164932, -4279729, -4594463, -3123537, -1061420, -490552, -2047964, -4367082, -5565113, -4915416, -3060971, -898485, 1215739, 2947788, 3447745, 2284167, 534699, -216901, 184522, 729888, 1160837, 1963839, 2548685, 1602498, -257030, -523822, 1422462, 2880785, 1819327, 214915, 1150508, 4079212, 5510236, 3662980, 202351, -2222062, -2256926, -139749, 2411674, 2981974, 903980, -1441407, -1443858, 176716, 574617, -927887, -2036665, -1015678, 1145961, 2524271, 2437855, 1370349, 217753, -1110, 1011550, 2047295, 1625371, -37462, -1528289, -2350727, -2938659, -2971923, -1729558, -7460, 556292, 220569, 835316, 2405446]
37124B405446J88729j929562j287437J885688L665837K030874q18992k155591
37116C984992j913378j399444j075356o28538J59274J208136J908909J281035
37108C525630n97352j971297j592756o48894q05759j350445m81605J404421K257791
37099b60266J664964R69952M90297o06465j812074j578368k32468K79496k33482
37090a318414q4638P51813L38254j271646j364753P81486K107503O08939j313448
37081g64904q58046P41706P95198k35649j00028R96315J045072P8645j00971M93887
37071B091225Q9028j243933j278371N08972J682115N18364j428995j771980n09723
37062a343298N47093L08849q14615j762215j582271j41876J349993J428540L65041
$$ y = [2405446, 2594175, 664613, -622824, 1262864, 4928701, 6959575, 6140583, 3984992, 2071614, 672170, -403186, -1031724, -872450, 335686, 2244595, 3525630, 2928278, 956981, -635775, -1284669, -2090428, -3440873, -3922478, -2518057, -260266, 1404698, 2374650, 2864947, 2258482, 446408, -1131960, -1364428, -1084932, -1318414, -1403052, -651239, -312985, -1584631, -2949384, -2167898, -60395, 548544, -764904, -1622950, -881244, -86046, -321695, -421723, 574592, 1619664, 1698309, 1597338, 2091225, 2180253, 936320, -342051, 166921, 1849036, 2367400, 938405, -833575, -1343298, -796205, -487356, -1301971, -3064186, -4646457, -4788333, -3438340, -2009800, -1644759]
37053a644759j32647L77975L54895q19660j149015R10491L240018K531449p19059
37044B949688k581626j225514Q10248Q35695k77117m33098p228n50126j390857
37035a869935o81127Q76261P04512j092401j264687J406020L636507K342045p63033
37026C294162j875205n81207L50666l52199j086387n54469M25959Q03643Q02486
37017A227449Q28980N65760j39152p91707j129038j287524r35624L25295J555211
37008B19650J199863m15173j189454m42348O5799o93600j059706L59310J753001
36999b02658O50894j821845k146741L69962K434572J514962o56362p83676J386383
36990G45491K965165J787847j187947l309716k922072m97457J997861K579276
$$ y = [-1644759, -1777406, -1399431, -1044536, -1864196, -3013211, -2102720, 1137298, 3668747, 2949688, 368062, -857452, -47204, 788491, 511374, 78276, 71048, -479078, -1869935, -2551062, -1674801, -970289, -2062690, -3327377, -1921357, 1715150, 4057195, 3294162, 1418957, 837750, 1188416, 836217, -250170, -804639, -378680, 424963, 1227449, 2056429, 2622189, 2483037, 1691330, 562292, -725232, -1660856, -1335561, 219650, 1419513, 1004340, -185114, -627462, -561663, -1255263, -2314969, -1955659, -202658, 448236, -1373609, -3520350, -3150388, -715816, 799146, 142784, -640892, 745491, 3710656, 5498503, 4310556, 1000840, -1921232, -2418689, -420828, 2158448]
36982B158448Q61249j353094j694570P7884J613081Q70883j166041j850967n94368
36973a077495M23825l56806j521107r81578O44681Q68910q92361k382106j733461
36964g007498O3125R04072N87912O73349J758257K416155J359629l62224n21985
36955a29208J057048J796839k37268l225189l530914n52671K304330K121390P5278
36946c20365p58466L23139J453614J335753M84150l68055j143269j555822j030636
36937a579957J42586Q36521N60778j00549n44774n89837k7892J011874J463001
36928A171751N28533p06253n49290N14926L16951j497405k623399j436796Q59788
36919c421194K364837K799476K531454J207314j020751k463631j936611p25160
$$ y = [2158448, 3019697, 1666603, -27967, 49917, 1662998, 2533881, 1367840, -483127, -1077495, -653670, -1010476, -2531583, -3513161, -2868480, -1999570, -2891931, -5274037, -7007498, -6944373, -6040301, -5452389, -4779040, -3020783, -604628, 755001, 392777, -129208, 927840, 2724679, 2487411, -737778, -4268692, -4821363, -2517033, -395643, -320365, -1078831, -755692, 697922, 2033675, 2517825, 2149770, 1006501, -549321, -1579957, -1437371, -600850, -40072, -140621, -685395, -1275232, -1303124, -291250, 1171751, 1700284, 994031, 444741, 959667, 1276618, -220787, -2844186, -4280982, -3421194, -1056357, 1743119, 4274573, 5481887, 4461136, 1997505, 60894, -664266]
36911f64266p22262j491836j071944Q17947K256442J791996J11057j205890j465217
36902a643973j037715m78885R6790Q47934J477347J070734o27254k089534j493534
36893c878090N74784J553790N25614n18870l9967N32849n39693j954692j229646
36884d973921J159049K310726J251376J5282J16610N32905Q2998m20959J82868
36875B56934J198517J140007J04328m69635n6601K86131l71446j437692j593878
36866i43335n25837O76361Q37416l087q57292j015842n17176L48567J215661J376762
36856E92198L69059r10985p99770Q47537K055019J238708o79379j649605j038329
36847B4453K98128J486058J863944P62927j281099k013138j73174K001158J392235
$$ y = [-664266, -1386528, -2878364, -3950308, -3132361, -875919, 916077, 1027134, -178756, -1643973, -2681688, -3160573, -3063783, -2215849, -738502, 332232, -295022, -2384556, -3878090, -3303306, -1749516, -1223902, -1742772, -1782739, -1249890, -1789583, -3744275, -4973921, -3814872, -1504146, -252770, -237488, -120878, 412027, 495025, 74066, 256934, 1455451, 2595458, 2699786, 2230151, 2173550, 2459681, 2088235, 650543, -943335, -1469172, -792811, 44605, 41518, -815774, -1831616, -2348792, -2000225, -784564, 592198, 961257, 50272, -749498, 98039, 2153058, 3391766, 2712387, 1062782, 24453, 322581, 1808639, 3672583, 4435510, 3154411, 1141273, 968099, 2969257, 4361492]
36838D361492j297950k336773o02576Q37862j20700j240589L9712K054872J660953
36829C356303l42143m61352J489906J832301q48847k980047j448848J410449J347370
36820C355092j349117k592059r10290P47314K04472n52403Q91514K990258K461826
36811E246607n17893k410964j344129P21636J347103P45669M08868M36858j31687
36802D502068j306037j996907j541492l07261R78621J671423J279757l9133j176413
36793B064626j016960K84361J474773J596117P80173k26428q77859j184948j536060
36784A357795k094390k286878j276204P98729K530625K668051J463547R7376q15956
36775B442695j408254j566953q40248M53068J001323Q0441j226579j262977j0685
$$ y = [4361492, 3063542, 726769, 124193, 962055, 841355, -399234, -359522, 1695350, 3356303, 3014160, 2552808, 4042714, 5875015, 5026168, 2046121, 597273, 2007722, 3355092, 2005975, -586084, -1496374, -749060, -544588, -1096991, -205477, 2784781, 5246607, 4728714, 2317750, 973621, 1695257, 3042360, 3788029, 4196897, 4633755, 4502068, 3196031, 1199124, -342368, -649629, 328992, 2000415, 3280172, 3241039, 2064626, 1047666, 1332027, 2806800, 4402917, 5183090, 4956662, 4078803, 2893855, 1357795, -736595, -3023473, -4299677, -3500948, -970323, 1697728, 3161275, 3258651, 2442695, 1034441, -532512, -1372760, -919692, 81631, 162072, -1064507, -2327484, -2338169]
36766b338169R22009O20053K7363K09164O35203M22815K90208J331216K334218
36757D454080Q90941k421948l772009j364768J602386J449614q08493j669975
36749a640172o95649k72461q66834n00382J076104J561941J89207q29796k3084
36740b001126J259637J627052J515637J097488n41402k679255k657202j35683
36732b514854J564302N14004p40408K34881J472789L09932j629071j208591Q03445
36723a193571J435154Q19151J239901K160919J026111j529618k087536j91429
36715A679082Q84181l09067j444857r89096m49889o34248K19057K509220L206341
36706D670724L92710l075292l329069p34128J372816J484389P43139J25786n69445
$$ y = [-2338169, -1416160, -796107, -768744, -559580, 75623, 498438, 788646, 2119862, 4454080, 5345021, 2923073, -848936, -2213704, -611318, 838296, 29803, -1640172, -2335821, -2608282, -3475116, -3975498, -2899394, -1337453, -1148246, -1978042, -2001126, -741489, 885563, 2401200, 3498688, 2957286, 278031, -2379171, -2514854, -950552, -436548, -1176956, -942075, 530714, 840646, -788425, -1997016, -1193571, 241583, 1060734, 2300635, 4461554, 5487665, 3958047, 1870511, 1679082, 2563263, 2254196, 809339, -179757, -629646, -1263894, -1044837, 1464383, 4670724, 5063434, 1988142, -1340927, -2075055, -702239, 782150, 1525289, 1651075, 1081630]
36697A081630j329766j523367q51672M38137J948404K965809K629437J069983
36689F428595m03902r47176j067912j254304r50373J79241J149490R54246L1761
36680D119666o38092j042641j663258k237020k084070j177600m8733Q74162J195317
36671b702269N39538o40255r84503J37774J508554J540971M53609p3926P04848
36662D84341J586959J162086j50716o41675J71612N95507q42796k816274k635468
36653c086424j63292J740677J301753J49363K55253Q03377J96726p75695m55419
36644c3681M92124L49169l40916J08027J002464L17623j313138j362497M4826
36635g35999K67046r68528r39754J030067K052664O09610q58982j47847J374946
$$ y = [1081630, -248136, -1771503, -2623175, -2185038, -236634, 2729175, 5358612, 6428595, 6024693, 5077517, 4009605, 2755301, 1804928, 1984169, 3133659, 4087905, 4119666, 3481574, 2438933, 775675, -1461345, -3545415, -4723015, -4771748, -3897586, -2702269, -2162731, -2802986, -3787489, -3649715, -2141161, -600190, -146581, -220507, 484341, 2071300, 3233386, 3082670, 2440995, 2612607, 3208114, 2365318, -450956, -3086424, -3249716, -1509039, -207286, -57923, 197330, 1000707, 1197433, 421738, -33681, 458443, 807612, 466696, 574723, 1577187, 1894810, 581672, -780825, -735999, -468953, -1437481, -2377235, -1347168, 705496, 1315106, 456124, 308277, 1683223]
36626A683223J604907P65879k59173j616511k654874j595611R71540J575494q80274
36617d05400k746364j164764J429135J503248p9819m38462K21787j13276j032638
36608b826553p68646J29792j6038n54004J65192J312731R82556j69866j76150
36599a920986N79680M45419M382Q35280J907263J016708j097540j840617j070517
36590a140928n31543j2731J743139L160081J480376k029791l162213j099314Q59726
36581g33198J011252R24574J032619l50350k567644k271432P73418K329159K27294
36572C75692k228889j781678J55446J049256J279428J596242N24134k157714k936572
36563d124655M03886M233139L792213R8108k173130j761746j195708j332843l40367
$$ y = [1683223, 3288130, 4054009, 3794836, 2178325, -476549, -2072160, -1100620, 474874, -405400, -3151764, -4316528, -2887393, -1384145, -1463964, -1902426, -1680639, -1793915, -2826553, -3595199, -3465407, -3481445, -4035449, -3870257, -2557526, -1574970, -1744836, -1920986, -1341306, -895887, -891505, -56225, 1851038, 2867746, 1770206, -70411, -1140928, -1672471, -1685202, 57937, 3218018, 4698394, 2668603, -493610, -1592924, -733198, 278054, 1202628, 2235247, 1884897, -682747, -2954179, -2180761, 148398, 375692, -1853197, -3634875, -3479429, -2430173, -1150745, 445497, 969631, -1188083, -4124655, -3720769, 512370, 4304583, 4402691, 2229561, 467815, -727893, -2060736, -2401103]
36554b401103J946122K933551J349760q39340j487773p27659L03434R83231Q61462
$$ y = [-2401103, -454981, 2478570, 3828330, 2988990, 1501217, 773558, 1076992, 2060223, 2921685]
$$ [...]
##END NTUPLES=NMR SPECTRUM
##END=
