##TITLE=31Pdec_4C2410TFA07
 aceton-d6, 24 sc
 25.10.2021
##JCAMPDX= 6.0         $$ Bruker NMR JCAMP-DX V2.0
##DATA TYPE= NMR SPECTRUM
##DATA CLASS= NTUPLES
##ORIGIN= UXNMR, Bruker Analytische Messtechnik GmbH
##OWNER= root
$$ XWIN-NMR		Version 3.5
$$ Mon Oct 25 10:45:45 2021 Russian Standard Time (UT+4h)  she@DPX200
##.OBSERVE FREQUENCY= 81.013821
##.OBSERVE NUCLEUS= ^31P
##.ACQUISITION MODE= SIMULTANEOUS
##.ACQUISITION SCHEME= undefined
##.AVERAGES= 24
##.DIGITISER RES= 16
##SPECTROMETER/DATA SYSTEM= spect
##.PULSE SEQUENCE= zgpg30
##.SOLVENT NAME= CDCl3
##.SHIFT REFERENCE= (INTERNAL, CDCl3, 0, 248.564)
##AUDIT TRAIL= $$ (NUMBER, WHEN, WHO, WHERE, WHAT)
$$ ##TITLE= Audit trail, XWIN-NMR		Version 3.5
$$ ##JCAMPDX= 5.01
$$ ##ORIGIN= Bruker BioSpin GmbH
$$ ##OWNER= she
$$ F:/spectra/data/she/nmr/P31/1/pdata/1/auditp.txt
$$ ##AUDIT TRAIL=  $$ (NUMBER, WHEN, WHO, WHERE, WHAT)
(   1,<2021-10-25 10:44:38.06 +0400>,<she>,<DPX200>,
      <created by zg, POWCHK disabled, PULCHK disabled
       configuration hash MD5:
       00 E9 B6 7A A2 85 ED C7 34 08 36 98 17 FE 4E 26
       data hash MD5: 32K
       E4 44 DF 56 01 16 74 07 68 47 D6 9C C8 04 AB EF>)
(   2,<2021-10-25 10:44:43.87 +0400>,<she>,<DPX200>,
      <Start of raw data processing
       efp BC_mod = 2 LB = 1 FT_mod = 6 PKNL = 1 PHC0 = -8838.202 PHC1 = 115.669 SI = 64K 
       data hash MD5: 64K
       A8 07 26 65 81 EE B6 63 10 13 08 E8 A0 A0 3C B4>)
(   3,<2021-10-25 10:45:02.17 +0400>,<she>,<DPX200>,
      <pk PHC0 = 3.636161 PHC1 = 0 
       data hash MD5: 64K
       F9 06 69 C3 A0 5C 21 DA B0 F0 E2 6C 8D C6 D3 E7>)
$$ ##END=
$$ 
$$ hash MD5
$$ 34 01 83 A5 2D 90 08 A7 48 90 96 72 19 52 74 99
##$RELAX= 
##$RELAX= 
##$RELAX= 
##$RELAX= 
##$RELAX= 
##$RELAX= 
##$RELAX= 
##$RELAX= 
$$ Bruker specific parameters
$$ --------------------------
##$DU= <F:/spectra>
##$EXPNO= 1
##$NAME= <P31>
##$PROCNO= 1
##$TYPE= <nmr>
##$USER= <she>
##$AMP= (0..31)
100 100 100 100 100 100 100 100 100 100 100 100 100 100 100 100 100 100 
100 100 100 100 100 100 100 100 100 100 100 100 100 100 
##$AQSEQ= 0
##$AQ_mod= 1
##$AUNM= <au_zg>
##$AUTOPOS= <>
##$BF1= 81.014009
##$BF2= 200.13
##$BF3= 200.13
##$BF4= 200.13
##$BF5= 200.13
##$BF6= 200.13
##$BF7= 200.13
##$BF8= 200.13
##$BYTORDA= 1
##$CFDGTYP= 0
##$CFRGTYP= 5
##$CHEMSTR= <none>
##$CNST= (0..31)
1 1 145 1 1 1 1 1 1 1 1 1 1 1 1 1 1 1 1 1 1 1 1 1 1 1 1 1 1 1 1 1 
##$CPDPRG= <waltz16>
##$CPDPRG1= <>
##$CPDPRG2= <waltz16>
##$CPDPRG3= <>
##$CPDPRG4= <mlev>
##$CPDPRG5= <mlev>
##$CPDPRG6= <mlev>
##$CPDPRG7= <mlev>
##$CPDPRG8= <mlev>
##$CPDPRGB= <>
##$CPDPRGT= <>
##$D= (0..31)
0 1 0 0 0 0 0 0 0 0 0 0.03 2e-05 3e-06 0 0 0 0 0 0 0 0 0 0 0 0 0 0 0 0 
0 0 
##$DATE= 1635144277
##$DBL= (0..7)
120 120 120 11 120 120 24 19 
##$DBP= (0..7)
150 150 150 150 150 150 150 150 
##$DBP07= 0
##$DBPNAM0= <>
##$DBPNAM1= <>
##$DBPNAM2= <>
##$DBPNAM3= <>
##$DBPNAM4= <>
##$DBPNAM5= <>
##$DBPNAM6= <>
##$DBPNAM7= <>
##$DBPOAL= (0..7)
0.5 0.5 0.5 0.5 0.5 0.5 0.5 0.5 
##$DBPOFFS= (0..7)
$$ [...]
##$SUBNAM2= <"">
##$SUBNAM3= <"">
##$SUBNAM4= <"">
##$SUBNAM5= <"">
##$SUBNAM6= <"">
##$SUBNAM7= <"">
##$SUBNAM8= <"">
##$SUBNAM9= <"">
##$SW= 501.771253377433
##$SWIBOX= (0..15)
0 1 3 0 0 0 0 0 0 0 0 0 0 0 0 0 
##$SW_h= 40650.406504065
##$TD= 32768
##$TD0= 1
##$TE= 0
##$TE2= 300
##$TE3= 300
##$TEG= 300
##$TL= (0..7)
0 120 53 12 22 120 120 120 
##$TP= (0..7)
150 150 150 150 150 150 150 150 
##$TP07= 0
##$TPNAME0= <>
##$TPNAME1= <>
##$TPNAME2= <>
##$TPNAME3= <>
##$TPNAME4= <>
##$TPNAME5= <>
##$TPNAME6= <>
##$TPNAME7= <>
##$TPOAL= (0..7)
0.5 0.5 0.5 0.5 0.5 0.5 0.5 0.5 
##$TPOFFS= (0..7)
0 0 0 0 0 0 0 0 
##$TUNHIN= 0
##$TUNHOUT= 0
##$TUNXOUT= 0
##$USERA1= <user>
##$USERA2= <user>
##$USERA3= <user>
##$USERA4= <user>
##$USERA5= <user>
##$V9= 5
##$VALIST= <valist>
##$VCLIST= <CCCCCCCCCCCCCCC>
##$VD= 0
##$VDLIST= <DDDDDDDDDDDDDDD>
##$VPLIST= <PPPPPPPPPPPPPPP>
##$VTLIST= <TTTTTTTTTTTTTTT>
##$WBST= 1024
##$WBSW= 4
##$XGAIN= (0..3)
0 0 0 0 
##$XL= 0
##$YL= 0
##$YMAX_a= 2646
##$YMIN_a= -2801
##$ZGOPTNS= <>
##$ZL1= 120
##$ZL2= 120
##$ZL3= 120
##$ZL4= 120
##$ABSF1= 0
##$ABSF2= 0
##$ABSG= 0
##$ABSL= 0
##$ALPHA= 0
##$AQORDER= 0
##$ASSFAC= 0
##$ASSFACI= 0
##$ASSFACX= 0
##$ASSWID= 0
##$AUNMP= <proc_1d>
##$AZFE= 0.1
##$AZFW= 0.5
##$BCFW= 0
##$BC_mod= 2
##$BYTORDP= 0
##$COROFFS= 0
##$CY= -3
##$DATMOD= 1
##$DC= 0
##$DFILT= <>
##$DTYPP= 0
##$F1P= 0
##$F2P= 0
##$FCOR= 1
##$FTSIZE= 65536
##$FT_mod= 6
##$GAMMA= 0
##$GB= 0
##$INTBC= 1
##$INTSCL= 5.30512e-09
##$ISEN= 30
##$LB= 1
##$LEV0= 0
##$LPBIN= 0
##$MAXI= 10000
##$MC2= 0
##$MEAN= 0
##$ME_mod= 0
##$MI= 50
##$NCOEF= 0
##$NC_proc= -7
##$NLEV= 6
##$NOISF1= 182.463
##$NOISF2= 159.3651
##$NSP= 0
##$NTH_PI= 0
##$NZP= 0
##$OFFSET= 248.5645
##$PC= 4
##$PHC0= -8834.566
##$PHC1= 115.669
##$PH_mod= 1
##$PKNL= yes
##$PPARMOD= 0
##$PSCAL= 0
##$PSIGN= 0
##$REVERSE= no
##$SF= 81.014009
##$SI= 65536
##$SIGF1= 159.3651
##$SIGF2= -187.1042
##$SINO= 113.3802
##$SIOLD= 16384
##$SREGLST= <1H.CDCl3>
##$SSB= 0
##$STSI= 65536
##$STSR= 0
##$SW_p= 40650.406504065
##$SYMM= 0
##$S_DEV= 0
##$TDeff= 32768
##$TDoff= 0
##$TI= <>
##$TILT= no
##$TM1= 0
##$TM2= 0
##$TOPLEV= 0
##$USERP1= <user>
##$USERP2= <user>
##$USERP3= <user>
##$USERP4= <user>
##$USERP5= <user>
##$WDW= 1
##$XDIM= 65536
##$YMAX_p= 314258384
##$YMIN_p= -63469078
$$ End of Bruker specific parameters
$$ ---------------------------------
##NTUPLES= NMR SPECTRUM
##VAR_NAME=  FREQUENCY,     SPECTRUM/REAL,   SPECTRUM/IMAG
##SYMBOL=    X,             R,               I
##VAR_TYPE=  INDEPENDENT,   DEPENDENT,       DEPENDENT
##VAR_FORM=  AFFN,          ASDF,            ASDF
##VAR_DIM=   65536,         65536,           65536
##UNITS=     HZ,            ARBITRARY UNITS, ARBITRARY UNITS
##FACTOR=    0.620285442955139, 1,           1
##FIRST=     20137.2065510759, 0,            0
##LAST=      -20513.1999529892, 0,           0
##MIN=       -20513.1999529892, -63469078,   0
##MAX=       20137.2065510759, 314258384,    0
$$ Real data points
##PAGE= N=1
##DATA TABLE= (X++(R..R)), XYDATA
$$ [...]
$$ plain form
41749 -1420168 -2585765 -727027 2367152 3456964 2545870 2322968 3579755 3931777 1485498
41740 1485498 -2392270 -4892785 -4942199 -3604740 -2222630 -1113108 183821 1931543
41732 1931543 3517347 3851912 2697785 1240168 717028 808425 272861 -995446 -1658753
41723 -1658753 -864427 548636 1192732 663850 -511219 -1707810 -2436260 -2353414 -1646554
41714 -1646554 -1002130 -714149 -229946 941893 2288563 2845658 2416205 1613107 787505
41705 787505 -442441 -2362532 -4216621 -4495425 -2370823 1140353 3668172 3475787 1043830
41696 1043830 -1427173 -2010605 -465706 1912567 3283428 2335847 -764305 -4237845
41688 -4237845 -6043442 -5622330 -4000586 -2333670 -1091079 -575615 -1023785 -1714731 -1169274
$$ packed form
41749a420168j165597J858738L094179J089812r11094k22902J256787L52022k446279
41740A485498l877768k500515m9414J337459J382110J109522J296929J747722
41732A931543J585804L34565j154127j457617n23140R1397n35564j268307o63307
41723a658753P94326J413063O44096n28882j175069j196591p28450Q2846P06860
41714a646554O44424K87981M84203J171839J346670N57095m29453q03098q25602
41705G87505j229946j920091j854089k78804K124602L511176K527819j92385k431957
41696A043830k471003n83432J544899K378273J370861r47581l100152l473540
41688d237845j805597M21112J621744J666916J242591N15464m48170o90946N45457
$$ plain form
41679 -1169274 816882 2257484 1326359 -964210 -1869228 -529347 1017166 773652 -638728
41670 -638728 -1215098 -454968 183484 -523846 -2025283 -2962323 -2926440 -2609705 -2563180 -2660966
41660 -2660966 -2945206 -4106142 -6333603 -8182649 -7715182 -4889864 -1868978 -629494
41652 -629494 -1100025 -1998768 -2495424 -2357591 -1411415 106352 1280316 1595776 1741179
41643 1741179 2364906 2738179 1966588 931256 1354190 3183568 4705301 5249392 5772052
41634 5772052 6376423 5523455 2826493 548493 518534 1133390 -313679 -3232706 -4177368
41625 -4177368 -1626219 1983362 3604522 3066242 2167619 1759822 1248251 356774 -131856
41616 -131856 392416 1302898 1390711 281100 -1135946 -1633721 -801183 764837 2176029
$$ packed form
41679a169274J986156J440602r31125k290569r05018J339881J546513k43514j412380
41670f38728n76370P60130O38452p07330j501437r37040L5883L16735M6525r7786
41660b660966k84240j160936k227461j849046M67467K825318L020886J239484
41652f29494m70531q98743m96656J37833R46176J517767J173964L15460J45403
41643A741179O23727L73273p71591j035332M22934J829378J521733N44091N22660
41634E772052O04371q52968k696962k278000k9959O14856j447069k919027r44662
41625d177368K551149L609581J621160n38280q98623m07797n11571q91477m88630
41616a31856N24272R10482Q7813j109611j417046m97775Q32538J566020J411192
$$ plain form
41607 2176029 2878408 2701060 1839692 1038258 1294648 2845427 4612857 5122360 3946619
41598 3946619 1987732 510528 214957 1032663 2361801 3513129 4202597 4533415 4398030
41589 4398030 3333226 1333347 -664369 -1698072 -1849977 -1799023 -1686017 -1194036 -489318
41580 -489318 -229302 -724088 -1750215 -2901123 -3414575 -2309660 86762 1442423 96789
41571 96789 -1957118 -1211848 2049282 3552037 1263810 -1374212 -817173 935856 -151432
41562 -151432 -2939335 -2301070 2645440 6488050 5178306 1375003 -408240 -265491 -937182
41553 -937182 -2144046 -1291317 1389042 2720511 1544530 37838 -349126 -732966 -1664390
41544 -1664390 -1509267 521771 2605605 3309222 3711173 4570466 4072653 1038868 -1936879
$$ packed form
41607B176029P02379j77348q61368q01434K56390J550779J767430N09503j175741
41598C946619j958887j477204k95571Q17706J329138J151328O89468L30818j35385
41589D398030j064804j999879j997716j033703j51905N0954J13006M91981P04718
41580d89318K60016m94786j026127j150908n13452J104915K396422J355661j345634
41571I6789k053907P45270L261130J502755k288227k638022N57039J753029j087288
41562a51432k787903O38265M946510L842610j309744l803303j783243J42749o71691
41553i37182j206864Q52729K680359J331469j175981j506692l86964l83840r31424
41544a664390J55123K031038K083834P03617M01951Q59293m97813l033785k975747
$$ plain form
41535 -1936879 -1807844 114714 210416 -1650758 -2216835 -470324 901738 356904 23576
41526 23576 1768797 3909198 4032348 2687209 1869847 1628325 670921 -829677 -1456244
41517 -1456244 -916242 -69999 976323 2776487 4664426 4871335 2842680 36638 -1915515
41508 -1915515 -2707228 -2708817 -1879508 18329 2501841 4129358 3492296 876296 -1266699
41499 -1266699 -599653 2061697 3348931 1686380 -523574 -314634 1840070 3352574
41491 3352574 3521792 3693541 4145951 3630624 2024360 756181 180204 -909751 -2493500
41482 -2493500 -2730002 -1264305 -442722 -1517985 -2191991 -356306 1897155 1213737 -1404141
41473 -1404141 -1646951 1532915 4093435 2781847 -260494 -871237 1297066 2974649
$$ packed form
41535a936879J29035J922558R5702j861174n66077J746511J372062n44834l33328
41526B3576J745221K140401J23150j345139q17362k41522r57404j500598o26567
41517a456244N40002Q46243J046322J800164J887939K06909k028655k806042j952153
41508a915515p91713j589Q29309J897837K483512J627517o37062k616000k142995
41499a266699O67046K661350J287234j662551k209954K08940K154704J512504
41491C352574J69218J71749M52410n15327j606264j268179n75977j089955j583749
41482b493500k36502J465697Q21583j075263o74006J835685K253461o83418k617878
41473a404141k42810L179866K560520j311588l042341o10743K168303J677583
$$ plain form
41465 2974649 2349481 1250747 2040977 4426804 6255201 6135233 4233910 1382388 -1388974
41456 -1388974 -2849259 -2389794 -1009865 -490281 -1178749 -1389525 381582 3230606 4655929
41447 4655929 3402484 749340 -1085845 -1190077 -388424 39997 -379591 -1187673 -1669938
41438 -1669938 -1415201 -330531 1444528 3319633 4313833 4010801 3331621 3462430 3910819
41429 3910819 2827605 -120597 -2470395 -1860812 613390 1615649 -118599 -2399717
41421 -2399717 -2782314 -1551144 -699950 -1037269 -1386305 -307202 2070427 3908526 3287091
41412 3287091 250950 -2934600 -4101181 -3446137 -2676649 -2347495 -1496367 125438 1270293
41403 1270293 1248732 1096721 1693297 2212874 1768013 1282696 2085475 3617009 4346837
$$ packed form
41465B974649o25168j098734P90230K385827J828397j19968j901323k851522k771362
41456a388974j460285M59465J379929N19584o88468k10776J771107K849024J425323
41447D655929j253445k653144j835185j04232Q01653M28421m19588q08082m82265
41438a669938K54737J084670J775059J875105R94200l03032o79180J30809M48389
41429C910819j083214k948202k349798O09583K474202J002259j734248k281118
41421b399717l82597J231170Q51194l37319l49036J079103K377629J838099o21435
41412C287091l036141l185550j166581O55044P69488L29154Q51128J621805J144855
41403A270293k1561j52011N96576N19577m44861m85317Q02779J531534P29828
$$ plain form
41394 4346837 4238323 4259878 3880391 1502083 -2261733 -4155819 -2345361 898965 2178574
41385 2178574 1373359 1211232 3078112 5267974 5614345 4232861 2889414 2639553 2939287
41376 2939287 2617080 1111410 -951299 -2017527 -858561 1977232 4338179 4569251
41368 4569251 3084481 1442123 470615 23747 -84296 -47629 -507113 -1613859 -1936768
41359 -1936768 -58245 2685900 3165018 787782 -1338380 -807566 768906 767142 -243782
41350 -243782 -89269 740219 -143877 -2567805 -3704722 -2705043 -1935484 -2703136 -3090033
41341 -3090033 -1566652 317233 889177 1241335 2667042 3622921 2263670 187691 330002
41332 330002 2274759 3035409 1843667 751023 688195 455503 -39144 854071 2900567
$$ packed form
41394D346837j08514K1555l79487k378308l763816j894086J810458L244326J279609
41385B178574q05215j62127J866880K189862L46371j381484j343447k49861K99734
41376B939287l22207j505670k062709j066228J158966K835793K360947K31072
41368D569251j484770j642358r71508m46868j08043L6667m59484j106746l22909
41359a936768J878523K744145M79118k377236k126162N30814J576472j764j010924
41350b43782J54513Q29488q84096k423928j136917R99679P69559p67652l86897
41341c090033J523381J883885N71944L52158J425707R55879j359251k075979J42311
41332C30002J944757P60650j191742j092644o2828k32692m94647Q93215K046496
$$ plain form
41323 2900567 3208560 853923 -874859 660233 2981739 2105766 -1140109 -2075432 1115965
41314 1115965 5127925 6377488 5056011 3325282 2096226 1230354 981372 1278210 817918
41305 817918 -1216344 -3352259 -3589258 -2364033 -1776000 -2161296 -1711596 175661 1509602
41296 1509602 788874 -474422 1507 1850006 2806020 2080023 1004210 620405 548473
41287 548473 408252 685733 1721754 3075443 4180204 4485212 2974312 -764609 -4611494
41278 -4611494 -4980527 -954109 4037465 5887595 4059218 1038523 -1169862 -2332807
41270 -2332807 -2623252 -1981529 -918432 -494477 -1115644 -2138115 -2718307 -2400612 -1104711
41261 -1104711 624554 1585097 1123540 303161 864264 2907938 4538364 4084192 1933601
$$ packed form
41323B900567L07993k354637j728782J535092K321506q75973l245875r35323L191397
41314A115965M011960J249563j321477j730729j229056q65872k48982K96838m60292
41305H17918k034262k135915k36999J225225N88033l85296M49700J887257J333941
41296A509602p20728j263296M75929J848499R56014p25997j075813l83805p1932
41287E48473j40221K77481J036021J353689J104761L05008j510900l738921l846885
41278d611494l69033M026418M991574J850130j828377l020695k208385j162945
41270b332807k90445O41723J063097M23955o21167j022471n80192L17695J295901
41261a104711J729265R60543m61557q20379N61103K043674J630426m54172k150591
$$ plain form
41252 1933601 -157207 -981473 -763033 -573266 -1241430 -2643842 -3857130 -4091767 -3493770
41243 -3493770 -2926132 -3045939 -3756447 -4466215 -4660123 -4164315 -2955606 -980605 1398453
41234 1398453 2804559 1672167 -1535489 -3799499 -2667559 544121 2402652 2010125
41226 2010125 1747022 2957983 3599854 1802865 -524372 -194807 2463324 4065089 2986066
41217 2986066 1132289 658491 1191941 1187641 399435 -213069 -227816 -276747 -832960 -1154559
41207 -1154559 -66798 2040886 2868025 1012548 -1474397 -1339805 1119622 2252448
41199 2252448 743610 -186101 1696040 3283649 908323 -3050792 -3033099 1355543 4797870
41190 4797870 4085437 1645322 349645 -441676 -1695850 -1834456 77299 1585153 481762
$$ packed form
41252A933601k090808q24266K18440J89767o68164j402412j213288k34637N97997
41243c493770N67638j19807p10508p09768j93908M95808J208709J975001K379058
41234A398453J406106j132392l207656k264010J131940L211680J858531l92527
41226B010125k63103J210961O41871j796989k327237L29565K658131J601765j079023
41217B986066j853777m73798N33450m300p88206o12504j4747m8931n56213l21599
41207a154559J087761K107684Q27139j855477k486945J34592K459427J132826
41199B252448j508838r29711J882141J587609k375326l959115J7693M388642L442327
41190D797870p12433k440115j295677p91321j254174j38606J911755J507854j103391
$$ plain form
41181 481762 -1325802 -800775 1349964 2072716 812367 -280071 -51413 842424 2226026
41172 2226026 4414291 6066562 4994659 1523505 -1460352 -2368079 -2557025 -3470211 -4370779
41163 -4370779 -4054534 -2990738 -2340649 -2071336 -1361256 -40134 1456631 2809741 3496764
41154 3496764 2584419 105002 -1988683 -1801742 -253853 -179951 -2339583 -4055536 -2869587
41145 -2869587 -50188 1299394 681499 466047 1884910 3300774 3184804 2389895 2030232
41136 2030232 1323526 -352068 -1155892 649843 3068345 2524756 -776603 -2893140 -1716905
41127 -1716905 643068 1680467 1589943 1368104 662100 -834306 -2111351 -2540904 -2806019
41118 -2806019 -2852949 -1339362 1306979 1997998 -613879 -3408832 -3229349 -1687997 -2192040
$$ packed form
41181D81762j807564N25027K150739P22752j260349j092438K28658Q93837J383602
41172B226026K188265J652271j071903l471154k983857r07727j88946r13186r00568
41163d370779L16245J063796O50089K69313P10080J321122J496765J353110O87023
41154C496764r12345k479417k093685J86941J547889P3902k159632j715953J185949
41145b869587K819399J349582o17895k15452J418863J415864j15970p94909l59663
41136B030232p06706j675594q03824J805735K418502n43589l301359k116537J176235
41127a716905K359973J037399r0524k21839p06004j496406j277045m29553k65115
41118b806019m6930J513587K646341O91019k611877k794953J79483J541352n04043
$$ plain form
41109 -2192040 -4102405 -3925378 -1347845 237799 -607816 -1170571 875429 3936463 5063035
41100 5063035 3743845 1672832 431245 603571 1796410 2528093 1294811 -1415919
41092 -1415919 -3187162 -2359711 235342 2528877 3181776 2149410 486093 -173694 907313
41083 907313 2440379 2587069 1504119 1001174 1691827 2208122 1537917 400956 -253716
41074 -253716 -511241 -580913 -100428 903383 1642075 1800044 1914945 2026381 1320017 -326521
41064 -326521 -1882800 -2846267 -3846406 -4885898 -4689252 -2835877 -960320 -582926 -1079228
41055 -1079228 -1006306 -138537 1036136 2445106 3611398 3080026 436094 -2198454 -2617263
41046 -2617263 -1681547 -2013436 -4065600 -5640457 -5291473 -4135781 -3755072 -3945860 -3469846
$$ packed form
41109b192040j910365J77027K577533J585644q45615n62755K046000L061034J126572
41100E063035j319190k071013j241587J72326J192839P31683j233282k710730
41092a415919j771243Q27451K595053K293535O52899j032366j663317o59787J081007
41083I07313J533066J46690j082950n02945O90653N16295o70205j136961o54672
41074b53716k57525o9672M80485J003811P38692J57969J14901J11436p06364j646538
41064c26521j556279r63467j000139j039492J96646J853375J875557L77394m96302
41055a079228P2922Q67769J174673J408970J166292n31372k643932k634548m18809
41046b617263R35716l31889k052164j574857L48984J155692L80709j90788M76014
$$ plain form
41037 -3469846 -2059723 -759068 -569364 -1283900 -1761452 -1369081 -909102 -1487020 -2562025
41028 -2562025 -2366245 -701776 237920 -982172 -2519642 -1760799 614094 1393405 -543220
41019 -543220 -2687940 -2493524 -559134 688922 79584 -1567501 -2843905 -2958702 -2074759
41010 -2074759 -1031839 -397784 269114 1587493 2978669 3260056 2584614 2309820 2667843
41001 2667843 2341495 1113854 990247 3165910 5543587 5410579 3459528 2597455 3273062
40992 3273062 2911112 413090 -1684026 -988442 1122690 1733310 663059 150410 1137871
40983 1137871 2275517 2356519 1518561 6583 -2055488 -3410551 -2522915 -313147 381250
40974 381250 -918331 -1262235 811699 2112012 -548635 -4761664 -5466861 -2301330 356248
$$ packed form
41037c469846J410123J300655J89704p14536m77552L92371M59979n77918j075005
41028b562025J95780J664469R39696j220092j537470P58843K374893P79311j936625
41019e43220k144720J94416J934390J248056o09338j647085j276404j14797Q83943
41010b074759J042920O34055O66898J318379J391176K81387o75442k74794L58023
41001B667843l26348j227641j23607K175663K377677j33008j951051q62073O75607
40992C273062l61950k498022k097116O95584K111132O10620j070251n12649R87461
40983A137871J137646Q1002q37958j511978k062071j355063Q87636K209768O94397
40974C81250j299581l43904K073934J300313k660647m213029p05197L165531K657578
$$ plain form
40965 356248 526684 1028568 3477793 4638946 1785021 -1963530 -1793950 1433658 2437123
40956 2437123 -565922 -3531930 -2884906 -434123 -121738 -2305416 -3688213 -2014322
40948 -2014322 1172367 2601555 1020346 -1650006 -2663042 -1437008 308835 1147483
40940 1147483 1465925 1944516 1974134 865460 -534453 -1143607 -1654827 -3190693 -4622758
40931 -4622758 -3764772 -1095929 543325 471103 1343789 4434254 6647408 4731421 405532
40922 405532 -1757686 -525045 1043244 653144 -286890 347583 1967616 2467564 1386873
40913 1386873 178776 12249 752077 1831865 2826772 3067174 1834191 -527167 -2399374
40904 -2399374 -2456644 -1132297 -8300 9155 -666211 -1275644 -1536600 -1391262 -763178
$$ packed form
40965C56248J70436N01884K449225J161153k853925l748551J69580L227608J003465
40956B437123l003045k966008O47024K450783L12385k183678j382797J673891
40948b014322L186689J429188j581209k670352j013036J226034J745843Q38648
40940A147483L18442M78591K9618j108674j399913o09154n11220j535866j432065
40931d622758Q57986K668843J639254p2222Q72686L090465K213154j915987m325889
40922D05532k163218J232641J568289l90100r40034O34473J620033M99948j080691
40913A386873j208097j66527P39828J079788R94907K40402j232983k361358j872207
40904b399374n7270J324347J123997J7455o75366o09433k60956J45338O28084
$$ plain form
40895 -763178 46203 424737 402348 826338 1959882 2686830 2027512 714632 33245
40886 33245 -316836 -1621338 -3669311 -4681256 -3952803 -2802790 -2307856 -1826916 -742975
40877 -742975 -43216 -700844 -1659794 -1136460 672891 1793747 1214410 88583 95270
40868 95270 1562295 3369580 4063160 2998211 820014 -1171925 -2211662 -2284671 -1361201
40859 -1361201 485344 2014302 1471060 -782149 -1853464 -30242 2419783 2078146
40851 2078146 -961572 -3495491 -3727961 -2904271 -2372101 -1527411 464979 2822429 4100870
40842 4100870 3738132 1929659 -765639 -3013044 -3188918 -1170329 1270526 2467924
40834 2467924 2380356 1791487 1182690 836613 828095 482864 -826863 -2052782 -1427467 404137
$$ packed form
40895g63178Q09381L78534k2389M23990J133544P26948o59318j312880o81387
40886C3245l50081j304502k047973j011945P28453J150013M94934M80940J083941
40877g42975O99759o57628r58950N23334J809351J120856n79337j125827O687
40868I5270J467025J807285O93580j064949k178197j991939j039737p3009R23470
40859a361201J846545J528958n43242k253209j071315J823222K450025l41637
40851B078146l039718k533919k32470Q23690N32170Q44690J992390K357450J278441
40842D100870l62738j808473k695298k247405j75874K018589K440855J197398
40834B467924q7568n88869o08797l46077q518l45231j309727j225919O25315J831604
$$ plain form
40824 404137 463324 -2130984 -4174263 -2883589 -353704 -657280 -3733484 -5426083 -3423613
40815 -3423613 -76233 1375901 799975 122350 123899 -122754 -1406683 -3099257 -3526923
40806 -3526923 -1390506 2663691 5936814 6047463 3508060 999792 23920 -563376 -2400850
40797 -2400850 -5225418 -7254124 -7123391 -4941947 -2123735 -507207 -867031 -2030749
40789 -2030749 -2297115 -1814337 -2295328 -4034104 -4815522 -2846576 543163 2587213 2578868
40780 2578868 2012458 1676794 533214 -2046923 -4434434 -4310746 -1619147 1084549 1511214
40771 1511214 327744 287380 2625560 5211418 5153016 2652280 738886 1055199 1713238
40762 1713238 352422 -2241598 -3327360 -2095191 -300484 712005 1443168 2326486
$$ packed form
40824D04137N9187k594308k043279J290674K529885l03576l076204j692599K002470
40815c423613L347380J452134n75926o77625J549k46653j283929j692574m27666
40806c526923K136417M054197L273123J10649k539403k508268r75872n87296j837474
40797b400850k824568k028706J30733K181444K818212J616528l59824j163718
40789b030749k66366M82778m80991j738776p81418J968946L389739K044050q345
40780B578868n66410l35664j143580k580137k387511J23688K691599K703696M26665
40771A511214j183470m0364K338180K585858n8402k500736j913394L16313O58039
40762A713238j360816k594020j085762J232169J794707J012489P31163Q83318
$$ plain form
40754 2326486 2503741 1630790 1234928 2684478 4883905 5701121 4990962 4306521 3898529
40745 3898529 2198925 -1180549 -3942429 -3851732 -1623572 332074 992329 964143 486659
40736 486659 -798340 -2266379 -2519189 -1556162 -994399 -1538626 -1945591 -1408057 -1257188
40727 -1257188 -2808701 -4795630 -4783835 -2532337 -232347 406069 -158891 -541797 -115336
40718 -115336 774806 1465733 1680722 1895864 2619186 3067820 1679866 -1278301 -3063170
40709 -3063170 -1922406 105882 -84827 -2222780 -3459819 -2888250 -2258467 -2324679 -1729633
40700 -1729633 -115516 829698 572873 1015766 3045433 4567377 3839664 2220723 1510914
40691 1510914 1029891 -236866 -990530 -72331 539181 -1345276 -3754344 -2921996 842843
$$ packed form
40754B326486J77255q72951l95862J449550K199427Q17216p10159o84441m07992
40745C898529j699604l379474k761880R0697K228160J955646O60255k8186m77484
40736D86659j284999j468039k52810R63027N61763n44227m06965N37534J50869
40727a257188j551513j986929J1795K251498K299990O38416n64960l82906M26461
40718a15336Q90142O90927K14989K15142P23322M48634j387954k958167j784869
40709c063170J140764K028288j90709k137953j237039N71569O29783o6212N95046
40700a729633J614117R45214k56825M42893K029667J521944p27713j618941p09809
40691A510914m81023j266757p53664R18199O11512j884457k409068Q32348L764839
$$ plain form
40682 842843 3511840 3220990 1902725 926470 -727636 -2879729 -2721393 843674 4396916
40673 4396916 4088286 610517 -2153051 -2052639 -261459 1006815 637359 -820183 -1518087
40664 -1518087 -42216 2439241 3085054 1336451 136632 1654156 3655404 2518823
40656 2518823 -1396866 -4204990 -3841929 -2108530 -1086838 -292372 1382170 3049324
40648 3049324 3072724 1822383 1245389 1952502 2424344 1455585 -32238 -557113 -515628
40639 -515628 -1625559 -4116871 -6017634 -5758567 -4123808 -2634605 -1261536 706872
40631 706872 2481831 2555111 1311366 578917 409045 -1223091 -4614566 -6600049 -4345031
40622 -4345031 696612 4408952 4575740 2299522 -147386 -1276927 -903399 -182059 -605613
$$ packed form
40682H42843K668997k90850j318265r76255j654106k152093J58336L565067L553242
40673D396916l08630l477769k763568J00412J791180J268274l69456j457542o97904
40664a518087J475871K481457O45813j748603j199819J517524K001248j136581
40656B518823l915689k808124L63061J733399J021692P94466J674542J667154
40648C049324K3400j250341n76994P07113M71842r68759j487823n24875M1485
40639e15628j109931k491312j900763K59067J634759J489203J373069J968408
40631G06872J774959P3280j243745p32449j69872j632136l391475j985483K255018
40622d345031N041643L712340J66788k276218k446908j129541L73528P21340m23554
$$ plain form
40613 -605613 -1934515 -2140123 -572841 345269 -1489544 -4219770 -4404605 -2107169 -547361
40604 -547361 -1018483 -1532831 -954701 -930471 -2226697 -2346535 719578 4586530 5176390
40595 5176390 2141521 -1086410 -2102568 -1841024 -2006479 -2488261 -2208416 -1128075 -350329
40586 -350329 -716082 -1867034 -2565518 -1896807 -372817 328229 -938567 -3503507 -5541740
40577 -5541740 -5728907 -4086242 -1760752 -326515 -669441 -2072728 -2982038 -3007871 -3240607
40568 -3240607 -4109254 -4327513 -3090407 -1892215 -2340301 -3258202 -2357867 -289451 -248370
40559 -248370 -3172755 -5963161 -5544079 -2504530 612578 2614165 3550854 3098301 1281326
40550 1281326 -233422 237645 2011120 3129253 3249227 3470818 3804032 3142397 1710416
$$ packed form
40613f05613j328902k05608J567282R18110j834813k730226j84835K297436J559808
40604e47361m71122n14348N78130K4230j296226j19838L066113L866952N89860
40595E176390l034869l227931j016158K61544j65455m81782K79845J080341P77746
40586c50329l65753j150952o98484O68711J523990P01046j266796k564940k038233
40577e541740j87167J642665K325490J434237l42926j403287r09310k5833k32736
40568c240607q68647k18259J237106J198192m48086r17901R00335K068416M1081
40559b48370k924385k790406M19082L039549L117108K001587R36689m52553j816975
40550A281326j514748M71067J773475J118133J19974K21591L33214o61635j431981
$$ plain form
40541 1710416 1130717 1652147 1656411 648560 303052 1249785 1226541 -1446931 -4420825
40532 -4420825 -4106731 -964610 961875 -247628 -2039780 -1613539 63006 304032 -906911
40523 -906911 -1031177 934545 2822042 2456928 769170 351826 1773348 2983368 2346178
40514 2346178 654627 -506469 -984452 -1386693 -1189875 684244 3627562 5447227 5058154
40505 5058154 3658392 2811077 2749638 3077582 3578427 3499473 1645437 -1532930 -3339321
40496 -3339321 -1904229 1189558 2939336 2602768 1626072 876212 104027 -398266 46191
40487 46191 713613 -3176 -2079297 -3763515 -4156685 -3948012 -3453555 -2148065 -584243
40478 -584243 -422953 -1685902 -2177693 -726900 1086226 1649494 1635772 2086443 2242401
$$ packed form
40541A710416n79699N21430M264j007851l45508R46733k3244k673472k973894
40532d420825L14094L142121J926485j209503j792152M26241J676545K41026j210943
40523i06911j24266J965722J887497l65114j687758m17344J421522J210020o37190
40514B346178j691551j161096m77983m02241J96818J874119K943318J819665l89073
40505E058154j399762q47315o1439L27944N00845p8954j854036l178367j806391
40496c339321J435092L093787J749778l36568r76696p49860p72185n02293M44457
40487D6191O67422p16789k076121j684218l93170K08673M94457J305490J563822
40478e84243J61290j262949m91791J450793J813126N63268j3722M50671J55958
$$ plain form
40469 2242401 1182045 -151739 -615008 -962139 -2092354 -2739170 -1506172 7190 -923349
40460 -923349 -3773630 -5280939 -4242274 -2884027 -3041969 -3725590 -3414010 -2458075 -1945062
40451 -1945062 -1894621 -1775675 -1505523 -965338 321320 2195065 3573067 3796034 3276950
40442 3276950 2446946 1343310 650741 1543102 3668156 4801105 3573501 1245473 -312782
40433 -312782 -1028044 -1659685 -1763060 -509833 1173597 1283234 -445577 -1987533 -1661493
40424 -1661493 -243626 10226 -2075144 -5237941 -6821711 -5392235 -2410104 -639485
40416 -639485 -683606 -287618 2138431 4722865 4539176 1896370 242 430164 1269567
40407 1269567 484282 -884990 -471161 1681379 2974683 1672364 -932202 -2076263
$$ packed form
40469B242401j060356j333784m63269l47131j130215o46816J232998J513362r30539
40460i23349k850281j507309J038665J358247j57942o83621L11580R55935N13013
40451a945062N0441J18946K70152N40185J286658J873745J378002K22967n19084
40442C276950q30004j103636o92569Q92361K125054J132949j227604k328028j558255
40433c12782p15262o31641j03375J253227J683430J09637j728811j541956L26040
40424a661493J417867K53852k085370l162797j583770J429476K982131J770619
40416f39485m4121L95988K426049K584434j83689k642806j896128M29922Q39403
40407A269567p85285j369272M13829K152540J293304j302319k604566j144061
$$ plain form
40399 -2076263 -467560 2654696 4923695 4994466 3461202 1842360 844912 -47124 -1284131
40390 -1284131 -2269338 -2252619 -1716216 -1925752 -3137659 -4203101 -4246331 -3856373 -4009373
40381 -4009373 -4502878 -4308891 -3107270 -1599443 -450139 276727 680183 794333 816481
40372 816481 867062 578987 -345458 -1391057 -2012695 -2800889 -4365119 -5267539 -3278116
40363 -3278116 787772 2990274 1442166 -803446 -208249 2038702 2280056 351818
40355 351818 -454847 1045388 2317712 1676271 841130 1481652 2305264 1602564 278776
40346 278776 146220 993124 1432520 1208357 763243 -74954 -1074623 -681666 1795081
40337 1795081 4310878 4558355 3186093 2269391 1707018 -81227 -2521972 -3025712 -927087
$$ packed form
40399b076263J608703L122256K268999P0771j533264j618842r97448q92036j237007
40390a284131r85207J6719N36403k09536j211907j065442m3230L89958j53000
40381d009373m93505J93987J201621J507827J149304P26866M03456J14150K2148
40372H16481N0581k88075r24445j045599o21638p88194j564230r02420J989423
40363c278116M065888K202502j548108k245612N95197K246951K41354j928238
40355C51818q06665J500235J272324o41441q35141O40522Q23612p02700j323788
40346B78776j32556Q46904M39396k24163m45114q38197r99669L92957K476747
40337A795081K515797K47477j372262r16702n62373j788245k440745n03740K098625
$$ plain form
40328 -927087 1400313 1898791 994151 -173422 -1444348 -2659167 -2920627 -1965725 -853105
40319 -853105 -393978 -226220 -194372 -1147049 -3303976 -5126273 -5092904 -3743516 -2788443
40310 -2788443 -2804523 -2889726 -2218482 -959243 271019 1131313 1554241 1354432 194711
40301 194711 -1760353 -3292008 -3045501 -1409650 -539795 -1647417 -3186463 -2973047 -1268313
40292 -1268313 -114316 -168077 -93492 1047604 2643896 3874456 4574027 4687325 4343476
40283 4343476 4294636 4700686 4028251 1284444 -1265815 -478233 2752485 4286631 2841117
40274 2841117 1639131 2864522 4263895 3271887 1080773 31402 -80696 -284198 278145
40265 278145 2260640 3726501 3102192 2271770 3237581 3950327 1620024 -1673850 -1536710
$$ packed form
40328i27087K327400M98478r04640j167573j270926j214819k61460R54902J112620
40319h53105M59127J67758L1848r52677k156927j822297L3369J349388R55073
40310b788443j6080q5203O71244J259239J230262Q60294M22928j99809j159721
40301A94711j955064j531655K46507J635851Q69855j107622j539046K13416J704734
40292a268313J153997n3761P4585J141096J596292J230560O99571J13298l43849
40283D343476m8840M06050o72435k743807k550259P87582L230718J534146j445514
40274B841117j201986J225391J399373r92008k191114j049371j12098k03502N62343
40265B78145J982495J465861o24309q30422R65811P12746k330303l293874J37140
$$ plain form
40256 -1536710 1514436 2451932 -583382 -3853571 -4051695 -2260509 -594803 907629
40248 907629 2185565 1671078 -781086 -2442417 -1412498 765423 2134926 3243369
40240 3243369 4725284 4667604 1464945 -2555411 -3628330 -1713425 -213776 -957273 -2158677
40231 -2158677 -1572446 536143 2264433 2520473 1835325 1337998 1421661 1471670 984990
40222 984990 599002 1241837 2458028 2724908 1487017 -341801 -1925208 -3082847 -3275741
40213 -3275741 -1872377 177575 871525 -35704 -690922 -219009 117628 -276378 97935
40204 97935 2004495 3652689 3565252 3034020 3593575 4110499 2806069 442769 -979054
40195 -979054 -1193059 -977975 -143492 1232779 1267468 -1070110 -3304970 -2713160 -814172
$$ packed form
40256a536710L051146R37496l035314l270189j98124J791186J665706J502432
40248I07629J277936n14487k452164j661331J029919K177921J369503J108443
40240C243369J481915n7680l202659m020356j072919J914905J499649p43497j201404
40231b158677N86231K108589J728290K56040o85148m97327Q3663N0009m86680
40222I84990l85988O42835J216191K66880j237891j828818j583407j157639j92894
40213c275741J403364K049952O93950r07229o55218M71913L36637l94006L74313
40204I7935J906560J648194q7437n31232N59555N16924j304430k363300j421823
40195i79054k14005K15084Q34483J376271L4689k337578k234860N91810J898988
$$ plain form
40186 -814172 -933080 -2451330 -1781427 1382560 3379516 2561745 1484002 1980161 2295035
40177 2295035 946397 -368333 -85590 227351 -1177240 -2941488 -2991481 -1986365 -1633396
40168 -1633396 -1531013 -635790 -219421 -2041427 -4499234 -3947726 261784 4958083 7533775
40159 7533775 8417247 8616514 7523327 4632479 1516875 198789 474392 510253 -314991
40150 -314991 -715532 262650 1717626 2304315 2158694 2278953 2533169 1782158 84310
40141 84310 -845885 -163845 575671 -273688 -1776304 -1763209 -94717 1316482 1303771 302345
40131 302345 -1282217 -3284727 -4310089 -2599045 946812 3004869 2179871 857548
40123 857548 1313858 2235500 1223638 -975222 -1344455 1073289 4067182 5278652 4438212
$$ packed form
40186h14172j18908j518250O69903L163987J996956q17771j077743M96159L14874
40177B295035j348638j314730K82743L12941j404591j764248m9993J005116L52969
40168a633396J02383Q95223M16369j822006k457807N51508M209510M696299K575692
40159G533775Q83472J99267j093187k890848l115604j318086K75603L5861q25244
40150c14991m00541R78182J454976N86689j45621J20259K54216p51011j697848
40141H4310r30195O82040P39516q49359j502616J3095J668492J411199j2711j001426
40131C02345j584562k002510j025362J711044L545857K058057q24998j322323
40123H57548M56310R21642j011862k198860l69233K417744K993893J211470q40440
$$ plain form
40114 4438212 2609979 851931 -153478 -369922 -538091 -1220790 -1835170 -1464956 -333412
40105 -333412 539800 902254 1369377 2029646 2069404 1002033 -562601 -1600970 -1544026
40096 -1544026 -446951 1045968 1848502 1243995 -178656 -879472 5568 1615210 2239385
40087 2239385 1238823 -196346 -542650 -51325 -543127 -2683782 -4459969 -3524894 -409433
40078 -409433 2101775 2436103 1360294 -144565 -1949079 -3370670 -3077629 -1434271 -808019
40069 -808019 -2142250 -3190433 -1882471 388929 1010570 190704 222637 1622172 2662788
40060 2662788 2481509 2136488 2335156 2304280 1544307 965671 1452400 2497337 3005030
40051 3005030 2625010 1720981 650292 -344537 -750805 225397 2817692 5614679 6086831
$$ packed form
40114D438212j828233j758048j005409k16444j68169o82699o14380L70214J131544
40105c33412Q73212L62454M67123O60269L9758j067371j564634j038369N6944
40096a544026J097075J492919Q02534o04507j422651p00816Q85040J609642O24175
40087B239385j000562j435169l46304M91325m91802k140655j776187R35075L115461
40078d09433K511208L34328j075809j504859j804514j421591K93041J643358O26252
40069h08019j334231j048183J307962K271400O21641q19866L1933J399535J040616
40060B662788j81279l45021J98668l0876p59973n78636M86729J044937N07693
40051C005030l80020r04029j070689r94829m06268R76202K592295K796987M72152
$$ plain form
40042 6086831 3392879 161387 -402239 981489 647328 -2142794 -3711083 -1914909
40034 -1914909 112624 -839740 -2488275 -966786 2219271 2461318 -17599 -351934 2705467
40025 2705467 4572997 2383386 -647046 -919532 177281 -119397 -898409 7644 1580378
40016 1580378 1666178 1243382 2516513 4326083 3671359 984579 -228834 1100323 2303356
40007 2303356 1655152 812520 1457109 2487188 2149449 782062 -167384 -248372 282321
39998 282321 1509566 3229073 4316726 4071270 3416744 3506073 3723013 2437965 -395260
39989 -395260 -2638067 -2336373 -14322 1820595 1202297 -1502875 -4140810 -4805104 -3318117
39980 -3318117 -1041974 376184 142903 -1216088 -2200506 -1533586 536348 2327706 2490118
$$ packed form
40042F086831k693952l231492n63626J383728l34161k790122j568289J796174
40034a914909K027533r52364j648535J521489L186057K42047k478917l34335L057401
40025B705467J867530k189611l030432k72486J096813k96678p79012R06053J572734
40016A580378Q5800m22796J273131J809570o54724k686780j213413J329157J203033
40007B303356o48204q42632O44589J030079l37739j367387r49446q0988N30693
39998B82321J227245J719507J087653k45456o54526Q9329K16940j285048k833225
39989c95260k242807L01694K322051J834917o18298k705172k637935o64294J486987
39980c318117K276143J418158k33281j358991r84418O66920K069934J791358J62412
$$ plain form
39971 2490118 1474410 837263 1277058 1892528 1407001 -311923 -2103739 -2675604 -1857198
39962 -1857198 -786543 -719815 -1530119 -1682473 -73601 2299591 3077490 1125283 -1968809
39953 -1968809 -3328083 -1714773 1184843 2553631 1437106 -374766 -619343 699594
39945 699594 1464079 256226 -1809680 -2554052 -1472951 -198970 -298513 -1444775 -2198448
39936 -2198448 -1985843 -1456446 -1044242 -302830 793318 925870 -905391 -3234223 -3261318
39927 -3261318 -458001 2382809 2422028 -28732 -2379963 -2741195 -1098628 1336357 2724588
39918 2724588 1590724 -1283358 -2810834 -1086287 1835514 2476927 544507 -1231164
39910 -1231164 -1429509 -1416929 -2204952 -2588744 -1553409 -311314 -409964 -1378100 -1724699
$$ packed form
39971B490118j015708o37147M39795O15470m85527j718924j791816n71865Q18406
39962a857198J070655O6728q10304j52354J608872K373192P77899j952207l094092
39953a968809j359274J613310K899616J368788j116525j811872k44577J318937
39945F99594P64485j207853k065906p44372J081101J273981r9543j146262p53673
39936b198448K12605N29397M12204P41412J096148J32552j831261k328832k7095
39927c261318K803317K840810L9219k450760k351231l61232J642567K434985J388231
39918B724588j133864k874082j527476J724547K921801O41413j932420j775671
39910a231164j98345J2580p88023l83792J035335J242095r8650r68136l46599
$$ plain form
39901 -1724699 -1119595 -300641 225513 284927 -281593 -1070835 -1082854 -56821 1019940
39892 1019940 1430395 1722462 2416070 2829547 2179254 949052 205647 217585 424512
39883 424512 113965 -1188911 -3073932 -3905480 -2511301 -286748 227376 -942337 -1283782
39874 -1283782 -100704 254901 -1255739 -2022954 -134633 1919040 1042784 -1317797 -1464414
39865 -1464414 793835 2486267 2446859 1978371 1188949 -1192710 -4219321 -4875266 -2549606
39856 -2549606 46417 1174912 1924216 2866568 2422112 172888 -1371307 -417220 1248681
39847 1248681 1182945 -77284 -482367 192105 661863 486541 193243 84185 396451
39838 396451 1464536 2451631 1481175 -1443179 -3358703 -2131177 226787 326501 -1724661
$$ packed form
39901a724699O05104Q18954N26154N9414n66520p89242j2019J026033J076761
39892A019940M10455K92067O93608M13477o50293j230202p43405J1938K06927
39883D24512l10547j302876j885021q31548J394179K224553N14124j169713l41445
39874a283782J183078L55605j510640p67215J888321K053673q76256k360581j46617
39865a464414K258249J692432l9408m68488p89422k381659l026611o55945K325660
39856b549606K596023J128495P49304R42352m44456k249224j544195R54087J665901
39847A248681o5736j260229m05083O74472M69758j75322k93298j09058L12266
39838C96451J068085R87095r70456k924354j915524J227526K357964R9714k051162
$$ plain form
39829 -1724661 -2795460 -1386243 776747 1655895 1071452 -258585 -1827418 -3001277
39821 -3001277 -3108924 -2317634 -1298347 32711 2176540 4463945 5264090 4067680 2118119
39812 2118119 676773 -184389 -797187 -1109325 -1132551 -1197776 -1363656 -1414775 -1635524 -2522189
39802 -2522189 -3433523 -2781067 -253492 2216209 2633434 1320855 126242 -161393 -395850
39793 -395850 -1170718 -1524625 -164517 2507306 4305028 3424222 469757 -2026966 -2198930
39784 -2198930 -599562 915995 1617519 2385522 3742222 4429153 2841722 -449071 -2699286
39775 -2699286 -2031081 128015 536996 -1920104 -4741260 -4856250 -2398107 -261731 -200418
39766 -200418 -922708 -522874 744340 1327779 927105 514400 270913 -699858 -2408292
$$ packed form
39829a724661j070799J409217K162990Q79148n84443j330037j568833j173859
39821c001277j07647P91290J019287J331058K143829K287405Q00145j196410j949561
39812B118119j441346q61162o12798l12138k3226o5225j65880n1119k20749q86665
39802b522189r11334O52456K527575K469701M17225j312579j194613k87635k34457
39793c95850p74868l53907J360108K671823J797722q80806k954465k496723j71964
39784b198930J599368J515557P01524P68003J356700O86931j587431l290793k250215
39775b699286O68205K159096M08981k457100k821156j14990K458143K136376O1313
39766b00418p22290L99834J267214N83439m00674m12705k43487r70771j708434
$$ plain form
39757 -2408292 -3343710 -2493148 -803886 213627 459324 915799 1985222 3079418 3491011
39748 3491011 2896760 1369368 -312984 -773494 503304 1983336 1534519 -746628 -2321353
39739 -2321353 -1362264 915143 1963970 1144749 -3886 -379035 -683390 -1795577 -3075420
39730 -3075420 -3308983 -2628764 -2264619 -2520659 -2204480 -481447 1619032 2338276 1405802
39721 1405802 317850 473677 1731360 2944831 3297151 2746693 1675944 715105 671532
39712 671532 1850656 3230675 2957212 276710 -3203121 -4788493 -3407287 -685785
39704 -685785 868044 404240 -885762 -1583591 -1497052 -1135621 -510706 716644 2082875
39695 2082875 2279815 705124 -1521531 -2646306 -2024704 -289264 1692100 3141888
$$ packed form
39757b408292r35418Q50562J689262J017513K45697M56475J069423J094196M11593
39748C491011n94251j527392j682352m60510J276798J480032m48817k281147j574725
39739b321353R59089K277407J048827q19221j148635l75149l04355j112187j279843
39730c075420k33563O80219L64145k56040L16179J723033K100479P19244r32474
39721A405802j087952J55827J257683J213471L52320n50458j070749r60839m3573
39712F71532J179124J380019k73463k680502l479831j585372J381206K721502
39704f85785J553829m63804j290002o97829Q6539L61431O24915J227350J366231
39695B082875J96940j574691k226655j124775O21602J735440J981364J449788
$$ plain form
39687 3141888 3051682 910709 -1975873 -3178583 -1859736 169871 832935 195974 -449092
39678 -449092 -782561 -1242801 -1433803 -614930 526495 505284 -518425 -833076 16111
39669 16111 530692 -26232 -356751 315009 511145 -918014 -2211215 -1000276 1838938
39660 1838938 3122707 1848946 430460 1127183 3159108 4111989 2940631 819864
39652 819864 -293454 465574 2019564 2442034 1334867 535569 1579676 3242652 3146102
39643 3146102 1328888 192899 717324 857429 -1297381 -4438193 -5606659 -3973523
39635 -3973523 -1559254 -369165 -30789 1235286 3805651 5611710 4443250 987900
39627 987900 -1567194 -1401350 -254925 -701659 -2510650 -3546036 -3400969 -3694769 -4853086
$$ packed form
39687C141888r0206k140973k886582j202710J318847K029607O63064o36961o45066
39678d49092l33469m60240j91002Q18873J141425k1211j023709l14651Q49187
39669A6111N14581n56924l30519O71760J96136j429159j293201J210939K839214
39660A838938J283769j273761j418486O96723K031925R52881j171358k120767
39652H19864j113318P59028J553990M22470j107167p99298J044107J662976r6550
39643C146102j817214j135989N24425J40105k154810l140812j168466J633136
39635c973523K414269J190089L38376J266075K570365J806059j168460l455350
39627I87900k555094J65844J146425m46734j808991j035386J45067k93800j158317
$$ plain form
39618 -4853086 -5177483 -3856288 -2674070 -3454642 -5400864 -6278049 -5105596 -2611503 -31859
39609 -31859 1591579 1824865 1340505 1177975 1106160 -59108 -2118868 -3161087 -2375283
39600 -2375283 -1410165 -1703685 -2168900 -1124655 963195 2522271 3450885 4628954 5708619
39591 5708619 5526127 4362083 3857906 4658456 5633533 5508121 4137974 2272110 1009001
39582 1009001 1212334 2572481 3608546 3315023 2197535 1119610 258436 -21733 1146028
39573 1146028 3282801 4139642 2895030 1977773 3388509 5002565 3617993 300159
39565 300159 -1020709 410495 1555776 987788 658604 1446968 1221936 -823533 -1778778
39556 -1778778 385374 2966621 2456508 -7688 -586609 1270882 2291668 490191
$$ packed form
39618d853086l24397J321195J182218p80572j946222q77185J172453K494093K579644
39609c1859J623438K33286m84360j62530p1815j165268k059760j042219P85804
39600b375283R65118k93520m65215J044245K087850J559076R28614J178069J079665
39591E708619j82492j164044n04177Q00550R75077j25412j370147j865864j263109
39582A009001K03333J360147J036065k93523j117488j077925q61174k80169J167761
39573A146028K136773Q56841j244612r17257J410736J614056j384572l317834
39565C00159j320868J431204J145281n67988l29184P88364k25032k045469r55245
39556a778778K164152K581247n10113k464196n78921J857491J020786j801477
$$ plain form
39548 490191 -2201499 -2905117 -1330609 370818 141881 -2045865 -4283144 -4747248 -3709526
39539 -3709526 -2861922 -2686110 -1955246 -240147 1012243 913812 671162 1208454 1222309
39530 1222309 -411743 -2096863 -1828660 -590330 -691519 -1858299 -2027338 -1290539 -1675316
39521 -1675316 -3114447 -3123520 -1119963 219122 -823333 -2278262 -1698249 217865 1196998
39512 1196998 900147 826722 1782165 3241621 4591939 5539508 5692739 4867464 3535328
39503 3535328 2292391 1341114 920600 1429367 2546570 3092781 2423852 1216824 401596
39494 401596 222514 769955 2245032 4037779 4733010 3824710 2361790 1284929 452827
39485 452827 -32642 721647 2509779 3382037 2429594 1544995 2566134 4258848 4392330
$$ packed form
39548D90191k691690p03618J574508J701427k28937k187746k237279m64104J037722
39539c709526Q47604J75812P30864J715099J252390r8431k42650N37292J3855
39530A222309j634052j685120K68203J238330j01189j166780j69039P36799l84777
39521a675316j439131r073K003557J339085j042455j454929N80013J916114R79133
39512A196998k96851p3425R55443J459456J350318R47569J53231q25275j332136
39503C535328j242937r51277m20514N08767J117203N46211o68929j207028q15228
39494D01596j79082N47441J475077J792747O95231r08300j462920j076861q32102
39485D52827m85469P54289J788132Q72258r52443q84599J021139J692714J33482
$$ plain form
39476 4392330 3459154 3659996 5041753 5467001 4120842 2406610 1390011 817383 723708
39467 723708 1585819 2707146 2780432 2151996 2121700 2100615 421169 -1902455 -1774507 807565
39457 807565 1944891 -231440 -2580907 -2196281 -958841 -1696439 -3062794 -2261132 -370243
39448 -370243 -377897 -1498167 -315661 3026049 4631342 3112588 1459337 1708740 2085486
39439 2085486 1113530 626448 2264474 4134608 3746458 2001415 1554747 2826127 4062210
39430 4062210 4154298 3342796 2203684 1646470 2661577 4410157 4055149 423269 -3620855
39421 -3620855 -4596775 -2820262 -1076268 -345088 234215 228534 -1765990 -4812452 -5954635
39412 -5954635 -4305384 -1942247 -241386 1686535 4055799 5004443 3665351 1931384
$$ packed form
39476D392330r33176K00842J381757M25248j346159j714232j016599n72628r3675
39467G23708Q62111J121327P3286o28436l0296k1085j679446k323624J27948K582072
39457H07565J137326k176331k349467L84626J237440p37598j366355Q01662J890889
39448c70243p654j120270J182506L341710J605293j518754j653251K49403L76746
39439B085486r71956m87082J638026J870134l88150j745043m46668J271380J236083
39430D062210R2088q11502j139112n57214J015107J748580l55008l631880m044124
39421c620855r75920J776513J743994P31180N79303n681j994524l046462j142183
39412e954635J649251K363137J700861J927921K369264R48644j339092j733967
$$ plain form
39404 1931384 1326425 617701 -1277459 -2430187 -880433 1310318 446218 -3203310 -5685464
39395 -5685464 -5141158 -3775677 -3324732 -2030805 1873840 6256472 7401354 4999040
39387 4999040 2278734 1612354 2228378 2351596 1582596 540796 -293611 -504468 392532
39378 392532 2110412 3420693 3659456 3692694 4464238 5244681 4550903 2510885 959503
39369 959503 995065 1640586 1472181 637797 450951 1474812 2781727 3015252 1771498
39360 1771498 15518 -726489 111878 1310183 1038189 -963890 -3027325 -3674482 -3245638
39351 -3245638 -2785884 -2248688 -991331 513088 967705 277700 -124676 575978 1283823
39342 1283823 574399 -1281154 -2741841 -2925188 -2258853 -1501547 -977524 -792359 -1069320
$$ packed form
39404A931384o04959p08724j895160j152728J549754K190751q64100l649528k482154
39395e685464N44306J365481M50945J293927L904645M382632J144882k402314
39387D999040k720306o66380O16024J23218p69000j041800q34407k10857Q97000
39378C92532J717880J310281K38763L3238P71544P80443o93778k040018j551382
39369I59503L5562O45521j68405q34384j86846J023861J306915K33525j243754
39360A771498j755980p42007Q38367J198305k71994k002079k063435o47157M28844
39351c245638M59754N37196J257357J504419M54617o90005m02376P00654P07845
39342A283823p09424j855553j460687j83347O66335P57306N24023J85165k76961
$$ plain form
39333 -1069320 -1691715 -2241519 -2473118 -2580438 -2761392 -2767700 -2206585 -1121931 121359
39324 121359 1414596 2774162 3587415 2878701 877985 -576868 -286885 382047 -570380
39315 -570380 -2327722 -2014005 670952 2182129 79531 -3044588 -3122762 -473797 1100761
39306 1100761 319116 -143968 1418293 3039204 2781514 1970993 2401052 2777169 881875
39297 881875 -2260421 -3488778 -2084329 -320943 381740 984336 2102010 2496381 1427436
39288 1427436 321278 584713 1391138 1285222 740777 1245138 2534350 2704811 1075133
39279 1075133 -743214 -1095723 -335399 82114 -325506 -727616 -245239 1183722 2932869
39270 2932869 4024864 3586988 1779390 216779 511718 2138361 2767005 1362637 -86815
$$ packed form
39333a069320o22395n49804k31599j07320j80954o308N61115J084654J243290
39324A21359J293237J359566Q13253p08714k000716j454853K89983O68932r52427
39315e70380j757342L13717K684957J511177k102598l124119p8174K648965J574558
39306A100761p81645m63084J562261J620911k57690q10521M30059L76117j895294
39297H81875l142296j228357J404449J763386P02683O02596J117674L94371j068945
39288A427436j106158K63435Q06425j05916n44445N04361J289212J70461j629678
39279A075133j818347l52509P60324M17513m07620m02110M82377J428961J749147
39270B932869J091995m37876j807598j562611K94939J626643O28644j404368j449452
$$ plain form
39261 -86815 870801 3600844 5049961 3796372 1606211 586687 699816 1096895 2097534
39252 2097534 4068877 5542285 4589804 1659282 -886831 -1921916 -2359530 -2726906 -2008929
39243 -2008929 317739 2791344 3657324 2956372 1907716 1121969 459109 -40997 -150602
39234 -150602 -14586 78463 217523 622060 1219025 1841814 2347511 2251356 1039228 -701775
39224 -701775 -1418750 -579724 413229 212578 -512798 -314664 631926 896102 184657 -206185
39214 -206185 606255 1944441 2656925 2341233 1329229 334887 142166 753188 951321
39205 951321 -216299 -1610221 -988341 1954691 4878208 5634110 4626217 3661826 3513898
39196 3513898 3574772 3303256 3069369 3610887 4987736 6061465 5346818 2956690 1195032
$$ packed form
39261h6815R57616K730043J449117j253589k190161j019524J13129L97079J000639
39252B097534J971343J473408r52481k930522k546113j035085m37614l67376P17977
39243b008929K326668K473605Q65980p00952j048656p85747o62860n00106j09605
39234a50602J36016R3049J39060M04537N96965O22789N05697r6155j212128j741003
39224g01775p16975Q39026R92953k00651p25376J98134R46590K64176p11445l90842
39214b06185Q12440J338186P12484l15692j012004r94342j92721O11022J98133
39205I51321j167620j393922O21880K943032K923517P55902j007893r64391j47928
39196C513898O0874k71516k33887N41518J376849J073729p14647k390128j761658
$$ plain form
39187 1195032 2029767 4289035 5002538 3529835 2295517 2855076 3572169 2679645 1564396
39178 1564396 2693684 5546746 7213640 6623475 5717813 6173882 7061373 6527904 4386054
39169 4386054 2195800 1587367 2958688 5200033 6560310 6424462 6114661 7120236 8840169
39160 8840169 9311905 8086002 6872204 6952999 7380232 6566941 4671008 3438212 4168327
39151 4168327 6523383 9026733 10265090 9864899 8662687 7858634 7999344 8896968 10143611
39142 10143611 11193062 11366353 10603673 9953729 10429039 11568957 12040491 11411554 10312632
39133 10312632 9167071 8030124 7442330 7962563 8926834 9200184 9062432 9587664 10293371
39124 10293371 9750014 8797429 10295659 14530472 17743476 17272317 15660566 16906008
$$ packed form
39187A195032Q34735K259268P13503j472703j234318N59559P17093q92524j115249
39178A564396J129288K853062J666894n90165r05662M56069Q87491n33469k141850
39169D386054k190254o08433J371321K241345J360277j35848l09801J005575J719933
39160H840169M71736j225903j213798Q0795M27233q13291j895933j232796P30115
39151D168327K355056K503350J238357m00191j202212q04053J40710Q97624J246643
39142A0143611J049451J73291p62680o49944M75310J139918M71534o28937j098922
39133A0312632j145561j136947n87794N20233R64271K73350j37752N25232P05707
39124A0293371n43357r52585J498230M234813L213004m71159j611751J245442
$$ plain form
39116 16906008 20515646 22623749 22052860 21748971 24098740 27906181 30777715 32075123
39108 32075123 32596960 33369356 35671453 40363342 46137611 50253541 52342799 55841605
39100 55841605 63926869 75305660 86088536 95086072 104926121 117938547 133339750
39093 133339750 149458185 166725700 186553213 208323797 229848201 250708325 272522847
39086 272522847 294513353 310741860 314258384 303743258 284256822 261661168 238374900
39079 238374900 214750831 191886172 171233387 152852854 135929223 120429942 106870569
39072 106870569 94968760 83869585 73431355 64229619 56584477 50472783 45924708
39065 45924708 42512710 38931381 34202993 29001987 24824448 22224180 20795578 20320617
$$ packed form
39116A6906008L609638K108103n70889l03889K349769L807441K871534J297408
39108C2075123N21837P72396K302097M691889N774269M115930K089258L498806
39100E5841605Q085264J1378791J0782876Q997536R840049J3012426J5401203
39093A33339750J6118435J7267515J9827513K1770584K1524404K0860124K1814522
39086B72522847K1990506J6228507L516524j0515126j9486436k2595654k3286268
39079B38374900k3624069k2864659k0652785j8380533j6923631j5499281j3559373
39072A06870569j1901809j1099175j0438230r201736p645142o111694m548075
39065D5924708l411998l581329m728388n201006m177539k600268j428602m74961
$$ plain form
39057 20320617 20683942 20985691 20008489 17545570 14444867 11655808 9953518 9835124 10602438
39048 10602438 10418894 8685710 7456813 8681799 10845846 10681313 7898494 5613447
39040 5613447 5758114 6651684 6130810 4867680 5004373 6920835 8948886 9604125 8968299
39031 8968299 8224431 8436286 9444514 9805596 8355005 5697863 3377021 1984225 1326106
39022 1326106 1921594 4367674 7231965 7818151 5671839 3345614 2854394 3314743 3189021
39013 3189021 2925185 3725437 5133750 5731207 5509798 5920392 7717676 9780568 10108659
39004 10108659 7757243 4151338 2276230 3575773 5865573 5787674 3243026 1475712
38996 1475712 2522014 4743693 5502210 4093953 1248055 -1906729 -3310445 -1024012
$$ packed form
39057B0320617L63325L01749r77202k462919l100703k789059j702290j18394P67314
39048A0602438j83544j733184j228897J224986K164047j64533k782819k285047
39040E613447J44667Q93570n20874j263130J36693J916462K028051O55239o35826
39031H968299p43868K11855J008228L61082j450591k657142k320842j392796o58119
39022A326106N95488K446080K864291N86186k146312k326225m91220M60349j25722
39013C189021k63836Q00252J408313N97457k21409M10594J797284K062892L28091
39004A0108659k351416l605905j875108J299543K289800p7899k544648j767314
38996A475712J046302K221679P58517j408257k845898l154784j403716K286433
$$ plain form
38988 -1024012 3571055 6066457 4389094 1505069 777279 1332569 804771 59626 1419741
38979 1419741 3908748 4368667 2543537 1170910 1276164 1107303 -53095 -573898 348175
38970 348175 1325064 1481286 1806153 2927110 4005762 4623192 5292849 5352637 3068691
38961 3068691 -995134 -3388615 -2264097 -252147 -884928 -3782763 -5409975 -3620967
38953 -3620967 225492 3061183 2818160 -63534 -2926238 -3197542 -892184 1799397
38945 1799397 3387516 4262771 4903065 4691021 3238813 1356187 -138202 -1266736 -1947027
38936 -1947027 -1690907 -888343 -729981 -1094775 -364894 1655417 2661668 1192776 -775756
38927 -775756 -486626 1729636 3237951 2796052 1574663 1103018 1821421 3215641 4104510
$$ packed form
38988a024012M595067K495402j677363k884025p27790N55290n27798p45145J360115
38979A419741K489007M59919j825130j372627J05254j68861j160398n20803R22073
38970C48175R76889J56222L24867J120957J078652O17430O69657N9788k283946
38961C068691m063825k393481J124518K011950o32781k897835j627212J789008
38953c620967L846459K835691k43023k881694k862704k71304K305358K691581
38945A799397J588119Q75255O40294k12044j452208j882626j494389j128534o80291
38936a947027K56120Q02564J58362l64794P29881K020311J006251j468892j968532
38927g75756K89130K216262J508315m41899j221389m71645P18403J394220Q88869
$$ plain form
38918 4104510 3353150 1351055 -27316 124093 556922 273366 473442 2317342 4320452
38909 4320452 4355181 3062791 2566259 2597250 966678 -2290446 -4391967 -3914165 -2495326
38900 -2495326 -1559762 -246248 1851467 2566109 260356 -2667283 -2230396 1754014 5301300
38891 5301300 5509282 3943958 3818077 5459651 6275378 4640826 2043412 841189 1139097
38882 1139097 1032574 -570479 -2643034 -3566164 -2808777 -821954 1579434 3169823 2757396
38873 2757396 595579 -1370833 -1480268 37809 1989612 3744024 4948955 4830570
38865 4830570 3164845 1288868 822302 1825882 3240706 4379893 4815023 3813703
38857 3813703 1527852 -143565 238573 1335198 965642 -404072 -579139 528878 948524
$$ packed form
38918D104510p51360k002095j378371J51409M32829k83556K00076J843900K003110
38909D320452L4729j292390m96532L0991j630572l257124k101521M77802J418839
38900b495326R35564J313514K097715P14642k305753k927639M36887L984410L547286
38891E301300K07982j565324j25881J641574Q15727j634552k597414j202223K97908
38882A139097j06523j603053k072555r23130P57387J986823K401388J590389m12427
38873B757396k161817j966412j09435J518077J951803J754412J204931j18385
38865D830570j665725j875977m66566J003580J414824J139187M35130j001320
38857C813703k285851j671417L82138J096625l69556j369714j75067J108017M19646
$$ plain form
38848 948524 483257 1266401 3872511 6066788 6546069 6818237 7841367 7971661 6466442
38839 6466442 6029798 8817457 12191725 11949522 8342322 5397927 5125198 5883810 6176438
38830 6176438 6553139 7346887 7605560 7096409 6838409 6881869 5960662 4143965 3379863
38821 3379863 4344027 5148088 4534454 4021177 5105303 6461750 6148552 4914155 4810016
38812 4810016 5740611 6104571 6103482 7428326 9703221 10312440 8633759 7688559 9858178
38803 9858178 13028778 13326143 10566486 8460164 9553180 12379674 14377838 15547232
38795 15547232 17505883 20134421 21479246 21091120 21373319 24509114 29459710 33602929
38787 33602929 36569311 40516721 46616425 53290364 58813800 64041403 70974447 79407345
$$ packed form
38848I48524m65267P83144K606110K194277M79281K72168J023130J30294j505219
38839F466442m36644K787659L374268k42203l607200k944395k72729P58612K92628
38830F176438L76701P93748K58673n09151k58000M3460r21207j816697p64102
38821C379863R64164Q04061o13634n13277J084126J356447l13198j234397j04139
38812D810016R30595L63960j089J324844K274895O09219j678681r45200K169619
38803I858178L170600K97365k759657k106322J093016K826494J998164J169394
38795A5547232J958651K628538J344825l88126K82199L135795M950596M143219
38787C3602929K966382L947410O099704O673939N523436N227603O933044Q432898
$$ plain form
38779 79407345 86642925 90467099 91141309 90316893 89055930 87231376 84016184 78583478
38771 78583478 70966543 62498309 54806902 48267966 42231238 36806488 33085871 30978668
38763 30978668 28332826 23707112 19021587 17431774 18825695 19618092 17509453 14355842
38755 14355842 13108920 13681090 13703804 12237130 10512559 9418252 8467475 7406840 6755442
38746 6755442 6205265 4503068 1896425 822838 2710155 5588838 6574158 5507996
38738 5507996 4249368 3393204 2044448 391214 -42041 990093 1796121 1377215 860381
38729 860381 1513713 2975814 4302571 5194832 5246244 3606365 686233 -1218654 -552458
38720 -552458 1299334 1943162 1219081 909312 1853133 2995053 3054087 1810461 -69608
$$ packed form
38779G9407345P235580L824174O74210q24416j260963j824554l215192n432706
38771G8583478p616935q468234p691407o538936o036728n424750l720617k107203
38763C0978668k645842m625714m685525j589813J393921P92397k108639l153611
38755A4355842j246922N72170K2714j466674j724571j094307r50777j060635o51398
38746F755442n50177j702197k606643j073587J887317K878683R85320j066162
38738E507996j258628q56164j348756j653234m33255J032134Q06028m18906n16834
38729H60381O53332J462101J326757Q92261N1412j639879k920132j904887O66196
38720e52458J851792O43828p24081l09769R43821J141920N9034j243626j880069
$$ plain form
38711 -69608 -1437460 -1295218 -46986 502984 -441623 -1092056 516727 3250859 4023703
38702 4023703 2033638 -154473 -51460 1920813 3494286 3137280 1209472 -431370
38694 -431370 52120 2350226 3803278 2655923 827748 1486188 4424672 6379704 5782202
38685 5782202 4287736 3243591 1825958 -256027 -1322757 -657619 -126869 -988054 -1687557
38676 -1687557 -914814 -178354 -802218 -967527 1120961 3432403 3149451 1655398 2324059
38667 2324059 4547008 4498370 1483371 -1056234 -1284443 -1302423 -2673685 -3791788 -3420760
38658 -3420760 -3092459 -3757270 -3343876 -332612 2847541 2813642 -251123 -3527748 -5296023
38649 -5296023 -5418264 -3864348 -1386135 -259952 -1654905 -3294835 -2317356 468355
$$ packed form
38711f9608j367852J42242J248232N49970r44607o50433J608783K734132P72844
38702D023703j990065k188111J03013J972273J573473l57006j927808j640842
38694d31370M83490K298106J453052j147355j828175O58440K938484J955032n97502
38685E782202j494466j044145j417633k081985j066730O65138N30750q61185o99503
38676a687557P72743P36460o23864j65309K088488K311442k82952j494053O68661
38667B324059K222949m8638l014999k539605k28209j7980j371262j118103L71028
38658c420760L28301o64811M13394L011264L180153l3899l064765l276625j768275
38649e296023j22241J553916K478213J126183j394953j639930R77479K785711
$$ plain form
38641 468355 1841637 945460 -35135 344289 1157235 1449822 1670566 2208935 2546644
38632 2546644 2401347 2092574 1601177 898974 1042506 2897259 4910479 4615045 2500460
38623 2500460 1595570 2636377 2811032 671821 -932308 756480 3728035 4080162 1849146
38614 1849146 503542 1438294 2487321 2004926 1145439 1176201 1266251 401889 -544814
38605 -544814 -274237 897429 1975588 2988601 4091445 4048197 1679871 -1587983 -2760325
38596 -2760325 -1179962 422769 -385506 -2476349 -2909547 -1092088 458561 -427786 -2707851
38587 -2707851 -3443246 -1286402 2213690 4585829 4869209 3840571 2528601 1242825
38579 1242825 -34282 -985481 -1041459 80585 2024722 3723577 3729970 1327403 -2241328
$$ packed form
38641D68355J373282q96177r80595L79424Q12946K92587K20744N38369L37709
38632B546644j45297l08773m91397p02203J43532J854753K013220k95434k114585
38623B500460r04890J040807J74655k139211j604129J688788K971555L52127k231016
38614A849146j345604R34752J049027m82395q59487L0762R0050q64362r46703
38605e44814K70577J171666J078159J013013J102844m3248k368326l267854j172342
38596b760325J580363J602731q08275k090843m33198J817459J550649q86347k280065
38587b707851p35395K156844L500092K372139K83380j028638j311970j285776
38579A242825j277107r51199n5978J122044J944137J698855O393k402567l568731
$$ plain form
38570 -2241328 -4286987 -3291073 -775877 356139 -701210 -1882252 -1144033 1042922
38562 1042922 2721224 2870675 1804181 46500 -1789496 -2495462 -1234254 905591
38554 905591 1686804 332237 -1821243 -3461253 -4620716 -5335544 -4652888 -2249620 166131
38545 166131 649851 -469321 -1385389 -1564809 -1934186 -2521824 -1975202 -30107 1354154
38536 1354154 577913 -1097903 -1170611 595596 1917293 1277990 -63010 -26197 1461893
38527 1461893 2755676 3008549 2912736 2807859 1677001 -902411 -3018802 -2448219 -19353
38518 -19353 1081077 -319507 -1801164 -1148150 351548 295531 -756513 -259605 1950142
38509 1950142 3172094 1971036 81007 -702046 -1038725 -1957456 -2392595 -980138 1049767
$$ packed form
38570b241328k045659R95914K515196J132016j057349j181042P38219K186955
38562A042922J678302J49451j066494j757681j835996p05966J261208K139845
38554I05591P81213j354567k153480j640010j159463p14828O82656K403268K415751
38545A66131M83720j119172r16068j79420l69377n87638N46622J945095J384261
38536A354154p76241j675816p2708J766207J321697o39303j341000L6813J488090
38527A461893J293783K52873r5813j04877j130858k579412k116391N70583K428866
38518a9353J100430j400584j481657O53014J499698n6017j052044M96908K209747
38509A950142J221952j201058j890029p83053l36679r18731m35139J412457K029905
$$ plain form
38500 1049767 1190909 -628798 -1846149 -866015 938591 1306856 -134987 -1773105 -1866849
38491 -1866849 -91566 2206357 3047989 1529562 -1431322 -4270327 -6294485 -7545744
38483 -7545744 -7815423 -6858891 -5327292 -4393914 -4427066 -4810633 -4854885 -4012997 -1656736
38474 -1656736 2017876 5080765 5458373 3623317 2210728 2662272 3800595 4154445 3902108
38465 3902108 3589500 2642159 628758 -1201293 -1267572 109596 1179955 992279 51930
38456 51930 -731259 -735330 171368 1170909 929106 -562749 -1522194 -932088 -377508 -1560073
38446 -1560073 -3020926 -1787560 2012713 4733031 3829427 765416 -1352651 -1153624
38438 -1153624 734181 2992369 4174849 3428177 1636131 635435 626428 -152237 -2463552
$$ packed form
38500A049767J41142j819707j217351R80134J804606L68265j441843j638118r3744
38491a866849J775283K297923Q41632j518427k960884k839005k024158j251259
38483g545744k69679R56532J531599R33378l3152l83567m4252Q41888K356261
38474a656736L674612L062889L77608j835056j412589M51544J138323L53850k52337
38465C902108l12608r47341k013401j830051o6279J377168J070359j87676r40349
38456E1930p83189m071R06698R99541k41803j491855r59445N90106N54580j182565
38446a560073j460853J233366L800273K720318r03604l064011k118067J99027
38438a153624J887805K258188J182480p46672j792046j000696r007p78665k311315
$$ plain form
38429 -2463552 -4618249 -5090129 -4656907 -4338759 -3128005 -112903 2548374 1678631 -2304421
38420 -2304421 -5502377 -5426377 -3419930 -1762898 -650111 897081 2857210 4284669
38412 4284669 4575205 3697329 1978494 403143 255702 1634250 3013981 3068858 2304593
38403 2304593 2087093 2598096 2689538 1562814 -193324 -1301292 -1125330 -306871 -213803
38394 -213803 -1519220 -3220046 -3517910 -1926582 9573 526849 -257871 -591619 844134
38385 844134 3622238 6127854 6887619 5437447 2483658 -527287 -2273497 -2336121 -1299260
38376 -1299260 -167710 392808 489824 793480 1750613 2970537 3593522 3294068 2613121
38367 2613121 2182732 1986836 1667139 1235615 995779 841437 194818 -1080015 -2067698
$$ packed form
38429b463552k154697m71880M33222L18148J210754L015102K661277q69743l983052
38420b304421l197956P6000K006447J657032J112787J547192J960129J427459
38412D284669K90536q77876j718835j575351j47441J378548J379731N4877p64265
38403B304593k17500N11003R1442j126724j756138j107968J75962Q18459R3068
38394b13803j305417j700826k97864J591328J936155N17276p84720l33748J435753
38385H44134K778104K505616P59765j450172k953789l010945j746210o2624J036861
38376a299260J131550N60518R7016L03656R57133J219924O22985k99454o80947
38367B613121m30389j95896l19697m31524k39836j54342o46619j274833r87683
$$ plain form
38358 -2067698 -1650624 -21628 1163719 567940 -1155182 -2051336 -1232437 85033 196011
38349 196011 -981997 -1934438 -1413404 231130 1521894 1342721 15091 -978139 -555860
38340 -555860 611200 761416 -782212 -2725610 -3451227 -2819974 -1718863 -580217 664034
38331 664034 1662040 1821742 1246036 527682 -199400 -1015501 -1257347 -49105 2140788
38322 2140788 3672637 3734780 3122387 2735135 2359909 1405889 -48425 -1441341 -2281123
38313 -2281123 -2240093 -1462962 -966266 -1771620 -3330305 -3825985 -2488448 -605681 296776
38304 296776 270613 256431 518073 630700 394626 -17331 -428264 -722128 -983281 -1702075
38294 -1702075 -3076741 -4076867 -3392778 -1558382 -691612 -1623324 -2858104 -3080187 -2848994
$$ packed form
38358b067698M17074J628996J185347n95779j723122q96154Q18899J317470J10978
38349A96011j178008r52441N21034J644534J290764j79173j327630r93230M22279
38340e55860J167060J50216j543628j943398p25617O31253J101111J138646J244251
38331F64034R98006J59702n75706p18354p27082q16101k41846J208242K189893
38322B140788J531849O2143o12393l87252l75226r54020j454314j392916q39782
38313b281123M1030P77131M96696q05354j558685m95680J337537J882767R02457
38304B96776k6163j4182K61642J12627k36074m11957m10933k93864k61153p18794
38294a702075j374666j000126O84089J834396Q66770r31712j234780k22083K31193
$$ plain form
38285 -2848994 -2692182 -1547942 1077411 3184991 2865039 1479512 1663369 3130539 3408774
38276 3408774 2251314 2050406 3584465 4605444 3710633 2664593 3159761 3766309 2414370
38267 2414370 139637 -321806 1151343 1768794 -79268 -2600230 -3210267 -1879847 -763557
38258 -763557 -1192110 -2192833 -2110234 -864045 115749 -61219 -765652 -1253310 -1930749
38249 -1930749 -3177348 -3828616 -2566420 -504142 -305346 -2283385 -3442141 -1598198
38241 -1598198 1222035 1276082 -1962042 -5264937 -5797972 -4102865 -2620811 -2508966 -2688480
38232 -2688480 -1601594 690618 2378320 1915800 -137738 -1855794 -2334646 -2329278 -2413815
38223 -2413815 -1982592 -862688 -445504 -1733438 -3281735 -2909231 -986856 -149921 -1684906
$$ packed form
38285b848994J56812J144240K625353K107580l19952j385527J83857J467170K78235
38276C408774j157460k00908J534059J020979q94811j046040M95168O06548j351939
38267B414370k274733m61443J473149O17451j848062k520962o10037J330420J116290
38258g63557m28553j000723Q2599J246189R79794j76968p04433m87658o77439
38249a930749j246599o51268J262196K062278J98796j978039j158756J843943
38241a598198K820233N4047l238124l302895n33035J695107J482054J11845j79514
38232b688480J086886K292212J687702m62520k053538j718056m78852N368q4537
38223b413815M31223J119904M17184j287934j548297L72504J922375Q36935j534985
$$ plain form
38214 -1684906 -3812663 -3865818 -936275 3728163 7613956 8174735 4853853 383520 -1432361
38205 -1432361 128345 2129763 2063063 742784 130973 165593 -424678 -1457809 -1627404
38196 -1627404 -908562 -592181 -1057625 -1332654 -976583 -737284 -999693 -1029429 -257065 823384
38186 823384 1466946 1439200 733632 -474090 -1426150 -1398012 -817082 -611331 -494238 530503
38176 530503 1858377 1532530 -504972 -1536103 270811 3214181 4685629 4644496 4389660
38167 4389660 3471003 633949 -2918375 -4202160 -2596954 -827488 -1228006 -3073297
38159 -3073297 -4301150 -4043729 -2608427 -566267 1113732 1266212 -115623 -1549777
38151 -1549777 -1756062 -923871 41039 546251 285192 -656620 -1271298 -430629 1317181
$$ packed form
38214a684906k127757n3155K929543M664438L885793N60779l320882m470333j815881
38205a432361J560706K001418o6700j320279o11811L4620n90271j033131j69595
38196a627404P18842L16381m65444k75029L56071K39299k62409k9736P72364J080449
38186H23384O43562k7746p05568j207722r52060K8138N80930K05751J17093J024741
38176E30503J327874l25847k037502j031131J806914K943370J471448m1133k54836
38167D389660r18657k837054l552324j283785J605206J769466m00518j845291
38159c073297j227853K57421J435302K042160J679999J52480j381835j434154
38151a549777k06285Q32191R64910N05212k61059r41812o14678Q40669J747810
$$ plain form
38142 1317181 2047402 1123496 217934 936775 2701348 3827078 3558480 2258666 715313
38133 715313 -83389 242760 340426 -1529957 -4357767 -4792462 -1963026 548068 -332641
38124 -332641 -2483580 -1831553 1339147 2892829 1020625 -1716279 -2741964 -2446698 -1875633
38115 -1875633 -500137 2035700 4188761 4390848 3181819 1944795 802471 -706654
38107 -706654 -1953121 -1906991 -915121 -271477 -252574 116353 1305547 2394831 2328143 1394392
38097 1394392 898096 1462724 2142681 1629076 155636 -595782 205000 1279337 1107643
38088 1107643 168844 -4855 624865 748745 241026 551975 2054656 2836176 1272077
38079 1272077 -1438360 -2577341 -1059658 1745551 3841953 4334986 3616267 2590648
$$ packed form
38142A317181P30221r23906r05562P18841J764573J125730k68598j299814j543353
38133G15313p98702L26149R7666j870383k827810m34695K829436K511094q80709
38124c32641k150939O52027L170700J553682j872204k736904j025685K95266N71065
38115a875633J375496K535837K153061K02087j209029j237024j142324j509125
38107g06654j246467M6130R91870O43644J8903L68927J189194J089284o6688r33751
38097A394392m96296N64628O79957n13605j473440p51418Q00782J074337j71694
38088A107643r38799j73699O29720J23880n07719L10949J502681P81520j564099
38079A272077k710437j138981J517683K805209K096402M93033p18719j025619
$$ plain form
38071 2590648 1747701 773618 -730277 -2209861 -2475484 -1228545 361407 847911 -235930
38062 -235930 -2324300 -4282328 -4912615 -3975174 -2898769 -3437656 -5282707 -6085819 -4348294
38053 -4348294 -1203999 1312383 2685422 3693868 4636753 4896103 3910815 1834841 -490860
38044 -490860 -1843768 -1519076 -386173 -287830 -1780071 -3264151 -3108494 -1798463 -948074
38035 -948074 -836884 -266095 1242059 2334464 1419438 -1173671 -3191493 -2773669 -604426
38026 -604426 810304 338398 -170002 1411750 3922938 4071777 1195925 -1468185 -1190218
38017 -1190218 749829 1496267 674195 -51369 -51209 64338 488860 1896092 3274846
38008 3274846 2570321 -105795 -1991733 -1138430 1222431 2475030 1481833 -944007 -3184052
$$ packed form
38071B590648q42947r74083j503895j479584k65623J246939J589952M86504j083841
38062b35930k088370j958028o30287R37441J076405n38887j845051q03112J737525
38053d348294L144295K516382J373039J008446R42885K59350r85288k075974k325701
38044d90860j352908L24692J132903R8343j492241j484080J55657J310031Q50389
38035i48074J11190N70789J508154J092405r15026k593109k017822M17824K169243
38026f04426J414730m71906n08400J581752K511188J48839k875852k664110K77967
38017a190218J940047P46438q22072p25564J60J15547M24522J407232J378754
38008C274846p04525k676116j885938Q53303K360861J252599r93197k425840k240045
$$ plain form
37999 -3184052 -3775023 -2318855 -134606 830077 223871 -386832 288877 1763329 2778096
37990 2778096 2654473 1242670 -1104193 -2850310 -2102918 735376 2491326 904727
37982 904727 -2265077 -3522509 -2174315 -546335 -161132 -158019 198299 -34809 -1315319
37973 -1315319 -1975661 -610941 1256868 1062601 -947826 -2029505 -1074537 -146470 -1133982
37964 -1133982 -2829358 -2781419 -844891 742666 320855 -1529693 -3091934 -3130810 -1467722
37955 -1467722 985427 2580454 2151274 200766 -1525664 -1675002 -242384 1655948
37947 1655948 2360016 604423 -3035736 -5925329 -5814641 -3488111 -1826386 -2241897 -3366818
37938 -3366818 -3439150 -2473129 -1466536 -823194 -462727 -475716 -790525 -1001747 -1223172 -2189980
$$ packed form
37999c184052n90971J456168K184249R64683o06206o10703O75709J474452J014767
37990B778096j23623j411803k346863j746117P47392K838294J755950j586599
37982I04727l169804j257432J348194J627980L85203L113L56318k33108j280510
37973a315319o60342J364720J867809j94267k010427j081679R54968R28067r87512
37964a133982j695376M7939J936528J587557m21811j850548j562241l8876J663088
37955a467722K453149J595027m29180j950508j726430j49338J432618J898332
37947A655948P04068j755593l640159k889593J10688K326530J661725m15511j124921
37938c366818p2332R66021J006593O43342L60467j2989l14809k11222k21425r66808
$$ plain form
37928 -2189980 -3788753 -4547301 -3574631 -2058063 -1677158 -2294597 -2425628 -1388746 193359
37919 193359 1475660 1762298 346453 -2620751 -5380286 -6040538 -4733714 -3162387 -2194429
37910 -2194429 -1194392 326808 1787843 2501092 2425638 1754704 813090 476395 1472740
37901 1472740 3001592 3300272 2012730 753694 753257 1243355 1043432 485443 476176 594972
37891 594972 -249589 -1668851 -1994368 -820400 135435 -625296 -2268834 -2775671 -1524801
37882 -1524801 278331 1440390 1989245 2456435 2896151 3074791 3021989 2869563 2536898
37873 2536898 2026094 1644338 1468456 1048799 280762 93318 1313250 3067240 3462340
37864 3462340 2070998 745217 1459086 3971106 6068194 5754685 3053131 71062
$$ packed form
37928b189980j598773p58548R72670J516568L80905o17439j31031J036882J582105
37919A93359J282301K86638j415845k967204k759535o60252J306824J571327R67958
37910b194429J000037J521200J461035P13249p5454o70934r41614l36695R96345
37901A472740J528852K98680j287542j259036m37M90098j99923n57989r267J18796
37891E94972q44561j419262l25517J173968R55835p60731j643538n06837J250870
37882a524801J803132J162059N48855M67190M39716J78640n2802j52426l32665
37873B536898n10804l81756j75882m19657p68037j87444J219932J753990L95100
37864C462340j391342j325781P13869K512020K097088l13509k701554k982069
$$ plain form
37856 71062 -759102 901168 2793402 2763210 1609925 1883956 3944823 5101101 3346320
37847 3346320 209043 -1300093 -249629 1935426 3525830 3426229 1201324 -2143519
37839 -2143519 -4170559 -3478028 -1622580 -1005034 -1455211 -812103 1419909 3133006 2656535
37830 2656535 914943 -126119 181289 1032366 1344695 480394 -1380616 -3142208 -3723701
37821 -3723701 -3272950 -2763794 -2472600 -1881743 -1112555 -1187621 -2484042 -4000596 -4608989
37812 -4608989 -4118799 -2814681 -1047079 292810 134452 -1166722 -1652879 -126920 2199355
37803 2199355 3436244 3544986 3804086 4323669 3794657 1851160 56367 -292056 -134897
37794 -134897 -1136794 -2870684 -3201784 -1622948 -468033 -1744595 -4062474 -4414253 -2377494
$$ packed form
37856G1062q30164J660270J892234l0192j153285K74031K060867J156278j754781
37847C346320l137277j509136J050464K185055J590404r9601k224905l344843
37839b143519k027040O92531J855448O17546m50177O43108K232012J713097m76471
37830B656535j741592j041062L07408Q51077L12329q64301j861010j761592n81493
37821c723701M50751N09156K91194N90857P69188p5066j296421j516554o08393
37812d608989M90190J304118J767602J339889j58358j301174m86157J525959K326275
37803B199355J236889J08742K59100N19583n29012j943497j794793l48423J57159
37794a34897j001897j733890l31100J578836J154915j276562k317879l51779K036759
$$ plain form
37785 -2377494 -549796 -754141 -1845910 -1966571 -1111828 -288809 321308 861621 672845
37776 672845 -636455 -1789882 -1189198 792333 2281603 2228144 1003992 -633840 -1742233
37767 -1742233 -1145179 1018197 2343849 817497 -2021842 -2876551 -1462452 -838652 -2571649
37758 -2571649 -4317159 -3398149 -449713 2116230 3395424 3868579 3461746 1916889 373300
37749 373300 473584 1944988 2774830 2077599 1364557 2276233 4058743 4406528 2596710
37740 2596710 642925 700914 2072144 2078493 -112673 -2125366 -1644968 363988 1170873
37731 1170873 49886 -1245490 -1325810 -675974 -381902 -965760 -2544165 -4623506 -5658026
37722 -5658026 -4364151 -1686782 -11887 -240428 -1079155 -1328173 -1231087 -1288076 -1390699
$$ packed form
37785b377494J827698k04345j091769j20661Q54743Q23019O10117N40313j88776
37776F72845j309300j153427O00684J981531J489270n3459j224152j637832j108393
37767a742233N97054K163376J325652j526352k839339q54709J414099O23800j732997
37758b571649j745510R19010K948436K565943J279194M73155m06833j544857j543589
37749C73300J00284J471404Q29842o97231p13042R11676J782510L47785j809818
37740B596710j953785N7989J371230O349k191166k012693M80398K008956Q06885
37731A170873j120987j295376q0320O49836K94072n83858j578405k079341j034520
37722e658026J293875K677369J674895k28541q38727k49018R7086n6989j02623
$$ plain form
37713 -1390699 -1561523 -2027995 -2203736 -1131236 782457 2075548 2399131 2500257 2021977
37704 2021977 -166559 -2948380 -3158955 -116902 2713398 2386473 404518 -192933 497427
37695 497427 224436 -1246111 -1943796 -1127221 -269964 -559707 -1405185 -1630774 -712122
37686 -712122 1192831 3228658 4003794 2932347 1276402 814169 1639981 2242284 1604710
37677 1604710 327076 -351743 -34111 437921 -12526 -1157724 -1376752 142029 1754871
37668 1754871 1385281 -323209 -941786 -85655 319593 -254697 -158093 679721 -231927
37659 -231927 -3383551 -5200556 -3182296 -65587 308589 -1353906 -1870940 -1042143 -944844
37650 -944844 -1389201 -461055 1201374 947843 -1251542 -2639395 -2197301 -1599833 -1471820
$$ packed form
37713a390699j70824m66472j75741J072500J913693J293091L23583J01126m78280
37704B021977k188536k781821k10575L042053K830300l26925j981955n97451O90360
37695D97427k72991j470547o97685Q16575Q57257k89743q45478k25589R18652
37686g12122J904953K035827P75136j071447j655945m62233Q25812O02303o37574
37677A604710j277634o78819L17632M72032m50447j145198k19028J518781J612842
37668A754871l69590j708490o18577Q56131M05248n74290R6604Q37814r11648
37659b31927l151624j817005K018260L116709L74176j662495n17034Q28797R7299
37650i44844m44357R28146J662429k53531k199385j387853M42094N97468J28013
$$ plain form
37641 -1471820 -543963 887973 555107 -1542500 -2066831 763731 4222669 5005850 3702463
37632 3702463 3216017 4418886 5427165 4399986 1687588 -541201 -484882 1080618 1326917
37623 1326917 -969855 -3443453 -3488677 -2192007 -2387754 -4074620 -4977290 -4662579 -4375795
37614 -4375795 -3588257 -1064122 1099324 -411951 -3795766 -3641249 176149 1391952
37606 1391952 -2554993 -5867100 -3715883 -87148 -906732 -4484179 -5332467 -3634845
37598 -3634845 -3644470 -5073301 -3670456 422867 2166400 -44792 -2063118 -1233645 -26247
37589 -26247 -583535 -994223 546744 2375749 2743845 2691198 3074986 2381142 98892
37580 98892 -1163076 244954 1963267 1600474 743413 1686110 2966634 2079290 444478
$$ packed form
37641a471820R27857J431936l32866k097607n24331K830562L458938P83181j303387
37632C702463m86446J202869J008279j027179k712398k228789N6319J565500K46299
37623A326917k296772k473598m5224J296670j95747j686866r02670L14711K86784
37614d375795P87538K524135K163446j511275l383815J54517L817398J215803
37606A391952l946945l312107K151217L628735q19584l577447q48288J697622
37598c634845r625j428831J402845M093323J743533k211192k018326Q29473J207398
37589b6247n57288m10688J540967J829005L68096n2647L83788o93844k282250
37580I8892j261968J408030J718313l62793q57061R42697J280524q87344j634812
$$ plain form
37571 444478 1297200 3869064 4103685 887982 -2482157 -3395158 -2843660 -2484833 -2105584
37562 -2105584 -1343967 -1213819 -2276684 -3272668 -3027021 -2100327 -1321661 -324927 1113767
37553 1113767 1861202 1167496 333804 846092 1790802 1090408 -1141009 -2419822 -1175462
37544 -1175462 1344673 2772496 2014974 -343086 -2913449 -4347082 -4199034 -3389281 -3129334
37535 -3129334 -3233882 -2433884 -618738 449940 -585600 -2694176 -3765545 -3196797 -2070637
37526 -2070637 -1273851 -701455 -181530 25378 -140567 -291925 -216202 -127937 -276156 -887386
37516 -887386 -2240957 -3912657 -4267562 -2076081 1312379 2953273 1927988 478077
37508 478077 790747 2200197 2730060 1947024 649225 -1102582 -3544336 -5390037 -4722884
$$ packed form
37571D44478Q52722K571864K34621l215703l370139r13001N51498L58827L79249
37562b105584P61617J30148j062865r95984K45647R26694P78666R96734J438694
37553A113767P47435o93706q33692N12288R44710p00394k231417j278813J244360
37544a175462K520135J427823p57522k358060k570363j433633J48048Q09753K59947
37535c129334j04548P99998J815146J068678j035540k108576j071369N68748J126160
37526b070637P96786N72396N19925K06908j65945j51358P5723Q8265j48219o11230
37516h87386j353571j671700l54905K191481L388460J640894j025285j449911
37508D78077L12670J409450N29863p83036j297799j751807k441754j845701O67153
$$ plain form
37499 -4722884 -1846067 675851 1207008 558927 -106322 -978026 -2231714 -2702725 -1466797
37490 -1466797 380523 1140063 970242 1279394 2092771 1873122 165146 -1264812 -729791
37481 -729791 1063139 1964248 996520 -873481 -2145770 -2036936 -555006 1565468 2775251
37472 2775251 1651858 -1254795 -3219196 -2136269 707749 1964030 508228 -1110519
37464 -1110519 -367269 1577657 1676301 -396251 -1744030 -477441 1826596 2744477 2119373
37455 2119373 1239835 602925 227275 826226 2575181 3672016 2446658 294260 -41449
37446 -41449 1192658 1085484 -1008898 -2200902 -932142 243793 -972766 -2426125 -920957
37437 -920957 2312585 3490036 2415790 2431469 4355810 4970501 2658919 380214 875895
$$ packed form
37499d722884K876817K521918N31157o48081o65249q71704j253688m71011J235928
37490a466797J847320P59540j69821L09152Q13377k19649j707976j429958N35021
37481g29791J792930R01109r67728j870001j272289J08834J481930K120474J209783
37472B775251j123393k906653j964401J082927K844018J256281j455802j618747
37464a110519P43250J944926R8644k072552j347779J266589K304037R17881o25104
37455B119373q79538o36910l75650N98951J748955J096835j225358k152398l35709
37446d1449J234107j07174k094382j192004J268760J175935j216559j453359J505168
37437i20957L233542J177451j074246J5679J924341O14691k311582k278705M95681
$$ plain form
37428 875895 2468724 2491942 1913868 2946964 4241136 2726909 -738536 -1983615 34898
37419 34898 1567003 4511 -2286830 -2141647 -484029 -193631 -1248258 -1294659 -37205
37410 -37205 225978 -1511389 -3339488 -3420101 -2434987 -1996587 -2241000 -2256999 -1836540 -1539246
37400 -1539246 -1572782 -1600968 -1348808 -724871 272322 1191435 1183433 109480 -909756 -862917
37390 -862917 -313404 -551918 -1668624 -2628284 -3088554 -3792515 -4942598 -5492827 -4607955
37381 -4607955 -2774953 -894688 719007 1834325 1941682 1279733 1148896 2114459 2879828
37372 2879828 2198861 942706 727864 1340756 1390418 926340 1260080 2374917 2762934
37363 2762934 2049503 1592680 2001015 2175598 1454534 596094 -95586 -1323950 -2521952
$$ packed form
37428H75895J592829K3218n78074J033096J294172j514227l465445j245079K018513
37419C4898J532105j562492k291341J45183J657618K90398j054627m6401J257454
37410c7205K63183j737367j828099q0613R85114M38400k44413j5999M20459K97294
37400a539246l3536k8186K52160O23937R97193R19113q002j073953j019236M6839
37390h62917N49513k38514j116706r59660m60270p03961j150083n50229Q84872
37381d607955J833002J880265J613695J115318J07357o61949j30837R65563P65369
37372B879828o80967j256155k14842O12892M9662m64078L33740J114837L88017
37363B762934p13431m56823M08335J74583p21064q58440o91680j228364j198002
$$ plain form
37354 -2521952 -1596579 1522150 3633111 2636304 765610 933553 2142486 1749923 389267
37345 389267 676169 2113276 1672437 -621884 -1097575 1662962 4357705 4047427 2166349
37336 2166349 1310653 1144404 233752 -515643 571884 2522652 3053127 2470333 3136679
37327 3136679 5218849 5923073 3648062 570510 -153815 1653833 3309218 2661977 347033
37318 347033 -1249468 -653607 1308847 2679008 2553968 1658643 933261 502139 369166
37309 369166 1057893 2623829 3766126 3144939 1309015 134190 339494 688563 -83320
37300 -83320 -1637570 -2926117 -3799565 -4744273 -5546054 -5451812 -4656488 -4358609 -4866010 -4864458
37290 -4864458 -3484489 -1936255 -1637269 -1720076 -535135 938830 11696 -3108485 -4760045
$$ packed form
37354b521952R25373L118729K110961r96807j870694J67943J208933l92563j360656
37345C89267K86902J437107m40839k294321m75691K760537K694743l10278j881078
37336B166349q55696j66249r10652p49395J087527J950768N30475n82794O66346
37327C136679K082170P04224k275011l077552p24325J807648J655385o47241k314944
37318C47033j596501N95861J962454J370161j25040q95325p25382m31122j32973
37309C69166O88727J565936J142297o21187j835924j174825K05304L49069p71883
37300h3320j554250j288547q73448r44708q01781R4242P95324K97879n07401J552
37290d864458J379969J548234K98986q2807J184941J473965r27134l120181j651560
$$ plain form
37281 -4760045 -3120307 -971294 -1172567 -2393840 -2222468 -1697463 -2877680 -4129872 -2581089
37272 -2581089 72486 -467607 -3642467 -4191310 -561653 2552685 2008282 976412 2764350
37263 2764350 4899194 3697283 820778 345714 1976944 2159221 240314 -1236204
37255 -1236204 -1380426 -1615295 -1957540 -825322 1400920 2329719 1356389 339441 323774
37246 323774 543703 692351 1192178 1220192 -455010 -2606208 -2659344 -777038 464356
37237 464356 642148 2000400 4704416 5523484 2815896 -637636 -1720921 -913347 -161279
37228 -161279 299866 716964 50382 -1936432 -2995399 -1555037 255430 -367985 -2340748
37219 -2340748 -2325327 -60112 1257134 -85385 -1997518 -1986347 -485169 490370 404472
$$ packed form
37281d760045J639738K149013k01273j221273J71372N25005j180217j252192J548783
37272b581089K653575n40093l174860n48843L629657L114338n44403j031870J787938
37263B764350K134844j201911k876505m75064J631230J82277j918907j476518
37255a236204j44222k34869l42245J132218K226242R28799r73330j016948j5667
37246C23774K19929J48648M99827K8014j675202k151198n3136J882306J241394
37237D64356J77792J358252K704016Q19068k707588l453532j083285Q07574P52068
37228a61279M61145M17098o66582j986814j058967J440362J810467o23415j972763
37219b340748J5421K265215J317246j342519j912133J1171J501178R75539q5898
$$ plain form
37210 404472 380400 995078 1302326 297952 -1405031 -2060642 -946547 627742 959327
37201 959327 76884 -591490 -329287 154095 44524 -631198 -1465992 -2061848 -1890124 -801231
37191 -801231 281561 246976 -651520 -1240543 -1188760 -942174 -284802 1154963 2220341
37182 2220341 1425977 -77783 453865 2751629 3132069 133286 -2655546 -1802195 698793
37173 698793 595538 -2120678 -3614096 -2241780 -434363 -308755 -713309 196109 1833406
37164 1833406 2201012 728358 -1167481 -1702975 -163298 2760729 5494308 6701860
37156 6701860 6219155 4861419 3465459 2315078 1240722 -12669 -1344137 -2166332
37148 -2166332 -2076590 -1551606 -1321948 -1202138 -473203 728696 1656061 2473317 3913837
$$ packed form
37210D04472k4072O14678L07248j004374j702983o55611J114095J574289L31585
37201I59327q82443o68374K62203M83382j09571o75722q34794n95856J71724J088893
37191h01231J082792l4585q98496n89023N1783K46586O57372J439765J065378
37182B220341p94364j503760N31648K297764L80440k998783k788832Q53351K500988
37173F98793j03255k716216j493418J372316J807417J25608m04554R09418J637297
37164A833406L67606j472654j895839n35494J539677K924027K733579J207552
37156F701860m82705j357736j395960j150381j074356j253391j331468q22195
37148b166332Q9742N24984K29658J19810P28935J201899R27365Q17256J440520
$$ plain form
37139 3913837 5328702 5037016 3053640 1382095 982017 794535 610989 2042395 5047714
37130 5047714 6454605 4363953 1462357 1090254 2296534 2082936 561693 67881 584690
37121 584690 187999 -755727 -86796 1646843 1411449 -1177832 -2963395 -2356327 -1558825
37112 -1558825 -2408521 -3490588 -3015094 -1512383 40340 1945274 3822409 3606771 625664
37103 625664 -2535600 -3346608 -2654834 -2762322 -3921606 -4708808 -4421260 -3273134 -1453723
37094 -1453723 445761 1290250 998114 952407 1732918 2073886 1154506 -28158 -746491
37085 -746491 -1671898 -2476767 -1101119 2395606 4066780 1163984 -3348020 -4714277 -2807176
37076 -2807176 -960869 -271676 562489 952354 -1080828 -4269124 -4832745 -2493300 -1128875
$$ packed form
37139C913837J414865k91686j983376j671545m00078j87482j83546J431406L005319
37130E047714J406891k090652k901596l72103J206280k13598j521243m93812N16809
37121E84690l96691r43726O68931J733639k35394k589281j785563O07068P97502
37112a558825q49696j082067M75494J502711J552723J904934J877135k15638k981107
37103F25664l161264q11008O91774j07488j159284p87202K87548J148126J819411
37094a453723J899484Q44489k92136m5707P80511L40968r19380j182664p18333
37085g46491r25407q04869J375648L496725J671174k902796m512004j366257J907101
37076b807176J846307O89193Q34165L89865k033182l188296n63621K339445J364425
$$ plain form
37067 -1128875 -2299248 -2821454 -756141 811334 -940850 -3439975 -2852743 -449302
37059 -449302 -345655 -2620583 -3338287 -938214 1757647 2410483 2180062 2564567 2403065
37050 2403065 72972 -3358900 -5244014 -4535994 -2364550 -279869 831993 847509 590898
37041 590898 1280746 2737680 2864363 178144 -3694632 -5526543 -4308986 -2128829 -1158008
37032 -1158008 -1224785 -836744 673027 2804717 4758216 5813477 5525156 4282344 3113335
37023 3113335 2362465 1309437 -265476 -1177634 -561311 528665 734535 731259 1943469
37014 1943469 3435783 2605527 -693734 -3226060 -2599853 -228114 1323761 1829671 2251856
37005 2251856 1953370 -140442 -2536581 -2405141 96601 1515392 -117514 -2610820
$$ packed form
37067a128875j170373n22206K065313J567475j752184k499125N87232K403441
37059d49302J03647k274928p17704K400073K695861O52836k30421L84505j61502
37050B403065k330093l431872j885114P08020K171444K084681J111862J5516k56611
37041E90898O89848J456934J26683k686219l872776j831911J217557K180157R70821
37032a158008o6777L88041J509771K131690J953499J055261k88321j242812j169009
37023C113335p50870j053028j574913r12158O16323J089976K05870l276J212210
37014A943469J492314q30256l299261k532326O26207K371739J551875N05910M22185
37005B251856k98486k093812k396139J31440K501742J418791j632906k493306
$$ plain form
36997 -2610820 -3028199 -1810457 -1631791 -3318744 -4928953 -4610368 -2742601 -1048542 -754727
36988 -754727 -1953501 -3846626 -5085483 -4482259 -2078695 570226 1593963 431808
36980 431808 -1760420 -3234417 -3095709 -1786830 -425552 204977 124603 -195714 -513710
36971 -513710 -978827 -1522241 -1402835 29081 2056456 2886204 1753460 28417 -661974
36962 -661974 -807309 -2137153 -4550490 -5634999 -3866976 -866686 611781 3253 -895236
36953 -895236 -483272 994366 2069875 1510422 -589717 -2624194 -2881034 -1675888 -1289832
36944 -1289832 -2964126 -4865309 -4287316 -1197462 1867949 3014216 2533232 1451294
36936 1451294 254940 -667405 -810137 -306245 203562 783264 2095101 3695068 3781031
$$ packed form
36997b610820m17379J217742J78666j686953j610209L18585J867767J694059K93815
36988g54727j198774j893125j238857O03224K403564K648921J023737j162155
36980D31808k192228j473997J38708J308879J361278O30529q0374l20317l17996
36971e13710m65117n43414J19406J431916K027375Q29748j132744j725043o90391
36962f61974j45335j329844k413337j084509J768023L000290J478467o08528q98489
36953h95236M11964J477638J075509n59453k100139k034477k56840J205146L86056
36944a289832j674294j901183N77993L089854L065411J146267m80984j081938
36936A451294j196354r22345j42732N03892N09807N79702J311837J599967Q5963
$$ plain form
36927 3781031 1490638 -1509499 -2678413 -1332697 925026 2039592 1229124 -674576
36919 -674576 -2064447 -1940345 -697366 640276 1766668 3028989 4194392 4356579 3312731
36910 3312731 1974895 931965 -374727 -2306502 -3764735 -3359307 -1445527 8666
36902 8666 -410093 -2191373 -3731946 -3967159 -2973426 -1372959 322391 1634403 1875143
36893 1875143 724105 -932280 -1635015 -1221059 -1080403 -1828080 -1886275 203367 2945711
36884 2945711 3364303 1118535 -909722 -570641 846243 746952 -1279218 -3152271 -2734398
36875 -2734398 112596 3367156 4485501 2816528 362692 -551824 130282 1084817 2204299
36866 2204299 4193158 6039513 5665664 3383908 1836771 1779349 1014001 -1184271 -1885831
$$ packed form
36927C781031k290393l000137j168914J345716K257723J114566q10468j903700
36919f74576j389871J24102J242979J337642J126392J262321J165403J62187j043848
36910C312731j337836j042930j306692j931775j458233M05428J913780J454193
36902H666m18759j781280j540573k35213R93733J600467J695350J312012K40740
36893A875143j151038j656385p02735M13956J40656p47677n8195K089642K742344
36884B945711M18592k245768k028257L39081J416884r9291k026170j873053M17873
36875b734398K846994L254560J118345j668973k453836r14516O82106R54535J119482
36866B204299J988859J846355l73849k281756j547137n7422p65348k198272p01560
$$ plain form
36857 -1885831 1009144 4977871 6392056 5514663 4914241 4862447 3778658 1900043 926961
36848 926961 757475 -86753 -1317783 -1389348 -634991 -557728 -473066 1368453 3474160 2252336
36838 2252336 -1843839 -3769482 -1152217 2093610 1959474 387289 1573157 4947458
36830 4947458 6038889 3221688 -205099 -726274 1458578 3691607 4035887 2640661
36822 2640661 1166105 1108416 1991218 1597498 -1192958 -4516606 -5591799 -3968301 -1439573
36813 -1439573 570927 1922902 2471768 1708406 -16429 -1252346 -963879 414906 1618394
36804 1618394 1704233 673926 -492664 -653009 104727 341150 -767148 -1960061 -1424757
36795 -1424757 693021 2529138 2952295 2435935 1566438 159705 -1744333 -3212657 -3377481
$$ packed form
36857a885831K894975L968727J414185q77393o00422n1794j083789j878615r73082
36848I26961j69486q44228j231030p1565P54357P7263Q4662J841519K105707j221824
36838B252336m096175j925643K617265L245827j34136j572185J185868L374301
36830D947458J091431k817201l426787n21175K184852K233029L44280j395226
36822B640661j474556n7689Q82802l93720k790456l323648j075193J623498K528728
36813a439573K010500J351975N48866p63362j724835j235917K88467J378785J203488
36804A618394Q5839j030307j166590j60345P57736K36423j108298j192913N35304
36795a424757K117778J836117M23157n16360q69497j406733j904038j468324j64824
$$ plain form
36786 -3377481 -2321735 -646134 1044474 1869993 875985 -1702256 -3992402 -4203973 -2618099
36777 -2618099 -1182116 -1166125 -1843179 -1690717 -422116 703615 604352 -118457 50690
36768 50690 1353536 2105767 737140 -2017333 -3783036 -3299046 -1636898 -442625 137217
36759 137217 1039308 2401371 3263817 3195332 3043982 3452335 3594875 2475681 817305
36750 817305 150278 240121 -694725 -2740502 -3332848 -936033 2045643 2173208 -237924
36741 -237924 -1703213 -596943 989975 753958 -939668 -2634150 -4070492 -5420203
36733 -5420203 -5827425 -4427806 -1972926 -114209 339679 -399602 -1796250 -2992660 -3053423
36724 -3053423 -2108317 -1343082 -1173140 -763655 -201588 -1247806 -4266930 -6238936 -4348109
$$ packed form
36786c377481J055746J675601J690608Q25519r94008k578241k290146k11571J585874
36777b618099J435983J5991o77054J52462J268601J125731r9263p22809J69147
36768E0690J302846P52231j368627k754473j765703M83990J662148J194273N79842
36759A37217R02091J362063Q62446o8485j51350M08353J42540j119194j658376
36750H17305o67027Q9843r34846k045777n92346K396815K981676J27565k411132
36741b37924j465289J106270J586918k36017j693626j694482j436342j349711
36733e420203m07222J399619K454880J858717M53888p39281j396648j196410o0763
36724c053423R45106P65235J69942M09485N62067j046218l019124j972006J890827
$$ plain form
36715 -4348109 -421750 1022145 -1309454 -4309558 -5156746 -4265410 -2974232 -1150650
36707 -1150650 1431366 3455093 3608940 2507202 1610910 1247182 945333 730312 757284
36698 757284 527536 -149180 -162229 1369471 3053429 2457053 -550942 -3281217 -3513704
36689 -3513704 -1981011 -827883 -722874 -653070 76440 1048765 1899262 2925095 4038529
36680 4038529 4247337 3099766 1800825 1613960 1648371 -135656 -3647819 -6157414 -5820518
36671 -5820518 -4187340 -3899201 -4990577 -5117750 -2946537 321714 2739449 3469498 2660914
36662 2660914 844879 -932309 -1357916 -81698 1667555 2255725 1313662 -55970 -663424
36653 -663424 -562577 -745732 -1456151 -1400636 494935 2868297 3004806 585705 -1353368
$$ packed form
36715d348109L926359J443895k331599l000104q47188Q91336J291178J823582
36707a150650K582016K023727J53847j101738q96292l63728l01849k15021K6972
36698G57284k29748o76716j3049J531700J683958n96376l007995k730275k32487
36689c513704J532693J153128J05009O9804P29510R72325Q50497J025833J113434
36680D038529K08808j147571j298941j86865L4411j784027l512163k509595L36896
36671e820518J633178K88139j091376j27173K171213L268251K417735P30049q08584
36662B660914j816035j777188m25607J276218J749253N88170r42063j369632o07454
36653f63424J00847j83155p10419N5515J895571K373362J36509k419101j939073
$$ plain form
36644 -1353368 -433251 1606655 1338374 -1483319 -3792068 -3600129 -2091832 -1020095 -335217
36635 -335217 571945 1076243 223616 -1567584 -2977236 -3452388 -3509424 -3697917 -3906366
36626 -3906366 -3558887 -2269222 -495046 589852 334398 -556316 -1079942 -1362199 -2014573
36617 -2014573 -2582425 -2103014 -955588 -464149 -702014 -586941 -309420 -1408110 -3729391
36608 -3729391 -4637270 -2574523 602556 2444651 3213375 4410183 5622707 5293938 3683692
36599 3683692 2558040 2329487 1850944 960723 892252 1765627 1822586 74344 -1880954
36590 -1880954 -1769110 606099 3336478 4416074 3255863 990690 -208085 1079948
36582 1079948 3814770 5222415 3802790 1015635 -583396 -210226 916522 1613990
$$ packed form
36644a353368R20117K039906k68281k821693k308749J91939J508297J071737O84878
36635c35217R07162N04298q52627j791200j409652m75152n7036j88493k08449
36626c906366L47479J289665J774176J084898k55454q90714n23626k82257o52374
36617b014573n67852M79411J147426M91439k37865J15073K77521j098690k321281
36608c729391r07879K062747L177079J842095P68724J196808J212524l28769j610246
36599C683692j125652k28553m78543q90221o8471Q73375N6959j748242j955298
36590a880954J11844K375209K730379J079596j160211k265173j198775J288033
36582A079948K734822J407645j419625k787155j599031L73170J126748O97468
$$ plain form
36574 1613990 1830860 1723693 814287 -1215196 -3399779 -4020074 -2419451 133210 1659382
36565 1659382 1369217 162919 -582639 -452498 -240424 -917506 -2354419 -3147606 -2092099
36556 -2092099 57828 909988 -938984 -4063475 -5734797 -4927336 -2884780 -983717
36548 -983717 643008 2116628 2770835 1936160 56943 -1696314 -2511645 -2215147 -1035815
36539 -1035815 389551 1226632 1163406 681902 424667 644384 1262978 1875601 1779669 858563
36529 858563 332791 1411688 3152280 3282933 1624059 807490 2452384 4374335 3396363
36520 3396363 -218358 -3119719 -3073121 -1015071 784359 979417 -317604 -1835082 -1995908
36511 -1995908 -592579 650424 260670 -864341 -988268 -480455 -1163642 -2968605 -3596185
$$ packed form
36574A613990K16870j07167r09406k029483k184583o20295J600623K552661J526172
36565A659382k90165j206298p45558J30141K12074o77082j436913p93187J055507
36556b092099K149927Q52160j848972l124491j671322Q07461K042556J901063
36548i83717J626725J473620O54207q34675j879217j753257q15331K96498J179332
36539a035815J425366Q37081o3226m81504k57235K19717O18594O12623r5932r21106
36529H58563n25772J078897J740592J30653j658874q16569J644894J921951r77972
36520C396363l614721k901361M6598K058050J799430J95058j297021j517478j60826
36511a995908J403329J243003l89754j125011j23927N07813o83187j804963o27580
$$ plain form
36502 -3596185 -1923059 452827 1855025 2669092 3698142 4251810 3508021 2438177 2545897
36493 2545897 3424329 3265993 1483035 -645976 -1866313 -2221360 -2305825 -2270310 -1894960
36484 -1894960 -1036634 203406 1361305 1692293 853662 -507115 -1329863 -1340131 -1217716
36475 -1217716 -1483848 -1663078 -816313 1300208 3842039 5593640 5922144 4988892 3225985
36466 3225985 990862 -1129458 -2176404 -1640585 -344065 179328 -630568 -1854240 -2485932
36457 -2485932 -2664911 -3009020 -3276953 -2528118 -534436 1670303 2845868 2749836 2162641
36448 2162641 2074961 2986204 4600271 5891687 5754092 4043910 1951556 962729 1404734
36439 1404734 2338790 2858494 2919262 2661362 1647903 -453971 -2809805 -4007590 -3765695
$$ packed form
36502c596185J673126K375886J402198Q14067J029050N53668p43789j069844J07720
36493B545897Q78432j58336j782958k129011j220337l55047q4465L5515L75350
36484a894960Q58326J240040J157899L30988q38631j360777q22748j0268J22415
36475a217716k66132j79230Q46765K116521K541831J751601L28504r33252j762907
36466C225985k235123k120320j046946N35819J296520N23393q09896j223672o31692
36457b485932j78979l44109k67933P48835J993682K204739J175565r6032n87195
36448B162641q7680R11243J614067J291416j37595j710182k092354r88827M42005
36439A404734R34056N19704O0768k57900j013459k101874k355834j197785K41895
$$ plain form
36430 -3765695 -3217035 -3293170 -3640374 -3514507 -2973351 -2564718 -2392581 -2198810 -2052316 -2289280
$$ packed form
36430c765695N48660p6135l47204J25867N41156M08633J72137J93771J46494k36964
$$ [...]
##END NTUPLES=NMR SPECTRUM
##END=
