##TITLE=31Pdec_4C1703-HF
 CDCl3, 24 sc
 17.3.2023
##JCAMPDX= 6.0         $$ Bruker NMR JCAMP-DX V2.0
##DATA TYPE= NMR SPECTRUM
##DATA CLASS= NTUPLES
##ORIGIN= UXNMR, Bruker Analytische Messtechnik GmbH
##OWNER= root
$$ XWIN-NMR		Version 3.5
$$ Fri Mar 17 15:49:00 2023 Russian Standard Time (UT+4h)  she@DPX200
##.OBSERVE FREQUENCY= 81.013821
##.OBSERVE NUCLEUS= ^31P
##.ACQUISITION MODE= SIMULTANEOUS
##.ACQUISITION SCHEME= undefined
##.AVERAGES= 24
##.DIGITISER RES= 16
##SPECTROMETER/DATA SYSTEM= spect
##.PULSE SEQUENCE= zgpg30
##.SOLVENT NAME= DMSO
##.SHIFT REFERENCE= (INTERNAL, DMSO, 0, 248.564)
##AUDIT TRAIL= $$ (NUMBER, WHEN, WHO, WHERE, WHAT)
$$ ##TITLE= Audit trail, XWIN-NMR		Version 3.5
$$ ##JCAMPDX= 5.01
$$ ##ORIGIN= Bruker BioSpin GmbH
$$ ##OWNER= she
$$ F:/spectra/data/she/nmr/P31/1/pdata/1/auditp.txt
$$ ##AUDIT TRAIL=  $$ (NUMBER, WHEN, WHO, WHERE, WHAT)
(   1,<2023-03-17 15:47:35.92 +0400>,<she>,<DPX200>,
      <created by zg, POWCHK disabled, PULCHK disabled
       configuration hash MD5:
       00 E9 B6 7A A2 85 ED C7 34 08 36 98 17 FE 4E 26
       data hash MD5: 32K
       BE 04 92 83 DA 70 05 D0 85 1E 17 81 EC F0 64 11>)
(   2,<2023-03-17 15:47:41.96 +0400>,<she>,<DPX200>,
      <Start of raw data processing
       efp BC_mod = 2 LB = 1 FT_mod = 6 PKNL = 1 PHC0 = -10709.81 PHC1 = -319.99 SI = 64K 
       data hash MD5: 64K
       43 72 22 95 36 78 46 AA 1E 5D E1 30 A2 B9 3E 37>)
(   3,<2023-03-17 15:48:25.17 +0400>,<she>,<DPX200>,
      <pk PHC0 = 173.0624 PHC1 = -432.4 
       data hash MD5: 64K
       11 B6 4F 32 55 A8 6E 5A 59 EA 1C CA 37 1B 55 B6>)
(   4,<2023-03-17 15:48:27.95 +0400>,<she>,<DPX200>,
      <abs ABSG = 5 
       data hash MD5: 64K
       E0 94 56 91 BB 4A 2F 54 CA 99 3A E1 26 35 0C CC>)
$$ ##END=
$$ 
$$ hash MD5
$$ 9A D3 C3 82 47 72 1E FD 4E 1C F8 07 2B 1E 58 CC
##$RELAX= 
##$RELAX= 
##$RELAX= 
##$RELAX= 
##$RELAX= 
##$RELAX= 
##$RELAX= 
##$RELAX= 
##$RELAX= 
$$ Bruker specific parameters
$$ --------------------------
##$DU= <F:/spectra>
##$EXPNO= 1
##$NAME= <P31>
##$PROCNO= 1
##$TYPE= <nmr>
##$USER= <she>
##$AMP= (0..31)
100 100 100 100 100 100 100 100 100 100 100 100 100 100 100 100 100 100 
100 100 100 100 100 100 100 100 100 100 100 100 100 100 
##$AQSEQ= 0
##$AQ_mod= 1
##$AUNM= <au_zg>
##$AUTOPOS= <>
##$BF1= 81.014009
##$BF2= 200.13
##$BF3= 200.13
##$BF4= 200.13
##$BF5= 200.13
##$BF6= 200.13
##$BF7= 200.13
##$BF8= 200.13
##$BYTORDA= 1
##$CFDGTYP= 0
##$CFRGTYP= 5
##$CHEMSTR= <none>
##$CNST= (0..31)
1 1 145 1 1 1 1 1 1 1 1 1 1 1 1 1 1 1 1 1 1 1 1 1 1 1 1 1 1 1 1 1 
##$CPDPRG= <waltz16>
##$CPDPRG1= <>
##$CPDPRG2= <waltz16>
##$CPDPRG3= <>
##$CPDPRG4= <mlev>
##$CPDPRG5= <mlev>
##$CPDPRG6= <mlev>
##$CPDPRG7= <mlev>
##$CPDPRG8= <mlev>
##$CPDPRGB= <>
##$CPDPRGT= <>
##$D= (0..31)
0 1 0 0 0 0 0 0 0 0 0 0.03 2e-05 3e-06 0 0 0 0 0 0 0 0 0 0 0 0 0 0 0 0 
0 0 
##$DATE= 1679053655
##$DBL= (0..7)
120 120 120 11 120 120 24 19 
##$DBP= (0..7)
150 150 150 150 150 150 150 150 
##$DBP07= 0
##$DBPNAM0= <>
##$DBPNAM1= <>
$$ [...]
##$SUBNAM3= <"">
##$SUBNAM4= <"">
##$SUBNAM5= <"">
##$SUBNAM6= <"">
##$SUBNAM7= <"">
##$SUBNAM8= <"">
##$SUBNAM9= <"">
##$SW= 501.771253377433
##$SWIBOX= (0..15)
0 1 3 0 0 0 0 0 0 0 0 0 0 0 0 0 
##$SW_h= 40650.406504065
##$TD= 32768
##$TD0= 1
##$TE= 0
##$TE2= 300
##$TE3= 300
##$TEG= 300
##$TL= (0..7)
0 120 53 12 22 120 120 120 
##$TP= (0..7)
150 150 150 150 150 150 150 150 
##$TP07= 0
##$TPNAME0= <>
##$TPNAME1= <>
##$TPNAME2= <>
##$TPNAME3= <>
##$TPNAME4= <>
##$TPNAME5= <>
##$TPNAME6= <>
##$TPNAME7= <>
##$TPOAL= (0..7)
0.5 0.5 0.5 0.5 0.5 0.5 0.5 0.5 
##$TPOFFS= (0..7)
0 0 0 0 0 0 0 0 
##$TUNHIN= 0
##$TUNHOUT= 0
##$TUNXOUT= 0
##$USERA1= <user>
##$USERA2= <user>
##$USERA3= <user>
##$USERA4= <user>
##$USERA5= <user>
##$V9= 5
##$VALIST= <valist>
##$VCLIST= <CCCCCCCCCCCCCCC>
##$VD= 0
##$VDLIST= <DDDDDDDDDDDDDDD>
##$VPLIST= <PPPPPPPPPPPPPPP>
##$VTLIST= <TTTTTTTTTTTTTTT>
##$WBST= 1024
##$WBSW= 4
##$XGAIN= (0..3)
0 0 0 0 
##$XL= 0
##$YL= 0
##$YMAX_a= 124
##$YMIN_a= -139
##$ZGOPTNS= <>
##$ZL1= 120
##$ZL2= 120
##$ZL3= 120
##$ZL4= 120
##$ABSF1= 248.5645
##$ABSF2= -253.2056
##$ABSG= 5
##$ABSL= 3
##$ALPHA= 0
##$AQORDER= 0
##$ASSFAC= 0
##$ASSFACI= 0
##$ASSFACX= 0
##$ASSWID= 0
##$AUNMP= <proc_1d>
##$AZFE= 0.1
##$AZFW= 0.5
##$BCFW= 0
##$BC_mod= 2
##$BYTORDP= 0
##$COROFFS= 0
##$CY= -3
##$DATMOD= 1
##$DC= 0
##$DFILT= <>
##$DTYPP= 0
##$F1P= 0
##$F2P= 0
##$FCOR= 1
##$FTSIZE= 65536
##$FT_mod= 6
##$GAMMA= 0
##$GB= 0
##$INTBC= 1
##$INTSCL= 6.047779e-11
##$ISEN= 30
##$LB= 1
##$LEV0= 0
##$LPBIN= 0
##$MAXI= 10000
##$MC2= 0
##$MEAN= 0
##$ME_mod= 0
##$MI= 50
##$NCOEF= 0
##$NC_proc= -12
##$NLEV= 6
##$NOISF1= 182.463
##$NOISF2= 159.3651
##$NSP= 0
##$NTH_PI= 0
##$NZP= 0
##$OFFSET= 248.5645
##$PC= 4
##$PHC0= -10536.75
##$PHC1= -752.39
##$PH_mod= 1
##$PKNL= yes
##$PPARMOD= 0
##$PSCAL= 0
##$PSIGN= 0
##$REVERSE= no
##$SF= 81.0140089999694
##$SI= 65536
##$SIGF1= 159.3651
##$SIGF2= -187.1042
##$SINO= 113.3802
##$SIOLD= 16384
##$SREGLST= <1H.CDCl3>
##$SSB= 0
##$STSI= 65536
##$STSR= 0
##$SW_p= 40650.406504065
##$SYMM= 0
##$S_DEV= 0
##$TDeff= 32768
##$TDoff= 0
##$TI= <>
##$TILT= no
##$TM1= 0
##$TM2= 0
##$TOPLEV= 0
##$USERP1= <user>
##$USERP2= <user>
##$USERP3= <user>
##$USERP4= <user>
##$USERP5= <user>
##$WDW= 1
##$XDIM= 65536
##$YMAX_p= 337273448
##$YMIN_p= -178077576
$$ End of Bruker specific parameters
$$ ---------------------------------
##NTUPLES= NMR SPECTRUM
##VAR_NAME=  FREQUENCY,     SPECTRUM/REAL,   SPECTRUM/IMAG
##SYMBOL=    X,             R,               I
##VAR_TYPE=  INDEPENDENT,   DEPENDENT,       DEPENDENT
##VAR_FORM=  AFFN,          ASDF,            ASDF
##VAR_DIM=   65536,         65536,           65536
##UNITS=     HZ,            ARBITRARY UNITS, ARBITRARY UNITS
##FACTOR=    0.620285442955139, 1,           1
##FIRST=     20137.2065510682, 0,            0
##LAST=      -20513.1999529968, 0,           0
##MIN=       -20513.1999529968, -178077576,  0
##MAX=       20137.2065510682, 337273448,    0
$$ Real data points
##PAGE= N=1
##DATA TABLE= (X++(R..R)), XYDATA
$$ [...]
$$ plain form
40812 -6089275 -1469163 1039617 943900 58266 -486422 -684065 -502097 -142108 -304583
40803 -304583 -762539 -206227 1100065 698349 -1998776 -3457590 -778326 3342035 3935867
40794 3935867 612340 -2686176 -3797128 -4193563 -5064547 -5553935 -5308400 -5332865 -5779644
40785 -5779644 -5800798 -5594258 -5462139 -3340684 2510955 8361928 7708842 531517 -5163576
40776 -5163576 -3539384 1814631 3946249 1710872 -1169918 -2846352 -4191494 -4727271
40768 -4727271 -2604542 1575923 4650247 4782734 2857384 402983 -1236859 -325290
40760 -325290 3503328 6965423 5825335 546520 -3502304 -2572445 984985 2099471
40752 2099471 -927251 -5278116 -7379609 -6031513 -2149030 2808918 7185352 8700998
$$ packed form
40812f089275M620112K508780r5717q85634n44688j97643J81968L59989j62475
40803c04583m57956N56312J306292m01716k697125j458814K679264M120361N93832
40794C935867l323527l298516j110952l96435q70984m89388K45535k4465m46779
40785e779644k1154K06540J32119K121455N851639N850973o53086p177325n695093
40776e163576J624192N354015K131618k235377k880790j676434j345142n35777
40768d727271K122729M180465L074324J32487j925350k454401j639842R11569
40760c25290L828618L462095j140088n278815m048824R29859L557430J114486
40752B099471l026722m350865k101493J348096L882483M957948M376434J515646
$$ plain form
40744 8700998 5485566 -1383866 -7318436 -8046537 -4108880 105590 1918478 2682503
40736 2682503 3815072 3504271 -119154 -4663003 -5919772 -4018071 -3531396 -6838553
40728 -6838553 -10590557 -10475692 -7098850 -4663671 -5043478 -5897603 -4734168 -2368688 -1112931
40719 -1112931 -1237683 -1234967 -807442 -1120936 -1847973 -710344 2472325 3682506 -542799
40710 -542799 -7537074 -10847010 -7850496 -2076862 2087599 3811441 4328317 4357193 4559837
40701 4559837 5916531 7841848 7979745 5452142 2433606 1172319 1429761 2013412 2470729
40692 2470729 1996984 -576589 -4103139 -5418338 -4184792 -4026675 -6399104 -7222393 -3246198
40683 -3246198 1924023 2886033 593529 165287 2810954 5626727 7684227 10023839
$$ packed form
40744H700998l215432o869432n934570p28101L937657M214470J812888P64025
40736B682503J132569l10801l623425m543849j256769J901701M86675l307157
40728f838553l752004J14865L376842K435179l79807q54125J163435K365480J255757
40719a112931j24752K716M27525l13494p27037J137629L182669J210181m225305
40710e42799o994275l309936K996514N773634M164461J723842N16876K8876K02644
40701D559837J356694J925317J37897k527603l018536j261287K57442N83651M57317
40692B470729m73745k573573l526550j315199J233546J58117k372429q23289L976195
40683c246198N170221R62010k292504m28242K645667K815773K057500K339612
$$ plain form
40675 10023839 10556716 5871056 -1561935 -4747326 -1967887 1192273 1243723 1414377 4158352
40666 4158352 5958091 4037377 2304460 4986109 8914001 8294479 3908477 1286336
40658 1286336 1783872 1658214 -876206 -3414346 -4194888 -4161538 -3690810 -1651359 1382908
40649 1382908 2677378 1143194 -1264535 -2535096 -2346431 -680944 2346840 4921447
40641 4921447 4611598 1488314 -2186958 -5113794 -7023659 -6453216 -2509898 1377806
40633 1377806 361567 -4402757 -6430152 -3691263 -2126015 -6241650 -11664502 -11946203
40625 -11946203 -8393109 -7015945 -8690965 -9271080 -8128597 -9208649 -12865519 -13581859
40617 -13581859 -8443589 -2337863 -1136223 -3893407 -5781180 -5608355 -6006282 -7919197
$$ packed form
40675A0023839N32877m685660p432991l185391K779439L160160N1450J70654K743975
40666D158352J799739j920714j732917K681649L927892o19522m386002k622141
40658A286336M97536j25658k534420k538140p80542L3350M70728K039451L034267
40649A382908J294470j534184k407729j270561J88665J665487L027784K574607
40641D921447l09849l123284l675272k926836j909865N70443L943318L887704
40633A377806j016239m764324k027395K738889J565248m115635n422852k81701
40625a1946203L553094J377164j675020n80115J142483j080052l656870p16340
40617a3581859N138270O105726J201640k757184j887773J72825l97927j912915
$$ plain form
40609 -7919197 -9233146 -8536708 -6895938 -5688502 -5115982 -5065641 -5525759 -5993964 -5934362
40600 -5934362 -5711541 -5864531 -5952607 -5373264 -4530255 -3770296 -2272758 127156 1244410
40591 1244410 -753952 -3820898 -4270730 -2259232 -1649268 -3934840 -5754406 -3963834
40583 -3963834 -359770 796118 -1788514 -5382087 -6509036 -3944970 566710 3575441
40575 3575441 2801078 -686556 -4131511 -6695468 -9366705 -11404407 -10104357 -5278221
40567 -5278221 -808619 323961 -80579 1100737 3396768 4112422 2741459 1055611
40559 1055611 114883 -178608 119090 143137 -2143938 -6600236 -9087824 -6651667 -2871151
40550 -2871151 -3528473 -7761183 -8652562 -3139223 3662101 5733599 3465506 1171233
$$ packed form
40609g919197j313949O96438J640770J207436N72520N0341m60118m68205N9602
40600e934362K22821j52990q8076N79343Q43009P59959J497538K399914J117254
40591A244410j998362l066946m49832K011498O09964k285572j819566J790572
40583c963834L604064J155888k584632l593573j126949K564066M511680L008731
40575C575441p74363l487634l444955k563957k671237k037702J300050M826136
40567e278221M469602J132580m04540J181316K296031P15654j370963j685848
40559A055611r40728k93491K97698K4047k287075m456298k487588K436157L780516
40550b871151o57322m232710q91379N513339O801324K071498k268093k294273
$$ plain form
40542 1171233 702696 657376 -136671 -1321877 -2332533 -2998421 -3303436 -3601942 -4329691
40533 -4329691 -4904210 -3997420 -1320281 2109304 5504683 8290138 8598787 4523981 -2293146
40524 -2293146 -6992489 -6782539 -3663566 -750563 1363551 2874141 2392327 -863246
40516 -863246 -4608302 -6238536 -6546069 -7798492 -9474607 -9219984 -7281602 -6469210 -7594791
40507 -7594791 -8174980 -6419962 -3788246 -2453666 -2430840 -2480477 -2093321 -1301169 -72258
40498 -72258 749010 -638240 -4426988 -7695363 -7528129 -5032310 -3941566 -5295215 -6167318
40489 -6167318 -4515381 -2423722 -2337613 -2531040 14973 3417615 2220193 -4371611 -10083628
40480 -10083628 -9669224 -5626234 -3647344 -4600958 -5231773 -4540086 -4504514 -5379026 -5149095
$$ packed form
40542A171233m68537m5320p94047j185206j010656o65888l05015k98506p27749
40533d329691n74519R06790K677139L429585L395379K785455L08649m074806o817127
40524b293146m699343K09950L118973K913003K114114J510590m81814l255573
40516h63246l745056j630234l07533j252423j676115K54623J938382Q12392j125581
40507g594791n80189J755018K631716J334580K2826m9637L87156P92152J228911
40498g2258Q21268j387250l788748l268375J67234K495819J090744j353649q72103
40489f167318J651937K091659Q6109j93427K546013L402642j197422o591804n712017
40480a0083628M14404M042990J978890r53614o30815O91687L5572q74512K29931
$$ plain form
40471 -5149095 -3742440 -3385908 -4358891 -4566470 -3832842 -4218923 -5265785 -3760181 143892
40462 143892 1483833 -2268174 -6997165 -8068672 -6460430 -5183150 -3731833 -807152
40454 -807152 851887 -1898163 -6032205 -5347926 301334 4173405 1893688 -3017738
40446 -3017738 -4616745 -2069994 635477 540677 -1105115 -1251411 765265 2371940 1347879
40437 1347879 -857939 -1165381 434133 1081367 -37104 -755163 -731392 -2509203 -5662846
40428 -5662846 -5146910 608460 4947453 1788839 -5020059 -7634870 -5878983 -5142591
40420 -5142591 -5279872 -1183926 5825695 7315175 863246 -5312795 -4901102 -2278344
40412 -2278344 -3231677 -4569802 -670151 5188961 5083061 -643694 -3574165 -66168
$$ packed form
40471e149095J406655L56532r72983k07579P33628l86081j046862J505604L904073
40462A43892J339941l752007m728991j071507J608242J277280J451317K924681
40454h07152J659039k750050m134042O84279N649260L872071k279717m911426
40446c017738j599007K546751K705471r4800j645792j46296K016676J606675j024061
40437A347879k205818l07442J599514O47234j118471p18059K3771j777811l153643
40428e662846N15936N755370M338993l158614o808898k614811J755887P36392
40420e142591j37281M095946P009621J489480o451929o176041M11693K622758
40412b278344r53333j338125L899651N859112j05900n726755k930471L507997
$$ plain form
40404 -66168 4076196 3420303 619213 946614 3958683 4992126 2634391 610291 2477440
40395 2477440 7233862 10923598 11048983 8312248 4655291 1043671 -2236313 -4257977
40387 -4257977 -4015913 -2103026 -287210 752295 1822463 3174084 3719818 2709982
40379 2709982 577638 -2170885 -4942334 -5670572 -2204487 3844242 7554236 6784044
40371 6784044 4935997 5256196 5453289 1710196 -4322576 -7366986 -6362157 -5313906
40363 -5313906 -5988581 -5070059 -569387 3733296 3815625 1869670 2703087 5719030 5621330
40354 5621330 851926 -3820846 -4642828 -4218547 -6395141 -9326216 -8258240 -3646990
40346 -3646990 -1354596 -4237372 -8092475 -7924370 -4575444 -2204943 -1818363 -969674 1206696
$$ packed form
40404f6168M142364o55893k801090L27401L012069J033443k357735k024100J867149
40395B477440M756422L689736J25385k736735l656957l611620l279984k021664
40387d257977K42064J912887J815816J039505J070168J351621N45734j009836
40379B709982k132344k748523k771449p28238L466085O048729L709994p70192
40371F784044j848047L20199J97093l743093o032772l044410J004829J048251
40363e313906o74675R18522M500672M302683Q2329j945955Q33417L015943r7700
40354E621330m769404m672772q21982M24281k176594k931075J067976M611250
40346c646990K292394k882776l855103J68105L348926K370501L86580Q48689K176370
$$ plain form
40337 1206696 2174245 -442694 -5622467 -9773474 -9879255 -6216998 -2628953 -2914637 -6180328
40328 -6180328 -7778505 -6044607 -5012595 -7867159 -11153280 -9930448 -6009212 -5238997
40320 -5238997 -7913411 -8444047 -4836452 -1781668 -2536728 -3999074 -2794868 -662543
40312 -662543 -33041 793436 3603522 5580593 3663351 387810 166177 2092843 1790797
40303 1790797 -1061604 -2405246 -602422 1239700 189336 -3031366 -5953357 -6707390
40295 -6707390 -4418328 -248981 1999385 -583668 -5731414 -8202652 -6498538 -4355181
40287 -4355181 -4993962 -6985290 -7217995 -5589655 -4802235 -6521095 -9215872 -9822401 -7149571
40278 -7149571 -3376812 -1664954 -2540756 -3961628 -4750280 -5567954 -6092501 -4550607 -1568916
$$ packed form
40337A206696R67549k616939n179773m151007j05781L662257L588045k85684l265691
40328f180328j598177J733898J032012k854564l286121J222832L921236P70215
40320e238997k674414n30636L607595L054784p55060j462346J204206K132325
40312f62543O29502Q26477K810086J977071j917242l275541k21633J926666l02046
40303A790797k852401j343642J802824J842122j050364l220702k921991p54033
40295f707390K289062M169347K248366k583053n147746k471238J704114K143357
40287d355181o38781j991328k32705J628340P87420j718860k694777o06529K672830
40278g149571L772759J711858q75802j420872p88652q17674n24547J541894K981691
$$ plain form
40269 -1568916 -871806 -3593835 -5532218 -3509909 -784766 -1516175 -3336836 -1551304
40261 -1551304 1765436 243879 -5955889 -9530468 -7267064 -4467137 -5626735 -7503475
40253 -7503475 -5457095 -1162255 888368 627360 1104732 2418934 1727899 -1703669 -5202465
40244 -5202465 -6223955 -4864388 -3120743 -2919683 -4213356 -4681003 -2818212 -993908
40236 -993908 -2454621 -5335344 -4051415 2133101 6860902 5569124 1812886 1010429
40228 1010429 2311354 1543597 -1282003 -3002287 -3449360 -4830656 -6368469 -5233446
40220 -5233446 -2391687 -2315959 -6627570 -12310491 -16126908 -16643522 -12541789 -4074285 3733148
40211 3733148 4812132 -57918 -4167254 -4553468 -4916546 -7136465 -6624468 -311219 6324602
$$ packed form
40269a568916O97110k722029j938383K022309K725143p31409j820661J785532
40261a551304L316740j521557o199768l574579K263404K799927j159598j876740
40253g503475K046380M294840K050623k61008M77372J314202o91035l431568l498796
40244e202465j021490J359567J743645K01060j293673m67647J862791J824304
40236i93908j460713k880723J283929O184516M727801j291778l756238q02457
40228A010429J300925p67757k825600j720284m47073j381296j537813J135023
40220e233446K841759P5728m311611n682921l816417n16614M101733Q467504P807433
40211C733148J078984m870050m109336l86214l63078k219919N11997O313249O635821
$$ plain form
40202 6324602 5982460 -184696 -4729512 -4088382 -1049581 1516867 3641621 5033771
40194 5033771 4141029 1567369 372887 1634487 2965589 2593672 1811147 2022551 2197045
40185 2197045 981049 -773917 -1111820 940881 5062816 9449131 10627827 6342819
40177 6342819 -470444 -3733714 -1636895 1318105 1340062 270225 542559 -299556 -5054439
40168 -5054439 -10170070 -9867212 -5234583 -2608633 -3469933 -3038905 266877 1406353 -2568860
40159 -2568860 -7147024 -7762658 -6737783 -7918540 -9457323 -7704960 -4174297 -2350364
40151 -2350364 -978317 2572239 5028470 1311325 -5358653 -6047057 555704 5695427
40143 5695427 3622093 -764430 -1022895 1087614 136008 -4045904 -7581706 -8894199
$$ packed form
40202F324602l42142o167156m544816O41130L038801K566448K124754J392150
40194E033771q92742k573660j194482J261600J331102l71917p82525K11404J74494
40185B197045j215996j754966l37903K052701M121935M386315J178696m285008
40177F342819o813263l263270K096819K955000K1957j069837K72334q42115m754883
40168e054439n115631L02858M632629K625950q61300M31028L305782J139476l975213
40159b568860m578164o15634J024875j180757j538783J752363L530663J823933
40151b350364J372047L550556K456231l717145o669978o88404O602761N139723
40143E695427k073334m386523k58465K110509r51606m181912l535802j312493
$$ plain form
40135 -8894199 -8484537 -5432381 515322 5605509 6070309 3949734 4065844 6468360 6930600
40126 6930600 4286353 2069725 2474610 3410392 2756895 1591824 1476865 1500284 -143522
40117 -143522 -3406862 -6338675 -6614446 -3135480 2312460 5504891 4033030 544947
40109 544947 -777800 -185729 -1396418 -5033558 -7287909 -5969994 -3669181 -3066638 -3054160
40100 -3054160 -2209651 -2560434 -6010910 -9379000 -7533456 -897303 4259232 3678012 5609
40091 5609 -1625873 -475171 -335554 -3712709 -8229479 -9620294 -7025748 -3785372 -3068954
40082 -3068954 -4369264 -5240197 -5020561 -4858240 -4752750 -3174199 -102135 1892354 825231
40073 825231 -2180949 -4891196 -6833270 -8416171 -8577318 -5836515 -1443266 881464
$$ packed form
40135h894199M09662L052156N947703N090187M64800k120575J16110K402516M62240
40126F930600k644247k216628M04885R35782o53497j165071j14959K3419j643806
40117a43522l263340k931813k75771L478966N447940L192431j471861l488083
40109E44947j322747N92071j210689l637140k254351J317915K300813O02543J2478
40100c054160Q44509l50783l450476l368090J845544O636153N156535n81220l672403
40091E609j631482J150702J39617l377155m516770j390815K594546L240376P16418
40082c068954j300310q70933K19636J62321J05490J578551L072064J994489j067123
40073H25231l006180k710247j942074j582901j61147K740803M393249K324730
$$ plain form
40065 881464 -942124 -4945367 -7480297 -6862568 -4045285 -932042 774015 -98895 -3225455
40056 -3225455 -5996404 -5320122 -1168562 2735680 3013928 650944 -661597 313255 1117690
40047 1117690 -104614 -1608110 -986765 767902 545485 -2367625 -5378839 -6099696 -4824053
40038 -4824053 -3259140 -2365401 -1958134 -1478936 -824921 -759025 -1973219 -3272361 -2071283
40029 -2071283 1925704 5016147 3681707 -583634 -3248195 -2793403 -1726724 -1829368
40021 -1829368 -1879059 -694702 894242 2314576 4471860 7161039 7974073 5678537 2471438
40012 2471438 1013366 1130637 1136266 474005 -704863 -2655927 -4769460 -4903739 -2099138
40003 -2099138 1246016 1637113 -2037004 -8177143 -13945036 -16249348 -13655909 -8610643
$$ packed form
40065H81464j823588m003243k534930O17729K817283L113243J706057q72910l126560
40056c225455k770949O76282M151560L904242K78248k362984j312541R74852Q04435
40047A117690j222304j503496O21345J754667k22417k913110l011214p20857J275643
40038d824053J564913Q93739M07267M79198O54015O5896j214194j299142J201078
40029b071283L996987L090443j334440m265341k664561M54792J066679j02644
40021a829368m9691J184357J588944J420334K157284K689179Q13034k295536l207099
40012B471438j458072J17271N629o62261j178868j951064k113533j34279K804601
40003b099138L345154L91097l674117o140139n767893k304312K593439N045266
$$ plain form
39995 -8610643 -5337027 -4425045 -2686206 360219 433821 -4169172 -7896622 -5205316 1262433
39986 1262433 5008001 4908317 4199323 3140590 -234720 -3783252 -3277270 -246211 -221822
39977 -221822 -3110763 -3397093 -791719 -1691134 -7384683 -9981110 -4846424 1265329 845431
39968 845431 -2905515 -2884002 -304613 -1235734 -5152610 -6423443 -4868293 -5321638 -7393079
39959 -7393079 -5130820 1954753 6293679 3489398 -1200789 -1253751 2314752 4572240
39951 4572240 4090875 2418943 94075 -2394784 -2623125 493058 3487563 2309332
39943 2309332 -1972121 -4920933 -4942755 -4147071 -3638905 -1694219 2588455 6558489 6622870
39934 6622870 2652294 -1362052 -1101266 3915330 10097792 13526785 13169412 10188206
$$ packed form
39995h610643L273616R11982J738839L046425P3602m602993l727450K691306O467749
39986A262433L745568r9684p08994j058733l375310l548532N05982L031059K4389
39977b21822k888941k86330K605374q99415n693549k596427N134686O111753m19898
39968H45431l750946K1513K579389r31121l916876j270833J555150m53345k071441
39959g393079K262259P085573M338926k804281m690187n2962L568503K257488
39951D572240m81365j671932k324868k488859k28341L116183K994505j178231
39943B309332m281453k948812k1822P95684N08166J944686M282674L970034O4381
39934F622870l970576m014346K60786N016596O182462L428993l57373k981206
$$ plain form
39926 10188206 5720664 913024 -2280915 -2914279 -3021922 -5089796 -7943956 -8138376
39918 -8138376 -5284848 -2638516 -2098469 -2179864 -1570879 -900928 32719 2707111 5995017
39909 5995017 6101009 2573730 164671 1923735 4615527 4359734 2645598 2503161 2543503
39900 2543503 -19748 -3395980 -3893189 -2546559 -3457653 -6813537 -9000271 -8829991 -8352878
39891 -8352878 -7984509 -6059110 -3069659 -1364156 -780008 469871 998680 -2054472 -6658158
39882 -6658158 -7497372 -4590327 -3638949 -6178704 -6292783 -213978 7052262 8812743 5387371
39873 5387371 1590258 -129743 131850 2511494 5966294 7085996 4095474 -519609
39865 -519609 -3932553 -5867555 -5290321 286803 8188763 9313980 -202225 -10901825
$$ packed form
39926A0188206m467542m807640l193939o33364j07643k067874k854160j94420
39918h138376K853528K646332N40047q1395O08985O69951R33647K674392L287906
39909E995017J05992l527279k409059J759064K691792k55793j714136j42437M0342
39900B543503k563251l376232m97209J346630r11094l355884k186734J70280M77113
39891h352878L68369J925399K989451J705503N84148J249879N28809l053152m603686
39882f658158q39214K907045R51378k539755j14079O078805P266240J760481l425372
39873E387371l797113j720001K61593K379644L454800J119702k990522m615083
39865e19609l412944j935002N77234N577124P901960J125217r516205j0699600
$$ plain form
39857 -10901825 -11018502 -2021200 4799356 4577936 2791886 3985745 5920127 6155596
39849 6155596 6121288 6189125 3848421 -386435 -1753751 897147 2141154 -1378134 -5008652
39840 -5008652 -3341295 1414056 3444629 1997028 571169 -32476 -2346019 -6833306
39832 -6833306 -10396531 -10309683 -6676540 -1398171 2928063 4034251 2328005 1229340
39824 1229340 2988934 5521426 5670650 3816662 2296703 1031288 -1477000 -3916172
39816 -3916172 -3331414 -528599 13637 -3301153 -6543379 -5967333 -3101948 -1664611 -1946460
39807 -1946460 -1449747 243941 687506 -1232910 -3173825 -2559637 -20977 1939580 2511667
39798 2511667 2920150 3655015 3476731 1724181 -214162 -935647 -1083352 -1698336 -1631731
$$ packed form
39857a0901825j16677Q997302O820556k21420j786050J193859J934382K35469
39849F155596l4308O7837k340704m234856j367316K650898J244007l519288l630518
39840e008652J667357M755351K030573j447601j425859o03645k313543m487287
39832f833306l563225Q6848L633143N278369M326234J106188j706246j098665
39824A229340J759594K532492J49224j853988j519959j265415k508288k439172
39816c916172N84758K802815N42236l314790l242226N76046K865385J437337k81849
39807a946460M96713J693688M43565j920416j940915O14188K538660J960557N72087
39798B511667M08483P34865j78284j752550j938343p21485j47705o14984O6605
$$ plain form
39789 -1631731 1062360 5389949 7534807 5429754 1306543 -1352148 -1867731 -2051040
39781 -2051040 -2911480 -3280938 -1607459 1883185 5109280 6011485 4451725 2133685 682462
39772 682462 401612 1031087 2451828 3876914 3899951 2748930 2813927 4945488 6131365
39763 6131365 3770476 395466 79738 1544717 143816 -3637071 -4001647 480048
39755 480048 3657209 1456699 -1573779 -388194 1351985 -2942148 -11237209 -14768029
39747 -14768029 -10445675 -4324926 -2141545 -2538149 -1422224 1818353 4770434 5430467
39739 5430467 3499622 592800 -287212 1954132 3860711 1385078 -3701479 -5535772
39731 -5535772 -2695742 -234311 -1750444 -4266741 -3618872 -654549 1405541 2319038
$$ packed form
39789a631731K694091M327589K144858k105053m123211k658691n15583j83309
39781b051040q60440l69458J673479L490644L226095R02205j559760k318040j451223
39772F82462k80850O29475J420741J425086K3037j151021O4997K131561J185877
39763F131365k360889l375010l15728J464979j400901l780887l64576M481695
39755D80048L177161k200510l030478J185585J740179m294133q295061l530820
39747a4768029M322354O120749K183381l96604J115925L240577K952081O60033
39739E430467j930845k906822q80012K241344J906579k475633n086557j834293
39731e535772K840030K461431j516133k516297O47869K964323K060090R13497
$$ plain form
39723 2319038 3545531 4137727 2148392 -1216490 -2713874 -1729303 -564811 -434275 -200428
39714 -200428 864439 1725013 1364548 -124382 -2417253 -5023291 -6378792 -4993091 -2101874
39705 -2101874 -1281099 -4241296 -8159038 -8460068 -3867806 2234189 5450731 4722658 2708402
39696 2708402 2233114 3189360 3318406 1317933 -1732571 -3729782 -3485564 -1590526 -86657
39687 -86657 -685237 -2387317 -1916671 1947212 5739157 5419310 2000431 -236526 -393157
39678 -393157 -1339029 -3118784 -1474131 4558157 8672440 5289995 -2068156 -5487622
39670 -5487622 -3488154 -1819499 -4445795 -8956967 -11167554 -9752660 -5531940 -65347
39662 -65347 3966716 4359265 2474210 1823929 2831196 2218526 -1440975 -5081851 -5674986
$$ packed form
39723B319038J226493N92196j989335l364882j497384R84571J164492J30536K33847
39714b00428J064867Q60574l60465j488930k292871k606038j355501J385701K891217
39705b101874Q20775k960197l917742l01030M592262O101995L216542p28073k014256
39696B708402m75288R56246J29046k000473l050504j997211K44218J895038J503869
39687h6657n98580j702080M70646L863883L791945l19847l418879k236957j56631
39678c93157r45872j779755J644653O032288M114283l382445p358151l419466
39670e487622J999468J668655k626296m511172k210587J414894M220720N466593
39662f5347M032063L92549j885055o50281J007267o12670l659501l640876n93135
$$ plain form
39653 -5674986 -4142247 -2668386 -1053355 1660806 4243764 4784402 3656110 2566436
39645 2566436 1884912 1033645 296084 152258 -26540 -622252 -373026 1518311 3166705
39636 3166705 2400225 362524 1360 1607213 2659793 1785790 -2768 -1946551 -4321022
39627 -4321022 -6159010 -5439582 -2755443 -1761716 -4052460 -6218354 -4603796 -958825
39619 -958825 -42115 -2586510 -4389701 -2893535 -1182634 -3376468 -8297533 -10617778
39611 -10617778 -7674979 -2444939 731858 1064307 645010 733724 979801 1609627 3768560
39602 3768560 7102773 9056348 7802588 4516747 1461951 -1038982 -4144803 -7708126
39594 -7708126 -9700217 -8543228 -4999604 -1711580 -1353641 -4529289 -8621467 -9740137
$$ packed form
39653e674986J532739J473861J615031K714161K582958N40638j128292j089674
39645B566436o81524q51267p37561j43826j78798n95712K49226J891337J648394
39636C166705p66480k037701l61164J605853J052580q74003j788558j943783k374471
39627d321022j837988P19428K684139R93727k290744k165894J614558L644971
39619i58825R16710k544395j803191J496166J710901k193834m921065k320245
39611a0617778K942799N230040L176797L32449m19297Q8714K46077O29826K158933
39602C768560L334213J953575j253760l285841l054796k500933l105821l563323
39594g708126j992091J156989L543624L288024L57939l175648m092178j118670
$$ plain form
39586 -9740137 -7242752 -5249881 -7520556 -11639653 -11373403 -5059112 1675198 3023294
39578 3023294 -84769 -2513888 -2017010 -591938 -78612 -172357 -1010488 -4220144 -9772461
39569 -9772461 -14182019 -14068093 -10403019 -7226825 -6605311 -6741224 -5240602 -2523205 -993736
39560 -993736 -1750187 -3345306 -3726465 -2523400 -1140558 -1043225 -2220583 -3183827 -2487960
39551 -2487960 -383187 1457551 2345652 3931062 7676529 11393832 10826278 5612666
39543 5612666 1020839 1438991 4229118 3412405 -1698928 -5692528 -5044409 -2587916 -2355751
39534 -2355751 -3780092 -3907602 -2714142 -2834070 -5358994 -8812992 -11469576 -12293339 -10520245
39525 -10520245 -6786359 -3927234 -4175344 -6105298 -6678636 -5616480 -5111617 -5718929 -5487633
$$ packed form
39586i740137K497385J992871k270675m119097K66250O314291O734310J348096
39578C023294l108063k429119M96878J425072N13326r3745q38131l209656n552317
39569i772461m409558J13926L665074L176194O21514j35913J500622K717397J529469
39560i93736p56451j595119l81159J203065J382842R7333j177358r63244O95867
39551b487960K104773J840738Q88101J585410L745467L717303n67554n213612
39543E612666m591827M18152K790127q16713n111333l993600O48119K456493K32165
39534b355751j424341j27510J193460j19928k524924l453998k656584q23763J773094
39525a0520245L733886K859125k48110j929954n73338J062156N04863o07312K31296
$$ plain form
39516 -5487633 -3271839 -281017 1847346 2156200 -276178 -5294400 -9972373 -11051311
39508 -11051311 -9391400 -8751342 -9668286 -8407559 -3340158 1630515 2475597 524042
39500 524042 -492666 -163966 -662779 -2105040 -2255742 -145217 2819441 4770984 4265193
39491 4265193 475842 -4911278 -7283375 -3854996 1786287 3353292 77895 -2338851
39483 -2338851 183264 4633699 5598536 2659451 13548 -44939 185851 -1785242 -4463475
39474 -4463475 -4846188 -3560100 -4198961 -7209549 -8161135 -4571261 -1158485 -3585483 -8677415
39465 -8677415 -7263695 2289287 9990351 7208439 -1794562 -6612062 -4782225 -2430176
39457 -2430176 -3207738 -4293857 -3693341 -4234989 -7634151 -10134340 -7889747 -3123298 -1123590
$$ packed form
39516e487633K215794K990822K128363L08854k432378n018222m677973j078938
39508a1051311J659911O40058r16944J260727N067401M970673Q45082j951555
39500E24042j016708L28700m98813j442261j50702K110525K964658J951543n05791
39491D265193l789351n387120k372097L428379N641283J567005l275397k416746
39483b338851K522115M450435R64837k939085k645903n8487K30790j971093k678233
39474d463475l82713J286088o38861l010588r51586L589874L412776k426998n091932
39465h677415J413720R552982P701064k781912r003001m817500J829837K352049
39457b430176p77562j086119O00516n41648l399162k500189K244593M766449J999708
$$ plain form
39448 -1123590 -3260951 -6338215 -7545472 -6942740 -5432296 -2968818 463554 3490488
39440 3490488 4090162 1864364 -826682 -886951 1954480 4636859 4580930 2601684 719413
39431 719413 -1097861 -3653288 -5588806 -4984617 -3032137 -2615993 -3669567 -3722996 -2973524
39422 -2973524 -4433577 -8213429 -10139128 -7840067 -4089418 -1788311 313367 3746012
39414 3746012 5958926 4204137 1205197 1913850 5605578 6215975 1127586 -4775384
39406 -4775384 -5761232 -2660930 -640726 -1398854 -1397458 1744566 4733991 3199923 -1315024
39397 -1315024 -3014203 -124560 3121774 3869139 4699683 7261188 7325831 1755886 -4033965
39388 -4033965 -2996388 2021769 2259336 -2782980 -4811138 -977672 1680595 -1059043
$$ packed form
39448a123590k137361l077264j207257O02732J510444K463478L432372L026934
39440C490488N99674k225798k691046o0269K841431K682379n5929j979246j882271
39431G19413j817274k555427j935518O04189J952480M16144j053574n3429P49472
39422b973524j460053l779852j925699K299061L750649K301107K101678L432645
39414C746012K212914j754789k998940P08653L691728O10397n088389n902970
39406d775384r85848L100302K020204p58128J396L142024K989425j534068m514947
39397a315024j699179K889643L246334P47365Q30544K561505O4643n569945n789851
39388d033965J037577N018157K37567n042316k028158L833466K658267k739638
$$ plain form
39380 -1059043 -3701344 -1934765 -939337 -5766896 -11632746 -12144373 -10313338 -12109785
39372 -12109785 -14861384 -12446293 -7736107 -8603655 -13829374 -14314277 -7843355 -1806035
39364 -1806035 -499764 -208029 1283002 572633 -2714953 -2734814 2643844 6981586 5270851
39355 5270851 1383304 348741 232182 -2317297 -4671361 -3139322 -382614 -1123402
39347 -1123402 -4246281 -5585104 -5192927 -5402564 -4721192 -627365 3675772 2509855 -3089117
39338 -3089117 -6056069 -3112361 2037954 5385467 6586432 5770915 2395043 -1321313
39330 -1321313 -1399402 1484496 1803776 -2280066 -5583290 -4480796 -3398466 -7398173 -12477248
39321 -12477248 -10464417 -2030187 2870025 -1179639 -7642579 -7888398 -2877549 321054
$$ packed form
39380a059043k642301J766579R95428m827559n865850n11627J831035j796447
39372a2109785k751599K415091M710186q67548n225719m84903O470922O037320
39364a806035J306271K91735J491031p10369l287586j9861N378658M337742j710735
39355E270851l887547j034563j16559k549479k354064J532039K756708p40788
39347a123402l122879j338823L92177k09637O81372M093827M303137j165917n598972
39338c089117k966952K943708N150315L347513J200965q15517l375872l716356
39330a321313p8089K883898L19280m083842l303224J102494J082330l999707n079075
39321a2477248K012831Q434230M900212m049664o462940k45819N010849L198603
$$ plain form
39313 321054 -143652 26450 2074616 1480275 -3712752 -8131871 -6443849 -1031199 2054551
39304 2054551 1446066 4624 -1354223 -3856706 -6187598 -5276366 -1877487 -439510
39296 -439510 -2783310 -6202561 -8321221 -9399955 -9170926 -6163960 -1527651 1005230
39288 1005230 587659 392231 1788700 2145409 363095 -541167 934638 1791186 608095
39279 608095 1278393 6090973 10036013 7787101 2423110 743179 2780139 2899834 -335407
39270 -335407 -2539579 -1529895 -352585 -1293687 -2499708 -2161425 -1444853 -1517916 -1417997
39261 -1417997 -469202 232423 -119650 -1145237 -2833912 -5082635 -5721071 -2640719 1833909
39252 1833909 2727254 -699381 -4028353 -4743329 -5486173 -8021123 -8668900 -3756964 3606791
$$ packed form
39313C21054m64706J70102K048166n94341n193027m419119J688022N412650L085750
39304B054551o08485j441442j358847k502483k330892R11232L398879J437977
39296d39510k343800l419251k118660j078734K29029L006966M636309K532881
39288A005230m17571j95428J396469L56709j782314r04262J475805Q56548j183091
39279F08095O70298M812580L945040k248912n363991j679931K036960J19695l235241
39270c35407k204172J009684J177310r41102j206021L38283P16572p3063R9919
39261a417997R48795P01625l52073j025587j688675k248723o38436L080352M474628
39252A833909Q93345l426635l328972p14976p42844k534950o47777M911936P363755
$$ plain form
39243 3606791 6890486 4792675 2152402 2454999 3491601 1678148 -2402490 -5124367
39235 -5124367 -4991411 -4034674 -4032601 -3857682 -2016411 141085 408871 -110856 1619904
39226 1619904 4904803 5122868 711454 -3797629 -4384304 -3139456 -3441379 -3440656 141073
39217 141073 4474393 3624215 -1764481 -4550983 -1538318 2443789 2578076 406473 -542192
39208 -542192 -570639 -1839959 -4080603 -5476908 -5404671 -3998117 -1296955 1514691 2537865
39199 2537865 2056766 2092414 2245758 -62469 -3961851 -4611116 -726594 2350174 623085
39190 623085 -2269776 -1298318 1606297 989597 -3396251 -7204896 -8775814 -9837788 -10238202
39181 -10238202 -8114780 -5045491 -5021979 -7553338 -7300979 -2088998 3568424 4902728
$$ packed form
39243C606791L283695k097811k640273L02597J036602j813453m080638k721877
39235e124367J32956R56737K073J74919J841271K157496K67786n19727J730760
39226A619904L284899K18065m411414m509083n86675J244848l01923P23L581729
39217A41073M333320q50178n388696k786502L012665L982107J34287k171603r48665
39208e42192k8447j269320k240644j396305P2237J406554K701162K811646J023174
39199B537865m81099L5648J53344k308227l899382o49265L884522L076768j727089
39190F23085k892861R71458K904615o16700m385848l808645j570918j061974m00414
39181a0238202K123422L069289K3512k531359K52359N211981N657422J334304
$$ plain form
39173 4902728 2638415 95156 -1640910 -2925216 -3012899 -1411019 104764 -570753 -3099246
39164 -3099246 -5564068 -6678910 -5780322 -2617809 1025234 1594292 -1809873 -4837733
39156 -4837733 -2688495 3310035 6951526 4907430 370707 -1609755 146888 3024034
39148 3024034 4239996 2819408 -446968 -3158173 -2516750 1615703 5486595 5279351
39140 5279351 1853693 -481297 154991 1231031 431318 -668408 370310 2425582
39132 2425582 2448417 438513 -401253 1533612 4121421 4779786 3413731 1095957 -2029989
39123 -2029989 -5850363 -8582076 -7923287 -4005140 -228938 -521290 -5432125 -11104924
39115 -11104924 -12948879 -10461475 -7088548 -5092939 -3105910 -157073 1182069 -918871
$$ packed form
39173D902728k264313k543259j736066j284306q7683J601880J515783o75517k528493
39164c099246k464822j114842Q98588L162513L643043N69058l404165l027860
39156d837733K149238N998530L641491k044096m536723j980462J756643K877146
39148C024034J215962j420588l266376k711205O41423M132453L870892k07244
39140E279351l425658k334990O36288J076040p99713j099726J038718K055272
39132B425582K2835k009904q39766J934865K587809O58365j366055k317774l125946
39123b029989l820374k731713O58789L918147L776202k92352m910835n672799
39115a1104924j843955K487404L372927J995609J987029K948837J339142k100940
$$ plain form
39107 -918871 -2865696 -247428 4251886 3395537 -3946391 -10594119 -11029307 -7959250 -6408084
39098 -6408084 -6508590 -5781956 -4296935 -3497619 -3099008 -2680296 -3239643 -4002546 -1556838
39089 -1556838 4014964 6478196 2013976 -3611770 -2804952 2202928 2942779 -2074225
39081 -2074225 -6064732 -5594422 -4862035 -6672922 -7244759 -3607692 479858 579874 -1519386
39072 -1519386 -1606297 257389 1511577 2332280 4273920 5961941 4813789 1621563 -818249
39063 -818249 -2511293 -5416073 -8408777 -7697828 -2996888 734576 -393213 -3877098
39055 -3877098 -4063781 793794 6827723 9278044 7052454 2437525 -2055285 -5297151
39047 -5297151 -6707348 -5710220 -2862291 -286985 450657 351115 1442445 3662571 5020723
$$ packed form
39107i18871j946825K618268M499314q56349p341928o647728m35188L070057J551166
39098f408084j00506P26634J485021P99316L98611M18712n59347p62903K445708
39089a556838N571802K463232m464220n625746Q06818N007880P39851n017004
39081b074225l990507M70310P32387j810887n71837L637067M087550J00016k099260
39072a519386q6911J863686J254188Q20703J941640J688021j148152l192226k439812
39063h18249j693044k904780k992704P10949M700940L731464j127789l483885
39055c877098j86683M857575O033929K450321k225590m614929m492810l241866
39047e297151j410197R97128K847929K575306P37642r9542J091330K220126J358152
$$ plain form
39038 5020723 4803928 4592938 5463589 6040311 4581699 1749623 -161897 -256936 -111819
39029 -111819 -1752678 -5122035 -7836828 -7652407 -5117476 -3012769 -2736944 -2439209 121427
39020 121427 4111799 6889100 7760920 8052996 7961917 6260336 3317855 1363573 855592
39011 855592 -492216 -3627771 -5862523 -4723169 -1785863 -108788 370225 1790677
39003 1790677 3656471 2642362 -2266376 -7182348 -7556678 -3634984 103223 484606
38995 484606 -1270422 -2570559 -3636912 -6349837 -9556121 -8960609 -3289541 2361448
38987 2361448 2466883 -1409200 -2859811 326839 3686973 3171253 392705 -1069588
38979 -1069588 -939183 -1056279 -1630174 -1821816 -2349039 -4408032 -6899333 -7492586 -6059857
$$ packed form
39038E020723k16795k10990Q70651N76722j458612k832076j911520r5039J45117
39029a11819j640859l369357k714793J84421K534931K104707K75825K97735K560636
39020A21427L990372K777301Q71820K92076r1079j701581k942481j954282n07981
39011H55592j347808l135555k234752J139354K937306J677075M79013J420452
39003A790677J865794j014109m908738m915972l74330L921694L738207L81383
38995D84606j755028j300137j066353k712925l206284N95512N671068N650989
38987B361448J05435l876083j450611L186650L360134n15720k778548j462293
38979a069588J30405j17096n73895j91642n27223k058993k491301n93253J432729
$$ plain form
38970 -6059857 -4664021 -4260115 -3635181 -2013001 -924910 -2558918 -6969780 -11518268
38962 -11518268 -12965870 -10146311 -4774098 265958 3108353 3370296 1634977 -387918
38954 -387918 -306331 2393623 4894115 4349969 1969811 999510 1242250 -518087 -4321043
38945 -4321043 -5851273 -3223725 -592381 -2100290 -5960067 -8096261 -8439050 -9308982
38937 -9308982 -9962383 -7620507 -2859187 548545 965756 301771 230592 546598 1307050
38928 1307050 3115910 4859140 4349859 1919184 615889 2105151 4689242 5897968
38920 5897968 4918651 2302827 -475820 -1197173 826745 2654657 735295 -3790343
38912 -3790343 -5893680 -3288910 939971 3151095 3108489 1689294 -1743723 -6998095
$$ packed form
38970f059857J395836M03906O24934J622180J088091j634008m410862m548488
38962a1518268j447602K819559N372213N040056K842395K61943j735319k022895
38954c87918Q1587K699954K500492n44146k380158r70301K42740j760337l802956
38945d321043j530230K627548K631344j507909l859777k136194l42789q69932
38937i308982o53401K341876M761320L407732M17211o63985p1179L16006P60452
38928A307050J808860J743230n09281k430675j303295J489262K584091J208726
38920E897968r79317k615824k778647p21353K023918J827912j919362m525638
38912c790343k103337K604770M228881K211124m2606j419195l433017n254372
$$ plain form
38904 -6998095 -10758132 -9868993 -5608364 -2054731 -1088956 -1293160 -1103837 -750089 -1092430
38895 -1092430 -2268653 -3765713 -4855209 -4906174 -3866521 -2305191 -755392 525038
38887 525038 1232380 1482833 2480844 5066703 7423103 6466421 2375997 -717063 -124898
38878 -124898 1786818 1660405 295676 234813 144163 -3431825 -8864237 -9493138 -3039797
38869 -3039797 3705035 3423469 -1824283 -4145199 -1396856 686415 -1708843 -4599188
38861 -4599188 -3045259 841650 1337751 -2172246 -4997216 -4619490 -3396805 -3528483 -3886586
38852 -3886586 -3105910 -1951128 -1004654 522448 2024204 1223050 -1278043 -1223267 2441745
38843 2441745 4021102 -1167521 -8839196 -11157600 -7940671 -6115975 -8706918 -11064574
$$ packed form
38904f998095l760037Q89139M260629L553633R65775k04204J89323L53748l42341
38895a092430j176223j497060j089496n0965J039653J561330J549799J280430
38887E25038P07342K50453R98011K585859K356400r56682m090424l093060N92165
38878a24898J911716j26413j364729o0863r0650l575988n432412o28901O453341
38869c039797O744832k81566n247752k320916K748343K083271k395258k890345
38861d599188J553929L886909M96101l509997k824970L77726J222685j31678l58103
38852c886586P80676J154782R46474J527102J501756q01154k501093N4776L665012
38843B441745J579357n188623p671675k318404L216929J824696k590943k357656
$$ plain form
38835 -11064574 -9145064 -5304143 -3240605 -2237707 136560 3311250 5153875 5428463
38827 5428463 4811158 2855583 -200155 -1857011 -568342 1407971 1327371 296254 1084442
38818 1084442 3169480 3596775 1951377 797235 1210124 1251899 -509830 -2809834 -3991851
38809 -3991851 -4265897 -4517019 -4502046 -3376221 -1023612 1854098 4170232 4604903 2314904
38800 2314904 -1866890 -5506963 -6421242 -4463157 -1554884 -16491 -475162 -1278378 -503547
38791 -503547 1496475 2542257 1540994 -672256 -3484816 -6927301 -9019313 -6035663
38783 -6035663 1915518 8411271 7669716 2123295 -1312078 -1120945 -1869490 -5184745 -6531553
38774 -6531553 -3235938 162770 -1256797 -4991918 -5159347 -1328296 2130258 3648432
$$ packed form
38835a1064574J919510L840921K063538J002898K374267L174690J842625K74588
38827E428463o17305j955575l055738j656856J288669J976313q0600j031117P88188
38818A084442K085038M27295j645398j154142M12889M1775j761729k300004j182017
38809c991851k74046k51122J4973J125825K352609K877710K316134M34671k289999
38800B314904m181794l640073r14279J958085K908273J538393m58671q03216P74831
38791e03547K000022J045782j001263k213250k812560l442485k092012K983650
38783f035663P951181O495753p41555n546421l435373J91133p48545l315255j346808
38774f531553L295615L398708j419567l735121j67429L831051L458554J518174
$$ plain form
38766 3648432 5545310 7977906 7734076 4193075 1303970 1529354 2205647 550583 -1595073
38757 -1595073 -1284021 531172 1328855 1868935 4394147 7469267 7186052 3316274 197989
38748 197989 900540 3788418 5580076 4950629 2480834 -184409 -536425 2543065 6054599
38739 6054599 5482482 951812 -2595312 -2468577 -1507807 -2378058 -2956057 -790891 1660392
38730 1660392 793272 -1854922 -2008023 447651 2010838 1826005 2070409 2574908 737210
38721 737210 -2633227 -3046096 463208 3113826 1786669 -204656 1024775 3593573
38713 3593573 3437417 956318 -308862 615396 2012735 3409244 5425598 6836721
38705 6836721 5960976 4360406 5047125 7251910 7230054 4580881 3282633 5151114 6607297
$$ packed form
38766C648432J896878K432596k43830l541001k889105K25384O76293j655064k145656
38757a595073L11052J815193P97683N40080K525212L075120k83215l869778l118285
38748A97989P02551K887878J791658o29447k469795k665243l52016L079490L511534
38739F054599n72117m530670l547124J26735R60770q70251n77999K165166K451283
38730A660392q67120k648194j53101K455674J563187j84833K44404N04499j837698
38721G37210l370437m12869L509304K650618j327157j991325J229431K568798
38713C593573j56156k481099j265180R24258J397339J396509K016354J411123
38705F836721q75745j600570O86719K204785k1856k649173j298248J868481J456183
$$ plain form
38696 6607297 4353892 541982 -1039641 -1029098 -2552363 -4868811 -3792909 1304286
38688 1304286 5394917 4484534 856908 -1099660 -1525224 -3687705 -7422163 -8690258
38680 -8690258 -6223061 -4108566 -5544040 -7713969 -6344684 -2707484 -1705529 -4262369
38672 -4262369 -6339071 -5552999 -4042762 -3508391 -1958548 1960769 5119367 4108337
38664 4108337 956600 576018 3467285 4906327 1755606 -3124443 -4624082 -1651152
38656 -1651152 1865443 1593579 -2587027 -6709561 -7126265 -4143830 -719745 1504070
38648 1504070 2979331 3495727 1722773 -1455090 -2335464 505548 3159154 1610993
38640 1610993 -2063002 -2732458 -257229 188757 -3874092 -8464020 -9044159 -6395030 -4047507
$$ packed form
38696F607297k253405l811910j581623J0543j523265k316448J075902N097195
38688A304286M090631r10383l627626j956568m25564k162481l734458j268095
38680h690258K467197K114495j435474k169929J369285L637200J001955k556840
38672d262369k076702P86072J510237N34371J549843L919317L158598j011030
38664D108337l151737l80582K891267J439042l150721m880049j499639K972930
38656a651152L516595k71864m180606m122534m16704K982435L424085K223815
38648A504070J475261N16396j772954l177863q80374K841012K653606j548161
38640A610993l673995o69456K475229M45986m062849m589928n80139K649129K347523
$$ plain form
38631 -4047507 -2781944 -959776 1298714 1703409 -633938 -3856600 -5971289 -6800628
38623 -6800628 -6732895 -5289796 -2179087 1213375 2867654 2615057 2411787 3587572 4571581
38614 4571581 2414987 -3331726 -9138781 -10582089 -6743941 -1111340 1878632 909676
38606 909676 -1581495 -2542465 -1688052 -1375471 -3190067 -5560948 -5637000 -3100903 -905941
38597 -905941 -1967729 -5945877 -9652800 -10159711 -7360385 -3852938 -2263691 -2569915 -2711551
38588 -2711551 -2027124 -2453977 -5148254 -7859541 -8012074 -6767445 -6827827 -7429764 -5595833
38579 -5595833 -1875072 -146286 -1350340 -2497521 -2982167 -6097650 -11820484 -14125159
38571 -14125159 -9701155 -4021321 -3351530 -5276998 -3610107 894926 2241311 -412788
$$ packed form
38631d047507J265563J822168K258490M04695k337347l222662k114689q29339
38623f800628O7733J443099L110709L392462J654279k52597k03270J175785R84009
38614D571581k156594n746713n807055j443308L838148N632601K989972r68956
38606I09676k491171r60970Q54413L12581j814596k370881p6052K536097K194962
38597i05941j061788l978148l706923n06911K799326L507447J589247l06224j41636
38588b711551O84427m26853k694277k711287j52533J244629o0382o01937J833931
38579e595833L720761J728786j204054j147181m84646l115483n722834k304675
38571a4125159M424004N679834O69791j925468J666891M505033J346385k654099
$$ plain form
38563 -412788 -1848104 119382 2000157 1765660 1772229 3064613 3013999 748855 -571452
38554 -571452 787214 2302099 1936337 986176 258048 -1588115 -3746380 -2688292 1424874
38545 1424874 3279656 703730 -1267733 1071934 3150676 -556932 -6974514 -8926764
38537 -8926764 -5821916 -2785754 -1457935 842571 3628470 2492872 -3089749 -7534611
38529 -7534611 -6720379 -2945291 -431233 -76969 -648956 -1551921 -2275650 -1865702 -674790
38520 -674790 -311940 -751793 -70044 1942947 2766381 1082287 -1027191 -1403862 -804848
38511 -804848 -839528 -1266695 -1277935 -1398767 -2034086 -1874829 82620 2303211 2581981 1062217
38501 1062217 -491848 -1334814 -1670936 -1009898 1041586 2951000 2787842 1580254 2544238
$$ packed form
38563d12788j435316J967486J880775k34497O569J292384n0614k265144j320307
38554e71452J358666J514885l65762r50161p28128j846163k158265J058088M113166
38545A424874J854782k575926j971463K339667K078742l707608o417582j952250
38537h926764L104848L036162J327819K300506K785899j135598n582621m444862
38529g534611Q14232L775088K514058L54264n71987r02965p23729M09948J190912
38520f74790L62850m39853O81749K012991Q23434j684094k109478l76671N99014
38511h04848l4680m27167j1240j20832o35319J59257J957449K220591K78770j519764
38501A062217j554065q42966l36122O61038K051484J909414j63158j207588R63984
$$ plain form
38492 2544238 6218357 8770119 6750826 1797600 -1523722 -1549209 -716273 -1224048 -2412750
38483 -2412750 -3346153 -4989192 -7451113 -7455674 -2252210 4979476 7803934 4837398 1228766
38474 1228766 838906 1450147 12998 -1918420 -1850373 -1613819 -3872986 -6048378 -3611829
38465 -3611829 1893854 4335067 2390940 1228229 3680849 5849014 3863050 -389076
38457 -389076 -3443809 -5381016 -7018667 -6251666 -1742853 2904307 3384495 879759 -348016
38448 -348016 489043 1074259 1103469 2015895 2685662 637738 -2597443 -2464206 1639168
38439 1639168 5022894 4429723 1838450 274845 -36922 280505 1573958 3038527 2531310
38430 2531310 698737 1520119 6060597 9428880 7434178 3005229 1864950 4382182
$$ packed form
38492B544238L674119K551762k019293m953226l321322k5487Q32936n07775j188702
38483b412750r33403j643039k461921m561N203464P231686K824458k966536l608632
38474A228766l89860O11241j437149j931418O8047K36554k259167k175392K436549
38465c611829N505683K441213j944127j162711K452620K168165j985964m252126
38457c89076l054733j937207j637651P67001M508813M647160M80188k504736j227775
38448c48016Q37059N85216K9210R12426O69767k047924l235181J33237M103374
38439A639168L383726n93171k591273j563605l11767L17427J293453J464569n07217
38430B531310j832573Q21382M540478L368283j994702m428949j140279K517232
$$ plain form
38422 4382182 6275290 5659566 4580008 4320162 3873313 3173951 3657130 5001399 4929823
38413 4929823 2949896 1030324 -12865 -1434745 -3132703 -2823718 86549 3027740
38405 3027740 4089881 4322384 4837954 4859291 4369235 5285427 7621641 7740601 3467311
38396 3467311 -1788793 -3321493 -1206180 1332187 3355708 5917303 7940645 6955827
38388 6955827 3509329 817371 87154 -248523 -897917 -1168887 -1999302 -5258950 -9389047
38379 -9389047 -10058050 -6558993 -3495141 -4112682 -5698343 -4185385 -89769 3237431
38371 3237431 4786866 6033499 7563983 8623619 8971644 8641694 6912662 3958079
38363 3958079 2383368 4303679 7533696 7610497 3684912 -149489 82499 3891101 7718515
$$ packed form
38422D382182J893108o15724j079558k59846m46849o99362M83179J344269p1576
38413D929823j979927j919572j043189j421880j697958L08985K910267K941191
38405C027740J062141K32503N15570K1337m90056R16192K336214J18960m273290
38396C467311n256104j532700K115313K538367K023521K561595K023342r84818
38388F955827l446498k691958p30217l35677o49394k70970q30415l259648m130097
38379i389047o69003L499057L063852o17541j585661J512958M095616L327200
38371C237431J549435J246633J530484J059636L48025l29950j729032k954583
38363C958079j574711J920311L230017P6801l925585l834401K31988L808602L827414
$$ plain form
38354 7718515 9018939 8007152 6417926 5594596 5653961 6036145 6479148 6992267 7059922
38345 7059922 5987051 4441041 4428537 6810215 9773776 10873818 9967882 9100068 9856123
38336 9856123 11674125 12659293 11799321 10583933 11885774 16072469 18947688 16035151
38328 16035151 9157972 5766311 10211783 18202745 22023066 19282415 14159979 11523870
38320 11523870 12378831 14329390 14363378 11497262 7943401 6930820 8632798 9855527
38312 9855527 8659335 7004312 7424025 9713605 12735002 16461384 19765492 19523292
38304 19523292 15308323 11858153 12983254 16164272 17630645 19191870 24000294 28614799
38296 28614799 26889888 20263125 16169097 16675096 17178917 16955637 21574205 32068998
$$ packed form
38354G718515J300424j011787j589226q23330N9365L82184M43003N13119O7655
38345G059922j072871j546010j2504K381678K963561J100042r05936q67814P56055
38336I856123J818002R85168q59972j215388J301841M186695K875219k912537
38328A6035151o877179l391661M445472P990962L820321k740651n122436k636109
38320A1523870Q54961J950559L3988k866116l553861j012581J701978J222729
38312I855527j196192j655023M19713K289580L021397L726382L304108k42200
38304A9523292m214969l450170J125101L181018J466373J561225M808424M614505
38296B8614799j724911o626763m094028N05999N03821k23280M618568J0494793
$$ plain form
38288 32068998 40729711 42227261 41042831 42482040 43761392 40786182 37455019 40277696
38280 40277696 48149754 55228588 60507539 66808964 73152888 76433122 79173542 87487331
38272 87487331 101628628 115910355 127878066 140196701 153237689 163885404 173466406
38265 173466406 189005351 213052036 238543086 257757443 271308921 284390143 298707451
38258 298707451 312420932 324304739 333422297 337273448 334330189 326502890 315826679
38251 315826679 300961776 280610577 258441802 240347764 227309770 214508301 197794150
38244 197794150 178567635 161760191 150450880 142795550 133829197 120773212 106497148
38237 106497148 96265371 91143916 87165187 81536545 76295852 73960726 72740362 69078966
$$ packed form
38288C2068998Q660713J497550j184430J439209J279352k975210l331163K822677
38280D0277696P872058P078834N278951O301425O343924L280234K740420Q313789
38272H7487331J4141297J4281727J1967711J2318635J3040988J0647715R581002
38265A73466406J5538945K4046685K5491050J9214357J3551478J3081222J4317308
38258B98707451J3713481J1883807R117558L851151k943259p827299j0676211
38251C15826679j4864903k0351199k2168775j8094038j3037994j2801469j6714151
38244A97794150j9226515j6807444j1309311p655330q966353j3055985j4276064
38237A06497148j0231777n121455l978729n628642n240693k335126j220364l661396
$$ plain form
38229 69078966 62898104 57247554 53911229 51841997 49081072 44444490 38449164 33805000
38221 33805000 33028365 34274883 32418186 26264796 21249905 21905884 25207983 25629731
38213 25629731 23553705 23185969 24452725 23396323 19787966 17853477 19014460 19973203
38205 19973203 19112149 18944732 20409481 20366167 17386217 14908486 15382107 15816564 13021926
38196 13021926 9566844 10220477 14865174 18751969 18239046 13529519 7514084 4187277
38188 4187277 6004251 10621720 12785783 11378525 11050655 14342545 16743881 13839438
38180 13839438 9065029 8591493 11802307 13481351 13078538 14301184 16617825 15364509
38172 15364509 10941411 9691690 13222487 14522007 8710722 1026444 -1103752 1394693
$$ packed form
38229F9078966o180862n650550l336325k069232k760925m636582n995326m644164
38221C3805000p76635J246518j856697o153390n014891O55979L302099M21748
38213B5629731k076026l67736J266756j056402l608357j934489J160983R58743
38205A9973203q61054j67417J464749m3314k979950k477731M73621M34457k794638
38196A3021926l455082O53633M644697L886795n12923m709527o015435l326807
38188D187277J816974M617469K164063j407258l27870L291890K401336k904443
38180A3839438m774409m73536L210814J679044m02813J222646K316641j253316
38172A5364509m423098j249721L530797J299520n811285p684278k130196K498445
$$ plain form
38164 1394693 2589617 1315903 875088 1405611 -322028 -3751196 -3629749 2165297 8741873
38155 8741873 10454901 7685618 4957387 4667486 5309249 4801697 3240932 2231394 2771560
38146 2771560 4236149 5028443 4028163 1581652 -728291 -1378716 -399303 328957 -994980
38137 -994980 -3466844 -3952756 -1190513 2084883 3000114 2896780 4702842 7183617 6368195
38128 6368195 2850501 2353074 7030540 11242389 9406859 3811622 337583 -25862
38120 -25862 -404512 -1612349 -2145258 -2774743 -5209278 -7066867 -4282388 1429536 3587660
38111 3587660 352268 -2884079 -1905529 942233 2032267 1695947 1159613 -683445 -3614453
38102 -3614453 -3655754 1224975 6515512 6856177 3383006 806492 63705 -834779 -974986
$$ packed form
38164A394693J194924j273714m40815N30523j727639l429168J21447N795046O576576
38155H741873J713028k769283k728231k89901O41763n07552j560765j009538N40166
38146B771560J464589P92294j000280k446511k309943o50425R79413P28260j323937
38137i94980k471864m85912K762243L275396R15231j03334J806062K480775q15422
38128F368195l517694m97427M677466M211849j835530n595237l474039l63445
38120b5862l78650j207837n32909o29485k434535j857589K784479N711924K158124
38111C587660l235392l236347R78550K847762J090034l36320n36334j843058k931008
38102c614453m1301M880729N290537L40665l473171k576514p42787q98484j40207
$$ plain form
38093 -974986 2307921 7388622 9473551 7843775 6377909 6331857 4455444 -65592 -2551590
38084 -2551590 124498 4019285 3565957 -748586 -4192088 -4898156 -4957409 -5688665 -5895212
38075 -5895212 -4716369 -2918321 -945243 1696135 4477213 5405264 3485485 310839
38067 310839 -1492880 -561062 2636458 6404529 8597614 7729724 4084044 -335304 -3100622
38058 -3100622 -2853209 -246045 2277965 2497862 803358 -292584 383543 1071861 133017
38049 133017 -984475 -188990 886356 -1770183 -8368982 -13436270 -11726132 -4197756
38041 -4197756 3525465 7387621 7967426 8105260 9109905 9505431 7039638 1948215 -2249743
38032 -2249743 -2399980 153434 1167816 -463480 -1057397 2061610 6061490 6713441 4723657
$$ packed form
38093i74986L282907N080701K084929j629776j465866m6052j876413m521036k485998
38084b551590K676088L894787m53328m314543l443502p06068n9253p31256k06547
38075e895212J178843J798048J973078K641378K781078R28051j919779l174646
38067C10839j803719R31818L197520L768071K193085q67890l645680m419348k765318
38058c100622K47413K607164K524010K19897j694504j095942O76127O88318r38844
38049A33017j117492P95485J075346k656539o598799n067288J710138P528376
38041d197756P723221L862156N79805J37834J004645L95526k465793n091423m197958
38032b249743j50237K553414J014382j631296n93917L119007L999880O51951j989784
$$ plain form
38023 4723657 4125488 5535955 5481097 2751274 1048250 3454810 7588443 8756491 5743148
38014 5743148 1078555 -2742109 -4831584 -4888421 -3165035 -1113022 -110095 280894 1311697
38005 1311697 2750990 3134799 1913082 -225575 -2757971 -5247068 -6102584 -3667471
37997 -3667471 819740 3272507 1135693 -3259489 -5017586 -2019818 3042894 5934749
37989 5934749 5256729 3015940 1357518 61382 -1935472 -3681825 -3029367 -535729
37981 -535729 -192239 -4597064 -10873973 -13517506 -10684390 -5707373 -2694984 -2664076 -4064288
37972 -4064288 -4954989 -3942902 -821254 2524588 3209749 777381 -1351371 504470
37964 504470 5443099 8389451 5891391 229657 -3443551 -3296120 -2268631 -3137797 -4433758
$$ packed form
38023D723657n98169J410467n4858k729823j703024K406560M133633J168048l013343
38014E743148m664593l820664k089475n6837J723386K052013J002927L90989J030803
38005A311697J439293L83809j221717k138657k532396k489097q55516K435113
37997c667471M487211K452767k136814m395182j758097K997768N062712K891855
37989E934749o78020k240789j658422j296136j996854j746353O52458K493638
37981e35729L43490m404825o276909k643533K833116M977017L012389L0908j400212
37972d064288q90701J012087L121648L345842O85161k432368k128752J855841
37964E04470M938629K946352k498060n661734l673208J47431J027489q69166j295961
$$ plain form
37955 -4433758 -3040979 814380 3990721 5155212 5763184 6103346 4173962 56622
37947 56622 -2255638 -218983 2949627 2734878 -153741 -1616076 -875785 -943545 -3044065
37938 -3044065 -5027862 -5499878 -5366688 -4678229 -2015409 1821486 3332710 1155846 -1885065
37929 -1885065 -3123750 -3271574 -3754098 -4235288 -4730080 -6686408 -9447059 -9012140 -3531676
37920 -3531676 2834974 5117064 4173054 4195471 5485415 4258937 -907269 -6549048 -8630826
37911 -8630826 -6435291 -1964320 2001074 3271431 2090744 1508374 3730445 6631294
37903 6631294 6430865 3223794 755279 889570 1647114 1107238 -89209 -1045416 -2258718
37894 -2258718 -3564563 -3189414 -552626 2291816 3732315 4966585 7322743 9136373
$$ packed form
37955d433758J392779L855359L176341J164491O07972L40162j929384m117340
37947E6622k312260K036655L168610k14749k888619j462335P40291o7760k100520
37938c044065j983797m72016J33190O88459K662820L836895J511224k176864l040911
37929a885065j238685j47824m82524m81190m94792j956328k760651M34919N480464
37920c531676O366650K282090r44010K2417J289944j226478n166206n641779k081778
37911h630826K195535M470971L965394J270357j180687n82370K222071K900849
37903F631294k00429l207071k468515J34291P57544n39876j196447r56207j213302
37894b258718j305845L75149K636788K844442J440499J234270K356158J813630
$$ plain form
37886 9136373 7792414 3823486 550665 -120924 333701 -518848 -2942664 -4735083 -3651635
37877 -3651635 -71545 2970773 3147423 1952799 2858168 6089918 7511775 4222089
37869 4222089 -703191 -1669918 2094844 5615973 4934198 2048638 1547376 4214564 6407073
37860 6407073 5258660 2015531 -572783 -2152238 -4124705 -6048821 -5276009 -914800
37852 -914800 3845619 5103091 2988401 1167361 1778970 2728093 762553 -3911307 -7256147
37843 -7256147 -5643213 -8692 4576000 3902088 -746599 -3698978 -1081464 5041652
37835 5041652 9611638 10494945 9572914 8520834 6295417 1902545 -2552430 -3872171
37827 -3872171 -2167595 -1088344 -3191757 -6668490 -7900940 -6417554 -5384124 -6741069
$$ packed form
37886I136373j343959l968928l272821o71589M54625q52549k423816j792419J083448
37877c651635L580090L042318J76650j194624R05369L231750J421857l289686
37869D222089m925280r66727L764762L521129o81775k885560n01262K667188K192509
37860F407073j148413l243129k588314j579455j972467j924116P72812M361209
37852i14800M760419J257472k114690j821040O11609R49123j965540m673860l344840
37843g256147J612934N634521M584692o73912m648687k952379K617514O123116
37835E041652M569986Q83307r22031j052080k225417m392872m454975j319741
37827c872171J704576J079251k103413l476733j232450J483386J033430j356945
$$ plain form
37819 -6741069 -7860544 -5031472 846452 5057406 5730436 6209009 9097026 11501376
37811 11501376 9763579 6358579 7067507 12098676 15612156 15150178 16010027 23056587
37803 23056587 32481895 36284672 32589387 26897329 24213147 24499238 25868298 27663438
37795 27663438 28860921 27115248 21969019 16785828 14859540 14845474 12615941 7244975
37787 7244975 2679196 2768952 6345742 8588859 6640994 2501345 162674 1051445 3244994
37778 3244994 4498312 4445519 3586197 1778015 -1089838 -4004206 -5806249 -6544958 -6474488
37769 -6474488 -4592864 -281442 3964749 4057322 -728176 -6442263 -9054374 -8365755 -6272468
37760 -6272468 -3512914 -202868 2318540 2892355 2667677 3148016 3036401 125281 -4121782
$$ packed form
37819f741069j119475K829072N877924M210954O73030M78573K888017K404350
37811A1501376j737797l405000P08928N031169L513480m61978Q59849P046560
37803B3056587R425308L802777l695285n692058k684182K86091J369060J795140
37795B7663438J197483j745673n146229n183191j926288j4066k229533n370966
37787G244975m565779Q9756L576790K243117j947865m139649k338671Q88771K193549
37778C244994J253318n2793q59322j808182k867853k914368j802043p38709P0470
37769f474488J881624M311422M246191R2573m785498n714087k612111O88619K093287
37760f272468K759554L310046K521408N73815k24678M80339j11615k911120m247063
$$ plain form
37751 -4121782 -5465597 -2878017 -151171 -301965 -1688172 -1621035 -775510 -1256730 -2624655
37742 -2624655 -2989957 -2470994 -2378231 -2095457 -106240 2434499 2509970 -243208 -2744137
37733 -2744137 -2571184 -316254 2428643 4773343 5687982 4098479 747566 -2230912
37725 -2230912 -4321216 -6940097 -10005422 -10774190 -7551928 -2573492 331466 -367969
37717 -367969 -3198217 -5469056 -5319823 -3560140 -3429732 -6444089 -9061873 -6851236 -1699791
37708 -1699791 -189304 -3885926 -6663494 -4113305 -57675 358172 -1048269 293581
37700 293581 3259060 3548767 2125861 3731452 7737081 7908318 2390925 -2650118 -1773835
37691 -1773835 2619860 4852606 3539640 1413910 498284 548584 723331 598993 332129
$$ packed form
37751d121782j343815K587580K726846j50794j386207O7137Q45525m81220j367925
37742b624655l65302N18963R2763K82774J989217K540739P5471k753178k500929
37733b744137J72953K254930K744897K344700R14639j589503l350913k978478
37725b230912k090304k618881l065325p68768L222262M978436K904958o99435
37717c67969k830248k270839J49233J759683J30408l014357k617784K210637N151445
37708a699791J510487l696622k777568K550189M055630M15847j406441J341850
37700B93581K965479K89707j422906J605591M005629J71237n517393n041043Q76283
37691a773835M393695K232746j312966k125730r15626N0300J74747j24338k66864
$$ plain form
37682 332129 630300 1531423 1503896 -241672 -1143918 1973420 7679735 10888382 9365199
37673 9365199 5808681 3039646 1032414 -446220 -481786 185853 -941743 -3569312 -3885606
37664 -3885606 -486304 2905342 3030386 1512961 1040824 1118584 725868 1204930 2854407
37655 2854407 2564902 -885509 -2902730 551325 5849375 6510629 2544109 -958455
37647 -958455 -2461556 -4547154 -6971850 -6441198 -3805227 -4439705 -9468217 -12755034 -9614307
37638 -9614307 -3511773 -689349 -2053767 -3917078 -3803416 -2109153 -50506 1183376
37630 1183376 748478 -335571 349241 3016837 4636813 3253962 1080375 1199169 3311214
37621 3311214 4995664 5207547 4201876 1979875 -594680 -1031901 1477273 3596218
$$ packed form
37682C32129K98171R01123k7527j745568r02246L117338N706315L208647j523183
37673I365199l556518k769035k007232j478634l5566O67639j127596k627569l16294
37664c885606L399302L391646J25044j517425m72137P7760l92716M79062J649477
37655B854407k89505l450411k017221L454055N298050O61254l966520l502564
37647i58455j503101k085598k424696N30652K635971o34478n028512l286817L140727
37638i614307O102534K822424j364418j863311J13662J694263K058647J233882
37630A183376m34898j084049O84812K667596J619976j382851k173587J18794K112045
37621C311214J684450K11883j005671k222001k574555m37221K509174K118945
$$ plain form
37613 3596218 1898288 -1917757 -3398887 -2015353 -1483326 -3491792 -5249158 -4332602
37605 -4332602 -2327077 -1758706 -2235940 -1901511 -757917 -291298 -1003921 -2221732 -3529615
37596 -3529615 -4936255 -6390394 -8203363 -10798347 -12930484 -11810475 -6800329 -1426255
37588 -1426255 679253 548904 1643772 3849123 3698322 862081 -36270 3826762 8627851
37579 8627851 9083138 5824734 3581069 3519293 2008951 -2887311 -8068799 -10074129 -9689833
37570 -9689833 -9665843 -10345128 -10161910 -8857227 -7550396 -6494947 -5178951 -4132011 -4285133
37561 -4285133 -4787216 -3947994 -2530534 -3346497 -6524500 -7923039 -4573880 201553 399711
37552 399711 -4396653 -7891948 -5354450 47983 1690428 -1775215 -5561424 -5922473
$$ packed form
37613C596218j697930l816045j481130J383534N32027k008466j757366R16556
37605d332602K005525N68371m77234L34429J143594M66619p12623j217811j307883
37596c529615j406640j454139j812969k594984k132137J120009N010146N374074
37588a426255K105508j30349J094868K205351j50801k836241q98351L863032M801089
37579H627851M55287l258404k243665o1776j510342m896262n181488k005330L84296
37570i689833K3990o79285J83218J304683J306831J055449J315996J046940j53122
37561d285133n02083Q39222J417460q15963l178003j398539L349159M775433J98158
37552C99711m796364l495295K537498N402433J642445l465643l786209l61049
$$ plain form
37544 -5922473 -4276986 -3204352 -2023836 947065 4169021 4530804 2476373 2056399
37536 2056399 5356300 9544867 10482164 7189824 1553770 -4495188 -9593665 -11848554
37528 -11848554 -9581583 -3831799 1208785 1605172 -2310395 -6086503 -5913735 -2765450
37520 -2765450 -837628 -2248680 -4926302 -5929069 -4798656 -2731782 -644971 362022
37512 362022 -1156052 -4392430 -5505211 -2256448 2258048 3698182 2593274 2387731
37504 2387731 2798733 264097 -5107367 -8437842 -7054905 -3655568 -1025609 1343302
37496 1343302 3212966 1542281 -3895400 -7373428 -4215940 2338081 5699372 4567874
37488 4567874 2451927 1000895 -1017216 -3378465 -4060970 -3052604 -2510982 -3273560 -4559629
$$ packed form
37544e922473J645487J072634J180516K970901L221956L61783k054431m19974
37536B056399L299901M188567R37297l292340n636054o048958n098477k254889
37528a1848554K266971N749784N040584L96387l915567l776108J72768L148285
37520b765450J927822j411052k677622j002767J130413K066874K086811J006993
37512C62022j518074l236378j112781L248763M514496J440134j104908k05543
37504B387731M11002k534636n371464l330475J382937L399337K629959K368911
37496A343302J869664j670685n437681l478028L157488O554021L361291j131498
37488D567874k115947j451032k018111k361249o82505J008366N41622p62578j286069
$$ plain form
37479 -4559629 -6502699 -9375132 -10893439 -8256367 -2908672 332166 -808484 -4091471
37471 -4091471 -6601196 -7323887 -6057386 -3294287 -1428065 -2670158 -5372456 -5607648
37463 -5607648 -2588529 866282 3283566 5861428 8254596 7583017 3448114 -52548
37455 -52548 240610 2322604 2731505 1598148 1153522 1489518 939363 -606717 -1575491
37446 -1575491 -1445783 -1586884 -3389766 -6541821 -8935020 -8194575 -4298093 -514359 -31935
37437 -31935 -1795876 -2072568 -204388 447989 -1728802 -3487484 -1634577 1874228 2693676
37428 2693676 -70055 -3718937 -6153611 -7216468 -6882879 -5198197 -3720549 -4257442
37420 -4257442 -5943875 -5878552 -3137067 -191828 412488 -774010 -1333630 -407714 414785
$$ packed form
37479d559629j943070k872433j518307K637072N347695L240838j140650l282987
37471d091471k509725p22691J266501K763099J866222j242093k702298k35192
37463e607648L019119L454811K417284K577862K393168o71579m134903l500662
37455e2548K93158K081994M08901j133357m44626L35996n50155j546080r68774
37446a575491J29708j41101j802882l152055k393199P40445L896482L783734M82424
37437c1935j763941k76692J868180O52377k176791j758682J852907L508805Q19448
37428B693676k763731l648882k434674j062857L33589J684682J477648n36893
37420d257442j686433O5323K741485K945239O04316j186498n59620R25916Q22499
$$ plain form
37411 414785 -370488 -1785093 -1426109 1161755 3344619 2469684 -779743 -3377649 -3709744
37402 -3709744 -2786409 -2159789 -2579239 -4612981 -8322975 -11778728 -12027636 -8580558 -4403789
37393 -4403789 -2678672 -3971070 -6909230 -9661390 -10197933 -7525755 -3852842 -3178719
37385 -3178719 -6092939 -8151385 -5525363 -444659 1524703 -1464354 -5716058 -6742056
37377 -6742056 -3543932 1888590 7264024 11195516 12688614 10746839 5339431 -1184926
37369 -1184926 -4944209 -4201187 -1473972 -205959 -87948 1721045 5138218 6485767
37361 6485767 4058292 800223 -264469 -46971 -618075 -1388466 -867773 190196 486926
37352 486926 1090870 3409571 5686733 4827435 901423 -3110503 -5392625 -6348452 -6219560
$$ packed form
37411D14785p85273j414605L58984K587864K182864q74935l249427k597906l32095
37402c709744R23335O26620m19450k033742l709994l455753k48908L447078M176769
37393d403789J725117j292398k938160k752160n36543K672178L672913O74123
37385c178719k914220k058446K626022N080704J969362k989057m251704j025998
37377f742056L198124N432522N375434L931492J493098j941775n407408o524357
37369a184926l759283P43022K727215J268013J18011J808993L417173J347549
37361F485767k427475l258069j064692K17498n71104p70391N20693J057969K96730
37352D86926O03944K318701K277162q59298l926012m011926k282122r55827J28892
$$ plain form
37343 -6219560 -4592346 -2215435 -767912 -559139 -275341 1030826 3114337 5128845
37335 5128845 5698250 3552887 -219699 -2024585 16274 3226584 4147736 3269934 2907034
37326 2907034 2389132 -266536 -3115471 -1921035 2800684 5493004 3553031 881571
37318 881571 1434796 3575510 3718363 2016690 947772 779603 15609 -1216532 -1434026
37309 -1434026 -474933 769324 2374969 4657059 6418595 6617880 6930291 9567397 12935462
37300 12935462 12982555 9451038 7286852 10097549 15078936 16950705 14827216 12103395
37292 12103395 10815414 9773825 8196091 7352437 7354442 5783392 1867958 -826020 874978
37283 874978 4337407 4254158 59504 -3951999 -5524941 -6810739 -9097593 -9943758 -7697652
$$ packed form
37343f219560J627214K376911J447523K08773K83798J306167K083511K014508
37335E128845N69405k145363l772586j804886K040859L210310R21152q77802l62900
37326B907034n17902k655668k848935J194436M721719K692320j939973k671460
37318H81571N53225K140714J42853j701673j068918j68169p63994j232141k17494
37309a434026R59093J244257J605645K282090J761536J99285L12411K637106L368065
37300A2935462M7093l531517k164186K810697M981387J871769k123489k723821
37292A2103395j287981j041589j577734q43654K005j571050l915434k693978J700998
37283H74978L462429q3249m194654m011503j572942j285798k286854q46165K246106
$$ plain form
37274 -7697652 -4844911 -4064341 -4227534 -3163041 -1306109 390325 2893890 5851413
37266 5851413 5345337 -336151 -5549556 -3772550 2452146 4395796 -538055 -5929761
37258 -5929761 -6420933 -3975444 -1950109 694216 5363696 8962181 7855380 3676718
37250 3676718 844842 422008 334669 -96710 126700 492284 -647526 -2800693 -3786180
37241 -3786180 -3534169 -4356416 -6866868 -8431827 -6971061 -4255343 -3642572 -5531499 -6939345
37232 -6939345 -5781401 -4091473 -5620514 -10526152 -14232559 -12606621 -6941341 -2105455
37224 -2105455 -657144 -963283 -684379 482271 1793948 2683748 2282196 -50675 -2940072
37215 -2940072 -3939124 -3079530 -3154124 -5452204 -7713244 -7709944 -6342013 -5326911 -4164993
$$ packed form
37274g697652K852741P80570j63193J064493J856932J696434K503565K957523
37266E851413n06076n681488n213405J777006O224696J943650m933851n391706
37258e929761m91172K445489K025335K644325M669480L598485j106801m178662
37250C676718k831876m22834q7339m31379K23410L65584j139810k153167r85487
37241c786180K52011q22247k510452j564959J460766K715718O12771j888927j407846
37232f939345J157944J689928j529041m905638l706407J625938N665280M835886
37224b105455J448311l06139K78904J166650J311677Q89800m01552k332871k889397
37215b940072r99052Q59594p4594k298080k261040L300J367931J015102J161918
$$ plain form
37206 -4164993 -1706752 1066153 2156734 1167806 -1002763 -3599195 -5509185 -5257555
37198 -5257555 -3486841 -3411685 -6456121 -9475658 -9024541 -6349206 -4942608 -5069810 -4629069
37189 -4629069 -4011096 -5502495 -8223761 -8316811 -4889346 -1683485 -1556138 -2830314 -2731041
37180 -2731041 -1434426 -849657 -1661898 -3213290 -4527537 -4388673 -2304207 -126096 -398879
37171 -398879 -2297374 -1976711 1753489 5073128 4483073 1812878 1253543 3384566 5047703
37162 5047703 3985951 996281 -1859802 -3116425 -2619665 -2011924 -3516724 -6731336
37154 -6731336 -8150409 -5815999 -2612247 -2198558 -3319446 -1795397 2653671 5662309
37146 5662309 4562053 1585913 -331274 -1410417 -2928410 -4261149 -4309652 -3704619 -3363885
$$ packed form
37206d164993K458241K772905J090581r88928k170569k596432j909990K51630
37198e257555J770714P5156l044436l019537M51117K675335J406598j27202M40741
37189d629069O17973j491399k721266r3050L427465L205861J27347j274176R9273
37180b731041J296615N84769q12241j551392j314247J38864K084466K178111k72783
37171c98879j898495L20663L730200L319639n90055k670195n59335K131023J663137
37162E047703j061752k989670k856083j256623M96760O07741j504800l214612
37154f731336j419073K334410L203752M13689j120888J524049M449068L008638
37146E662309j100256k976140j917187j079143j517993j332739m8503O05033L40734
$$ plain form
37137 -3363885 -2629654 -1033306 -266576 -1853416 -4018616 -3639047 -868422 818927 -612460
37128 -612460 -3217054 -3906811 -2025056 835891 3248278 4887079 5470842 3955325 -401586
37119 -401586 -6068783 -9289938 -7525283 -2741502 544408 882984 1162295 3101310 3613878
37110 3613878 -200802 -4862084 -4106067 1794974 5422330 2308629 -2904609 -3293950
37102 -3293950 731506 2549406 -1425976 -7283859 -8552185 -3322725 4004112 7062123
37094 7062123 3674386 -1960703 -4031401 -1978471 -431781 -1796144 -2434904 1204521
37086 1204521 5882202 5360094 -651274 -6123117 -7106036 -5790268 -5203860 -4382598 -1344154
37077 -1344154 2343181 3164515 350389 -3509015 -5740329 -5732839 -4533683 -3710021 -4030036
$$ packed form
37137c363885P34231J596348P66730j586840k165200L79569K770625J687349j431387
37128f12460k604594o89757J881755K860947K412387J638801N83763j515517m356911
37119d01586n667197l221155J764655M783781L285910L38576K79311J939015N12568
37110C613878l814680m661282P56017N901041L627356l113701n213238l89341
37102c293950M025456J817900l975382n857883j268326N229460P326837L058011
37094G062123l387737n635089k070698K052930J546690j364363o38760L639425
37086A204521M677681n22108o011368n471843r82919J315768N86408Q21262L038444
37077a344154L687335Q21334k814126l859404k231314P490J199156Q23662l20015
$$ plain form
37068 -4030036 -4354944 -2706131 811887 3437750 3146953 1233591 106023 -150144 -1096861
37059 -1096861 -2723220 -3171205 -1719429 -170223 -618488 -2923804 -5026677 -5250676 -3893949
37050 -3893949 -2689535 -2773550 -3338862 -2781141 -1111916 -226216 -1309832 -2993208 -2944096
37041 -2944096 -567781 2730911 5251319 6006769 4822219 2768454 2052703 3970838
37033 3970838 6928652 7800538 5523797 2259230 657368 1019419 1672269 1157939 -768536
37024 -768536 -3518512 -5843962 -5953164 -2941855 1303407 2759437 -859740 -7049346
37016 -7049346 -10476271 -8302118 -2759700 1780598 3230255 2674886 2073658 2441872 3739698
37007 3739698 5036524 4772304 2130119 -1594488 -3994328 -4186374 -3564548 -3669205 -4262427
$$ packed form
37068d030036l24908J648813L518018K625863k90797j913362j127568k56167r46717
37059a096861j626359m47985J451776J549206m48265k305316k102873k23999J356727
37050c893949J204414q4015n65312N57721J669225Q85700j083616j683376M9112
37041b944096K376315L298692K520408P55450j184550k053765p15751J918135
37033C970838K957814Q71886k276741l264567j601862L62051O52850n14330j926475
37024g68536k749976k325450j09202L011309M245262J456030l619177o189606
37016g049346l426925K174153N542418M540298J449657n55369o01228L68214J297826
37007C739698J296826k64220k642185l724607k399840j92046O21826j04657n93222
$$ plain form
36998 -4262427 -4096879 -2921459 -1891960 -1986182 -2563212 -2056538 -160262 1551970 2056852
36989 2056852 2931946 5956342 9195483 8669649 4549540 1781474 2419924 1573556 -4872456
36980 -4872456 -12041761 -11573018 -3633679 3154397 3659408 1413492 768952 848882 148892
36971 148892 700580 3231789 3453625 -1519979 -7030830 -6766731 -1891190 1333885 859639
36962 859639 -70162 129599 -580739 -2691659 -3333311 -893538 2443106 3958559 3343928
36953 3343928 1826116 855736 1654734 3640789 3900854 943110 -2141042 -1687440 589551
36944 589551 9247 -3417401 -4791677 -2062758 1174419 1759999 956347 568000 -316894
36935 -316894 -2215272 -2849161 -800091 1467358 1013058 -1495019 -3362641 -3410054 -2154405
$$ packed form
36998d262427J65548J175420J029499r4222n77030N06674J896276J712232N04882
36989B056852Q75094L024396L239141n25834m120109k768066O38450q46368o446012
36980d872456p169305M68743P939339O788076N05011k245916o44540P9930o99990
36971A48892N51688K531209K21836m973604n510851K64099M875541L225075m74246
36962H59639r29801J99761p10338k110920o41652K439773L336644J515453o14631
36953C343928j517812r70380P98998J986055K60065k957744l084152M53602K276991
36944E89551n80304l426648j374276K728919L237177N85580q03652l88347q84894
36935c16894j898378o33889K049070K267449m54300k508077j867622m7413J255649
$$ plain form
36926 -2154405 -610252 -252567 -1764940 -2893055 -649620 3400571 4019840 -5630
36918 -5630 -3571087 -3051369 -1571568 -2977398 -5257820 -4729332 -2754098 -2592552 -2584782
36909 -2584782 1169157 6984964 8798172 4783072 -888788 -4865911 -7672475 -9454726
36901 -9454726 -8207314 -3900256 103897 1588640 1777337 1684752 5872 -3472953 -5811552
36892 -5811552 -4611268 -1322331 982336 1017775 -811631 -3554289 -5474183 -5027635 -3289286
36883 -3289286 -3075771 -4721804 -5477193 -4099831 -2747545 -2783335 -2334128 -357683 471683
36874 471683 -1792942 -4135849 -2736893 990760 2880909 2878686 4555695 8231206 9499603
36865 9499603 5652473 -346518 -3913690 -3970584 -2542419 -1771955 -2858900 -5676151 -7766758
$$ packed form
36926b154405J544153L57685j512373j128115K243435M050191O19269m025470
36918e630l565457N19718J479801j405830k280422N28488J975234J61546P770
36909b584782L753939N815807J813208m015100n671860l977123k806564j782251
36901i454726J247412M307058M004153J484743J88697r2585j678880l478825k338599
36892e811552J200284L288937K304667L5439j829406k742658j919894M46548J738349
36883c289286K13515j646033p55389J377362J352286l5790M49207J976445Q29366
36874D71683k264625k342907J398956L727653J890149k223J677009L675511J268397
36865I499603l847130n998991l567172n6894J428165P70464j086945k817251k090607
$$ plain form
36856 -7766758 -5862195 -380606 3551285 2097011 -1768669 -1900456 2470526 5520935
36848 5520935 3033353 -1720786 -2813194 105003 2140167 933901 -132522 2230448
36840 2230448 5764642 5871339 2143238 -1650251 -3218644 -4015525 -5704149 -7473311
36832 -7473311 -7949465 -7440360 -6918551 -6392529 -5399446 -3812272 -1494099 1316477 2840159
36823 2840159 1142539 -2450922 -3830733 -1557541 594650 -1267112 -5683490 -8209790
36815 -8209790 -7564549 -6236446 -5956728 -5943182 -5533576 -5521342 -6349945 -7273882 -7799925 -8178352
36805 -8178352 -8366385 -8201311 -8301214 -8882673 -8355490 -5655449 -3344742 -4990207 -9376496
36796 -9376496 -11120764 -7994454 -3842530 -2530096 -2759184 -1619359 -17329 -831179
$$ packed form
36856g766758J904563N481589L931891j454274l865680j31787M370982L050409
36848E520935k487582m754139j092408K918197K035164j206266j066423K362970
36840B230448L534194J06697l728101l793489j568393p96881j688624j769162
36832g473311m76154N09105N21809N26022R93083J587174K318173K810576J523682
36823B840159j697620l593461j379811K273192K152191j861762m416378k526300
36815h209790O45241J328103K79718J3546M09606J2234q28603r23937n26043l78427
36805h178352j88033J65074r9903n81459N27183K700041K310707j645465m386289
36796i376496j744268L126310M151924J312434k29088J139825J602030q13850
$$ plain form
36788 -831179 -3670736 -5395967 -5018657 -4582088 -5271223 -5618099 -3939141 -332142 3981177
36779 3981177 7398868 8040578 5171861 832471 -1708995 -1477584 -419714 -597100 -2289233
36770 -2289233 -4650387 -6389491 -5943848 -3156065 -870453 -2319696 -6244120 -7261618
36762 -7261618 -2606997 3692454 5434374 1602533 -3011176 -3714972 -417657 3448119
36754 3448119 4619766 2371317 -1380129 -3618878 -2471356 1433983 5501761 6885796
36746 6885796 4265254 -885174 -4762190 -4501751 -1626146 -740019 -3803851 -7310873
36738 -7310873 -6800222 -2851443 -335518 -2231798 -6396940 -8532972 -6541441 -1773080
36730 -1773080 2406030 3127704 667936 -1347816 -38319 2560273 1691154 -3435464
$$ packed form
36788h31179k839557j725231L77310M36569o89135l46876J678958L606999M313319
36779C981177L417691O41710k868717m339390k541466K31411J057870j77386j692133
36770b289233k361154j739104M45643K787783K285612j449243l924424j017498
36762g261618M654621O299451J741920l831841m613709p03796L297315L865776
36754C448119J171647k248449l751446k238749J147522L905339M067778J384035
36746F885796k620542n150428l877016K60439K875605Q86127l063832l507022
36738g310873N10651L948779K515925j896280m165142k136032J991531M768361
36730a773080M179110P21674k459768k015752J309497K598592q69119n126618
$$ plain form
36722 -3435464 -7886933 -7213186 -2935611 72273 -389602 -2844397 -5528962 -7775922
36714 -7775922 -8593588 -6805164 -3068184 222779 1473891 926325 -692859 -2764057
36706 -2764057 -4056066 -3473124 -1937494 -1658257 -3002917 -3970781 -3444700 -2906745 -3702197
36697 -3702197 -4488387 -3293727 -1007786 -769124 -3960007 -8177519 -9533995 -6524605
36689 -6524605 -1546804 1463980 1157176 8063 658151 2076552 1485575 -489277 71946
36680 71946 4234796 7578471 6035455 1811658 504218 3865082 8366359 10020220
36672 10020220 7898868 3523818 -604218 -2194859 -1211430 -432676 -2027117 -4381320
36664 -4381320 -4574156 -2820407 -1466093 -650096 1161134 2741353 796830 -4016382
$$ packed form
36722c435464m451469O73747M277575L007884m61875k454795k684565k246960
36714g775922q17666J788424L736980L290963J251112n47566j619184k071198
36706b764057j292009N82942J535630K79237j344660r67864N26081N37955p95452
36697c702197p86190J194660K285941K38662l190883m217512j356476L009390
36689f524605M977801L010784l06804j149113O50088J418401n90977j974852N61223
36680G1946M162850L343675j543016m223797j307440L360864M501277J653861
36672A0020220k121352m375050m128036j590641R83429P78754j594441k354203
36664d381320j92836J753749J354314Q15997J811230J580219j944523m813212
$$ plain form
36656 -4016382 -6184475 -2515447 3256464 5382505 2774483 -1469084 -4438694 -4726600
36648 -4726600 -1842123 2659067 5195729 4161086 2504894 3669427 6397349 6585178
36640 6585178 3256768 -502018 -2092601 -1798421 -687295 833554 1803910 786690
36632 786690 -1674878 -2726784 -711020 2399233 3432927 1964749 419023 577351
36624 577351 1414931 996645 -409752 -548555 1310640 2668483 924073 -2913428 -5538897
36615 -5538897 -5636241 -4521244 -3031497 -846881 942843 193163 -2278382 -2695033 -208639
36606 -208639 910167 -2261281 -6127259 -5629188 -1671453 915150 849107 1003602 2539791
36597 2539791 3344043 2399754 1342966 989851 21463 -2060873 -3816865 -4298441 -3774819
$$ packed form
36656d016382k168093L669028N771911K126041k608022m243567k969610k87906
36648d726600K884477M501190K536662j034643j656192J164533K727922J87829
36640F585178l328410l758786j590583K94180J111126J520849R70356j017220
36632G86690k461568j051906K015764L110253J033694j468178j545726J58328
36624E77351Q37580m18286j406397j38803J859195J357843j744410l837501k625469
36615e538897r7344J114997J489747K184616J789724p49680k471545m16651K486394
36606b08639J118806l171448l865978M98071L957735K586603o6043J54495J536189
36597B539791Q04252r44289j056788l53115r68388k082336j755992m81576N23622
$$ plain form
36588 -3774819 -1996731 1048301 2812529 562129 -3647237 -4704393 -1929253 -114071
36580 -114071 -1628998 -2648580 -15874 3086131 2471981 -51587 -111722 1579772 639954
36571 639954 -3176545 -5190411 -3094506 -182676 -41833 -1943272 -3239736 -3188874 -2387247
36562 -2387247 -956625 374883 -756476 -5671326 -11747746 -14477194 -12272706 -7562403
36554 -7562403 -3344469 -543686 1036787 1268419 412167 -180228 276731 377738 -1782277
36545 -1782277 -5545371 -7913194 -6992480 -3936447 -1310522 -758919 -2336760 -4705415
36537 -4705415 -5803834 -4787992 -3369400 -3565409 -4388307 -3295379 -882469 -545257 -2487396
36528 -2487396 -2232356 2450814 7056255 6417628 2096616 -640986 -746747 -1338747 -3294250
$$ packed form
36588c774819J778088L045032J764228k250400m209366j057156K775140J815182
36580a14071j514927j019582K632706L102005o14150k523568o0135J691494r39818
36571F39954l816499k013866K095905K911830J40843j901439j296464N0862Q01627
36562b387247J430622J331508j131359m914850o076420k729448K204488M710303
36554g562403M217934K800783J580473K31632q56252n92395M56959J01007k160015
36545a782277l763094k367823R20714L056033K625925N51603j577841k368655
36537d705415j098419J015842J418592j96009q22898J092928K412910L37212j942139
36528b487396K55040M683170M605441o38627m321012k737602j05761n92000j955503
$$ plain form
36519 -3294250 -4114602 -2692923 -406675 2399743 6337791 9343116 8103723 3896371
36511 3896371 2169458 4862356 7549595 6092566 2138840 -269340 -232632 262300 -356643
36502 -356643 -2235610 -4555361 -5772185 -5029576 -3613305 -3075646 -2584015 -1002572 -386074
36493 -386074 -3092811 -6347148 -5259277 -1215350 -800538 -5181071 -7411860 -2932640
36485 -2932640 3753744 6425329 5159135 2943993 72048 -3239590 -3908932 -1139104
36477 -1139104 104658 -3500235 -7036845 -4479104 1289041 2615761 -1325115 -4314688
36469 -4314688 -3127220 -816312 -166293 -167436 228265 2065 -1190585 -2069382 -2220963
36460 -2220963 -2489454 -2863389 -2661226 -2170915 -1480475 1025733 6018635 10507231 10888965
$$ packed form
36519c294250q20352J421679K286248K806418L938048L005325j239393m207352
36511C896371j726913K692898K687239j457029l953726k408180L6708M94932o18943
36502c56643j878967k319751j216824P42609J416271N37659M91631J581443O16498
36493c86074k706737l254337J087871M043927M14812m380533k230789M479220
36485b932640O686384K671585j266194k215142k871945l311638o69342K769828
36477a139104J243762l604893l536610K557741N768145J326720l940876k989573
36469d314688J187468K310908O50019j143L95701k26200j192650q78797j51581
36460b220963k68491l73935K02163M90311O90440K506208M992902M488596L81734
$$ plain form
36451 10888965 7384790 2873342 -552511 -1389383 1448651 5112501 3257121 -5198547
36443 -5198547 -11961259 -10020567 -4251227 -3839117 -7738273 -7060904 -124696 5306994
36435 5306994 5323399 5109281 8199948 9816832 5470479 -1177666 -4197323 -3578397 -2780045
36426 -2780045 -2662264 -2379452 -2639731 -3899400 -4178566 -2184093 -104774 -332367 -1771838
36417 -1771838 -2111519 -1633460 -2218096 -4074958 -5439335 -4654855 -1839113 595456 -320397
36408 -320397 -4152637 -6308084 -3936009 -529036 -691197 -2640743 -1456573 2049930
36400 2049930 2641294 72977 -585614 1383338 541636 -4783212 -8621218 -6603641 -2070775
36391 -2070775 534587 1720536 2736921 1994282 -93134 868550 5705388 8329408
$$ packed form
36451A0888965l504175m511448l425853q36872K838034L663850j855380q455668
36443e198547o762712J940692N769340M12110l899156O77369O936208N431690
36435E306994J6405k14118L090667J616884m346353o648145l019657O18926P98352
36426b780045J17781K82812k60279j259669k79166J994473K079319k27593j439471
36417a771838l39681M78059n84636j856862j364377P84480K815742K434569r15853
36408c20397l832240k155447K372075L406973j62161j949546J184170L506503
36400B049930N91364k568317o58591J968952q41702n324848l838006K017577M532866
36391b070775K605362J185949J016385p42639k087416R61684M836838K624020
$$ plain form
36383 8329408 4993674 861315 1729014 4995540 5206776 3303065 3267417 3935217 1641484
36374 1641484 -2170850 -3306733 -2440016 -3443936 -5888746 -5917689 -3513102 -2584706 -4191457
36365 -4191457 -5152971 -3367059 -9020 3330730 5899805 6709743 5336403 2814175
36357 2814175 -446728 -5144803 -9206244 -7585183 251184 7077955 7098978 3994418
36349 3994418 3984663 5494833 3276579 -975051 -1254327 1385978 -322346 -7415584 -12058028
36340 -12058028 -9252637 -3557254 -1319983 -2373621 -2539636 238141 4908157 9039487
36332 9039487 9979098 7248402 4238476 4398639 6128634 5089350 673711 -4123664
36324 -4123664 -8077415 -11797351 -13479804 -10622542 -5703160 -3978168 -5444916 -5209939
$$ packed form
36383H329408l335734m132359Q67699L266526K11236j903711l5648O67800k293733
36374A641484l812334j135883Q66717j003920k444810k8943K404587R28396j606751
36365d191457r61514J785912L358039L339750K569075Q09938j373340k522228
36357B814175l260903m698075m061441J621061P836367O826771K1023l104560
36349C994418r755J510170k218254m251630k79276K640305j708324p093238m642444
36340a2058028K805391N695383K237271j053638j66015K777777M670016M131330
36332I039487R39611k730696l009926J60163J729995j039284m415639m797375
36324d123664l953751l719936j682453K857262M919382J724992j466748K34977
$$ plain form
36316 -5209939 -2189988 -754684 -2720999 -4529433 -4059618 -3633039 -4206630 -3207323 -618946
36307 -618946 -575887 -3852637 -5326108 -2561307 -487622 -3100341 -6542898 -5655242 -2099378
36298 -2099378 -259531 365727 2478865 4311373 2138694 -2795570 -5897670 -6321359
36290 -6321359 -6931913 -8144284 -7221873 -3833667 -1629098 -3182468 -6529568 -7865782
36282 -7865782 -5922240 -3138913 -3270018 -7348340 -11665868 -11290738 -6082768 -972531
36274 -972531 427440 -425190 -670575 84587 1310982 3197526 4403036 2034128 -3304331
36265 -3304331 -6515907 -5487605 -5078654 -9001801 -12163435 -7515383 2557162 8999383
36257 8999383 8665535 6581531 5949564 3967522 -461854 -2266016 2399239 9371988
$$ packed form
36316e209939L019951J435304j966315j808434M69815M26579n73591R99307K588377
36307f18946M3059l276750j473471K764801K073685k612719l442557Q87656L555864
36298b099378J839847O25258K113138J832508k172679m934264l102100m23689
36290f321359o10554j212371R22411L388206K204569j553370l347100j336214
36282g865782J943542K783327j31105m078322m317528L75130N207970N110237
36274i72531J399971q52630k45385P55162J226395J886544J205510k368908n338459
36265c304331l211576J028302M08951l923147l161634M648052J0072545O442221
36257H999383l33848k084004o31967j982042m429376j804162M665255O972749
$$ plain form
36249 9371988 11617300 7919890 2542202 -1282124 -3614582 -5140142 -5919386 -6356797
36241 -6356797 -6706238 -5935507 -3326672 -810222 -1308560 -4598051 -7013518 -6007424 -3277196
36232 -3277196 -2211811 -3412176 -4237443 -2385231 1536845 5208158 7061380 6838234
36224 6838234 4798223 1778630 -362583 10788 2201434 3478806 2132542 -610422
36216 -610422 -2296604 -1982328 -399709 1852864 4886627 8148826 9652855 7643897
36208 7643897 3016823 -801891 -1100186 1321437 3417051 3661259 3187509 3066582 2343718
36199 2343718 -142825 -3525688 -5879031 -6206622 -4294930 -311161 3780841 4416203
36191 4416203 584294 -3857052 -4919928 -3948246 -4852809 -7385068 -7734856 -5291834 -3658412
$$ packed form
36249I371988K245312l697410n377688l824326k332458j525560p79244m37411
36241f356797l49441P70731K608835K516450m98338l289491k415467J006094K730228
36232c277196J065385j200365q25267J852212L922076L671313J853222k23146
36224F838234k040011l019593k141213L73371K190646J277372j346264k742964
36216f10422j686182L14276J582619K252573L033763L262199J504029k008958
36208G643897m627074l818714k98295K421623K095614K44208m73750j20927p22864
36199B343718k486543l382863k353343l27591J911692L983769M092002O35362
36191D416203l831909m441346j062876R71682r04563k532259l49788K443022J633422
$$ plain form
36182 -3658412 -4160002 -3385725 837308 5293681 5771802 2343241 -2024058 -5106862 -5560349
36173 -5560349 -2592126 1935761 3827881 1522875 -1707525 -2664672 -2341999 -2586895 -2012398
36164 -2012398 1023954 3944301 2780655 -1823187 -5254234 -4816172 -1770397 1685347
36156 1685347 4318609 5298719 4687263 4225750 5191171 5945273 3964712 -261463 -3712188
36147 -3712188 -4695784 -4008881 -2812512 -1615614 -978905 -1182675 -1520546 -1495288 -1845141
36138 -1845141 -2710252 -2156586 1087923 4487392 4033706 -568357 -5269702 -6118638 -2824769
36129 -2824769 1529652 3090560 655581 -2374263 -1290741 3449328 5950082 3184640
36121 3184640 -186531 865115 3305365 773248 -5587504 -8160716 -4482539 -627527
$$ packed form
36182c658412n01590P74277M223033M456373M78121l428561m367299l082804m53487
36173e560349K968223M527887J892120k305006l230400r57147L22673k44896N74497
36164b012398L036352K920347j163646m603842l431047M38062L045775L455744
36156A685347K633262R80110o11456m61513R65421P54102j980561m226175l450725
36147c712188r83596O86903J196369J196898O36709k03770l37871K5258l49853
36138a845141q65111N53666L244509L399469m53686m602063m701345q48936L293869
36129b824769M354421J560908k434979l029844J083522M740069K500754k765442
36121C184640l371171J051646K440250k532117o360752k573212L678177L855012
$$ plain form
36113 -627527 -1383356 -3762648 -3534975 -2412462 -3919424 -6144171 -4252487 1541884 5780570
36104 5780570 5549171 4103667 5263484 7273599 5019151 -2448140 -9340095 -9501676
36096 -9501676 -3920453 660806 500238 -1126372 -150646 1817551 1026143 -1148445 81820
36087 81820 4705077 7232547 5152585 2505770 2785379 3405980 808003 -3130177 -4290499
36078 -4290499 -2987928 -2641019 -3695569 -3820127 -3053945 -3500938 -3981317 -600139 5852382
36069 5852382 8403927 3013017 -5006514 -7917110 -5840121 -4927480 -7066690 -7734558
36061 -7734558 -4634458 -2052216 -3506540 -5205233 -1691111 5180128 8322497 4947964
36053 4947964 -1210922 -6478400 -10521909 -12695873 -10805311 -5523214 -1377322 -851079
$$ packed form
36113f27527p55829k379292K27673J122513j506962k224747J891684N794371M238686
36104E780570k31399j445504J159817K010115k254448p467291o891955j61581
36096i501676N581223M581259j60568j626610R75726J968197p91408k174588J230265
36087H1820M623257K527470k079962k646815K79609O20601k597977l938180j160322
36078d290499J302571L46909j054550j24558P66182m46993m80379L381178O452521
36069E852382K551545n390910q019531k910596K076989R12641k139210o67868
36061g734558L100100K582242j454324j698693L514122O871239L142369l374533
36053D947964o158886n267478m043509k173964J890562N282097M145892N26243
$$ plain form
36045 -851079 -1374369 -413537 628554 344677 785963 3254146 4526127 1684104 -2584470
36036 -2584470 -4257293 -4531001 -6734170 -9255328 -7893297 -4022084 -3790828 -8835598
36028 -8835598 -13647146 -13354614 -9181660 -4839716 -1972071 -760681 -1198447 -2123455 -2031674
36019 -2031674 -1762779 -3390292 -6225127 -7538431 -7407016 -8588412 -11073403 -11436020 -8670976
36010 -8670976 -5888555 -4684172 -2783546 567577 1919689 -609907 -3447121 -3141349
36002 -3141349 -1925237 -3596195 -7035401 -8173710 -6084713 -2969768 81574 3172663
35994 3172663 4655838 2209382 -3226145 -7674302 -8580366 -7082386 -5872118 -6233071
35986 -6233071 -7119202 -6542907 -4285608 -2775399 -3646304 -4364525 -1583855 2595825 2491618
$$ packed form
36045h51079n23290R60832J042091k83877M41286K468183J271981k842023m268574
36036b584470j672823k73708k203169k521158J362031L871213K31256n044770
36028h835598m811548K92532M172954M341944K867645J211390m37766r25008R1781
36019b031674K68895j627513k834835j313304J31415j181396k484991l62617K765044
36010h670976K782421J204383J900626L351123J352112k529596k837214L05772
36002c141349J216112j670958l439206j138309K088997L114945L051342L091089
35994C172663J483175k446456n435527m448157r06064J497980J210268l60953
35986f233071q86131N76295K257299J510209q70905p18221K780670M179680j04207
$$ plain form
35977 2491618 -2238433 -5081731 -2381470 1213219 878361 -329210 2832801 8319240
35969 8319240 9707345 6085530 2450713 1484135 1019242 -841479 -3650261 -7372158
35961 -7372158 -11993751 -14631191 -12314343 -7646067 -6356746 -9031782 -10809830 -9707996
35953 -9707996 -9019896 -10051642 -9071309 -4463912 -934213 -2328993 -5088163 -3777726
35945 -3777726 436013 2019758 -692667 -4664628 -7965438 -11099059 -12956735 -10763907
35937 -10763907 -5323844 -2022703 -4242053 -8592695 -9353134 -5966637 -3302133 -4895957
35929 -4895957 -8590093 -9796816 -7294251 -4018942 -2745660 -2980691 -2652346 -1253169
35921 -1253169 -11553 179088 -411497 -1255935 -2086531 -2603120 -2666885 -2770216 -3485810
$$ packed form
35977B491618m730051k843298K700261L594689l34858j207571L162011N486439
35969H319240J388105l621815l634817r66578m64893j860721k808782l721897
35961g372158m621593k637440K316848M668276J289321k675036j778048J101834
35953i707996O88100j031746R80333M607397L529699j394780k759170J310437
35945c777726M213739J583745k712425l971961l300810l133621j857676K192828
35937a0763907N440063L301141k219350m350642p60439L386497K664504j593824
35929d895957l694136j206723K502565L275309J273282k35031L28345J399177
35921a253169J241616J90641n90585q44438q30596n16589o3765j03331p15594
$$ plain form
35912 -3485810 -4423146 -4336537 -2283806 1495174 5382984 6960098 4815547 299855 -3569435
35903 -3569435 -5410470 -6329609 -7066141 -6441364 -3830977 -852934 1243621 3550721 6476787
35894 6476787 7124042 3013757 -3234669 -6528637 -5513959 -2812973 -378821 1497380
35886 1497380 1671540 -844053 -3803332 -4146523 -3132182 -4180453 -5962239 -3731219
35878 -3731219 1662525 2925147 -2845539 -8837098 -8119964 -3156287 -762776 -2046546
35870 -2046546 -3095226 -2537098 -2401098 -3129145 -3149448 -2521046 -2363584 -1559583 1443001
35861 1443001 4279614 2751783 -2921891 -8152392 -10110157 -9674663 -7599578 -3595359
35853 -3595359 207281 -131544 -4505619 -7607337 -5757071 -1533923 495714 -422213
$$ packed form
35912c485810r37336Q6609K052731L778980L887810J577114k144551m515692l869290
35903c569435j841035r19139p36532O24777K610387K978043K096555K307100K926066
35894F476787O47255m110285o248426l293968J014678K700986K434152J876201
35886A497380J74160k515593k959279l43191J014341j048271j781786K231020
35878c731219N393744J262622n770686n991559P17134M963677K393511j283770
35870b046546j048680N58128J36000p28047k0303O28402J57462Q04001L002584
35861A443001K836613j527831n673674n230501j957765M35494K075085M004219
35853c595359L802640l38825m374075l101718J850266M223148K029637r17927
$$ plain form
35845 -422213 -2017447 -2852301 -2756373 -1477108 439890 830835 -1591254 -4808375 -5579085
35836 -5579085 -3296517 -134582 1965079 2785033 2706582 1762701 240462 -530514 1329895
35827 1329895 6330929 11791347 12957933 7563668 -991074 -6674486 -6931018 -4098969
35819 -4098969 -1287352 455099 800177 -631202 -2410793 -1700677 1622675 3894830
35811 3894830 2804342 915680 1351651 2506719 693620 -3684266 -6744348 -7160502
35803 -7160502 -7372639 -8601348 -8790517 -6697973 -4403001 -3799970 -3511227 -1665376 490465
35794 490465 457169 -1492940 -2914276 -3036326 -3313986 -4321850 -4757356 -4000994 -3156662
35785 -3156662 -2450745 -30677 4523247 7334917 4130361 -3297843 -7890871 -5687501
$$ packed form
35845d22213j595234q34854R5928J279265J916998L90945k422089l217121p70710
35836e579085K282568L161935K099661Q19954p8451r43881j522239p70976J860409
35827A329895N001034N460418J166586n394265q554742n683412k56532K832049
35819d098969K811617J742451L45078j431379j779591P10116L323352K272155
35811C894830j090488j888662M35971J155068j813099m377886l060082m16154
35803g160502k12137j228709j89169K092544K294972O03031K88743J845851K155841
35794D90465l3296j950109j421336j22050k77660j007864m35506P56362Q44332
35785c156662P05917K420068M553924K811670l204556p428204m593028K203370
$$ plain form
35777 -5687501 -467131 2020025 1874311 3694428 8760541 12756770 11762644 6867139
35769 6867139 1466911 -2810891 -5500060 -5565423 -3199495 -1296526 -1891351 -2453485 820004
35760 820004 6656678 9302703 5819199 -440881 -4490614 -4875371 -2921995 211086
35752 211086 3414597 4646097 3017791 1144999 2709098 7394112 10390237 7933323
35744 7933323 1947302 -2210118 -1951537 288950 1205316 1052386 2215530 4544416 4997411
35735 4997411 2395920 -261324 106051 2403879 3371911 2156046 399701 -805088
35727 -805088 -1209685 153640 3438461 5594624 3376946 -1191850 -2329471 1825136
35719 1825136 6936369 8950233 8664671 8008505 6150451 2467240 -231324 677123 3337655
$$ packed form
35777e687501N220370K487156j45714J820117N066113L996229r94126m895505
35769F867139n400228m277802k689169o5363K365928J902969n94825n62134L273489
35760H20004N836674K646025l483504o260080m049733l84757J953376L133081
35752B11086L203511J231500j628306j872792J564099M685014K996125k456914
35744G933323n986021m157420K58581K240487R16366j52930J163144K328886M52995
35735D997411k601491k657244L67375K297828R68032j215865j756345j204789
35727h05088m04597J363325L284821K156163k217678m568796j137621M154607
35719A825136N111233K013864k85562o56166j858054l683211k698564R08447K660532
$$ plain form
35710 3337655 4474046 4473974 5532885 6786703 5716524 2996834 1331152 322307 -2664727
35701 -2664727 -6758270 -7731394 -4579918 -1222090 -397290 -409544 294591 -156586 -3018391
35692 -3018391 -5470999 -4579094 -1787513 -105963 611648 1860079 2100653 -1359626 -6881199
$$ packed form
35710C337655J136391p2J058911J253818j070179k719690j665682j008845k987034
35701b664727m093543r73124L151476L357828Q24800j2254P04135m51177k861805
35692c018391k452608Q91905K791581J681550P17611J248431K40574l460279n521573
$$ [...]
##END NTUPLES=NMR SPECTRUM
##END=
