##TITLE=31Pdec_4C1403-HBr
 CDCl3, 24 sc
 15.3.2023
##JCAMPDX= 6.0         $$ Bruker NMR JCAMP-DX V2.0
##DATA TYPE= NMR SPECTRUM
##DATA CLASS= NTUPLES
##ORIGIN= UXNMR, Bruker Analytische Messtechnik GmbH
##OWNER= root
$$ XWIN-NMR		Version 3.5
$$ Wed Mar 15 14:00:11 2023 Russian Standard Time (UT+4h)  she@DPX200
##.OBSERVE FREQUENCY= 81.013821
##.OBSERVE NUCLEUS= ^31P
##.ACQUISITION MODE= SIMULTANEOUS
##.ACQUISITION SCHEME= undefined
##.AVERAGES= 24
##.DIGITISER RES= 16
##SPECTROMETER/DATA SYSTEM= spect
##.PULSE SEQUENCE= zgpg30
##.SOLVENT NAME= CDCl3
##.SHIFT REFERENCE= (INTERNAL, CDCl3, 0, 248.564)
##AUDIT TRAIL= $$ (NUMBER, WHEN, WHO, WHERE, WHAT)
$$ ##TITLE= Audit trail, XWIN-NMR		Version 3.5
$$ ##JCAMPDX= 5.01
$$ ##ORIGIN= Bruker BioSpin GmbH
$$ ##OWNER= she
$$ F:/spectra/data/she/nmr/P31/1/pdata/1/auditp.txt
$$ ##AUDIT TRAIL=  $$ (NUMBER, WHEN, WHO, WHERE, WHAT)
(   1,<2023-03-15 13:59:02.59 +0400>,<she>,<DPX200>,
      <created by zg, POWCHK disabled, PULCHK disabled
       configuration hash MD5:
       00 E9 B6 7A A2 85 ED C7 34 08 36 98 17 FE 4E 26
       data hash MD5: 32K
       67 45 3F 9D 79 AC 42 11 69 07 35 17 23 62 1B 44>)
(   2,<2023-03-15 13:59:11.46 +0400>,<she>,<DPX200>,
      <Start of raw data processing
       efp BC_mod = 2 LB = 1 FT_mod = 6 PKNL = 1 PHC0 = -11025.24 PHC1 = 171.4102 SI = 64K 
       data hash MD5: 64K
       5E AD 70 B4 4D 75 DD 72 A7 80 BD 04 09 91 FF 60>)
(   3,<2023-03-15 13:59:31.84 +0400>,<she>,<DPX200>,
      <pk PHC0 = 30.72726 PHC1 = -24.00001 
       data hash MD5: 64K
       86 76 A2 27 11 30 F3 67 77 63 88 55 AA D3 C8 F0>)
$$ ##END=
$$ 
$$ hash MD5
$$ 31 28 FB 70 80 F9 59 E5 01 1C 60 42 AA 38 10 1A
##$RELAX= 
##$RELAX= 
##$RELAX= 
##$RELAX= 
##$RELAX= 
##$RELAX= 
##$RELAX= 
##$RELAX= 
##$RELAX= 
$$ Bruker specific parameters
$$ --------------------------
##$DU= <F:/spectra>
##$EXPNO= 1
##$NAME= <P31>
##$PROCNO= 1
##$TYPE= <nmr>
##$USER= <she>
##$AMP= (0..31)
100 100 100 100 100 100 100 100 100 100 100 100 100 100 100 100 100 100 
100 100 100 100 100 100 100 100 100 100 100 100 100 100 
##$AQSEQ= 0
##$AQ_mod= 1
##$AUNM= <au_zg>
##$AUTOPOS= <>
##$BF1= 81.014009
##$BF2= 200.13
##$BF3= 200.13
##$BF4= 200.13
##$BF5= 200.13
##$BF6= 200.13
##$BF7= 200.13
##$BF8= 200.13
##$BYTORDA= 1
##$CFDGTYP= 0
##$CFRGTYP= 5
##$CHEMSTR= <none>
##$CNST= (0..31)
1 1 145 1 1 1 1 1 1 1 1 1 1 1 1 1 1 1 1 1 1 1 1 1 1 1 1 1 1 1 1 1 
##$CPDPRG= <waltz16>
##$CPDPRG1= <>
##$CPDPRG2= <waltz16>
##$CPDPRG3= <>
##$CPDPRG4= <mlev>
##$CPDPRG5= <mlev>
##$CPDPRG6= <mlev>
##$CPDPRG7= <mlev>
##$CPDPRG8= <mlev>
##$CPDPRGB= <>
##$CPDPRGT= <>
##$D= (0..31)
0 1 0 0 0 0 0 0 0 0 0 0.03 2e-05 3e-06 0 0 0 0 0 0 0 0 0 0 0 0 0 0 0 0 
0 0 
##$DATE= 1678874341
##$DBL= (0..7)
120 120 120 11 120 120 24 19 
##$DBP= (0..7)
150 150 150 150 150 150 150 150 
##$DBP07= 0
##$DBPNAM0= <>
##$DBPNAM1= <>
##$DBPNAM2= <>
##$DBPNAM3= <>
##$DBPNAM4= <>
##$DBPNAM5= <>
##$DBPNAM6= <>
##$DBPNAM7= <>
##$DBPOAL= (0..7)
0.5 0.5 0.5 0.5 0.5 0.5 0.5 0.5 
$$ [...]
##$SUBNAM2= <"">
##$SUBNAM3= <"">
##$SUBNAM4= <"">
##$SUBNAM5= <"">
##$SUBNAM6= <"">
##$SUBNAM7= <"">
##$SUBNAM8= <"">
##$SUBNAM9= <"">
##$SW= 501.771253377433
##$SWIBOX= (0..15)
0 1 3 0 0 0 0 0 0 0 0 0 0 0 0 0 
##$SW_h= 40650.406504065
##$TD= 32768
##$TD0= 1
##$TE= 0
##$TE2= 300
##$TE3= 300
##$TEG= 300
##$TL= (0..7)
0 120 53 12 22 120 120 120 
##$TP= (0..7)
150 150 150 150 150 150 150 150 
##$TP07= 0
##$TPNAME0= <>
##$TPNAME1= <>
##$TPNAME2= <>
##$TPNAME3= <>
##$TPNAME4= <>
##$TPNAME5= <>
##$TPNAME6= <>
##$TPNAME7= <>
##$TPOAL= (0..7)
0.5 0.5 0.5 0.5 0.5 0.5 0.5 0.5 
##$TPOFFS= (0..7)
0 0 0 0 0 0 0 0 
##$TUNHIN= 0
##$TUNHOUT= 0
##$TUNXOUT= 0
##$USERA1= <user>
##$USERA2= <user>
##$USERA3= <user>
##$USERA4= <user>
##$USERA5= <user>
##$V9= 5
##$VALIST= <valist>
##$VCLIST= <CCCCCCCCCCCCCCC>
##$VD= 0
##$VDLIST= <DDDDDDDDDDDDDDD>
##$VPLIST= <PPPPPPPPPPPPPPP>
##$VTLIST= <TTTTTTTTTTTTTTT>
##$WBST= 1024
##$WBSW= 4
##$XGAIN= (0..3)
0 0 0 0 
##$XL= 0
##$YL= 0
##$YMAX_a= 4123
##$YMIN_a= -4334
##$ZGOPTNS= <>
##$ZL1= 120
##$ZL2= 120
##$ZL3= 120
##$ZL4= 120
##$ABSF1= 0
##$ABSF2= 0
##$ABSG= 0
##$ABSL= 0
##$ALPHA= 0
##$AQORDER= 0
##$ASSFAC= 0
##$ASSFACI= 0
##$ASSFACX= 0
##$ASSWID= 0
##$AUNMP= <proc_1d>
##$AZFE= 0.1
##$AZFW= 0.5
##$BCFW= 0
##$BC_mod= 2
##$BYTORDP= 0
##$COROFFS= 0
##$CY= -3
##$DATMOD= 1
##$DC= 0
##$DFILT= <>
##$DTYPP= 0
##$F1P= 0
##$F2P= 0
##$FCOR= 1
##$FTSIZE= 65536
##$FT_mod= 6
##$GAMMA= 0
##$GB= 0
##$INTBC= 1
##$INTSCL= 6.047779e-11
##$ISEN= 30
##$LB= 1
##$LEV0= 0
##$LPBIN= 0
##$MAXI= 10000
##$MC2= 0
##$MEAN= 0
##$ME_mod= 0
##$MI= 50
##$NCOEF= 0
##$NC_proc= -6
##$NLEV= 6
##$NOISF1= 182.463
##$NOISF2= 159.3651
##$NSP= 0
##$NTH_PI= 0
##$NZP= 0
##$OFFSET= 248.5645
##$PC= 4
##$PHC0= -10994.51
##$PHC1= 147.4102
##$PH_mod= 1
##$PKNL= yes
##$PPARMOD= 0
##$PSCAL= 0
##$PSIGN= 0
##$REVERSE= no
##$SF= 81.0140089999694
##$SI= 65536
##$SIGF1= 159.3651
##$SIGF2= -187.1042
##$SINO= 113.3802
##$SIOLD= 16384
##$SREGLST= <1H.CDCl3>
##$SSB= 0
##$STSI= 65536
##$STSR= 0
##$SW_p= 40650.406504065
##$SYMM= 0
##$S_DEV= 0
##$TDeff= 32768
##$TDoff= 0
##$TI= <>
##$TILT= no
##$TM1= 0
##$TM2= 0
##$TOPLEV= 0
##$USERP1= <user>
##$USERP2= <user>
##$USERP3= <user>
##$USERP4= <user>
##$USERP5= <user>
##$WDW= 1
##$XDIM= 65536
##$YMAX_p= 359584362
##$YMIN_p= -19169821
$$ End of Bruker specific parameters
$$ ---------------------------------
##NTUPLES= NMR SPECTRUM
##VAR_NAME=  FREQUENCY,     SPECTRUM/REAL,   SPECTRUM/IMAG
##SYMBOL=    X,             R,               I
##VAR_TYPE=  INDEPENDENT,   DEPENDENT,       DEPENDENT
##VAR_FORM=  AFFN,          ASDF,            ASDF
##VAR_DIM=   65536,         65536,           65536
##UNITS=     HZ,            ARBITRARY UNITS, ARBITRARY UNITS
##FACTOR=    0.620285442955139, 1,           1
##FIRST=     20137.2065510682, 0,            0
##LAST=      -20513.1999529968, 0,           0
##MIN=       -20513.1999529968, -19169821,   0
##MAX=       20137.2065510682, 359584362,    0
$$ Real data points
##PAGE= N=1
##DATA TABLE= (X++(R..R)), XYDATA
$$ [...]
43959f49117Q90979J301368R44784J59748n53455p31083l39220M6106j2822q7568
43949I69720L26938N82427l42606j830352j915197j19966J488716J077741l91355
43940a53934p35247K73705R65893N43620J3409K30429O06960L64006j44010j92874
43930A771957L5747j36095o42259p49779k63076J59610N2077j71854K6250L62845
43920D45423J65894m64999o83836j81602L05454J38148k66243k22049N5030j27151
43910h35931p26088j047282p93932k00977N86540J330676J265150O1365j056726
43901a417205o58659N68776O51853m05726m04392J313004K306726P17789j626082
43892A046084j878427l18701N93652J69717j29498L34245O48740M85175N46445
$$ y = [-649117, 241862, 1543230, 2488014, 2647762, 2094307, 1363224, 1024004, 1070110, 1057288, 969720, 1296658, 1879085, 1536479, -293873, -2209070, -2329036, -840320, 237421, -153934, -889181, -615476, 350417, 894037, 907446, 1137875, 1744835, 2108841, 1964831, 1771957, 1807704, 1671609, 1029350, 279571, 16495, 176105, 228182, 56328, 82578, 445423, 611317, 146318, -537518, -719120, -413666, -275518, -541761, -763810, -708780, -835931, -1562019, -2609301, -3403233, -3604210, -3017670, -1686994, -421844, -360479, -1417205, -2075864, -1507088, -855235, -1260961, -1665353, -352349, 1954377, 2672166, 1046084, -832343, -1151044, -557392, -387675, -517173, -182928, 465812, 950987, 1497432]
43883A497432P57105K48094o43792n83123K75699L21116n78953o82954L73464
43874I84088O47373n83264j145446L21601J601395L73612j715694j536116M98137
43865e54314J297246J87402m55982L45750O53910o18184j606716p06178P04671
43856g52395O53937l04800m62944N3738p8328p07950m73583O33286J124086N35203
43846B20250J70815Q31699J443315P95721n83318j321470j132108p65843n43173
43837h84112j06123M59090M04832l74540p24107K96117J800251J933276L28191
43828C132875j288649j350486m04410k0294m53731n89695M9671N95743L63143
43819C4167j28863j91241R639J14674L18550O83012O01990j26782n56006j0774
$$ y = [1497432, 2254537, 2502631, 1858839, 1275716, 1551415, 1872531, 1293578, 610624, 984088, 1631461, 1048197, -97249, 224352, 1825747, 2199359, 483665, -1052451, -554314, 742932, 930334, 474352, 820102, 1474012, 855828, -750888, -1457066, -752395, -98458, -403258, -866202, -812464, -890792, -1598742, -2072325, -1439039, -314953, 220250, 391065, 1222764, 2666079, 3461800, 2878482, 1557012, 424904, -340939, -884112, -990235, -531145, -126313, -500853, -1224960, -928843, 871408, 2804684, 3132875, 1844226, 493740, 89330, 69036, -384695, -974390, -924719, -328976, 34167, -94696, -285937, -276298, -161624, 156926, 839938, 1441928, 1315146, 759140, 748366]
43809G48366N84081J61685m78394J06027J255163Q75391j038267j884938k91242
43800C7872J669654J504773j77357r84032l49039K33590n1746m45999l99824m20496
43790F17396p92108r11647m20132J01774O6446l27779n92236n05209K0187Q31535
43780a911773J173058L73277q74834r66179M50813J767170J478384N1698j000656
43771E40958j109623q24735o04193m06698j97679k8078K40778O32768O69941l8034
43761a124595r33946r15344L33451J871507K423471J494909l17185j790780j975463
43752i33975r79108J81783O97236P01709O81819N71918j8104q92405j228184n54704
43742a772015O05568J220721P46131l39164r30000l96737O51746J003909L31714
$$ y = [748366, 1332447, 1494132, 1015738, 1121765, 2376928, 3252319, 2214052, 329114, 37872, 1707526, 3212299, 3034942, 2050910, 1701871, 1935461, 1883715, 1437716, 1037892, 617396, -174712, -1086359, -1506491, -1404717, -1338271, -1666050, -2258286, -2763495, -2743308, -1911773, -738715, -365438, -1240272, -2206451, -1755638, 11532, 1489916, 1541614, 540958, -568665, -1393400, -1997593, -2404291, -2601970, -2630048, -2389270, -1756502, -1086561, -1124595, -2058541, -2973885, -2640434, -768927, 1654544, 3149453, 2832268, 1041488, -933975, -1913083, -1731300, -1034064, -332355, 349464, 921382, 903278, 10873, -1217311, -1772015, -1166447, 54274, 800405, 461241, -468759, -865496, -213750, 790159, 1121873]
43733A121873m09175k85037M40550Q43656N66029l0595n43737p70163n66392o9175
43723B97834J76835j25117m84542l09500J62202K89338J04622J48972L88089K18025
43713H66758l89276o49948j48331N05920N82176J94131o4062n633P1504m0058
43703I23181j73671n6186K73460L63569j60040r23125j006354j44308P19825O34088
43693D50439l0265k29357J14182J73882j66491J3519J043532J806136J174571
43684D350148m48151j710744j890980j265040l61614M63189R26925Q79270M58478
43675A401481n4639m30422m73261j32470K66932K97774M4313j2076J92292J87806
43665A287730j82309m92361n54379p24534j016589p86875R7835O61360K46455
$$ y = [1121873, 712698, 427661, 868211, 1711867, 2277896, 2247301, 1703564, 933401, 367009, 297834, 474669, 349552, -134990, -444490, -282288, 7050, 111672, 260644, 648733, 866758, 477482, -172466, -320797, 185123, 767299, 961430, 897368, 891735, 963239, 923181, 749510, 693324, 966784, 1330353, 1170313, 247188, -759166, -903474, -183649, 450439, 420174, 190817, 304999, 478881, 312390, 325909, 1369441, 3175577, 4350148, 3901997, 2191253, 300273, -964767, -1326381, -863192, 63733, 943003, 1401481, 1346842, 916420, 443159, 310689, 577621, 875395, 919708, 907632, 1099924, 1287730, 1105421, 613060, 58681, -665853, -1682442, -2469317, -2371482, -1710122, -1463667]
43656a463667k33767M14867J665006J836346M83942j014888j342691o26945K49142
43647c2655P10180N43626j89346q62089o85764J35866L93178m64294j376313j076405
43637b904016J57754R92339Q59325L70136J01909p2052l48505n24809m36518k33984
43627b038421L1110M93671Q87673N68343m16474r51404k45737R23214J202077
43618D54052N15743o7128j15878k86889q43603r70516j47660P90384P62431j06988
43608a6052r10942j201181j009930k62277Q68758J503630R93465j1827m32246
43599d78602l32581m82839o84179l087J306744J690538N68446o49774n60788L35400
43589G09278O10434m5323o64399m19975M91732J108112N40198r92937j899945
$$ y = [-1463667, -1697434, -1282567, 382439, 2218785, 2702727, 1687839, 345148, -281797, -32655, 677525, 1221151, 1031805, 169716, -516048, -380182, 12996, -451298, -1827611, -2904016, -2746262, -1753923, -894598, -524462, -422553, -494605, -843110, -1367919, -1804437, -2038421, -2007311, -1513640, -625967, -57624, -474098, -1425502, -1671239, -748025, 454052, 969795, 902667, 786789, 499900, -343703, -1314219, -1461879, -671495, 90936, -16052, -926994, -2128175, -3138105, -3400382, -2531624, -1027994, -34529, -46356, -478602, -811183, -1294022, -1978201, -1981288, -674544, 1015994, 1584440, 934666, 373878, 709278, 1319712, 1274389, 609990, 190015, 681747, 1789859, 2330057, 1337120, -562825]
43580e62825q13899J376863K189782O71379j328557j694811o41270K31567L48981
43571b22790K84942K47586q5396n56089o15274k72136L2367K69197O22241P56020
43561D60668K50894m81974o47332k03106K67526M89506N00130J98363k30932o2328
43551E41415P56986Q93202n12249k006138j599322J29566P64978k41361q41936
43542b114859K43332J610653J503745K40738p85251j054986p58651M0505R36746
43533a38028R65506k0836p05624j06297Q72110P81523k72757j028939r29488m74605
43523a057435j81733j60675l40466l61683K55562J174945J205742L979j018859
43514d80623n23342P75872J150926K63653p64169j196827j209618q52876P2525
$$ y = [-562825, -1376724, 139, 2189921, 2861300, 1532743, -162068, -803338, -571771, -222790, 62152, 309738, 224342, -331747, -947021, -1219157, -1186790, -917593, -295352, 460668, 711562, 229588, -417744, -620850, -353324, 136182, 636312, 834675, 603743, 541415, 1298401, 2191603, 1679354, -326784, -1926106, -1796540, -1031562, -1272923, -2114859, -1871527, -260874, 1242871, 1483609, 698358, -356628, -1115279, -1074774, -138028, 827478, 806642, 101018, -5279, 866831, 1648354, 1375597, 346658, -582830, -1057435, -1239168, -1399843, -1740309, -2101992, -1846430, -671485, 534257, 538236, -480623, -1003965, -228093, 922833, 1186486, 422317, -774510, -1984128, -2837004, -2764479]
43505b764479J101824J342114P56075J50474j51208n16503q32128l83380P48300
43496e48911J319948N56815p14973j194031p12425j04555M9985p5728q5894J30296
43486a379473M28051O61578P82879O97338J78182p69252j487026j171971m1186
43477b100880O55746K55720l62388j30578N76220O43313L6682k78337R686K46804
43467d48012J39268J36179L07656O9487n83078p07247J35260J016878R22639J24023
43457A113053m25289m27925k47016p0407J71510L44865K37714j747o9825j6885
43447F08048r2131j91569N5950O14979Q74176L81301m56393p43450k45008J85873
43437I91776k56663r97057o65573Q26523J758742Q10217j012157j660132p18898
$$ y = [-2764479, -1662655, -320541, 435534, 586008, 434800, -81703, -913831, -1297211, -548911, 771037, 1327852, 612879, -581152, -1293577, -1398132, -1348147, -1423875, -1509769, -1379473, -951422, -289844, 493035, 1190373, 1368555, 599303, -887723, -2059694, -2100880, -1445134, -1189414, -1551802, -1682380, -1106160, -462847, -426165, -704502, -694816, -448012, -308744, -172565, 135091, 204578, -378500, -1085747, -950487, 66391, 989030, 1113053, 687764, 259839, 12823, -57584, 113926, 458791, 696505, 694758, 624933, 608048, 515917, 324348, 380298, 995277, 1869453, 2250754, 1794361, 1050911, 805903, 991776, 735113, -261944, -927517, -100994, 1657748, 2467965, 1455808, -204324, -923222]
43428i23222L81793N48311J31082j72753k76146k52484L1281M24540M58203J25106
43418D75711n3235N0148K924k27978q5008N01337P82917L66567j53277j97159
43408A462947k8970j10118l66886n40310n85762m09959N5555L32750j26859p75403
43398a093015m32077Q08357J470636R40399K97567K55802j7750r73503j342214
43389h5798k81342P16292K5238j245526q57123R09735J661327O16571n34087o09995
43379C15292l88334n12258j92209R43604J546905N07086j071749j322246k44715
43370d18624N06319O3922o97046o56745R8251O53850N17732M2733k13485j30616
43360b33709J04215M17108P15877N71220k64663j047882o81224O02244J268767
$$ y = [-923222, -541429, 6882, 137964, -34789, -310935, -563419, -532138, -107598, 350605, 475711, 422476, 472624, 475548, 247570, 162562, 663899, 1446816, 1813383, 1660106, 1462947, 1433977, 1323859, 956973, 416663, -169099, -579058, -523503, -190753, -317612, -1093015, -1525092, -716735, 753901, 1694300, 1991867, 2247669, 2229919, 1256416, -85798, -367140, 349152, 374390, -871136, -1728259, -818524, 842803, 1459374, 925287, 315292, -73042, -585300, -777509, 166095, 1713000, 2220086, 1148337, -173909, -418624, 87695, 151617, -545429, -1202174, -1103923, -450073, 67659, 110392, -103093, -233709, -129494, 287614, 1003491, 1574711, 1310048, 262166, -419058, 183186, 1451953]
43351A451953O81013K1202J84941J48171j147972k502302j977264L1801J353231
43342a755226J273170J017005J116957O85099l39035o02601J88919M23066o59810
43333A347544j396286l63203J162561J167833q2571q95971r22754j040080j198218
43324b221145n39486N62828O60329l29495o66792N94106K016122J749589Q2574
43315A908630j056918o57559L49935O15471O1517m05300l91095m14262p25760
43306g15341o26167L43846J209628P17751n95483q98485K19865J040047L29474
43297A025135p94045p04090K28034M21107l71264q77928l99661L60331O10004
43288e02377M08136P7292l33111o93936o70843k51830J53544L07934L43181L17247
$$ y = [1451953, 2132966, 2154168, 2339109, 2487280, 1339308, -1162994, -3140258, -3108457, -1755226, -482056, 534949, 1651906, 2337005, 1997970, 1395369, 1584288, 2007354, 1347544, -48742, -411945, 750616, 1918449, 1835878, 939907, 17153, -1022927, -2221145, -2760631, -2197803, -1537474, -1866969, -2533761, -1939655, 76467, 1826056, 1908630, 851712, 194153, 544088, 1159559, 1221076, 815776, 424681, 10419, -715341, -1341508, -997662, 211966, 929717, 334234, -564251, -344386, 695661, 1025135, 231090, -473000, -244966, 176141, -195123, -1073051, -1472712, -1112381, -502377, -94241, -16949, -350060, -1043996, -1714839, -1966669, -1813125, -1505191, -1162010, -844763]
43278h44763J37875r321K42112P69081R45235N03722p7678k86429k12083j67379
43268A000372p5858L04065P32122N86562k60121j053919j000570l08262R6898
43259B1289j07981k52475J27960M53468J03557m26843l41037L5164j22272m79287
43249i88457n1121P70831N38402o32362p87862P05948J750568O25165j264976
43240F66136j539261l19531N05602M29677M53470O85207K14976p16690p00254
43231c20668L90140R43888J47516q01289o81052J01380N74039N45899J54377o65617
43221C88613j485378j325767j18659Q27352O24785L2762L1176K45402j04281n84390
43211a468385j96247Q90444J529206J269359O93925K01977m22902j096712j113016
$$ y = [-844763, -706888, -716209, -474097, 294984, 1240219, 1743941, 1666263, 1379834, 1167751, 1000372, 924514, 1228579, 1960701, 2547263, 2287142, 1233223, 232653, -75609, 21289, -86692, -339167, -211207, 242261, 345818, -81025, -422062, -386898, -509170, -988457, -1039578, -268747, 269655, -362707, -1150569, -444621, 1305947, 1931112, 666136, -873125, -1192656, -687054, -257377, 196093, 881300, 1096276, 379586, -320668, 69472, 1013360, 1160876, 359587, -321465, -220085, 353954, 899853, 1054230, 388613, -1096765, -2422532, -2541191, -1713839, -1089054, -1056292, -1025116, -779714, -883995, -1468385, -1664632, -774188, 755018, 2024377, 2718302, 2920279, 2497377, 1400665, 287649]
43202B87649j88409Q46058R39525O9406q47564j092607p47320k09372L62865Q37511
43192B57742P79750l1236q81023o97309M52315J217718P44951j75757l77063M1494
43182A331582K45710J72098L20620M76775k9277r38234j244416p66357k64799
43173f96298K9295N84115J099471M99551j044716j687033m62253J095931J109845
43164E27908K2182l31496M32677R06799J73822r77437j322762o85562J86656N89876
43154d77337L89335p0242l45662k81621n7179J09476J23635n9023l46711m11908
43144a427237q6391K60953K75841L28632Q69761J298045O46831o01466q48112
43135G16857J20326N83501l77167j260008n67240O43764M59799o91248p22619
$$ y = [287649, 99240, 945298, 1884823, 1954229, 1106665, 14058, -733262, -942634, -579769, 257742, 1037492, 1006256, 125233, -572076, -119761, 1097957, 1842908, 1667151, 1290088, 1331582, 1577292, 1749390, 2070010, 2546785, 2517508, 1579274, 334858, -431499, -696298, -667003, -82888, 1016583, 1516134, 471418, -1215615, -1677868, -581937, 527908, 550090, 218594, 651271, 1558070, 1731892, 754455, -568307, -1253869, -1067213, -477337, -88002, -158244, -503906, -785527, -842706, -733230, -609595, -668618, -1015329, -1427237, -1513628, -1252675, -976834, -648202, 221559, 1519604, 2166435, 1564969, 716857, 837183, 1420684, 1043517, -216491, -783731, -139967, 319832, -371416, -1094035]
43126a094035O60808J447792M94797q00350p60113K11499N93806K2973n46905
43117B30272m30799L2894J92586j27356o01416p91120m79422K00584Q68854J128200
43107B23277P90522P0795m63250m46650k38466m23557p40038k51184J076327J846225
43097A444001J014164n47035j210165p14824k4175L99803P79085P65799l13890
43088A592763j752557j703350J28470J515213N92624j402460j768168q5074J352255
43079a530284Q69913m24421n17131O44903J340350O37929m84345p24253j05391
43070b92730N07470P56307Q26545O34124p067n79438l08995M73369N12917m73824
43060B048678j176811n90436M72103O36256r3736o81376o96652m91134k15410
$$ y = [-1094035, -433227, 1014565, 1509362, 709012, -51101, 160398, 754204, 777177, 230272, -200527, -167633, 24953, -102403, -703819, -1494939, -1974361, -1773777, -904923, 223277, 1013799, 1084594, 621344, 174694, -63772, -487329, -1227367, -1478551, -402224, 1444001, 2458165, 1911130, 700965, -13859, -38034, 361769, 1140854, 1906653, 1592763, -159794, -1863144, -1734674, -219461, 373163, -1029297, -2797465, -2882539, -1530284, -660371, -1084792, -1601923, -957020, 383330, 1021259, 536914, -187339, -292730, 214740, 971047, 1797592, 2431716, 2424649, 1845211, 1536216, 2009585, 2522502, 2048678, 871867, 281431, 753534, 1389790, 1296054, 614678, -81974, -573108, -788518]
43051g88518J77977K93769j64847m78381K15785J294801J256426j5363r96155
43042G95494p67573j11845P3254M7998K19066J57920m06920o96912r8283N78010
43032b09791K54183o21005p03964J86749Q99993P13999J04574k81843l28539L2871
43022D7227R01391J626011J013404r70291k526248j995736l6156J171777O87564
43013h1057k84745l63971K56318N96819N01513M81664M93789L3726o85971q15583
43003A32502k86415l4807m38986o54862j37007K90149j62322p42912l23894O30869
42993a727685P24099j20986n81704l3280P40226J037079J006492O88637k40826
42984A492052j316783j331327k08741N34168L3199n52511K5188J045050J049833
$$ y = [-788518, -610541, -316772, -481619, -960000, -744215, 550586, 1807012, 1791649, 795494, 27921, -83924, -10670, 37328, 256394, 414314, 7394, -689518, -787801, -209791, 44392, -576613, -1280577, -1093828, -193835, 520164, 624738, 342895, 14356, 47227, 948618, 2574629, 3588033, 2617742, 91494, -1904242, -1940398, -768621, -81057, -365802, -729773, -473455, 123364, 624877, 1106541, 1600330, 1634056, 948085, 132502, -153913, -188720, -627706, -1282568, -1419575, -1129426, -1291748, -2034660, -2358554, -1727685, -1003586, -1124572, -1706276, -1739556, -999330, 37749, 1044241, 1732878, 1492052, 175269, -1156058, -1364799, -830631, -797432, -1349943, -1324755, -279705, 770128]
42975G70128J67458l21219r6927M0498k38630m95399o30975r37307j100604m46503
42965c289480P51918J388892J067377M62651R4773j53180k36149J21701N33402
42956G41905K32057n08421n44748K12406N04857r6177l23866N29239J081877K6775
42946A855904j493748j495380k44140L02793k80466m18450N54445J154444K34419
42937A69821j033027r07993L52490J053662N25382k84480m26408j7455L62609
42928b05399M45131K03476l39729q94589q95462r6085R45328J272375N35173n00621
42918D69598o57827L06855J247046Q40828p85061k043660j624053Q7129J500877
42909f58268J484276L25888p62768q86071k22263L90153N17501M73092M96930
$$ y = [770128, 937586, 616367, 519440, 559938, 321308, -174091, -805066, -1742373, -2842977, -3289480, -2537562, -1148670, -81293, 381358, 476131, 322951, 86802, 208503, 741905, 973962, 465541, -79207, 133199, 638056, 541879, 218013, 747252, 1829129, 1855904, 362156, -1133224, -1377364, -1074571, -1355037, -1773487, -1219042, -64598, 169821, -863206, -1771199, -1418709, -365047, 160335, -124145, -550553, -568008, -205399, 239732, 443208, 103479, -791110, -1686572, -1782657, -837329, 435046, 970219, 469598, -188229, 118626, 1365672, 2206500, 1421439, -622221, -2246274, -2159145, -658268, 826008, 1151896, 389128, -496943, -719206, -329053, 188448, 661540, 1158470]
42900A158470J89103o67833j255253o57634N96393J070855M77695o5838l303r8612
42890G44043p01243q08166J38675R26622M15297m62362j89285P42683O36706n15330
42880I27640r92119j75455N56363J77693m92036l74315J97358K82889j93258o06865
42870f92105n76701j24649N33057R22885N88780k69749r40037j068862q05410
42861b432791j82801P90392J501485J222878K66376l70081m76318o11281p26105
42852a018246k43013M65312L19676n11896o53563J01974L63491l02214m53337
42843a931816O01006J331636N33878n52815l42405N19416M99136k84189p09325
42834c35478o37119m54657J67971J242720J431370L0022j247729o42896O99201
$$ y = [1158470, 1347573, 679740, -575513, -1233147, -636754, 434101, 911796, 845958, 842655, 744043, 42800, -765366, -626691, 299931, 715228, 252866, 63581, 806264, 1442970, 927640, -64479, -239934, 316429, 494122, 2086, -372229, -174871, 108018, -85240, -692105, -1268806, -1393455, -860398, 62487, 651267, 381518, -558519, -1627381, -2432791, -2615592, -1825200, -323715, 899163, 1165539, 795458, 319140, -292141, -1018246, -1261259, -795947, -476271, -988167, -1641730, -1539756, -1176265, -1478479, -1931816, -1330810, 826, 534704, -18111, -360516, 158900, 658036, 373847, -335478, -972597, -1427254, -1259283, -16563, 1414807, 1444829, 197100, -445796, 253405]
42825B53405N79832n75154o68566K93770M59687k88132k38221O80774O19160n92257
42815E24298q19707N35392J227671J1742j135741l98498Q27213L85480j130109
42806B7741j566424n07504O90279J143527R13972Q1430j008252j263274j20442
42797a608947J228174J173861j91394j353494j294235k40751R60137J443804Q92905
42788A010060R8305J98888R12571O59629r45552k153773j610508l65185j5905
42779b211470k03342L44739J317445J305327K22309n88150m52015J8081L11085
42770F4009N74867P33457L30089n19478r74491n12643M52862J020373N32179q04367
42760H96857j741737j127643L96675Q45633l47717j322645n83511O33533M10211
$$ y = [253405, 833237, 258083, -410483, -116713, 342974, 54842, -183379, 497395, 1116555, 524298, -295409, 239983, 1467654, 1479396, 343655, -54843, 772370, 1157850, 27741, -1538683, -2046187, -1355908, -212381, 701591, 783021, -225231, -1488505, -1608947, -380773, 793088, 601694, -751800, -2046035, -2286786, -1326649, 117155, 1010060, 1108365, 1307253, 2219824, 2879453, 1933901, -219872, -1830380, -2195565, -2211470, -2414812, -2070073, -752628, 552699, 775008, 186858, -265157, -247076, 64009, 638876, 1372333, 1702422, 1182944, 208453, -304190, 148672, 1169045, 1701224, 896857, -844880, -1972523, -1575848, -730215, -1077932, -2400577, -2984088, -2350555, -1940344]
42751a940344o65555m96552J038516J911531J134824l4077l31924m4268J16622
42742F88773O9172j66742o56764q82956k72040M29873p2741j234337r72939J014723
42732b055978K291985J178852o83709q61869L58074R39231M15009J5502R8996
42723A696093k13556q93742p59603J72281K09412j191435k022437o35295J439021
42714b199261J538296j52626r24906L08297J500724P53615r18401j388861m92773
42705a975896L11431L82572K81161K49681J8504p0602O02087J433838J034998
42696B267774n61853j646724j239770l22506o5532k08730k4255L20578L35670
42687a145348K05783K95757M11899L23419K97343M76014N02813L12147L75213
$$ y = [-1940344, -2605899, -3102451, -2063935, -152404, 982420, 948343, 616419, 572151, 688773, 757945, 591203, -65561, -948517, -1220557, -790684, -863425, -2097762, -3070701, -2055978, 236007, 1414859, 731150, -130719, 227355, 1166586, 1581595, 1597097, 1696093, 1482537, 588795, -170808, 1473, 210885, -980550, -3002987, -3638282, -2199261, -660965, -813591, -1738497, -1430200, 70524, 824139, -94262, -1483123, -1975896, -1664465, -1281893, -1000732, -751051, -732547, -803149, -201062, 1232776, 2267774, 1705921, 59197, -1180573, -1503079, -1568611, -1777341, -1801596, -1481018, -1145348, -939565, -643808, -231909, 91510, 388853, 864867, 1367680, 1679827, 2055040]
42678B055040O41943L48818n20798q79010l93214k46650j026619j414151l64411
42669a799052Q93898P50616j86637l12554K47119K37363k50783j53379L06570
42660b66839L8798n89011k05278Q92481R24986k98418q61959J46691J194228Q16634
42650A792313l06904p90315n03331j02393J51723K31671K3927j90122J02244O27444
42640A036257N81200J27325K53678Q38764N19147r30571j820883j069598J20347
42631c44334K64517j94031p1571L98615K03859m77762n45886J97381Q45854P94301
42621A070943K61255l76831q18334o34569K21483Q52329K88056j048217j554902
42612a738787l65378J479966K085513P53295j202616j785559m87697J117104J229614
$$ y = [2055040, 2696983, 3045801, 2525003, 1645993, 1252779, 1006129, -20490, -1434641, -1799052, -905154, -154538, -341175, -653729, -406610, -169247, -420030, -573409, -266839, -228041, -817052, -1022330, -129849, 795137, 496719, -365240, -218549, 975679, 1792313, 1485409, 695094, 191763, 89370, 241093, 472764, 496691, 306569, 408813, 1036257, 1617457, 1744782, 1998460, 2837224, 3356371, 2425800, 604917, -464681, -344334, -79817, -273848, -345419, 53196, 257055, -220707, -766593, -569212, 276642, 1070943, 1332198, 955367, 137033, -497536, -276053, 576276, 864332, -183885, -1738787, -2104165, -624199, 1461314, 2214609, 1011993, -773566, -1261263, -144159, 1085455]
42603A085455n0414j043741p11096K84196P85980N59493J72369J07098L84821
42594A574161P06115P42681M92404K54658K5922o29538j612499j879236r23808
42585a249140J2376m40515j443062r26876J197026K655479J971713K80649o21717
42576A435933m90946j12122Q3167r159m87482r38442n51309O02614J328645R05853
42566A766752j7747n87663p57257o91682k92381J83632J63021j38071J32547Q10143
42556E71294O58842m92570j141658m10067N98959O59629J57806l5865j377j8038
42546E46955K63539Q31120Q03365o9614p22551n22401k46391m25725l95319L3684
42536I6662j23639r11555p80055N67912J090486n7597n61982J081618K345282
$$ y = [1085455, 1035041, -8700, -719796, -435600, 350380, 909873, 1082242, 1189340, 1574161, 2280276, 3022957, 3515361, 3770019, 3795941, 3166403, 1553904, -325332, -1249140, -1236764, -1677279, -3120341, -4047217, -2850191, -194712, 1777001, 2057650, 1435933, 944987, 832865, 916032, 906873, 419391, -519051, -1070360, -467746, 860899, 1766752, 1749005, 1161342, 404085, -287597, -579978, -396346, -233325, -371396, -238849, 571294, 1230136, 737566, -404092, -814159, -215200, 444429, 602235, 566370, 564993, 546955, 810494, 1641614, 2444979, 2375365, 1652814, 1130413, 884022, 458297, 62978, 96662, -26977, -938532, -1718587, -1150675, -60189, -117786, -679768, 401850, 2747132]
42527B747132O17835k004420j785406N58950J229030k35433o27762R51800J566577
42518C018303k05549j733310q42186P58639O69210m60389o36256J89792O73635
42509A431889L85889j82968p18904q94280k59569P07811P37277k70499q74577
42500F2069m00096O5156k17319l73187K03558N56473J7537l73369K94431J101938
42490I37191Q83487R2327l24281n17740p88575m95959N19379Q56840l31454j469418
42480f38203p59722Q78573J207656J13754o25384m35933m17986q53838n98566
42471b129649O50390J500294J009484J02362j3153L68103J78834o81879j228816
42462b44030p20833M47165J164992P86082j19868l98088K26798Q05776N63618
$$ y = [2747132, 3364967, 1360547, -424859, 134091, 1363121, 1127688, 499926, 1451726, 3018303, 2812754, 1079444, 237258, 995897, 1665107, 1204718, 568462, 758254, 1431889, 1817778, 1634810, 915906, 21626, -237943, 469868, 1207145, 936646, 62069, -338027, -272871, -490190, -863377, -659819, -103346, -85809, -459178, -164747, 937191, 1820678, 1913005, 1588724, 1070984, 282409, -213550, 305829, 1162669, 831215, -638203, -1397925, -519352, 688304, 802058, 176674, -259259, -677245, -1531083, -2129649, -1479259, 21035, 1030519, 1132881, 1119728, 1487831, 1666665, 984786, -244030, -964863, -517698, 647294, 1433376, 1313508, 915420, 1142218, 1947994, 2511612]
42453B511612l8138k17216j49209m38402q43645o29675M8841K17750m36996j116352
42443a091430j094622n62942o6172K44218N09886P70747R24390Q51121N08008
42434I93204M8570k47563l10951l37698l87029k90258j06071j25988j98542K25388
42424g36938R69347R41586k12000j152150n99338O76737R30015L0952n11568j556
42414C35087N29665J55260o06880q86931p41112n60167j17182Q56120J722063
42405F85923J530567L52314p43591r91854o09061j66917J37426L85388N25155
42396A105350M11673J30577l2258n618r1657n31563j039636j024749k82067P40333
42386f19615J376344J250188M07980p20590j440811j248158l62850M20857N44184
$$ y = [2511612, 2473474, 2256258, 2107049, 1668647, 825002, 195327, 244168, 461918, 24922, -1091430, -2186052, -2748994, -2815166, -2570948, -2061062, -1290315, -365925, 485196, 993204, 1041774, 794211, 483260, 145562, -241467, -531725, -637796, -763784, -962326, -736938, 232409, 1173995, 961995, -190155, -789493, -112756, 817259, 848211, 336643, 335087, 864752, 1020012, 413132, -473799, -1214911, -1775078, -1892260, -1036140, 685923, 2216490, 2568804, 1825213, 833359, 224298, 57381, 194807, 580195, 1105350, 1517023, 1647600, 1615342, 1609724, 1518067, 986504, -53132, -1077881, -1359948, -619615, 756729, 2006917, 2414897, 1694307, 253496, -994662, -1357512, -936655, -392471]
42377c92471J39451l21633m92044k37113L06993O61840M40366l1761j9923N56152
42367F09857R25270N42916k19449p27956q23831o10361j58788K13443O2894l77072
42357e63077k83977L88272N50827l12854j064086n53776N26954P38005J56679
42348d17033K8944N41964O28709L192k89989K46517O62206K28721k99274k9433
42338A304524M89184J54294q56094j269462n05501O38693J070961N28807l63578
42329A191828o85532L2347J195256J454143J92066j443787j714984n01294N39171
42320B59214L03880k79577O9515P35481J19159j502638j898693k16739J399623
42311a010775Q38038p94653r37401M14605Q83661l07429j152768k99945P91664
$$ y = [-392471, -253020, -574653, -1066697, -1303810, -996817, -334977, 105389, 73628, 53705, 609857, 1535127, 2078043, 1858594, 1130638, 306807, -303554, -462342, -248899, -186005, -563077, -847054, -458782, 92045, -220809, -1284895, -1838671, -1311717, -573712, -417033, -388089, 153875, 782584, 785776, 495787, 742304, 1404510, 1633231, 1333957, 1304524, 1793708, 1948002, 1091908, -177554, -683055, -44362, 1026599, 1555406, 1191828, 506296, 538643, 1733899, 3188042, 3380108, 1936321, 221337, -279957, 259214, 563094, 283517, 353032, 1088513, 1207672, -294966, -2193659, -2410398, -1010775, -172737, -967390, -1904791, -1490186, -606525, -913954, -2066722, -2366667, -1575003]
42302a575003M57688m61716k99855O15417Q19661K77280M2040J47197j01886l01392
42292c80569M33558J348701Q08054q16853j328946j80133N36037n47831j824574
42283a952556j229292O24877J510429P68637k35742l64834N4221K27832O0218
42274e36210K4747L55092O22968J92622p89248j199667l19751R24662J069759
42265C44974K58689k3890N84451P20228l28347j277416q91486M4408J38556l25052
42255g54885p2014R04937J371028Q32683P7558k13916k17263k79769m42598o84019
42245E21742q78608o15216K16990Q83300O53849l9091j82477K85369M94684R1753
42235A432295l31829k93965L454K39698L08391N4503n34677r09555n60317M8369
$$ y = [-1575003, -1117315, -1579031, -1878886, -1263469, -443808, -166528, -124488, 22709, -79177, -380569, 52989, 1401690, 2209744, 1392891, 63945, -116188, 419849, -127982, -1952556, -3181848, -2556971, -1046542, -277905, -513647, -878481, -824260, -596428, -536210, -511463, -156371, 466597, 659219, -130029, -1329696, -1649447, -724785, 344974, 603663, 579773, 1164224, 1884452, 1556105, 278689, -612797, -568389, -429833, -754885, -826899, 78038, 1449066, 2281749, 2359307, 2145391, 1928128, 1648359, 1205761, 521742, -356866, -972082, -755092, 128208, 782057, 742966, 560489, 845858, 1340542, 1432295, 1100466, 806501, 809955, 1049653, 1358044, 1412547, 877870, -31685, -592002, -543633]
42225e43633P4329l01532k07438K49684M9692p91656q94979K38487J146549N61288
42215d19209o35287q59615k03522Q8127j98917j76401L37044M69562j56402p86282
42205b540902o71179J20487J136453J862560J616705K16556j143530q95828P16887
42196D18209J687440R27371l92914q67849q28138j161723j403257n86304P66661
42187a440504J222034O48714K06539K79417J19190l71887k92782L97637M27404
42178A195762o21950j332957o85947K22042K5691o54536m33659L90743M74059
42169a420752j48040k39830L05465L09677m28050o45143J62420P90923L20443
42160i92887m64248n16154r0794Q4479R2859K79455L60683P5604q8741K29046
$$ y = [-543633, -469304, -770836, -978274, -728590, -678898, -1470554, -2365533, -2127046, -980497, -419209, -1054496, -1914111, -2117633, -2029506, -2228423, -2404824, -2067780, -1598218, -1754620, -2540902, -3212081, -3091594, -1955141, -92581, 1524124, 1740680, 597150, -298678, 418209, 2105649, 3033020, 2640106, 1772257, 944119, -217604, -1620861, -2207165, -1440504, -218470, 430244, 636783, 916200, 1035390, 663503, 370721, 768358, 1195762, 573812, -759145, -1445092, -1223050, -1197359, -1851895, -2285554, -1894811, -1420752, -1568792, -1808622, -1503157, -1193480, -1621530, -2266673, -2104253, -1313330, -992887, -1457135, -1973289, -2064083, -1979604, -1886745, -1607290, -1246607, -1171003, -1259744, -1030698]
42150a030698M54903R4062k61282Q950L10088r9885n28291J68988J460980J612887
42140B190702K40506j088163j026672K0970Q51475Q72946K27437n88522r22358
42131G78321n38816j11861l54533p43311k07784R15118J025559k86032j378379
42122i01718q64578N08723J189220Q82619K55586l77314q56739n53884O88515
42113b9570J637132J084267l07096r66291p53326p59001j104936p89836K19937
42104a768720O61856J72850l6307N66575P29907l15616j165755l56622J160443
42095c51389J436079M45353l02606l90093o70364j141701p91739K95764P12762
42086g57934O2563l53525J71522O04928K11916n7848N42140R28218M1899j025731
$$ y = [-1030698, -575795, -481733, -743015, -734065, -423977, -523862, -1052153, -883165, 577815, 2190702, 2431208, 1343045, 316373, 337343, 1188818, 2061764, 2289201, 1700679, 778321, 239505, 127644, -226889, -970200, -1177984, -262866, 762693, 476661, -901718, -1766296, -1257573, -68353, 814266, 1069852, 692538, -164201, -718085, -29570, 1607562, 2691829, 2384733, 1418442, 665116, -93885, -1198821, -1988657, -1768720, -1106864, -934014, -970321, -403746, 326161, 10545, -1155210, -1511832, -351389, 1084690, 1530043, 1227437, 837344, 166980, -974721, -1766460, -1470696, -757934, -695371, -1048896, -877374, -272446, -60530, -118378, 423762, 1351980, 1393879, 368148]
42076C68148o42051O05723P93967k41729p76032n4724O82735L31186o13829j201485
42066g48091j240432q55198n5048P21149P14524K0574l19489J46880O30447M35408
42056e49276l4300j24915J23616M08138O78601P47403K57530n05930o94562k25637
42046H0668j1368l96433n60945j17370K1245o87968j153562k95675J097062J523275
42036e01071R27761L00014j25175p13842j032976k81036J051816J469229M86984
42027A581704q38756j420547j103258j93703Q66841J369195R01153O2377k42682
42018I82324n9761n3145k54811k04597j2418j17224l00552j69194k26247j015343
42008a430968j587231n96196J215776J609667J45372j087219n53321P90531J387104
$$ y = [368148, -273903, 331820, 1125787, 884058, 108026, 53302, 736037, 1067223, 453394, -748091, -1988523, -2843721, -2898769, -2177620, -1463096, -1442522, -1762011, -1615131, -984684, -549276, -583576, -708491, -584875, -176737, 501864, 1249267, 1506797, 1000867, 306305, 80668, 69300, -327133, -888078, -1005448, -984203, -1672171, -2825733, -3121408, -2024346, -501071, 426690, 726704, 601529, -112313, -1145289, -1426325, -374509, 1094720, 1581704, 742948, -677599, -1780857, -1974560, -1107719, 261476, 1162629, 1225006, 982324, 922563, 869418, 614607, 410010, 397592, 280368, -20184, -189378, -415625, -1430968, -3018199, -3614395, -2398619, -788952, -643580, -1730799, -2284120, -1493589, -106485]
41999a06485J146039O94490J42463l83689l58854M6879j47886r09870q23324M39773
41989b60464J047824j80266j614702j273964Q2717M73070L4827L26472J101184
41980b63302N97268j074939j624833j96312J194189Q36230j90246r5839P65473
41971e2311Q53724J31297p5899N55664Q59086J48253p53913r17742o31624n98841
41961d82306n96635P3803J131692J396535M77420n67365p18169l26922k77874
41952A10179n33822m69655j27972q931O4404O26754J289759J129449L25182l7477
41942B367870J24930j84268r68383r49092Q1385O02784k4054l38538N35048J061209
41932B308891o4661j367401r24906L54090L48057o33098o34288L64757O19229
$$ y = [-106485, 1039554, 1734044, 1876507, 1492818, 1133964, 1180843, 1032957, 123087, -700237, -260464, 787360, 607094, -1007608, -2281572, -2198855, -1725785, -1690958, -1364486, -263302, 333966, -740973, -2365806, -2562118, -1367929, -531699, -721945, -817784, -52311, 801413, 932710, 856811, 1412475, 2271561, 2419814, 1665901, 748159, 116535, -482306, -1078941, -1005138, 126554, 1523089, 2000509, 1433144, 714975, 388053, 110179, -423643, -893298, -1021270, -1030201, -965797, -339043, 950716, 2080165, 2405347, 2367870, 2492800, 2308532, 1340149, 391057, 472442, 1075226, 1051172, 712634, 1247682, 2308891, 2244230, 876829, -48077, 306013, 654070, 20972, -613316, -248559, 370670]
41923C70670o5140j88885L52255P2321r35552o97023J052812J905805N30250j276490
41913A121023j623688j143633j027374p65228L06608J195673R68662N98746J127012
41904G57801J523832M91525r45390r36670J01102K10044r06639j625289j056013
41895b385697K7183P98363J186569J135118N94659J74951M32310P28705J59542
41886B851703p56897q45872l45659m55940j044956p45770N70087J354830Q07887
41877A389413n2624k82389k78270m58173k97381L84489N91135k95022j250234
41868e49056j027280L5276O77358M77638m3048m75169p09109n26615J03481O40984
41858a395540O17337L44976L57618N36552M56864K11117J59165J62597j89942
$$ y = [370670, 305530, 116645, 468900, 541221, -394331, -1091354, -38542, 1867263, 2397513, 1121023, -502665, -1646298, -2673672, -3438900, -3132292, -1936619, -967957, -369211, 757801, 2281633, 2773158, 1827768, 891098, 992200, 1202244, 295605, -1329684, -2385697, -2358514, -1560151, -373582, 761536, 1356195, 1531146, 1963456, 2692161, 2851703, 2094806, 1248934, 903275, 447335, -597621, -1343391, -773304, 581526, 1389413, 1336789, 1054400, 776130, 317957, 20576, 405065, 996200, 701178, -549056, -1576336, -1541060, -863702, -386064, -429112, -904281, -1613390, -2140005, -2036524, -1395540, -778203, -433227, -75609, 460943, 917807, 1128924, 1288089, 1450686, 1260744]
41849A260744p85763j089665r04250m53421R1899N69025N55199r9956o12299j0288
41839a478775J352939J889912P34147j084648j900088j303659k13192N13235P71603
41830g18526O88017K60286k51636k84369K20085M96256M3771m11226R8035J055461
41820A196154Q77970o73524j694877o09521J445495J964571M17636j155107j029242
41811G39555O7252L66028m15145j010160o10546J64684M00223J48768J11668M77312
41801D39639O46338J39462o40863q71168l78585J59833J73675p0449o586L13911
41791i4793L64818N9703p5980K50531O08512M85417O3206l2245L61057O31900
41781B622126J20577r72675j619733j057749K55149J073184P66186r1605o38898
$$ y = [1260744, 474981, -614684, -1518934, -1972355, -1880456, -1311431, -756232, -856188, -1468487, -1478775, -125836, 1764076, 2498223, 1413575, -486513, -1790172, -2003364, -1490129, -718526, -30509, 229777, -21859, -306228, -86143, 410113, 453884, 42658, 140693, 1196154, 2074124, 1400600, -294277, -903798, 541697, 2506268, 2923904, 1768797, 739555, 806807, 1172835, 757690, -252470, -863016, -698332, -298109, -149341, -37673, 439639, 1085977, 1225439, 584576, -286592, -665177, -505344, -331669, -402118, -408704, -94793, 270025, 329728, 253748, 504279, 1112791, 1598208, 1661414, 1629169, 1990226, 2622126, 2742703, 1770028, 150295, -907454, -652305, 420879, 1187065, 1095460, 456562]
41772D56562p08625n71615k70265J90926M19572J39355j74889L8187L88867J26912
41762C4987l97422q3317R69557J224166L872j255806j039187K5228K90417l02265
41752e29770l56706M87281R29045K11923o20130m80462M0987j02392m35665K53688
41742f02201J589450J792076L95572q49289n38049L11461k6505j209261j403690
41733e40436k34634O14977J7594r32561o21533Q17381J863377J571234L65874
41724B921273o84662p60289J45136J035000P21192p32685j890518j670958n45060
41715a461571M29651R18173J002785N12829m00249q45209m04483J2768l39507
41706e74813n85071L07469J424517J084670l99223j111551m73896K40650L35536
$$ y = [456562, -252063, -823678, -1093943, -903017, -483445, -344090, -518979, -480792, -91925, 34987, -362435, -445752, 523805, 1747971, 1751843, 496037, -543150, -517922, -227505, -529770, -886476, -399195, 529850, 741773, 121643, -358819, -317832, -420224, -855889, -602201, 987249, 2779325, 3174897, 2325608, 1787559, 2099020, 2072515, 863254, -540436, -775070, -160093, -142499, -1075060, -1696593, -879212, 984165, 2555399, 2921273, 2236611, 1476322, 1621458, 2656458, 3377650, 2644965, 754447, -916511, -1461571, -1031920, -113747, 889038, 1401867, 1001618, 156409, -248074, -235306, -574813, -1159884, -852415, 572102, 1656772, 1257549, 145998, -327898, -87248, 248288]
41697B48288M80948P68414J97042j168189j592599k65097J282377J446473O14439
41688B012096j41237p62036j320545j063308J51744Q90886K06268o60533k88154
41679i74819N38233L34520l97334j45766Q57663J112660M45314r8157m31384j173684
41669F7246j607941m46410J419885J597744n7946j026766j14837Q26606K97128
41660I54709l62748L94690J434656Q77330o86577j237702n25206K8437o0119J059
41650H18529L44565K50575j61633R529N48000J65698j145138j652470n48440O06100
41640g64685K43486p87570o39453O28527J250412M97590m30314m19764Q9628K20682
41630a11461J19646M31359J000275J058205M55593j22835j71574N2994O7440k35441
$$ y = [248288, 729236, 1497650, 1694692, 526503, -1066096, -1331193, -48816, 1397657, 2012096, 1870859, 1108823, -211722, -1275030, -1123286, -232400, -26132, -686665, -974819, -436586, -102066, -499400, -645166, 212497, 1325157, 1770471, 1672314, 1240930, 67246, -1540695, -1987105, -567220, 1030524, 972578, -54188, -169025, 657581, 954709, 591961, 986651, 2421307, 3298637, 2612060, 1374358, 849152, 877589, 817470, 818529, 1163094, 1413669, 1252036, 1261565, 1809565, 1975263, 830125, -822345, -1370785, -764685, -521199, -1308769, -1948222, -1319695, -69283, 428307, -2007, -421771, -332143, -111461, 8185, 439544, 1439819, 2498024, 2953617, 2830782, 2659208, 2712202, 2779642, 2544201]
41620B544201o72177j034110j079737o19262J51797O46458M52962j99831o68315
41611d78014n13084J10581N71410L60674k53611l64178M47743J333914J079279
41602B294714k81569j393408j252541l35657K05659m5344n22309m97342J40779
41593a687018P58613N99547k43196p12665j34475O80372N19585l50186n81497
41584a150920P8865M98734K56890L35403J075573J192583m6600j246335r61773
41575C2420k6263r1279r10477r71135q5104N80947N78959M23580J39658n67045
41565h95739r75628j28352J194058J244288L8730o84688k89368J22556R0015M47293
41555A63165J069822M63363j373068k076460l94290J592880J515412J49557k59144
$$ y = [2544201, 1872024, 837914, -241823, -861085, -709288, -62830, 390132, 190301, -478014, -991098, -880517, -309107, 51567, -202044, -566222, -118479, 1215435, 2294714, 2013145, 619737, -632804, -968461, -762802, -808146, -1330455, -1827797, -1687018, -928405, -328858, -572054, -1284719, -1419194, -738822, -219237, -569423, -1150920, -1072055, -573321, -316431, 18972, 1094545, 2287128, 2240528, 994193, 32420, 6157, -85122, -995599, -1966734, -2051838, -1470891, -891932, -468352, -328694, -895739, -1871367, -1999719, -805661, 438627, 477357, -207331, -496699, -374143, -284128, 163165, 1232987, 1696350, 323282, -1753178, -2147468, -554588, 960824, 1110381, 851237]
41546H51237L83781M31490m10479q07700k93320R5659k32935n77616l05770K77902
41536e87751O66727P11824L66532k10180l94002J16261M82300j91548j188028
41527b27865r41608N15344J340116M91387q21664j007090k51551J67995p6412
41518h11348j67673L54767R79182J140054Q81116L92627l45118j053100r93679
41509C76828k4618P10367J46927r00052o10766J002315J695109K36859j490051
41500A142918j123183O75388J364609M13884l52058j15027j38287r47815j013351
41491i2922N16289J925344J413873k12087j056645r38383q42700p22751J33802
41482A23820J236379J323945L61663m96762o97110o32686m93057j25717J79266
$$ y = [851237, 1235018, 1666508, 1256029, 448329, 155009, 250668, 17733, -559883, -865653, -587751, 78976, 790800, 1157332, 947152, 553150, 669411, 1151711, 960163, -227865, -1169473, -654129, 685987, 1177374, 355710, -651380, -902931, -734936, -811348, -979021, -624254, 354928, 1494982, 2376098, 2768725, 2423607, 1370507, 376828, 352210, 1062577, 1209504, 309452, -301314, 701001, 2396110, 2632969, 1142918, 19735, 695123, 2059732, 2473616, 2121558, 2006531, 1868244, 920429, -92922, 423367, 2348711, 3762584, 3550497, 2493852, 1555469, 712769, -9982, 123820, 1360199, 2684144, 3045807, 2549045, 1851935, 1219249, 726192, 600475, 779741]
41473G79741J1590k78167j22439J94094R5049j38922O3144L92285K77550O2990
41463A336915K66066L70079j89462o39253j70964K26502o94422j828930j139934
41454b463403P54555J241927j5997n10297Q13694J748104O00568j000598r07436
41445B61117K32275N76894J94100K79704O09642J24547p70642p50459M545K9539
41435G91262q35417j015000K85953J723951J654687K61522r08871r46742m07844
41426F03501k72015o01575n78331J94802R72324Q82470K10619r5853J15394K28458
41416A659794J38111K88123M62338o4784r76343j017695o9376M47203j45708p13559
41406H104l72886M2645k68140m60208L59289J308281J136557K85981j16201k19609
$$ y = [779741, 791331, 513164, 390725, 584819, 679868, 540946, 604090, 996375, 1273925, 1336915, 1602981, 1973060, 1783598, 1144345, 973381, 1199883, 505461, -1323469, -2463403, -1708848, -466921, -482918, -993215, -179521, 1568583, 2169151, 1168553, 261117, 493392, 1070286, 1264386, 1544090, 2153732, 2278279, 1507637, 757178, 761723, 791262, -44155, -1059155, -773202, 950749, 2605436, 2866958, 1958087, 1011345, 603501, 331486, -270089, -848420, -653618, 318706, 1201176, 1411795, 1315942, 1431336, 1659794, 1797905, 2086028, 2548366, 2483582, 1507239, 489544, 420168, 867371, 721663, 8104, -364782, -322137, -590277, -1050485, -691196, 617085, 1753642, 2039623, 1923422, 1703813]
41396A703813o39631p67650Q5963P77691j65098j743804j617214K40208J477228
41387f48494J015453K81644L92745N46199L4569l39389K8012K97346j42833m23481
41377A041771J13380M98986j72405r79916o49893L07684N55117J48818J33653
41368I97195N35822M54314j69256m73453k61201j92398l74199j56732M92445P21018
41358A573555K24463k26137j01010J05519j12273m57115n72226o70018p81793
41349a017035k95361R08223J639850Q13438p85623j289145j84586J075134J017807
41340A882702j74230j213945j237421m09159N26896R26097O83958J77131k94993
41331H67036p90784j176340p83567O08417J787538J244200o64092j880495j273009
$$ y = [1703813, 1064182, 296532, 382495, 1160186, 995088, -748716, -2365930, -2125722, -648494, 366959, 648603, 1041348, 1587547, 1622116, 1282727, 1310739, 1608085, 1465252, 1041771, 1155151, 1654137, 1481732, 501816, -148077, 159607, 714724, 863542, 997195, 1533017, 1987331, 1818075, 1344622, 1083421, 891023, 516824, 360092, 852537, 1573555, 1798018, 1571881, 1470871, 1576390, 1464117, 1007002, 434776, -235242, -1017035, -1312396, -404173, 1235677, 2049115, 1263492, -25653, -210239, 864895, 1882702, 1708472, 494527, -742894, -1152053, -625157, 300940, 984898, 1162029, 867036, 76252, -1100088, -1883655, -1275238, 512300, 1756500, 1092408, -788087, -2061096]
41322b061096J35719J024340J457129J839155J586069K38232j116068j136060
41314A967420k84254L698l41492k38370L67015M47629m7344m8074M95083L00541
41304B621852q73886j450989m79965Q21149R80819K56251l38994n85443n23591
41295D27203K46646J444810J568617n7903j774942j672179k71031M80462J04960
41286D96643k63704j15991j03993m31204l44525N06572J394554J481343O96965
41277C316660l80554r51655n54235K70713L65467m60540j020255n81240k6176
41268b1815k14130m18753K32408R49111N92283k52383l89351k19359p14593j101976
41258a558558n4468J445948J210109m38260r42998L39932J219521M33938n35747
$$ y = [-2061096, -1925377, -901037, 556092, 2395247, 3981316, 4219548, 3103480, 1967420, 1683166, 1686864, 1345372, 1107002, 1474017, 1921646, 1874302, 1826228, 2321311, 2621852, 1747966, 296977, -182988, 638161, 1618980, 1875231, 1536237, 950794, 427203, 673849, 2118659, 3687276, 3629373, 1854431, 182252, -88779, 391683, 496643, 232939, 116948, 12955, -418249, -762774, -256202, 1138352, 2619695, 3316660, 2936106, 1984451, 1430216, 1700929, 2066396, 1605856, 585601, 4361, -21815, -235945, -654698, -422290, 526821, 1119104, 866721, 477370, 258011, -456582, -1558558, -1613026, -167078, 1043031, 604771, -338227, 1705, 1221226, 1655164, 1119417]
41249A119417l26698L03411M59056O22068R95601P20926m2317K69634J607088
41240E728186J601134m32995j628940P351K028932J315018r39482j440831k11750
41231F026623M2893j081706j333367j58517M15090l74102p88001N272M80381j88708
41221C045858n56800K11554N96658m05936j096489J31992J800821J561359m7752
41212E241265o23691K13231N90823k18386p22531M5775Q99060N57237l21322m12549
41202E248912J07653O9768o27773q91223k82675K90415R6309k47623J75970J048753
41192D988486J228040M21807m05583l21492N71315J510632J841572J313822K68394
41183A1416993l00498M40741J999673K879078K446786J814733K329392L810664
$$ y = [1119417, 792719, 1096130, 1555186, 2177254, 3172855, 3893781, 3851464, 4121098, 5728186, 7329320, 6896325, 5267385, 5274736, 7303668, 8618686, 7679204, 6238373, 6026623, 6069516, 4987810, 3654443, 3495926, 3911016, 3536914, 2748913, 2754185, 3234566, 3045858, 2489058, 2700612, 3297270, 2891334, 1794845, 1926837, 3727658, 5289017, 5241265, 4617574, 4830805, 5421628, 5203242, 4480711, 4526486, 5425546, 5982783, 5661461, 5248912, 5356565, 5426333, 4798560, 3907337, 3624662, 3915077, 4011386, 3763763, 3939733, 4988486, 6216526, 6638333, 6232750, 5911258, 6482573, 7993205, 9834777, 11148599, 11416993, 11116495, 11557236, 13556909, 16435987, 18882773, 20697506, 23026898, 26837562]
41175B6837562N028538N552492O308753Q284831J1274464J4247118J6947108K0893586
41167A15374452K8168528L8592860M8292519N1670276M4893534K7863899M728294
41160C59584362j6145889k5208563j9167858n806925K478340J227057l616452
41153B93344072p021885j3017545k6695333m2378947m7525784l8197462k3821829
41146I4685287j4926358j2098891j0068321p281907o248536p281897p444136n373206
41138B3962035l079817k440267k815299k815081k224922j462395p42249l67925
41130H014080o27191j052532q66142l06837l74910j121073j409882o80700K29644
41121A804457M73280L32569L83006M52257J71103j61071j18072m4000m64035q81898
$$ y = [26837562, 31866100, 37418592, 43727345, 52012176, 63286640, 77533758, 94480866, 115374452, 143542980, 182135840, 230428359, 282098635, 326992169, 354856068, 359584362, 343438473, 318229910, 299062052, 293255127, 295733467, 296960524, 293344072, 286322187, 273304642, 246609309, 204230362, 156704578, 118507116, 94685287, 79758929, 67660038, 57591717, 50309810, 44061274, 36779377, 29335241, 23962035, 20882218, 18441951, 15626652, 12811571, 10586649, 9124254, 8382005, 8014080, 7386889, 6334357, 5468215, 5161378, 4786468, 3665395, 2255513, 1574813, 1804457, 2277737, 2610306, 2993312, 3445569, 3616672, 3455601, 3337529, 3293529, 2829494, 1947596]
41111A947596k55408J211681J860782P77160o96408o98969M24056N60957r65077
41102D166370k227871j471825L35005J001342J82106o23476n63493j93181Q5920
41093F90897N79924J064060O44586n88998j200045m07877P42303R64404M37433
41084B926687J39604L59358O39295N34988j12814j007614j236573j99342J112328
41075C155917J011841l85268j084787k07041O90587K62388m79547j61971M50464
41066C252583r7681j232499j244048j28058O27366O36861Q36385J253727P17224
41057D621860r12757k105104j816165p86299j12814J57225L76852L71122p2911
41048b78991n21374l72662L30735R23619P90997L6580m21636J41763R70562M54492
$$ y = [1947596, 1692188, 2903869, 4764651, 5541811, 4845403, 4146434, 4570490, 5131447, 4166370, 1938499, 466674, 801679, 1803021, 1985127, 1361651, 798158, 604977, 690897, 1270821, 2334881, 2979467, 2390469, 1190424, 782547, 1524850, 2489254, 2926687, 3066291, 3425649, 4064944, 4599932, 4487118, 3479504, 2242931, 2043589, 3155917, 4167758, 3782490, 2697703, 2490662, 3181249, 3443637, 2964090, 2802119, 3252583, 3154902, 1922403, 678355, 550297, 1177663, 1814524, 2650909, 3904636, 4621860, 3709103, 1603999, -212166, -998465, -1111279, -954054, -577202, -206080, -278991, -800365, -1173027, -842292, 81327, 872324, 908904, 487268, 629031, 1599593, 2054085]
41038B054085j390348k301422q00960J362134J539190J2074o76364K83393J095421
41029A177203N56443l16397m63396l87733o29406n25351L38477R70848M82078
41020A202766m59655p48285l45201K51197R09964J296046N78593j140245k134285
41011e89105j081365R51274J774577Q08691n44507q64721q2316Q54803R29388
41002B156719j06572j333868j439214k46678R93105J118530K56752o95069j008877
40993c05172l61306R08077J567576O64415q47439j039425J34734O72782k03208
40984A191034p26687K98051J265128M81627q53365p31065K01474k162r25395n61633
40974c62993Q25643Q70764p61577j599737m51696O87822R1853r41116n36000O45860
$$ y = [2054085, 663737, -1637685, -2438645, -1076511, 462679, 474753, -201611, 81782, 1177203, 1733646, 1417249, 953853, 566120, -63286, -588637, -250160, 720688, 1202766, 743111, -5174, -350375, -99178, 810786, 2106832, 2685425, 1545180, -589105, -1670470, -719196, 1055381, 1864072, 1319565, 454844, 372528, 1227331, 2156719, 2050147, 716279, -722935, -969613, 23492, 1142022, 1398774, 703705, -305172, -666478, 241599, 1809175, 2473590, 1626151, 586726, 721460, 1394242, 1191034, 464347, 762398, 2027526, 2509153, 1655788, 924723, 1126197, 1124035, 198640, -362993, 462650, 1333414, 571837, -1027900, -1479596, -791774, -699921, -1641037, -2177037, -1531177]
40964a531177Q10346N8668j59842K78694J68152o95497j070516k94138P30854
40955a704456R37244L85814k60897p01192r10653o87102R4982R79406J220222
40946f46632O92410J63110L55383R21817Q22501k37831j336930j579893j183858
40937b029923p91310l57198M13896J028335P51766m076q0325N84097P72645l3829
40927B54078p58831m12692M38640P21380M73345M20972N63035K61213n14938j000930
40917D45272p24142q0803L01390L18000L39333O02331P65398K07689j013214j756478
40907e95224j004978N69282J172670K98156m94933J16240J196817J023753j79979
40898B101804n90742K99971Q46519j47470j482728j325481O3938P70986K4147
$$ y = [-1531177, -720831, -662163, -822005, -543311, -375159, -1070656, -2141172, -2435310, -1704456, -767212, -381398, -642295, -1343487, -2254140, -2941242, -2846260, -1866854, -646632, 45778, 208888, 564271, 1486088, 2308589, 2070758, 733828, -846065, -2029923, -2821233, -3178431, -2764535, -1736200, -984434, -988510, -1068835, -484738, 287907, 254078, -504753, -917445, -478805, 242575, 715920, 1136892, 1699927, 1961140, 1446202, 445272, -278870, -359673, -58283, 259717, 599050, 1201381, 1966779, 2174468, 1161254, -595224, -1600202, -1030920, 141750, 439906, -55027, 61213, 1258030, 2281783, 2101804, 1511062, 1811033, 2657552, 2510082, 1027354, -298127, -234189, 536797, 560944]
40889E60944q85652o69127K44258O75086M06944L7288k07558m39848l05692N60932
40879b2425J397416R62775m69469j150455l88952L90081j4187o33890j02726Q71451
40869H39619O53490m91859q11779N338M55981j32797o99443n97498n52754p53729
40859b085431q9740J555875K214076O21238j493957j722066l11530P12200P16646
40850A17311O25887O26965K9469p80005n01523P11514J098226L9383r08684n34986
40840E23557J61837k21290j162078j117977J3409P65499K34780p76681r26160
40831b505104J9724R96352R22189j0790n38924M4417Q81249P31324k15374o51143
40821c26080j42865L66259K57931J83577O99874J086940M64879p09056j261644
$$ y = [560944, -324708, -993835, -749577, -74491, 332453, 369741, 162183, -277665, -583357, -22425, 1374991, 2337766, 1868297, 717842, 328890, 718971, 704784, 70894, -31832, 839619, 1493109, 1001250, 189471, 194809, 650790, 517993, -181450, -778948, -1331702, -2085431, -2175171, -619296, 1594780, 2216018, 722061, -1000005, -1311535, -599335, 117311, 743198, 1370163, 1399632, 619627, 118104, 829618, 1927844, 1967227, 1058543, 523557, 685394, 464104, -697974, -1815951, -1802542, -1037043, -802263, -1578944, -2505104, -2485380, -1489028, -566839, -577629, -1116553, -1072136, -190887, 540437, 325063, -326080, -468945, -102686, 155245, 338822, 1038696, 2125636, 2590515, 1881459, 619815]
40812F19815q92288k40346J80594K57535o6044n25423l78395N23617R94677L1070
40802E04812j328977j141663N43290J582137Q50288k46828j51221N49248M52396
40793A613482k87738n17661k15645l38941q87636q27306K2654O05794M20216K28644
40783a84137M95481N12805j74091p13087k76991N47408P28588L24139k972k49907
40773A007236o99560r08782l31121M89272N99223J67800Q4392L61049L07695L7767
40763A114971K59381O63809J98975r26400j265917n07067q016l85523m61513M48589
40753h68711J060187K64600q92440r66487m36481m93753p32918q6208Q40797N93813
40743a717601m37325l85582J065788K085235J414292p9275r82791r64686m09454
$$ y = [619815, -272473, -512819, -332225, -74690, -140734, -666157, -1044552, -520935, 473742, 504812, -824165, -1965828, -1422538, 159599, 1009887, 763059, 611838, 1161086, 1613482, 1325744, 808083, 592438, 253497, -634139, -1461445, -1438791, -832997, -412781, -184137, 311344, 824149, 650058, -63029, -340020, 207388, 935976, 1260115, 1257143, 1007236, 307676, -601106, -932227, -442955, 156268, 324068, 408460, 769509, 1077204, 1114971, 1374352, 2038161, 2237136, 1310736, 44819, -462248, -470264, -855787, -1317300, -868711, 191476, 456076, -436364, -1402851, -1839332, -2333085, -3066003, -3152211, -2311414, -1717601, -2154926, -2540508, -1474720, 610515, 2024807, 1945532, 962741, -1945, -411399]
40734d11399K42587M37791k2525l06407L95934J183574M37693j383022j899808
40725a325582l36114J124466N74683q20783p73540P32351J710764J072162l24418
40716A633989j173810j033988k90853K93449J58133l52093k32454P56848J520622
40707A279843J082587m3359o42627l83612R4292J71897k93782j021992j342568
40698a099321p57194K00354M75458J44756L85868J341432J524331K39810r94444
40689A461050p61868L3663p9346n72260j49286O08329K36099p22355m32177R00169
40679E22018J094502l79502j434000o99541N15039O30996J38068K15886O18506
40670A221972L77269m40942r27599o28460J60244P86102N30159o63784j537489
$$ y = [-411399, -168812, 268979, 246454, -59953, 335981, 1519555, 1957248, 574226, -1325582, -1661696, -537230, 37453, -783330, -1556870, -824519, 886245, 1958407, 1633989, 460179, -573809, -864662, -571213, -413080, -765173, -997627, -240779, 1279843, 2362430, 2319071, 1676444, 1292832, 1387124, 1559021, 1265239, 243247, -1099321, -1856515, -1656161, -1180703, -1035947, -650079, 691353, 2215684, 2455494, 1461050, 699182, 732845, 653499, 81239, -68047, 540282, 776381, 54026, -378151, 522018, 1616520, 1237018, -196982, -896523, -381484, 249512, 387580, 603466, 1221972, 1599241, 1158299, 230700, -397760, -237516, 548586, 1078745, 414961, -1122528]
40661a122528p46140J027614J612396L85170q70784p70840j91119l23170o43535
40652a642936k28149M11639L82413O4037J48568J62047m45702q25421p9464Q89976
40642a162992P18275j12826k37589J38936j14015o21241j04863R36995P01046
40633A41726p36330j271798k13285O69610L04088N1458J045750J991498J268189
40624C250906m50846j402431j256406p86153j47639P82419J223765M34568p01016
40615I47167o98987K45698N88102j38285p76074m87893J86713M99043M91516M20330
40605A277330J78051k40453m58421l12448j34024j74453l26661n68848r81435
40596a741362j131742l00694J230561J952472R38577o96396j070479R766Q68693
$$ y = [-1122528, -1868668, -841054, 771342, 1156512, 285728, -485112, -676231, -999401, -1642936, -1871085, -1459446, -1077033, -1012996, -864428, -702381, -1148083, -1973504, -2052968, -1162992, -444717, -557543, -795132, -656196, -770211, -1391452, -1496315, -559320, 141726, -594604, -1866402, -2079687, -1410077, -1105989, -1054531, -8781, 1982717, 3250906, 2800060, 1397629, 141223, -644930, -792569, -10150, 1213615, 1648183, 947167, 248180, 493878, 1081980, 943695, 167621, -320272, -133559, 365484, 857000, 1277330, 1455381, 1214928, 756507, 444059, 310035, 135582, -191079, -759927, -1741362, -2873104, -3173798, -1943237, 9235, 947812, 251416, -819063, -809297, 59396]
40587E9396L21446p73142q60957J30283Q70309O31480J77649L72110Q12494N88116
40577B329184j72534m81629m5323L51113J44554k41590k97883k69730n33170p88412
40567e420n62758n8728J86637J45317J27817O7465k80593n96382k46775O63996
40557e59424J177671O35441m98692j170398q29190R6338O49295L08510m07704
40548e98153n44701j8880K09521l84985r33810m28373O58052J043997N80418K92924
40538a23990N58005N66846j01864o28495k73623M54679O63440L04806j49328n37159
40528G33317p93564n89054L8946L24206j21540m60347J37667R91566Q54047k5953
40518A089291k09674O01886J051850L20033n87690n23125J1134j43311q39035
$$ y = [59396, 380842, -392300, -1253257, -1122974, -252665, 378815, 556464, 928574, 1741068, 2329184, 2156650, 1675021, 1629698, 1980811, 2125365, 1883775, 1585892, 1316162, 782992, -5420, -568178, -626906, -440269, -294952, -167135, -99670, -380263, -976645, -1223420, -559424, 618247, 1253688, 754996, -415402, -1244592, -1148254, -498959, -190449, -598153, -1142854, -1161734, -952213, -1337198, -2271008, -2699381, -2041329, -997332, -416914, -123990, 434015, 1000861, 898997, 270502, -3121, 451558, 1114998, 1419804, 1270476, 733317, -60247, -649301, -610355, -286149, -407689, -868036, -730369, 261197, 1115244, 1089291, 879617, 1481503, 2533353, 2853386, 2265696, 1742571, 1753705, 1610394, 771359]
40509G71359r74058m15250j83166o25598o96344L70030J614258J470113j17730
40500A213614j560761j536279l27071Q45203J217470R28538M95425K47422J23032
40491A646593k17851r41500j563276j235583J69085J551790J669073O15315l17682
40482A375964k88213J85435K03385k01069k83008J43366L33502l11142j249283
40473i1063j327295k44082R43171J054987K59711k19165J56363N16050k358q07036
40463B39283o62391M24956J170267Q52344J49429j17566o5888q5415l2150J90011
40453B062880L5751p84720j410834q58870M27166J101672P91685L63596L48504
40444B076830K46630l19143p87069n47645P3506L11864l3572n68136q68953o88790
$$ y = [771359, -202699, -617949, -801115, -1426713, -2123057, -1753027, -138769, 1331344, 1213614, -347147, -1883426, -2210497, -1365294, -147824, 780714, 1276139, 1523561, 1646593, 1428742, 487242, -1076034, -2311617, -2142532, -590742, 1078331, 1693646, 1375964, 1087751, 1273186, 1476571, 1275502, 992494, 1135860, 1469362, 1158220, -91063, -1418358, -1662440, -719269, 335718, 595429, 376264, 532627, 1048677, 1046319, 239283, -423108, 1848, 1172115, 2024459, 2173888, 2056322, 1990434, 1905019, 1872869, 2062880, 2098631, 1313911, -96923, -955793, -528627, 573045, 1364730, 1728326, 2076830, 2323460, 2004317, 1217248, 669603, 743109, 1054973, 1021401, 453265, -415688, -1104478]
40434a104478j3962O68517O00792k37537p46716J1044J384762J756673O17887
40425B936982p36039r07180j60693J40233m70636r91843n42734K90665L66852
40416g4393k32566l13572N43413J242929P93895j79660l48266M31260J046095
40407B909135P20029j78347q60373r00238l19434L94433L89297o53291j717465
40398b16254j423249Q1073J134305P52182j68109l37339J47501K93483j68497
40389I5096n47622k92675M01037R88023J082132O44862j7147n22886p74809q19949
40379B36062m66335L86357J089317P84311k42512p32750k76646J88644J68126
40370A134574M69007J350325J332849n74043k638941k377468o3819J791690K067174
$$ y = [-1104478, -1118440, -449923, 150869, -86668, -833384, -822340, 562422, 2319095, 2936982, 2200943, 1293763, 1133070, 1273303, 802667, -189176, -731910, -441245, -74393, -306959, -620531, -77118, 1165811, 1959706, 1780046, 1431780, 1863040, 2909135, 3629164, 3450817, 2590444, 1690206, 1370772, 1765205, 2154502, 1501211, -216254, -1639503, -1558430, -424125, 328057, 159948, -177391, -29890, 263593, 95096, -452526, -745201, -344164, 643859, 1725991, 2370853, 2353706, 1830820, 1056011, 236062, -230273, 156084, 1245401, 2029712, 1787200, 1054450, 777804, 966448, 1134574, 1603581, 2953906, 4286755, 3712712, 1073771, -1303697, -1367516, 424174, 2491348]
40361B491348J869819J799321R08932r04685j838123q42236N15181M38620l33330
40352D104847K2279J303525J698055Q08465K04831Q48035J744000J716360J138068
40343A3588465J074077J605220J893091J460866O64017N3607j72706j12208K0855
40334B0075284p0551n86286j286143j537354r96258j43215K35525P4996J2069
40325A5778067K38470J52805l98481m66220M53199J058115o7306j901552k054305
40316A2792792m14190M52258p83352k132233j520351q8819j68101j417415j568510
40307E152079l24303K16029q72749j872632j270056O47K89176l40644o66415k37094
40297G4038M21495Q31408Q30925L42437l70800o84431m23721j65220k70527l28202
$$ y = [2491348, 4361167, 6160488, 7069420, 6164735, 4326612, 3484376, 3999557, 4438177, 4104847, 4127126, 5430651, 7128706, 7937171, 8142002, 8990037, 10734037, 12450397, 13588465, 14662542, 16267762, 18160853, 19621719, 20285736, 20339343, 20166637, 20054429, 20075284, 20004733, 19418447, 18132304, 16594950, 15598692, 15455477, 15691002, 15765998, 15778067, 16016537, 16169342, 15770861, 15304641, 15757840, 16815955, 16748649, 14847097, 12792792, 12378602, 12830860, 12047508, 9915275, 8394924, 8306105, 8138004, 6720589, 5152079, 4827776, 5043805, 4171056, 2298424, 1028368, 1029015, 1318191, 977547, 311132, 74038, 495533, 1326941, 2157866, 2500303, 2129503, 1445072, 1021351, 856131, 585604, 257402]
40287B57402r1226j16334o98927j001429k66081P60176Q04310M4252j95103M15007
40277h7953P18966k6959r87565j056817m08094K6372J2817Q8200M38671N64439
40267g17923J83814j92359L2972O44686Q92766N22502M1614p2065P0317J96489
40257A602813L42030M92189K37273n88042j264755r66565R54N84801N18313M72762
40247A431773O09936J88391r37098j603776r36895K95609Q63369P67206O66489
40238A345004M03087m94534j333040r07384M35667R93658K24807m85957j26534
40229E4774L95388m1761q33083p45944l1891J18769k54277P0422J258902J830123
40219A821422Q20403p42054j310816q00592j86927J15929L95460O05217L40402
$$ y = [257402, 166176, 49842, -649085, -1650514, -1916595, -1156419, -352109, -307857, -502960, -87953, 631013, 604054, -383511, -1440328, -1848422, -1822050, -1809233, -1721033, -1282362, -717923, -534109, -726468, -693496, -48810, 843956, 1366458, 1408072, 1336007, 1406324, 1602813, 1944843, 2437032, 2674305, 2086263, 821508, -145057, -144103, 440698, 959011, 1431773, 2041709, 2230100, 1293002, -310774, -1247669, -952060, -88691, 678515, 1345004, 1748091, 1253557, -79483, -986867, -551200, 442458, 667265, 181308, 54774, 450162, 408401, -424682, -1170626, -1202517, -1083748, -1338025, -1267603, -8701, 1821422, 2641825, 1899771, 588955, -211637, -398564, -282635, 112825, 718042, 1058444]
40210A058444k41854m85764k70951q4953l3260K05714L22321m64287j722772j663973
40200c381335L31908K234328J831361j50091j082874j64563P93865M01677m10958
40191D03318k57204N11572O22157j06177p29388o31607q1332L51661K75510l37255
40181B1255r73273r32484j96285M89554O19589M14474J30690k69927m88123L1370
40171a153160R19802R39084j13103p85554j65156O08630K48911n09092k50641
40162b60279O10712N45039n01080j144672q74378m66676k52452K16381P75949
40153a351456O85104J47179J25469N66177N14840L7716J25327N71238J07196j003474
40143E25316r10065N42051R94882o74217k214650j425978M10267P73137j17039
$$ y = [1058444, 816590, 330826, 59875, -25078, -58338, 147376, 469697, 5410, -1717362, -3381335, -3049427, -815099, 1016262, 866171, -216703, -381266, 412599, 814276, 403318, 146114, 657686, 1279843, 1173666, 444278, -187329, -268661, 83000, 358510, 21255, -952018, -1884502, -2080787, -1591233, -971644, -557170, -426480, -696407, -1184530, -1153160, -233358, 705726, 592623, -192931, -358087, 250543, 499454, -9638, -260279, 350433, 895472, 394392, -750280, -1624658, -2091334, -2343786, -2127405, -1351456, -666352, -519173, -393704, 172473, 687313, 725029, 850356, 1421594, 1528790, 525316, -384749, 157302, 1152184, 477967, -1736683, -3162661, -2752394, -1979257, -2096296]
40134b096296j47118R45056J355870L43885q17594j036331n90562r296N73089
40125a479297Q40394N14785J32791K65657K39250q07656j921076j337546N41590
40116c011108J337075K44524p74454j75880Q82852P55567K009J06004P67780M82110
40106F16479p76583j376435n38817N62624N99318j76799n63151n0586P31931Q92053
40096g9966K12084o80538r27761k80542O74485J166519R81577M65573K5921j56101
40086A401251j17077p9859k95535o94094q49554n20685k8743J99517K58757N09528
40076b16494Q10056N61820l30602j038799p24745L81390J208289J041978J52226
40067A845119p04993j009746o84855l8243L28111k4170p40650r20887l29281J43971
$$ y = [-2096296, -2243414, -1298358, 57512, 401397, -416197, -1452528, -2043090, -2052386, -1479297, -638903, -124118, 8673, 274330, 513580, -294076, -2215152, -3552698, -3011108, -1674033, -1429509, -2203963, -2379843, -1496991, -741424, -739415, -633411, 134369, 616479, -160104, -1536539, -2075356, -1512732, -913414, -1090213, -1653364, -1703950, -972019, -79966, 132118, -548420, -1476181, -1756723, -1082238, 84281, 1065858, 1531431, 1557352, 1401251, 1284174, 1204315, 908780, 214686, -634868, -1155553, -1184296, -984779, -726022, -216494, 593562, 1155382, 824780, -214019, -938764, -557374, 650915, 1692893, 1845119, 1140126, 130380, -554475, -592718, -264607, -288777, -1029427, -1950314, -2279595, -2135624]
40057b135624k11643o76359p2035J273634J697127N27583q54449q45048L43324
40048i53490J191743Q48366j46332p71316n40130K03205N98959J19909o76112
40039a25198p09864Q2252N22025l8941o11138p6974R67259J063030J40010m02795
40029H09666J79112R93181R18936K9247q03695j030129p57741m32531m52590p55597
40019a302141p10555J74844J413348J889830J158958l8023o80593n32623j63868
40010A209177j77256n68150q02538n35121j15416m5373p1072M71548J324494J308588
40000A998881J05951r94791q93648k20186q1074k41615J35600P46281O79418J39307
39990A374124K8395K20765p4489n56912k77931L46180j3003j086993j142747K4286
$$ y = [-2135624, -2347267, -3023626, -3095661, -1822027, -124900, 402683, -451766, -1296814, -953490, 238253, 1086619, 940287, 168971, -371159, -167954, 431005, 550914, -125198, -835062, -752810, -230785, -269726, -880864, -957838, 9421, 1072451, 1212461, 809666, 988778, 1981959, 2900895, 2930142, 2126447, 1096318, 338577, -93954, -546544, -1302141, -2012696, -1837852, -424504, 1465326, 2624284, 2586261, 1905668, 1373045, 1209177, 1031921, 463771, -338767, -873888, -989304, -1034677, -1105749, -634201, 690293, 1998881, 2104832, 1110041, 216393, -3793, -84867, -326482, -190882, 555399, 1234817, 1374124, 1402519, 1623284, 1548795, 991883, 713952, 1060132, 1047129, -39864, -1182611, -1158325]
39980a158325N46139l12107p62702M12766J577770Q46362p97547j111639p9093
39971h38376M57429r1668n21943j58381K81412K80377K99744O15264P16124K99794
39961A339776j52576j86511J5364J00106j9763l26938o94270p07825j51017L63734
39951d19920J1017r38512j242335l57555P64258R54912K93469k31070j01052L05271
39941i61517N13923N43270N28691K68592m12531j098980j144973n72684p529L49330
39931a994408Q85249J426686R74370o17379j700034q58167Q36149J175401N415
39922A33282p49109j82418M49707R7794m85770l50960R0759J32106L1158J80990
39912f52461K14708j04624k44982j0241l8480l78419n7216R39594R69363o20717
$$ y = [-1158325, -612186, -924293, -1686995, -1274229, 303541, 1149903, 352356, -759283, -838376, -380947, -472615, -994558, -1152939, -871527, -591150, -291406, 323858, 1039982, 1339776, 1187200, 1000689, 1016053, 1116159, 1096396, 769458, 75188, -632637, -783654, -419920, -408903, -1347415, -2589750, -2947305, -2183047, -1228135, -934666, -1165736, -1266788, -961517, -447594, 95676, 624367, 892959, 480428, -618552, -1763525, -2336209, -2343738, -1994408, -1109159, 317527, 1291897, 674518, -1025516, -1883683, -1047534, 127867, 133282, -615827, -798245, -348538, -250744, -736514, -1087474, -996715, -864609, -833451, -652461, -437753, -542377, -787359, -797600, -836080, -1214499, -1271715, -332121, 637242, 16525]
39902A6525j893269j134128L69662M92281k63838P9J027116R94622L8437R4935
39892b57578J236416J254774m83653j652868o31876R04864P00503o53170q91127
39883d73715M62928J645042J240170j75287j004033m58019O89127R63634r4366
39874B795481j233272r75978M33780J346237Q26790m53448j404219j599011j104836
39865a368476k29926L83376K93012j0220K49254Q00157O59893k23450q33565p03672
39855i83617m63422n12812l33125M48650J293448J488137R16417r3746r76016
39846G83914j045028k74003K61734k47774r10068m02333P44336Q90830O6091j23074
39836b55375N62927N14891p17091j362579m08158O33286L09381m64807l10868
$$ y = [16525, -1876744, -3010872, -2641210, -2148929, -2412767, -2412688, -1385572, -390950, -352513, -257578, 978838, 2233612, 1749959, 97091, -534785, 370079, 1070582, 417412, -473715, -10787, 1634255, 2874425, 2699138, 1695105, 1237086, 1926213, 2889847, 2795481, 1562209, 586231, 1020011, 2366248, 3193038, 2739590, 1335371, -263640, -1368476, -1598402, -1215026, -922014, -932234, -682980, 117177, 777070, 553620, -279945, -983617, -1447039, -1959851, -2292976, -1844326, -550878, 937259, 1853676, 1759930, 783914, -261114, -535117, -273383, -521157, -1431225, -1833558, -1089222, -198392, -132301, -255375, 307552, 822443, 105352, -1257227, -1665385, -1032099, -722718, -1187525, -1498393]
39827a498393K35027Q7594k30384J84700N36041l57145j598034j284546M65691
39818c459449J625948J202093K42319q6160J62197M41747N00636K48070k21920
39809F55481m44909j43022K54177K93814K24212L20228J69798m76154r11288n89584
39799f47247k26624n52479p89346J29451J501240J700962O48211k84898n35722
39790I43548p33445r34892l69099Q06897J243538M04148o12953p83928m00855
39781d37041r5251J35013L22838Q2876n51966p82490k04422M53645L62657k83346
39771i97487o92944m62707K59017J026050J189353L59903q66745j253664l93334
39762a832558O88423P98481j2237p19064o50728j06925K10520M7358k13233j45243
$$ y = [-1498393, -1263366, -1175772, -1406156, -1221456, -685415, -1042560, -2640594, -3925140, -3459449, -1833501, -631408, -389089, -475249, -313052, 128695, 629331, 877401, 655481, 210572, 67550, 321727, 615541, 839753, 1159981, 1329779, 853625, -57663, -647247, -873871, -1426350, -2215696, -2086245, -585005, 1115957, 1764168, 1479270, 943548, 210103, -724789, -1093888, -286991, 956547, 1360695, 747742, -36186, -437041, -532292, -397279, -74441, 8435, -543531, -1326021, -1530443, -1076798, -714141, -997487, -1690431, -2153138, -1894121, -868071, 321282, 681185, -185560, -1439224, -1832558, -1144135, -345654, -357891, -1076955, -1727683, -1834608, -1624088, -1576730, -1789963, -1935206]
39752a935206J40125K89630L97931P49592Q98615L4994j389793j660161k36144
39743b710417J076570O48891m80890l50923O90997P12276l68330o08070N41565
39734h48331J175240R9336j172347q62196L95978Q23446J62242m38051l44688
39725a009371J24105O42910J089187J144576N84466k61600q86904j089531p82055
39716d44217N353O07797J39689j048410j339397k5269J456130J389192L4738j021564
39706b45958j046752n46183j9670M63563P07711M66861n06k27922k25439k22137
39696h96432n8503M31954P80411M43934k36162m39532n5091K89282K46201Q0520
39686E86582O1771J55510K68561L05325J08596k35718k90600R9583M17742K07194
$$ y = [-1935206, -1795081, -1505451, -1107520, -357928, 540687, 575681, -814112, -2474273, -2710417, -1633847, -984956, -1465846, -1816769, -1125772, -413496, -781826, -1389896, -848331, 326909, 426245, -746102, -1608298, -1212320, -388874, -226632, -664683, -1009371, -885266, -242356, 846831, 1991407, 2575873, 2314273, 1427369, 337838, -444217, -438864, 168933, 308622, -739788, -2079185, -2104454, -648324, 740868, 775606, -245958, -1292710, -1838893, -1858563, -1395000, -687289, -220428, -220934, -448856, -674295, -896432, -954935, -522981, 257430, 701364, 465202, 25670, -29421, 259861, 506062, 586582, 648353, 803863, 1072424, 1377749, 1486345, 1250627, 960027, 1059610, 1477352, 1684546]
39676A684546k08349k96591j65798j88771k13009R4935M63868L67590q3407l23718
39666A131296j83649Q3040L26569M31491J14895n25221p30399j19458N21321L64421
39656A414306j30183p2465K61672j2617o95213q17781l63481j46439j71110K28322
39646e04989O84945J07919j091234j071515N33100J711844J028801k89524m37924
39637F71423L47255O90763L37171m0182l28330p58267r44373n48081k25442n57201
39627a355264p42523J65153J361636J273986K1816p71417m13753K23384M11051
39618A74069L17698O3330m23994n62612K87352J304822R86195l75492q62202K6721
39608I35887N65133j96463p83127J7476Q25939o5475j637247j610658l8423R17410
$$ y = [1684546, 1476197, 1179606, 1013808, 825037, 612028, 706963, 1170831, 1538421, 1455014, 1131296, 947647, 1030687, 1357256, 1788747, 1903642, 1378421, 648022, 528564, 1049885, 1414306, 1284123, 1211658, 1473330, 1460713, 765500, -52281, -415762, -562201, -733311, -504989, 179956, 287875, -803359, -1874874, -1341774, 370070, 1398871, 1109347, 671423, 1018678, 1709441, 2046612, 2006430, 1678100, 919833, -24540, -572621, -798063, -1355264, -2097787, -1932634, -570998, 702988, 724804, -46613, -460366, -236982, 174069, 491767, 555097, 131103, -431509, -144157, 1160665, 2146860, 1771368, 909166, 935887, 1501020, 1304557, 521430, 538906, 1364845, 1299370, -337877, -1948535, -1986958, -1069548]
39598a069548M20376j11519L42132R01615N70547j32332k33325J56413K92858
39589A137217M6693j37622j05789j36576l68958n10235j59495O30054J145169
39580A540458O74522m43701r37990k08253P54546P32190k6583m22284k90369l29851
39570A042685n46576k08849O03986Q57845K87817r2366K80428N48575p5450r16690
39560A781405q10651K83571J414017J798557J267257J39926q01784p91454J5520
39551D296364O63789P04295O42222Q20491Q09005L47089p2440j01389r6037k66588
39541G746801k47608j2006j01650m31204j81323M88055K09306j174056j728147
39532D568168l54447J150548P89585m73480m91040M48779M15395o14074q51719
$$ y = [-1069548, -649172, -760691, -418559, 483056, 1053603, 921271, 687946, 844359, 1137217, 1183910, 1046288, 940499, 803923, 434965, -75270, -234765, 395289, 1540458, 2214980, 1771279, 833289, 625036, 1379582, 2111772, 2085189, 1662905, 1372536, 1042685, 496109, 287260, 891246, 1749091, 2036908, 1944542, 2224970, 2773545, 2698095, 1781405, 970754, 1254325, 2668342, 4466899, 5734156, 5874082, 5072298, 4280844, 4296364, 4960153, 5664448, 6306670, 7127161, 7936166, 8283255, 8210815, 8109426, 8013389, 7746801, 7499193, 7487187, 7385537, 6954333, 6773010, 7261065, 7470371, 6296315, 4568168, 4213721, 5364269, 6153854, 5680374, 5189334, 5638113, 6053508, 5439434, 4587715]
39523D587715k4142K44624m73076o34511M08987J211712O93271l08475p70186
39514D935919q65799q34233l09562M15015K63698o47113p22571N17380J393126
39505D145860O62417o23582j024510p37571m59053N9678Q77885R07117l14685
39496C493556j322736q12837L10849N84963L10777M81194P34005L27434n2280
39487D054925M60203R48788K18830p43591k60660Q98087N77123j006081j445294
39478C702330j45819P19084j71077j326890j096404l5104N63806O57730P11007
39469C578663M85419j59445m69370K7614N25296J43986p08954j063274p12147
39460A647788q3192M64166N90630K0802p89566q51301l3130O30400N21267L00389
$$ y = [4587715, 4563573, 4808197, 4335121, 3700610, 4109597, 5321309, 6014580, 5706105, 4935919, 4070120, 3235887, 2926325, 3341340, 3605038, 2957925, 2235354, 2752734, 4145860, 4808277, 4184695, 3160185, 2422614, 1963561, 2023239, 2901124, 3808241, 3493556, 2170820, 1357983, 1668832, 2253795, 2564572, 3045766, 3779771, 4107205, 4054925, 4515128, 5463916, 5682746, 4939155, 4678495, 5576582, 6153705, 5147624, 3702330, 3556511, 4275595, 4104518, 2777628, 1681224, 1646120, 2209926, 2867656, 3578663, 4064082, 3904637, 3435267, 3462881, 3988177, 4132163, 3423209, 2359935, 1647788, 1564596, 2028762, 2619392, 2640194, 1850628, 999327, 966197, 1596597, 2117864, 2418253]
39450B418253N70770P85244L35484k62469k52232J01205J05124j99795l99522
39441C202062n69765q52940q11355j77316L39895L4980n11898k43120O60884J040736
39431B112163N59209Q5220K09044M25665J21389m29037n43589j75864J0227m39478
39421A934949j070526j000098j40685M61986m0199r92882j055871j19174O44938
39412a377562O33744M42421L94973p4046r28479r42162L32348J376068Q55956
39403G13261k11103p1795R27757R91861j85832j056617o58908K89406P94324O00187
39393B132541k23544j310933j654841o57265N70531M91717m15420l10101R24205
39384d53110J374280K84599o78558k43908M71669Q3012p38643o09008K99496Q90641
$$ y = [2418253, 2989023, 3774267, 4109751, 3847282, 3595050, 3696255, 3801379, 3601584, 3202062, 2632297, 1779357, 968002, 790686, 1130581, 1165561, 653663, 410543, 1071427, 2112163, 2671372, 2756592, 2965636, 3391301, 3512690, 3083653, 2540064, 2364200, 2374427, 1934949, 864423, -135675, -276360, 185626, 145427, -847455, -1903326, -2022500, -1377562, -743818, -301397, 93576, 19530, -908949, -1851111, -1518763, -142695, 713261, 502158, 430363, 1358120, 2349981, 2164149, 1107532, 448624, 738030, 1532354, 2132541, 1908997, 598064, -1056777, -1714042, -1143511, -651794, -1067214, -1377315, -453110, 921170, 1205769, 527211, 283303, 754972, 837984, 99341, -509667, -210171, 680470]
39374F80470R23726P10707Q9682q58652j094930j27275P40205K43486p17971n48346
39364D1102L37660K92983o83951j009977k08804N60829O59211O34675O20454P4413
39354A318595o01812k22044R10731R30402o17646j692605p32851J037494J569243
39345A899507P44847k43329r54441j543172j546897n13205P49729J051571N57207
39336B01817L39597N79822N36907O6304j64505K7735K2690m44419p78076m69607
39326h1735J52207M03939M6342n55556q13192m65068J12328L41526K46720L59824
39316b52665P34339P75079L15976l546J07505K1749n73589q87309l48489K58764
39306A47814O1532m04282j96467L54040L52558K1990J59448M82634J31171o00336
$$ y = [680470, 1604196, 2314903, 2404585, 1545933, 451003, 323728, 1063933, 1307419, 589448, 41102, 378762, 671745, -12206, -1022183, -1230987, -670158, -10947, 623728, 1244182, 1318595, 716783, 494739, 1405470, 2335872, 1718226, 25621, -707230, 330264, 1899507, 2644354, 2401025, 1446584, -96588, -1643485, -2156690, -1406961, -355390, 201817, 541414, 1121236, 1658143, 1724447, 1559942, 1587677, 1610367, 1165948, 387872, -81735, 70472, 474411, 520753, -34803, -847995, -1313063, -1200735, -859209, -612489, -252665, 481674, 1256753, 1572729, 1569183, 1676688, 1698437, 1124848, 237539, -110950, 147814, 209346, -194936, -391403, -37363, 315195, 337185, 496633, 979267, 1110438, 510102]
39296E10102o88441k24431j15009j80220N71957J786240J834084L54271j085484
39287B763069j311441q64431n36468k38500J00570O0924k36301o0467M97951N53457
39277G28363K47022P24431J793879J709148J54197p70052J69785J221329N08326
39268F486428r45958j106191j96685J95806R086K80249P38985K77013o98003p25736
39258D314994J28895L59592l81037q61180n56831l46936o07620m84461L96666
39249A962082J099350Q84473K40773j35901k51108k61228r5755j5437n04863j245385
39239A677001j214239j92524P77987Q28268K73037j73680l62060m96322o55031
39230D62437q43794r70719o55549L09368J270494J207493L3748j209619j513471
$$ y = [510102, -178339, -402770, -517779, -697999, -126042, 1660198, 3494282, 3848553, 2763069, 1451628, 587197, 50729, -187771, -87201, -26277, -262578, -323045, 174906, 728363, 975385, 1699816, 3493695, 5202843, 5357040, 4586988, 4756773, 5978102, 6486428, 5540470, 4434279, 4237594, 4433400, 4442486, 4722735, 5461720, 5738733, 5040730, 4314994, 4443889, 4803481, 4422444, 3561264, 3004433, 2657497, 2049877, 1565416, 1962082, 3061432, 3945905, 4186678, 4050777, 3799669, 3538441, 3442686, 3427249, 2922386, 1677001, 462762, 270238, 1048225, 1876493, 2149530, 1975850, 1613790, 1117468, 462437, -381357, -1352076, -2007625, -1698257, -427763, 779730, 813478, -396141, -1909612]
39221a909612p52450M70649J267277J013674P8809l47717K34537Q68071O10303
39212A533541k2979j02673J09554q5877l36224m7998J55442m43436r36671k53498
39202d30819N28950j83340j332713o76867J042365R43354q81397j068172J277907
39193g80732K663132Q85340j277929p81062P36397J73019j575965j373583O78305
39184f53078J561690L30471r16813q04011j79285J68988M58771M92958j64687
39175B95004o24004K37319J292532M99322j380205j456946N76752J674994K85558
39166A400326j230230n81374R14733Q90147k65839n89322O8569K97309k03014
39157G01305m72055k75211k53565l75781k0991M92044J26297r49757j155626K61043
$$ y = [-1909612, -2662062, -2191413, -924136, 89538, 168347, -179370, 55167, 923238, 1533541, 1510562, 1407889, 1517443, 1431566, 1095342, 1047344, 1202786, 759350, -177321, -430819, 98131, -85209, -1417922, -2094789, -1052424, -109070, -990467, -2058639, -780732, 1882400, 2767740, 1489811, 708749, 1445146, 1618165, 42200, -1331383, -653078, 908612, 1239083, 322270, -481741, -661026, -492038, -33267, 459691, 295004, -329000, -91681, 1200851, 1700173, 319968, -1136978, -560226, 1114768, 1400326, 170096, -411278, 503455, 1393602, 1127763, 538441, 607010, 904319, 701305, 229250, -45961, -299526, -675307, -696298, -204254, -77957, -1027714, -2183340, -1922297]
39147a922297J889857J807828j5640j654631j442890K16353J455566J166623J45841
39138A646610k30491R0211N9247o32117j081404p31983k44907k56218k81449L02946
39128a359555R63739P10174l37113j035832p29718Q5687N40395K61600m51560
39119a352183q77496m52125N09877R49199L71345l37583n0256R26611J165205
39110H52594J21775j028705r35475J68664Q40709L05855o47577p68498R2745Q87488
39100a10425O98446k52944j032329j061003n06719J03964L19186M676m87796n36026
39090b860970N5329P54642R87904Q09008N19042Q2513m82141o27843m8381M86304
39080c24593J12708o11886m26044N53750R19405K36350l67883k59815k56460p97225
$$ y = [-1922297, -32440, 1775388, 1759748, 105117, -1337773, -1121420, 334146, 1500769, 1646610, 1416119, 1506330, 1565577, 933460, -147944, -879927, -1124834, -1381052, -1662501, -1359555, -395816, 314358, -22755, -1058587, -1788305, -1702618, -1162223, -900623, -1352183, -2229679, -2681804, -2171927, -1222728, -851383, -1188966, -1239222, -312611, 852594, 974369, -54336, -989811, -821147, 19562, 325417, -322160, -1090658, -997913, -110425, 588021, 335077, -697252, -1758255, -2264974, -2161010, -1841824, -1837148, -2324944, -2860970, -2805641, -2050999, -1063095, -254087, 264955, 347468, -134673, -762516, -810897, -324593, -211885, -823771, -1249815, -696065, 223340, 459690, 91807, -168008, -424468, -1221693]
39070a221693q63210J37176R52521M27018m70373k64411N03827L62274l31349
39061g68220j1823J089903J037673m95690j409976m64621P59078M49622o29349
39052d43403n80755N51282R74069o9713j338303j442066m48590O03237R64162
39043a230080O64049K45612K13407M95732M80035j79758r65678j057195l59409
39034a693285M12907O37194M23730K88406M05568L65006k21539r09960o45221
39025i37194P78549J883610J048987j149668k278366j140381O06055P72027m13500
39016h29881r57424j03222Q54569P17481r4206n61143m50931p4275M63088J042411
39006F467J169071N54240k87084o11679l68010m7307J25553L07363M77906L14696
$$ y = [-1221693, -2084903, -1947727, -995206, -568188, -1038561, -1302972, -799145, -436871, -768220, -780043, 309860, 1347533, 851843, -558133, -1022754, -263676, 185946, -443403, -1024158, -472876, 501193, 431480, -906823, -2348889, -2797479, -2194242, -1230080, -566031, -320419, -107012, 388720, 868755, 688997, -276681, -1333876, -1693285, -1280378, -643184, -219454, 68952, 474520, 839526, 617987, -291973, -937194, -158645, 1724965, 2773952, 1624284, -654082, -1794463, -1188408, -416381, -829881, -1787305, -1890527, -1035958, -318477, -412683, -973826, -1424757, -1499032, -1035944, 6467, 1175538, 1729778, 1442694, 831015, 463005, 415698, 541251, 848614, 1326520, 1641216]
38996A641216k85988r00753r41374k52181O45724R34297L21415n08224n91036
38987F3096R1125N33909Q5157o20864n84722R9985L87366k29645j019417r57295
38977b151305N0641J097461J228683L58827o68958r40840m06413K10805M21143
38968g99956M45487N11128K99694l64040q19670l75295N33830Q92955N94815L53881
38958A272829K52841l41309j197497j002224N38638J668058Q32908r51490j415676
38949c42922j79483R72394Q27831J50709j0761O4047k99667p27965m40168K56695
38939B70710L00769m53998r57044n01234L30665O14492K87410j02243l24531m89703
38929a024707m34854J44694R31508J065151K55439p27846j023664o58556j49683
$$ y = [1641216, 1355228, 454475, -486899, -739080, -93356, 840941, 1162356, 654132, 63096, 154221, 688130, 773287, 152423, -432299, -332314, 55052, -174593, -1194010, -2151305, -2100664, -1003203, 225480, 584307, -84651, -1025491, -1431904, -1221099, -799956, -354469, 156659, 456353, 92313, -727357, -1102652, -568822, 324133, 918948, 1272829, 1525670, 1184361, -13136, -1015360, -476722, 1191336, 2024244, 1072754, -342922, -522405, 449989, 1277820, 1428529, 1417768, 1481815, 1182148, 454183, 14015, 270710, 571479, 117481, -839563, -1340797, -1010132, -395640, -108230, -210473, -535004, -1024707, -1459561, -1314867, -383359, 681792, 937231, 209385, -814279, -1472835, -1622518]
38920a622518L41528Q10219Q07775k1556r54828q03370L18681R11191K35170n19216
38910d96924n5690R34788P62773o30505j489365q06301K84925K89731n15182o96009
38900b417759J60135R80572Q84765L57610L38112P76709P80476N29q34010r74480
38890E2659o77378o54428q26393l92262P67665J529219Q90789n65226j273840
38881a149195o06662M95371Q98627O20914M04245M35784K01788m25336o96094
38872A79442l6451Q65635P89204k51577q34316r8695R20137P12253n27695j222761
38862D95176o99088M8222K9693m39829n62996k13159L07723Q45320J126938O84125
38852A622125l11836q50854l80624M04278P10066P39056Q65530O82209p0096n43958
$$ y = [-1622518, -1280990, -470771, 337004, 315448, -639380, -1442750, -1124069, -212878, 22292, -496924, -552614, 382174, 1144947, 514442, -974923, -1781224, -1496299, -1206568, -1721750, -2417759, -2257624, -1277052, -392287, -34677, 303435, 1080144, 1860620, 1861149, 1027139, 52659, -624719, -1279147, -2105540, -2497802, -1730137, -200918, 689871, 124645, -1149195, -1755857, -1260486, -361859, 259055, 663300, 1099084, 1300872, 875536, 179442, 142991, 1008626, 1797830, 1546253, 711937, 613242, 1533379, 2245632, 1717937, 495176, -203912, -155690, -125997, -565826, -1128822, -1341981, -1034258, -188938, 938000, 1622125, 1310289, 459435, 78811, 483089, 1193155, 1932211, 2797741, 3479950, 3409854, 2865896]
38842B865896p6864L67869l92601j568992j430485j45148M22833k61707o93339
38833i12538n2875M26642k80317j140664p01355P13618J659575J474218N09878
38824A696182o54561j311441q17150L99655Q89822J23789n87877j06153O71876
38815C04142K82074q70245j138286j95254O34302M61040j69341m22301j43507
38806a257376M14151Q42976N50547n60083j418995q35708P32880J519566P43536
38797G31494m34218n89393K12591Q22535N45200k12716n34968o746P19213N24669
38787A777661p02194j605139r97639M55046J099460N41928q9365l2393K35651
38778F83016K15486J93985L40264J50226n03973p61683o2040P54720N79474l20117
$$ y = [2865896, 2789032, 3156901, 2764300, 1195308, -235177, -380325, 42508, -219199, -912538, -965413, -538771, -819088, -1959752, -2661107, -1947489, -287914, 1186304, 1696182, 1041621, -269820, -1086970, -687315, 202507, 326296, -261581, -367734, 304142, 586216, -284029, -1422315, -1617569, -983267, -522227, -691568, -1113869, -1257376, -843225, -249, 550298, -9785, -1428780, -2264488, -1531608, -12042, 731494, 297276, -292117, -79526, 743009, 1288209, 1075493, 540525, 533779, 1252992, 1777661, 1075467, -529672, -1527311, -1072265, 27195, 569123, 479758, 447365, 683016, 898502, 1092487, 1432751, 1582977, 1079004, 317321, 255281, 1010001, 1589475, 1269358]
38768A269358p61320l63524J62345K42359M1984j42835k90177l26988n4915M15297
38758A91584O57394N12104K46633K8956k85798o75287p35042k45829M01185O66495
38748G62395M69896N3429m26465p88716o70923n6825L11523j99080r64554p62987
38738b272307L35013Q84204L16701j7152R51435J977103J262521n48845j165144
38729A723529k00859K95325p28367j615283q11568N62526N82286m65254p98910
38720a456575P589P34325O18037J11940k32628k76279R2791O59012N74854m27907
38710D05159j070268k08875J094371R41518l93817q82436m6248M12754l62530
38701a10372r93209l44896O02156N46720q0390j53794K95607N09503L32761O1527
$$ y = [1269358, 508038, 144514, 306859, 549218, 591202, 448367, 158190, -168798, -223713, 191584, 848978, 1361082, 1607715, 1636671, 1350873, 675586, -59456, -305285, 95900, 762395, 1232291, 1285720, 859255, 70539, -600384, -657209, -345686, -544766, -1509320, -2272307, -1937294, -1053090, -736389, -753541, 197894, 2174997, 3437518, 2888673, 1723529, 1522670, 1817995, 1089628, -525655, -1337223, -774697, -192411, -657665, -1456575, -1448986, -714661, -96624, 15316, -217312, -493591, -400800, 258212, 833066, 405159, -665109, -873984, 220387, 1161905, 768088, -114348, -160596, 252158, -110372, -1103581, -1448477, -846321, -299601, -379991, -533785, -238178, 271325, 604086, 665613]
38691F65613k21874l37850R0857P29688N44467n61701j262080p55758K1173O4254
38681a023211j11134K91170P45404M16632k29457k53186J37462J50894j28649
38672d075j26058R0029K48510O34458J203874R31323n44051j641729q69101P76481
38662F99661J228721L61467l39518l62941l29330j80029N11459Q40672l93959
38653B036203k145309k105454k80167R60950O11278J32665L76538K40456o71322
38644h44162q33492L69296J145698L12433n20780K65737J414885R34421n65357
38635A678679j067204m14594k0663k46959l32695k28922l67918k19364Q22451
38626c97189J666802Q22814r31723j421329m03380K81849q9279j94485O21219
$$ y = [665613, 443739, 105889, 196746, 926434, 1470901, 909200, -352880, -1108638, -1087465, -1023211, -1134345, -843175, -97771, 318861, 89404, -163782, -26320, 124574, -4075, -130133, -40104, 208406, 842864, 2046738, 2978061, 2434010, 792281, -76820, 699661, 1928382, 2289849, 1950331, 1587390, 1258060, 1078031, 1589490, 2430162, 2036203, -109106, -2214560, -2494727, -1533777, -922499, -789834, -413296, -172840, -844162, -1677654, -1308358, -162660, 149773, -371007, -105270, 1309615, 2244036, 1678679, 611475, 196881, 176218, -70741, -403436, -632358, -1000276, -1219640, -397189, 1269613, 2092427, 1160704, -260625, -664005, -382156, -471435, -665920, -44701]
38617d4701J045080J38488r73846r19428p4934L94176K75592K4134k45847m90026
38607h71312l23342K38970M33467o6261m45105l4672N35378L81454k00501l35388
38597f87312K1450K79066L07979L46765K25231l30395r31991j004464p17063n02052
38587b992786l1212J145900K197516J709717m1764j015803k06849Q39050L13752
38578A917521j167206j584664n64898K65933n8659m92879J23535J176048J324417
38569I39148N49533n6247o0224k4771k57562m28252m74476p19616q84615j92216
38559a609298J128694J682254R11977K7205o353j08438j297474k385396j464792
38550c121621Q24487J772615N06392p74865k08021J096268J122533M8774m58013
$$ y = [-44701, 1000379, 1138867, 165021, -754407, -829341, -435165, -159573, -135439, -381286, -871312, -1194654, -955684, -522217, -588478, -1033583, -1068255, -532877, -151423, -351924, -687312, -665862, -386796, -78817, 267948, 493179, 162784, -769207, -1773671, -2490734, -2992786, -3023998, -1878098, 319418, 2029135, 1987371, 971568, 764719, 1603769, 1917521, 750315, -834349, -1399247, -1133314, -1191973, -1684852, -1561317, -385269, 939148, 1488681, 1432434, 1372210, 1347439, 1089877, 661625, 187149, -532467, -1417082, -1609298, -480604, 1201650, 2113627, 2140832, 2134479, 2026041, 728567, -1656829, -3121621, -2297134, -524519, -18127, -792992, -1001013, 95255, 1217788, 1266562, 808549]
38541H08549m1626J31681m09284p52737k55825N07344P81863N47998P7600m78702
38531I16861p24365j70138P89524R43746p3524r98090o11336M84827P85070R6949
38521A439524l88678r9576K06676J4609k4881N09725O80701l53886j592996j386059
38511i94841K5335P66967J42042m68696O2785R74593J120003O93463L63049p4800
38501B609900q37060j032563j5415R57755K67396j355625j637870j63475J064016
38492a42941P05516k56363n27354k95241j34772J88250P20612O18873l28381q15607
38482b67408j4529P81120P8756j276611j288979J33690J178275Q96222J87255
38473D07791k9424m280j75590l02920o6706L55795O47178O42975K31238l94373
$$ y = [808549, 766923, 898604, 489320, -263417, -519242, -11898, 769965, 1317963, 1395563, 916861, 192496, 22358, 811882, 1755628, 1682104, 684014, 72678, 557505, 1342575, 1439524, 1050846, 951270, 1157946, 1172555, 1147674, 1657399, 2338100, 1984214, 391218, -994841, -969506, -202539, -60497, -529193, -466408, 508185, 1628188, 2321651, 2684700, 2609900, 1772840, 740277, 724862, 1682617, 1950013, 594388, -1043482, -1206957, -142941, 562575, 306212, -221142, -516383, -651155, -462905, 257707, 876580, 548199, -267408, -281937, 499183, 577939, -698672, -1987651, -1853961, -675686, 220536, 407791, 378367, 374087, 198497, -104423, -171129, 184666, 831844, 1474819, 1706057, 1311684]
38463A311684n64405L971M79156J7401p55956n84803L55987O87720Q0673l07658
38453G23770J04810M34164L8102m09676l11099k08068n24559n37216K59088Q63871
38443D33187J78628j098612j361841l84765N72796O66048K87994Q6104J75071
38434d45390L67296M22741Q6214n26454p60258k39560M36143M83156O0508j74297
38424b89901k29154n03156o71734p4949Q40392Q10397k31594p41355K01990J393440
38414E04376J194650r9805p80076k22191L79277q1815j032563j116035q1278R49464
38404c85996R73672K42862k82306j75878J35998J09234k89723o89918o95228j17058
38394a174341Q00076J305256P53120m74008j106574m44140O88862R35230R8073
$$ y = [1311684, 747279, 751250, 1230406, 1247807, 491851, -92952, 263035, 950755, 1031428, 723770, 828580, 1262744, 1300846, 891170, 580071, 372003, -152556, -689772, -430684, 433187, 611815, -486797, -1848638, -2233403, -1660607, -994559, -706565, -620461, -445390, -78094, 344647, 430861, -95593, -855851, -1095411, -659268, -176112, -115604, -289901, -519055, -1022211, -1693945, -1768894, -928502, -118105, -349699, -1091054, -889064, 504376, 1699026, 1599221, 819145, 596954, 976231, 894416, -138147, -1254182, -1335460, -385996, 587676, 830538, 548232, 372354, 508352, 617586, 327863, -362055, -1057283, -1174341, -374265, 930991, 1684111, 1210103, 103529, -340611, 348251, 1283481, 1381554]
38385A381554p31234o45240O6531M84697J74079n02709r10690p33313j23584N49723
38375i90186R96719J037284N52990k77989q00055m51111L79741O45851O4713l94068
38365G63889O5247P80753N60524n16397j173704p31190O2730J74462m17999q86352
38355a318037o16630J63295P09598O59404N19668R21114J434269R23452o17574
38346B778559j625019j123590k48083l95938q81241j83263J174827J210887j89820
$$ y = [1381554, 650320, 5080, 71611, 556308, 730387, 227678, -683012, -1416325, -1539909, -990186, 6533, 1043817, 1596807, 1318818, 518763, 67652, 447393, 1093244, 1157957, 763889, 829136, 1609889, 2170413, 1654016, 480312, -250878, -188148, -13686, -431685, -1318037, -1934667, -1771372, -1061774, -402370, 117298, 1038412, 2472681, 3396133, 2778559, 1153540, 29950, -218133, -614071, -1495312, -1678575, -503748, 707139, 517319]
$$ [...]
##END NTUPLES=NMR SPECTRUM
##END=
