##TITLE=31Pdec_4C1011SA
 aceton-d6, 24 sc
 11.11.2021
##JCAMPDX= 6.0         $$ Bruker NMR JCAMP-DX V2.0
##DATA TYPE= NMR SPECTRUM
##DATA CLASS= NTUPLES
##ORIGIN= UXNMR, Bruker Analytische Messtechnik GmbH
##OWNER= root
$$ XWIN-NMR		Version 3.5
$$ Thu Nov 11 11:54:17 2021 Russian Standard Time (UT+4h)  she@DPX200
##.OBSERVE FREQUENCY= 81.013821
##.OBSERVE NUCLEUS= ^31P
##.ACQUISITION MODE= SIMULTANEOUS
##.ACQUISITION SCHEME= undefined
##.AVERAGES= 24
##.DIGITISER RES= 16
##SPECTROMETER/DATA SYSTEM= spect
##.PULSE SEQUENCE= zgpg30
##.SOLVENT NAME= Acetone
##.SHIFT REFERENCE= (INTERNAL, Acetone, 0, 248.564)
##AUDIT TRAIL= $$ (NUMBER, WHEN, WHO, WHERE, WHAT)
$$ ##TITLE= Audit trail, XWIN-NMR		Version 3.5
$$ ##JCAMPDX= 5.01
$$ ##ORIGIN= Bruker BioSpin GmbH
$$ ##OWNER= she
$$ F:/spectra/data/she/nmr/P31/1/pdata/1/auditp.txt
$$ ##AUDIT TRAIL=  $$ (NUMBER, WHEN, WHO, WHERE, WHAT)
(   1,<2021-11-11 11:52:58.00 +0400>,<she>,<DPX200>,
      <created by zg, POWCHK disabled, PULCHK disabled
       configuration hash MD5:
       00 E9 B6 7A A2 85 ED C7 34 08 36 98 17 FE 4E 26
       data hash MD5: 32K
       C6 E3 1B C6 CA 47 B6 6F 16 62 8D BD 0E E0 8F A2>)
(   2,<2021-11-11 11:53:03.07 +0400>,<she>,<DPX200>,
      <Start of raw data processing
       efp BC_mod = 2 LB = 1 FT_mod = 6 PKNL = 1 PHC0 = -8668.64 PHC1 = -270.1306 SI = 64K 
       data hash MD5: 64K
       98 0F FC 47 61 8D 3B 33 8F 29 66 4A F4 3F 25 84>)
(   3,<2021-11-11 11:53:20.70 +0400>,<she>,<DPX200>,
      <pk PHC0 = -41.07061 PHC1 = 0 
       data hash MD5: 64K
       8E EC 6E 7E C9 A1 E4 9B B8 94 ED CB 13 2D 6C BC>)
(   4,<2021-11-11 11:53:38.79 +0400>,<she>,<DPX200>,
      <pk PHC0 = 1.600008 PHC1 = 0 
       data hash MD5: 64K
       6D 12 8D 4B 8A 93 BC 8E D0 68 9B 9F C7 49 8F 08>)
$$ ##END=
$$ 
$$ hash MD5
$$ 9E 11 DD 4E 49 A6 1D 1D 84 5D 17 CA F8 AC 01 BC
##$RELAX= 
##$RELAX= 
##$RELAX= 
##$RELAX= 
##$RELAX= 
##$RELAX= 
##$RELAX= 
##$RELAX= 
$$ Bruker specific parameters
$$ --------------------------
##$DU= <F:/spectra>
##$EXPNO= 1
##$NAME= <P31>
##$PROCNO= 1
##$TYPE= <nmr>
##$USER= <she>
##$AMP= (0..31)
100 100 100 100 100 100 100 100 100 100 100 100 100 100 100 100 100 100 
100 100 100 100 100 100 100 100 100 100 100 100 100 100 
##$AQSEQ= 0
##$AQ_mod= 1
##$AUNM= <au_zg>
##$AUTOPOS= <>
##$BF1= 81.014009
##$BF2= 200.13
##$BF3= 200.13
##$BF4= 200.13
##$BF5= 200.13
##$BF6= 200.13
##$BF7= 200.13
##$BF8= 200.13
##$BYTORDA= 1
##$CFDGTYP= 0
##$CFRGTYP= 5
##$CHEMSTR= <none>
##$CNST= (0..31)
1 1 145 1 1 1 1 1 1 1 1 1 1 1 1 1 1 1 1 1 1 1 1 1 1 1 1 1 1 1 1 1 
##$CPDPRG= <waltz16>
##$CPDPRG1= <>
##$CPDPRG2= <waltz16>
##$CPDPRG3= <>
##$CPDPRG4= <mlev>
##$CPDPRG5= <mlev>
##$CPDPRG6= <mlev>
##$CPDPRG7= <mlev>
##$CPDPRG8= <mlev>
##$CPDPRGB= <>
##$CPDPRGT= <>
##$D= (0..31)
0 1 0 0 0 0 0 0 0 0 0 0.03 2e-05 3e-06 0 0 0 0 0 0 0 0 0 0 0 0 0 0 0 0 
0 0 
##$DATE= 1636617177
##$DBL= (0..7)
120 120 120 11 120 120 24 19 
##$DBP= (0..7)
150 150 150 150 150 150 150 150 
##$DBP07= 0
##$DBPNAM0= <>
$$ [...]
##$SUBNAM2= <"">
##$SUBNAM3= <"">
##$SUBNAM4= <"">
##$SUBNAM5= <"">
##$SUBNAM6= <"">
##$SUBNAM7= <"">
##$SUBNAM8= <"">
##$SUBNAM9= <"">
##$SW= 501.771253377433
##$SWIBOX= (0..15)
0 1 3 0 0 0 0 0 0 0 0 0 0 0 0 0 
##$SW_h= 40650.406504065
##$TD= 32768
##$TD0= 1
##$TE= 0
##$TE2= 300
##$TE3= 300
##$TEG= 300
##$TL= (0..7)
0 120 53 12 22 120 120 120 
##$TP= (0..7)
150 150 150 150 150 150 150 150 
##$TP07= 0
##$TPNAME0= <>
##$TPNAME1= <>
##$TPNAME2= <>
##$TPNAME3= <>
##$TPNAME4= <>
##$TPNAME5= <>
##$TPNAME6= <>
##$TPNAME7= <>
##$TPOAL= (0..7)
0.5 0.5 0.5 0.5 0.5 0.5 0.5 0.5 
##$TPOFFS= (0..7)
0 0 0 0 0 0 0 0 
##$TUNHIN= 0
##$TUNHOUT= 0
##$TUNXOUT= 0
##$USERA1= <user>
##$USERA2= <user>
##$USERA3= <user>
##$USERA4= <user>
##$USERA5= <user>
##$V9= 5
##$VALIST= <valist>
##$VCLIST= <CCCCCCCCCCCCCCC>
##$VD= 0
##$VDLIST= <DDDDDDDDDDDDDDD>
##$VPLIST= <PPPPPPPPPPPPPPP>
##$VTLIST= <TTTTTTTTTTTTTTT>
##$WBST= 1024
##$WBSW= 4
##$XGAIN= (0..3)
0 0 0 0 
##$XL= 0
##$YL= 0
##$YMAX_a= 3015
##$YMIN_a= -3001
##$ZGOPTNS= <>
##$ZL1= 120
##$ZL2= 120
##$ZL3= 120
##$ZL4= 120
##$ABSF1= 0
##$ABSF2= 0
##$ABSG= 0
##$ABSL= 0
##$ALPHA= 0
##$AQORDER= 0
##$ASSFAC= 0
##$ASSFACI= 0
##$ASSFACX= 0
##$ASSWID= 0
##$AUNMP= <proc_1d>
##$AZFE= 0.1
##$AZFW= 0.5
##$BCFW= 0
##$BC_mod= 2
##$BYTORDP= 0
##$COROFFS= 0
##$CY= -3
##$DATMOD= 1
##$DC= 0
##$DFILT= <>
##$DTYPP= 0
##$F1P= 0
##$F2P= 0
##$FCOR= 1
##$FTSIZE= 65536
##$FT_mod= 6
##$GAMMA= 0
##$GB= 0
##$INTBC= 1
##$INTSCL= 5.30512e-09
##$ISEN= 30
##$LB= 1
##$LEV0= 0
##$LPBIN= 0
##$MAXI= 10000
##$MC2= 0
##$MEAN= 0
##$ME_mod= 0
##$MI= 50
##$NCOEF= 0
##$NC_proc= -7
##$NLEV= 6
##$NOISF1= 182.463
##$NOISF2= 159.3651
##$NSP= 0
##$NTH_PI= 0
##$NZP= 0
##$OFFSET= 248.5645
##$PC= 4
##$PHC0= -8708.11
##$PHC1= -270.1306
##$PH_mod= 1
##$PKNL= yes
##$PPARMOD= 0
##$PSCAL= 0
##$PSIGN= 0
##$REVERSE= no
##$SF= 81.014009
##$SI= 65536
##$SIGF1= 159.3651
##$SIGF2= -187.1042
##$SINO= 113.3802
##$SIOLD= 16384
##$SREGLST= <1H.CDCl3>
##$SSB= 0
##$STSI= 65536
##$STSR= 0
##$SW_p= 40650.406504065
##$SYMM= 0
##$S_DEV= 0
##$TDeff= 32768
##$TDoff= 0
##$TI= <>
##$TILT= no
##$TM1= 0
##$TM2= 0
##$TOPLEV= 0
##$USERP1= <user>
##$USERP2= <user>
##$USERP3= <user>
##$USERP4= <user>
##$USERP5= <user>
##$WDW= 1
##$XDIM= 65536
##$YMAX_p= 577656479
##$YMIN_p= -310024635
$$ End of Bruker specific parameters
$$ ---------------------------------
##NTUPLES= NMR SPECTRUM
##VAR_NAME=  FREQUENCY,     SPECTRUM/REAL,   SPECTRUM/IMAG
##SYMBOL=    X,             R,               I
##VAR_TYPE=  INDEPENDENT,   DEPENDENT,       DEPENDENT
##VAR_FORM=  AFFN,          ASDF,            ASDF
##VAR_DIM=   65536,         65536,           65536
##UNITS=     HZ,            ARBITRARY UNITS, ARBITRARY UNITS
##FACTOR=    0.620285442955139, 1,           1
##FIRST=     20137.2065510759, 0,            0
##LAST=      -20513.1999529892, 0,           0
##MIN=       -20513.1999529892, -310024635,  0
##MAX=       20137.2065510759, 577656479,    0
$$ Real data points
##PAGE= N=1
##DATA TABLE= (X++(R..R)), XYDATA
$$ [...]
45863 2434069 -1961996 -3430330 -775462 1755501 399563 -3361195 -5635083 -5119192
45855 -5119192 -3201920 -1241926 -2306 -233559 -1817016 -3441454 -4356091 -4931479 -4670160
45846 -4670160 -2110880 1929355 3857311 2146864 -13320 576579 2450275 2555113
45838 2555113 1422169 1375088 1574335 -555573 -3868056 -4216701 -882555 2004811 1440456
45829 1440456 -787225 -1778870 -1535539 -1373496 -1060922 90023 1078586 538125 -761003
45820 -761003 -781694 786281 2048470 1464005 -316851 -1501941 -1277108 -280909 796076
45811 796076 2215051 4127377 5150451 3597313 396519 -1084025 670494 2860249
45803 2860249 2064663 -932080 -2523918 -1778867 -1505769 -3458496 -5446454 -4729696 -2125166
45794 -2125166 -677871 -1443375 -2665999 -2746013 -2170677 -2230078 -3194330 -4414650 -5332177
45785 -5332177 -5515898 -4186193 -858176 3312278 5855464 5481127 3644711 2670247 2849126
45776 2849126 2753602 2064796 2097652 3116966 3282521 1521696 -351729 -175483 1248190
45767 1248190 1489869 306437 -193755 1000445 2376218 2254073 790669 -873253 -1952058
45758 -1952058 -1933400 -565121 1253615 1652208 -184423 -2795208 -4015226 -3326683 -1978678
45749 -1978678 -1103168 -523908 372837 1182016 705812 -1130276 -2416846 -1372552 1027321
45740 1027321 2004604 722472 -653199 -361814 372166 -308683 -1561114 -1080671 1145570
45731 1145570 2649532 1921329 54065 -1195915 -1324297 -851584 -602407 -1316200 -2712996
45722 -2712996 -3161524 -1774997 -447349 -1760660 -4946041 -6336608 -4317372 -1361378
45714 -1361378 -170300 -286944 -225320 -721349 -3273024 -6626098 -7468351 -4613905 -469686
45705 -469686 1943488 1861202 367996 -1338511 -2485293 -2558138 -1611517 -451199 70799
45696 70799 -222158 -1090544 -2447605 -4137731 -5434697 -5553011 -4778460 -4327938 -4675878
45687 -4675878 -4770006 -3685459 -2408542 -2737586 -4662887 -6298410 -6552735 -6274942 -6209529
45678 -6209529 -5504841 -3379224 -891529 328085 78278 -932094 -2416850 -3858107
45670 -3858107 -3821118 -1874583 -118726 -555617 -1849710 -1333357 425054 220231 -2620243
45661 -2620243 -5052342 -5092384 -4469982 -4970266 -5151474 -3036880 176527 1708154 1006981
45652 1006981 -435364 -1862963 -3356875 -4051751 -2944653 -1259497 -1493558 -3791667
45644 -3791667 -5412302 -4444415 -2250913 -1267614 -1750942 -1925776 -627028 1390223 2682211
45635 2682211 2818357 2478285 2150180 1370722 -278180 -1821500 -1580576 585455 2827857
45626 2827857 3704239 3908182 4575518 4969349 3618225 1291435 674491 2516583 3935562
45617 3935562 1917198 -2537294 -5375933 -4376922 -1575062 -398769 -1602308 -3079918
45609 -3079918 -3077590 -2141226 -1644181 -1687820 -1408948 -594053 224968 973621 2054656 3089302
45599 3089302 2901086 1236668 -540616 -1167775 -1041986 -1201354 -1416424 -465371 1791441
45590 1791441 3664433 3374326 1020065 -1601537 -2901975 -2840952 -2436164 -2455523 -2958190
45581 -2958190 -3752349 -4538913 -4592984 -3214852 -874175 961866 1679219 2245156 3353703
45572 3353703 3998633 3115344 1558629 792349 497485 -543225 -1919346 -2335384 -2375809
45563 -2375809 -3625835 -5026840 -3508460 824373 3596668 2126144 -605736 -498939
45555 -498939 1791494 2704723 1466739 205593 -497567 -2183773 -4635333 -5099260 -2393201
45546 -2393201 985057 2107437 951437 -575370 -1159103 -512814 1200765 3118746
45538 3118746 3799247 2604144 434318 -1348891 -2103589 -1908116 -1302870 -1152719 -1824290
45529 -1824290 -2515834 -2446317 -2434496 -3782064 -5747590 -6080697 -4332207 -2554588 -2085889
45520 -2085889 -1805439 -646777 322123 -43841 -664256 -7404 1163611 963697 -553984
45511 -553984 -1566737 -1151126 115965 1711612 3318274 3752919 1926049 -999995 -2419255
45502 -2419255 -1607622 -395851 -105721 200601 1595864 3323872 4252485 4757124 5608371
45493 5608371 6128734 5208131 3530449 3033099 4155059 4956799 3292913 -809831 -4970127
45484 -4970127 -6290080 -3880959 -140950 1191298 -904787 -3410116 -3045099 -342989
45476 -342989 1667926 1852398 1617859 1570944 478675 -1826460 -3349840 -3080831 -2734479
45467 -2734479 -3638274 -4268323 -3119800 -1807891 -2402712 -3456609 -2186136 524761 1234687
45458 1234687 -324904 -844520 755082 1461925 -362784 -1818234 -319348 1958421
45450 1958421 1823124 368968 537201 1412098 -419179 -4496469 -6112878 -3044630 1176776
45441 1176776 2216589 251683 -1408031 -829178 1248978 3170891 3784119 2976897 1913086
45432 1913086 1990063 2901378 2716106 484320 -2355857 -3811709 -3426935 -1950013 -268216
45423 -268216 557003 -323334 -1989537 -1908153 1010592 4581086 5899393 4712525 2847615
45414 2847615 1372284 77601 -1040211 -1775849 -2784809 -4718606 -6452547 -6084064
45406 -6084064 -3771900 -1760277 -1372122 -1771071 -1982299 -2178399 -2399362 -2045314 -1558306
45397 -1558306 -2530705 -4798046 -5491257 -2935040 299087 748843 -876601 -1063084 745268
45388 745268 1359172 -670858 -2399793 -1155743 1028396 413587 -2759011 -4619011 -3069352
45379 -3069352 -54786 1689514 1793400 1538472 1826364 2700146 3623944 3581178 1949188
45370 1949188 -273438 -1220307 -551769 102458 -437009 -1375100 -1530975 -1088541 -770272
45361 -770272 -457479 210749 860874 1184425 1762813 2813439 3053546 1386931 -954715
45352 -954715 -1694583 -636883 163235 -662346 -2236440 -3057866 -2894946 -2663834 -3254092
45343 -3254092 -4639457 -5597544 -4646722 -1947320 468668 1359731 2015149 3663553 4504837
45334 4504837 2194333 -1378729 -1521531 2414111 5375793 3620374 20247 -436784
45326 -436784 2207692 3838571 2772951 1323609 1203652 1199534 245252 -351624 648169
45317 648169 1961998 1613166 -90570 -1049090 -148901 1725875 3081333 3264774 2719482
45308 2719482 2385048 2698433 2995263 2312799 835610 -237799 -495691 -979605 -2450550
45299 -2450550 -3927116 -3914517 -2495814 -1161582 -849879 -1107743 -1069652 -398250 700135
45290 700135 1573015 1273674 -458093 -2281082 -2368464 -769250 470934 186258 -167935
45281 -167935 1062201 2597995 1633377 -1698872 -3604889 -1475610 2331130 3362515
45273 3362515 747349 -2056149 -2011244 -23562 868927 -647346 -3097209 -4244546 -3330557
45264 -3330557 -1549234 -689941 -1159810 -1487844 -292092 1619164 2146510 759124 -872689
45255 -872689 -1255469 -600118 435333 1822658 3055524 2605192 -38387 -2924547 -3766625
45246 -3766625 -2685398 -1494793 -1176466 -1514601 -2235084 -2767113 -1823486 714974 2300867
45237 2300867 557225 -2833563 -3796065 -1406159 1113564 1367965 652975 713692 734248
45228 734248 -394478 -1326950 -376868 1379978 1815544 1356692 2128832 4157340 5138936
45219 5138936 3935124 1919319 610653 18237 -313016 -486848 -977647 -2485592 -4476944
45210 -4476944 -5348734 -4664819 -3860014 -4049736 -4430081 -3668891 -1808616 63810 1188998
45201 1188998 1422815 907337 167206 -77740 228069 371683 47402 -27611 895919 2627844
45191 2627844 4387953 5431706 5120294 3318906 1097752 53036 478923 1164844 1303081
45182 1303081 1310053 1330097 601059 -782653 -1233772 -190467 400675 -1027816 -2761235
45173 -2761235 -2099855 512030 2271014 2271470 2079208 2188776 1093153 -1353231 -2605317
45164 -2605317 -1015120 1506202 2191655 1086148 253944 706623 1911014 3254684 4169730
45155 4169730 3600003 1187603 -1426170 -2109694 -860016 382368 269683 -805943 -1792099
45146 -1792099 -2030885 -1544680 -1322431 -2764995 -5611058 -7177526 -5428791 -2262047 -1491460
45137 -1491460 -3518550 -4472931 -1536928 3057120 4957538 3205253 958034 1254315
45129 1254315 3679407 5405884 4547094 2042218 479123 1274820 3250486 4198150 3394378
45120 3394378 1835578 399615 -966168 -2215232 -2777726 -2595597 -2312606 -1927081 -634512
45111 -634512 1264519 1835435 116721 -2045264 -2287439 -831989 349132 539382 428322
45102 428322 -132519 -2066918 -4579881 -5105558 -2683945 459620 1890424 1984411 2544336
45093 2544336 3685067 4022065 3383042 3221809 3998490 3960269 1681953 -1234438 -1570134
45084 -1570134 1446744 4848236 5363880 3210509 1300025 1146860 1247128 -5394 -1477166
45075 -1477166 -898606 1548435 3103592 1884565 -1072586 -3474805 -4053718 -2827801
45067 -2827801 -635370 842250 46805 -2395998 -3841859 -3024639 -1914268 -2606634 -3826388
45058 -3826388 -2978825 -759200 -535618 -2980656 -4618345 -2958314 -124031 677587 -174358
45049 -174358 -291877 343047 -96751 -1339745 -1197250 275994 292558 -2113878 -4202129
45040 -4202129 -3740068 -2399652 -2864222 -4682035 -5399168 -4310219 -2644687 -1092751 429224
45031 429224 1285085 810157 87824 738177 2195636 2496278 1615729 1497848 2543181
45022 2543181 2682152 700900 -1848656 -3079973 -3075811 -2723187 -2218115 -1896372 -2642501
45013 -2642501 -4153650 -4619500 -3504490 -2710665 -3355249 -3524164 -1506584 662007 -111539
45004 -111539 -2941051 -3932152 -1896519 92664 -666577 -3078038 -4484805 -4212298 -3572581
44995 -3572581 -3669954 -4351462 -4720422 -4214123 -3574971 -4349424 -6466630 -7129953 -3985833
44986 -3985833 1055962 3551950 2194585 191574 358062 1595334 1704270 1125855 1504660
44977 1504660 2262698 1406524 -888548 -2039636 -575246 1966240 3098670 2096527
44969 2096527 275067 -537398 437437 2242397 3009164 1973104 415073 -37509 428959
44960 428959 414117 -238935 -75868 1506321 2838784 2104984 64612 -757653 519665
44951 519665 2003592 1869962 970940 1202305 2143573 1502016 -962041 -2386744 -929933
44942 -929933 1210353 1019185 -715812 -814151 1166576 2463472 1772915 1053866 1807159
44933 1807159 2617950 1917170 599692 114660 202913 391356 1530093 3723944 4898345
44924 4898345 3915736 3041257 4318493 5406040 2785374 -2099887 -4176085 -1996557
44916 -1996557 586453 631063 -110858 914530 3035505 4330494 4640279 4258638 2237100
44907 2237100 -1272390 -3153504 -1015803 2575873 2825710 -904312 -4525706 -5064490
44899 -5064490 -4101888 -4591589 -6712916 -8304971 -7847898 -5596179 -2692239 -356708 601168
44890 601168 416966 193285 524002 831978 678478 969899 2728262 5032743 5598122
44881 5598122 3697069 1309366 686336 1728590 2715619 2806633 2427972 1620210 -195998
44872 -195998 -2503736 -3480495 -2418158 -953016 -712437 -1003849 -389246 523459 -46846
44863 -46846 -1845315 -2525792 -1108950 501280 212594 -1642950 -3311996 -3911521 -3631065
44854 -3631065 -2648379 -1095457 291735 447794 -1022653 -3283509 -4518867 -3119145
44846 -3119145 475624 3323919 2662075 -861912 -3948500 -4677836 -4066304 -3405919 -2419295
44837 -2419295 -1115105 -1028054 -2584903 -3149534 -311131 4015721 5525212 3090521 -196177
44828 -196177 -1483193 -1107431 -682466 -639832 -636511 -557290 -43693 1495292 3389928 3612468
44818 3612468 1372479 -1295889 -1835911 -267456 1283666 1544746 1165770 1024300 914221
44809 914221 384992 -131906 93795 737233 544111 -939799 -2426865 -2369335 -1108238
44800 -1108238 -610873 -1910468 -3767215 -4355945 -3366719 -1725743 -167738 903550 986864
44791 986864 211141 -173917 535474 966714 -453944 -2562977 -2554387 -47302 2220957
44782 2220957 2288245 1302823 1017781 1133090 611583 -189039 -492725 -792844 -1682586 -2152640
44772 -2152640 -1059233 587876 917786 197789 347575 1720167 2659679 2450520 2403057
44763 2403057 3211955 3263189 998519 -2296326 -3644133 -1911460 957990 2243800 1258683
44754 1258683 -371156 -908588 -470094 -331709 -614881 24402 1872138 2866510 1292417
44745 1292417 -1471220 -2946642 -3352155 -4687736 -6447089 -5702831 -2212182 159533
44737 159533 -921370 -2413436 -699606 2330997 2013901 -1619820 -3642661 -1695393
44729 -1695393 680308 -261913 -3041775 -3810770 -2166381 -997109 -1724647 -2753913 -2566327
44720 -2566327 -1801042 -1625869 -1909654 -1963484 -1822688 -1758491 -1365625 -229851 951844
44711 951844 1019939 50120 -615417 -252889 312976 212289 -14515 471642 986151 214804
44701 214804 -1277963 -1352134 464485 2020516 1812937 1182517 1627373 1938627 469305
44692 469305 -1374438 -1134151 154493 -806178 -3832691 -4772673 -1745416 1931487 2742360
44683 2742360 1381289 4233 -1466394 -3392642 -3885207 -1783805 309218 -210437
44675 -210437 -1338423 171650 2778264 2455953 -225117 -891041 1052824 1529756 -728093
44666 -728093 -1805289 305755 1981634 471319 -1017601 1174247 4824602 5667071
44658 5667071 4158747 3414400 3123348 1050424 -1173126 341723 4775740 6787492
44650 6787492 4212002 660556 -561573 -476687 -747003 -279829 1960331 4010058 3514600
44641 3514600 1092296 -1096577 -2231286 -2423058 -1412794 337023 1033599 37126 -694630
44632 -694630 366301 1588068 849294 -647072 -177654 1827239 2190068 65999 -1524073
44623 -1524073 -157509 2564745 3580735 2504594 1351100 1233660 1322431 775674 -129685
44614 -129685 -1107112 -2501765 -3957290 -3730935 -821838 2838208 4034445 2125109 -390734
44605 -390734 -1456647 -1760816 -2645013 -3703767 -4060045 -4346891 -5278628 -5529097 -3572281
44596 -3572281 -815988 -81443 -1271974 -1502317 317040 2062783 2166572 1732204 1757984
44587 1757984 1202318 -512311 -1689070 -1046442 -7217 -290860 -1301398 -1975379 -3037269
44578 -3037269 -4944810 -5683728 -3579614 -611038 298586 -108822 950118 3142416 3514371
44569 3514371 1864048 1436991 3577230 5505037 4784590 2746545 1755019 1793783 1627753
44560 1627753 1094324 364106 -1192587 -3612817 -5398274 -5501499 -4744331 -4038847 -3085744
44551 -3085744 -2152897 -2782096 -4827405 -5309432 -2862971 -918009 -2933010 -6411047 -6112316
44542 -6112316 -2242589 -301032 -2329313 -3635709 -406124 4078589 4432761 1069947
44534 1069947 -1141351 -203897 1395966 1636670 1286705 1009677 -33348 -1628788 -1832266
44525 -1832266 -405342 -135952 -2751754 -5836710 -6157898 -4245615 -3009990 -3051365 -2292332
44516 -2292332 147286 2554698 3413597 3196751 2704506 1647564 -151229 -1724392 -2159626
44507 -2159626 -1678645 -749119 685640 2281350 2831252 1804195 386888 -94337 4048
44498 4048 -511586 -1687341 -2447108 -2160044 -1119341 195967 1313393 1506331 442574
44489 442574 -922781 -1072769 265008 1740558 1988380 1039852 -51325 -471301 -187186
44480 -187186 484427 1381270 2405871 3184647 3251118 2621394 1697686 472783 -1374169
44471 -1374169 -3195788 -3378991 -1694749 -435960 -1464335 -3128552 -2516166 -128259
44463 -128259 777752 -439899 -724640 1266974 2389988 -25144 -3595177 -4366550 -2435669
44454 -2435669 -635787 445093 2193598 3930355 3401281 1108929 158211 1337535
44446 1337535 1999057 645362 -836256 -759730 -265705 -710433 -1207909 -688547 -61285
44437 -61285 -285647 -265768 1224045 3147460 3857011 3772257 4240069 4798347 3888057 1769556
44427 1769556 557872 1303014 2685630 2868866 1510262 -251689 -1003769 -161967 1586327
44418 1586327 2946832 3302430 2982934 2294495 1222824 317271 546544 1546711 1332755
44409 1332755 -1062876 -3710871 -3966148 -1846544 222942 654629 235696 450136 1547686
44400 1547686 2622953 2786490 1871340 402114 -868246 -1470339 -1270222 -192834 1593589
44391 1593589 3214273 3593053 2782987 2148739 2796461 4330713 5455878 5219683 3438657
44382 3438657 667539 -1856767 -2931665 -2468197 -1374527 -340343 501612 867108 540279
44373 540279 368598 1500016 3242434 3316743 920970 -2036466 -3519164 -3464986 -2400694
44364 -2400694 -35186 3099294 4407543 1942022 -2547482 -5278157 -4569055 -1708522
44356 -1708522 1483207 4076663 5554943 5819839 5629720 5752874 5994842 6035237 6301887
44347 6301887 6700474 5692092 2529227 -624187 -1060457 682727 1731989 1015903 -47814
44338 -47814 -656350 -1564443 -2721577 -2772189 -1605400 -895651 -1229838 -1057924 415291
44329 415291 1509286 580961 -1589687 -3214992 -3604920 -2691929 -344984 2370100 3109581
44320 3109581 1305742 -274082 861282 3091042 2966899 518862 -579297 1696393
44312 1696393 4872102 5437168 3235930 907363 46068 -349408 -1683128 -3452497 -3971429
44303 -3971429 -2905779 -2050274 -3170846 -5697260 -7337933 -6772069 -4854572 -3075418
44295 -3075418 -1792005 -530365 635613 840829 -435510 -2394522 -3330350 -2285617
44287 -2285617 -421405 -203789 -2616961 -5643793 -6434197 -4633294 -2346467 -996825
44279 -996825 149469 1976095 3738462 4275308 3717516 2837376 1718336 339991 -376137
44270 -376137 367878 1593917 1522618 124898 -777152 -184800 714592 477746 -503357
44261 -503357 -852762 -341617 133586 395654 1301252 2811470 3197739 1413576 -633322
44252 -633322 38005 3388189 5954716 5106305 2020890 -553750 -1782116 -2321577 -1896068
44243 -1896068 254333 3045063 4156015 3119915 1679379 804008 -459914 -2568852
44235 -2568852 -4067901 -3626849 -1750159 478968 2619061 3939050 3339186 1546604
44227 1546604 1281712 3392125 4807731 2731554 -818523 -1608870 723288 2456763
44219 2456763 1391280 -639358 -1380698 -1204136 -1264143 -1133486 -45000 1287475 1910996
44210 1910996 2429293 3763009 5006230 4382572 1989536 -116570 -692367 -752329 -1753484
44201 -1753484 -3356628 -3827134 -2337439 -148766 740853 -163970 -1403852 -1419289 -316135
44192 -316135 707767 1219144 1859121 2807207 3017074 1524754 -1156942 -3505874 -4398028
44183 -4398028 -3679172 -1949614 -335095 76840 -717473 -1466941 -1105310 11058 873819
44174 873819 1293436 1710120 1930237 1226370 -269603 -1358270 -1228400 -219653 1112023
44165 1112023 2652716 3974895 4022944 2482478 696430 126285 345162 -345642 -2524636
44156 -2524636 -4940652 -6147597 -5825706 -4374481 -2208476 173482 2174521 3537030
44148 3537030 4289390 4181783 2896157 911599 -740757 -1844863 -3164679 -4824090
44140 -4824090 -5521456 -4079107 -1064397 1784981 3166609 2839194 1521528 728374 1718720
44131 1718720 3826996 4762067 3370777 1097767 -142259 -230321 206529 1547697 3939523
44122 3939523 5539610 4478778 1959446 832769 1344086 1039364 -904922 -2207269
44114 -2207269 -1269482 271567 348585 -357501 48557 1514578 2353962 1743670 240226
44105 240226 -1483882 -2968935 -3580050 -3043457 -2023348 -1344008 -1148877 -1366272 -2079513
44096 -2079513 -2773299 -2363364 -880090 5142 -881723 -2654977 -3840652 -4065137 -3300941
44087 -3300941 -1193552 1350683 1772036 -775227 -3217032 -2292443 735128 2015066
44079 2015066 872096 240065 1490692 2421722 1245374 -588768 -1039878 -439359 -153931
44070 -153931 -320009 -639946 -1753359 -3943120 -5645328 -5033020 -2436931 124253 1251368
44061 1251368 1060103 540988 893448 2635295 4593142 4826370 3314539 2307107 2924375
44052 2924375 3120712 809250 -2496069 -3579560 -2159897 -927550 -1198699 -1331937 -5078
44043 -5078 1480417 1365505 -31481 -1342687 -2233089 -2968975 -3041639 -1853241 -149830
44034 -149830 710034 591915 415888 424727 -14430 -864221 -1059881 -191199 530408 -198091
44024 -198091 -1855412 -2598992 -1623083 -277272 -380861 -1703692 -1915666 453124 3623874
44015 3623874 4386494 2366293 871712 2505948 5403529 5702477 2903598 338164
44007 338164 311731 1400834 1470396 909505 1099243 1572316 1037842 98733 474759 2005874
43997 2005874 2795046 2255196 1728632 1820754 1391406 -92833 -1301831 -1261453 -1067863
43988 -1067863 -1969999 -3084535 -2606180 -490437 1490969 1915515 839224 -791043 -1860869
43979 -1860869 -1598075 -258874 946524 1244919 1208311 1695456 2457089 2531108 1571978
43970 1571978 93750 -1218630 -1857293 -1561665 -548296 660370 1780841 2540806 2093827
43961 2093827 -4517 -2157009 -1937785 419547 1824310 717289 -658996 -133844
43953 -133844 699812 -575640 -2594873 -2169436 249020 1040748 -826129 -2477591 -2154461
43944 -2154461 -1710705 -2764970 -3844916 -3294038 -2051840 -1325169 -121622 2362257 4175020
43935 4175020 3344741 1464833 1496812 3200969 3851677 2690585 1442287 729964 -654611
43926 -654611 -2542964 -2723724 -643819 954053 -272449 -2987221 -4291644 -3489472 -2018387
43917 -2018387 -959728 -433094 -495316 -854655 -419120 1140258 2053520 614081 -1789933
43908 -1789933 -2043985 255288 2052097 1114821 -1143158 -2196305 -1721895 -843239 169620
43899 169620 1444458 2080197 1428935 863955 1818691 2733156 852307 -2996879 -4658915
43890 -4658915 -2547227 -181551 -1094330 -3869557 -4707209 -2940945 -1069393 -397901 292894
43881 292894 1854021 3164296 2954078 1449033 -277634 -1336668 -1322472 -769610 -1090674
43872 -1090674 -2719643 -3763157 -2265669 537133 1448264 -128644 -1313803 -120103
43864 -120103 1730019 1707683 151144 -820600 -651746 -537442 -962294 -997557 -7485 1438518
43854 1438518 2600431 3434885 4066591 4151788 3274621 1666761 103898 -934501 -1716568
43845 -1716568 -2645654 -3447986 -3536119 -3099938 -2933748 -2976516 -2240870 -829518 -575204 -2389645
43835 -2389645 -4291888 -3859219 -1596518 218304 1146435 2494509 4114157 4226331 2634837
43826 2634837 1298231 1106822 748530 -424845 -1046594 -323107 523651 611163 791461
43817 791461 1446930 1389911 382242 154798 1233838 1421289 -550755 -2536526 -2505528
43808 -2505528 -1868301 -2482813 -2981441 -1508304 155550 -854886 -3476717 -4354656 -3248786
43799 -3248786 -2574686 -2493819 -1115119 737565 -31162 -2918127 -3295046 575229 4334668
43790 4334668 3756946 643628 -329683 1991970 4936499 6326606 6349517 5976539 5638147
43781 5638147 5223543 4348268 2991477 2001269 1913515 1542996 -385121 -2492527 -2324524
43772 -2324524 -733629 -1268109 -4361917 -5972912 -3828649 -1208586 -1705998 -3640574
43764 -3640574 -3291893 -950353 396827 460359 1328266 2895158 3004851 1727678 1293149
43755 1293149 1697902 475845 -2574904 -4364538 -3327893 -1700003 -1516775 -1635889 -582132
43746 -582132 608702 599445 298145 811940 1010493 -265483 -1376518 -220950 1824055
43737 1824055 1515875 -1062800 -2078623 675571 4536362 5378135 2599463 -731849
43729 -731849 -1830831 -943382 -318546 -1414036 -3458983 -4405017 -2867089 873414 5225680
43720 5225680 8134377 8058838 5208920 1889328 531469 1059049 1256364 41416 -1109358
43711 -1109358 -771159 63652 -245594 -1154145 -853593 708772 1795036 1542064 702699
43702 702699 -90934 -776920 -659611 935427 2528111 1524338 -1783034 -3733693 -2150763
43693 -2150763 641927 1386690 284363 -431451 -371500 -544703 -324868 1833515 4997109
43684 4997109 6196072 4566338 2364386 1394352 1019878 416232 173910 506751 236088
43675 236088 -989102 -1549663 -533390 388815 -372275 -1493675 -734053 1517316 2913461
43666 2913461 2497673 1264285 52234 -1018537 -1436242 -637552 728878 1585779 2132075
43657 2132075 3060534 3608638 2466174 328770 -689292 -189074 162884 -488573 -1282335
43648 -1282335 -1890022 -3123998 -4546974 -3993640 -781614 2678097 3893628 3149435 2059476
43639 2059476 1126090 285256 120064 695093 636504 -748924 -1740462 -557769 1692681
43630 1692681 2497299 1430415 91667 -595916 -808932 -280348 1194095 2102444 682023
43621 682023 -1908947 -2441917 -103782 2214182 1846379 -530365 -2562821 -3022146 -1916737
43612 -1916737 326664 2520147 3130615 2351737 2337770 4047678 5364170 4068130 1364827
43603 1364827 245024 1051281 1090051 -1249966 -4176546 -5057906 -3706636 -2033663 -1478991
43594 -1478991 -1995759 -3056129 -4365494 -5395116 -5184202 -3343281 -973618 110976
43586 110976 -770863 -2544136 -3753819 -4041651 -3940803 -3850955 -3904041 -4338488 -5060281 -5115686
43576 -5115686 -3687810 -1568807 -495253 -842708 -1113363 -75767 1682310 2859772
43568 2859772 3053000 2530750 1288634 -719210 -2848254 -4045500 -3781462 -2502694 -1455974
43559 -1455974 -1919175 -3863863 -5521956 -5320704 -4087614 -3882379 -4688746 -4250835 -1634612
43550 -1634612 1257153 2602948 2747017 2118216 -220062 -3813881 -5259875 -2513270
43542 -2513270 1222152 1460279 -1182807 -2507846 -1571670 -1368174 -2769588 -2819436 -340637
43533 -340637 1424743 93881 -1887999 -1472933 47296 -309835 -2081566 -2456905 -944503
43524 -944503 410542 495663 -143937 -1250445 -2726577 -3199774 -1446561 1120663 1888182
43515 1888182 622035 -743155 -1384628 -2004816 -2283994 -896542 1607294 2691043 1356525
43506 1356525 -469647 -766278 401079 2087641 3757209 4692762 4172271 2997164 2894573
43497 2894573 3695486 3220210 838420 -1121045 -770393 666178 1124757 695335 559261
43488 559261 662286 475169 677595 1906666 2853710 1844506 -307743 -1195344 -308591
43479 -308591 352916 -769508 -2915692 -4309561 -3982940 -2095135 373047 2025018 2171280
43470 2171280 1715407 2014087 2840299 2581578 693432 -1178382 -1160009 521767 1931095
43461 1931095 1773931 594244 -396694 -962207 -1736793 -2799451 -3284648 -2706219 -1753950
43452 -1753950 -1100905 -369245 622072 590491 -1452607 -3862807 -4083811 -2485958 -1755215
43443 -1755215 -2132376 -548372 4025740 7574582 6076949 1257536 -1842463 -1552256
43435 -1552256 -520894 -820092 -1582548 -1633482 -1357891 -1145867 -381312 1076663 2242125
43426 2242125 2622958 2940687 3623134 4046741 3800221 3258190 2428649 751356 -1362233
43417 -1362233 -2289662 -1304031 306027 975579 637106 95121 -265301 -348042 176062
43408 176062 1415005 2781503 3494026 3224670 2207100 1210858 1150457 1918079 2029487
43399 2029487 573952 -990044 -591844 1229427 1853879 381999 -1286269 -1671327 -1772300
43390 -1772300 -2842563 -4012258 -3559110 -1309854 1372114 3025830 2836425 1124389
43382 1124389 -373938 -93231 1107135 1015996 -282814 -282915 1568564 2283849 -41822
43373 -41822 -2751168 -2409613 103646 1382842 805457 672756 1878174 2813301 2519252
43364 2519252 2001485 2135453 2669228 3480076 4592449 4903971 3204937 589318 -455348
43355 -455348 496696 1627060 2215931 3374941 4946983 4710722 1945638 -871274 -1583116
43346 -1583116 -1331201 -2202439 -3807859 -4230908 -3026782 -1385744 -241284 293721 469195
43337 469195 1019403 2716210 4879691 5678852 4794258 4005679 4068663 3306855 980049
43328 980049 -545900 431211 1446175 -411684 -3194406 -2743416 421801 1591227 -707733
43319 -707733 -2521148 -817309 2333824 3728642 3209724 1599245 -1715723 -6012004
43311 -6012004 -7369477 -3552380 1531205 2453043 -121847 -808886 2200897 4843989
43303 4843989 3764286 974249 197512 1710222 3079619 3049033 2506943 2581974 3377624
43294 3377624 4149752 3920909 2415947 694700 103645 552536 826301 427697 -256261
43285 -256261 -1314589 -2915122 -3668714 -1839384 1416128 2692021 1117630 -286049
43277 -286049 562905 1557685 215457 -1941753 -1892408 -93214 497695 -693037 -1387147
43268 -1387147 -512882 465962 422411 -51416 -519799 -1458080 -2632421 -2958610 -2463563
43259 -2463563 -2319393 -2581626 -2093587 -1020590 -1028637 -2220246 -2402542 -559698 1303648
43250 1303648 1320705 706724 1695192 4072361 5664265 5294604 3721709 2417096 2522521
43241 2522521 4049286 5179885 3645544 -184083 -3096605 -3083204 -1769196 -1264750 -774053
43232 -774053 1166348 3002748 2214099 100880 622886 4238928 6640396 4778673 847408
43223 847408 -1577987 -2476846 -3836886 -5289562 -4592642 -1744571 431446 81824 -1654749
43214 -1654749 -2964607 -3613652 -3938309 -3374566 -1477546 667829 1581557 1405550 1459617
43205 1459617 2094254 2289061 1373684 -10019 -835384 -659468 403799 1728510 2188481
43196 2188481 1258481 167930 583271 1933504 1794355 -385284 -1893640 -495049 2124550
43187 2124550 2578929 273737 -2387377 -3439564 -2848819 -1204945 722447 1367124 -332708
43178 -332708 -2914649 -3831696 -2992505 -2598577 -3344420 -3457906 -2120573 -1001735 -1115100
43169 -1115100 -766259 1530803 4175275 4556350 2499472 -165710 -2088866 -2732287 -1689257
43160 -1689257 329875 1018224 -918696 -3520558 -3926576 -2279485 -1327005 -2643466 -5147833
43151 -5147833 -7066524 -7581801 -6637174 -4661606 -2559713 -970316 171069 628574 -477977
43142 -477977 -2779432 -3808029 -2021140 434884 412876 -1498885 -1692314 1142233 4244968
43133 4244968 4798703 3078652 732102 -1572685 -3333567 -3149665 -483052 2657195
43125 2657195 3646765 2374802 1032274 1097982 1855706 1962643 1340532 887840 820071
43116 820071 142986 -1879828 -4222911 -4900735 -3352934 -1174915 -124364 -291929 -783242
43107 -783242 -1185326 -1455824 -1280647 -669584 -450230 -1025950 -1383321 -568216 621697
43098 621697 813549 169484 -255193 -542922 -1469653 -2550241 -2505906 -1416453 -463552
43089 -463552 259394 1633728 3323249 3890548 3219196 2600945 2164981 601515 -1977331
43080 -1977331 -3283156 -1926026 787933 3023963 4335284 4529925 2973778 421070
43072 421070 -654005 690625 2164595 1631094 334479 534149 1564583 1013695 -1086053
43063 -1086053 -2096550 -663074 1726455 3353103 4283744 5146525 5636850 5178828 4008617
43054 4008617 2844634 2115305 1866390 1805893 1282077 -56000 -1434109 -1582779 -397987
43045 -397987 861502 1356415 1728751 2728043 3595194 2975705 1207575 381012 1646024
43036 1646024 3548353 4038016 3349740 3357818 4315206 4232030 2195784 389402 1209451
43027 1209451 3688552 4751075 3285948 955282 -607890 -1258740 -1116893 -148643 696506
43018 696506 60453 -1532499 -1949890 -679974 255306 -532116 -1832446 -2191483 -2110878
43009 -2110878 -2411478 -2459238 -1888199 -2162467 -4116258 -5583957 -4210591 -1433723 -628102
43000 -628102 -1935758 -2227915 -253918 1561491 1360504 723176 1535603 2591233 1792609
42991 1792609 2382 -173570 1308566 1760352 106620 -1263169 -77062 2479720
42983 2479720 3652487 2851934 1516249 268215 -1325180 -2458766 -1384840 1253544
42975 1253544 2052095 -561536 -3569293 -3405435 -989463 27028 -1184177 -2081625 -1360975
42966 -1360975 -671827 -1216522 -1793962 -1361539 -785125 -608380 364905 2443622 3274964
42957 3274964 967148 -2643950 -4158626 -2948601 -1252449 -832592 -1541847 -2571619
42949 -2571619 -3213523 -2712111 -934877 1058009 2258646 2955071 3647930 3634253 2075132
42940 2075132 -323986 -2149629 -3047480 -3275309 -2457872 -476370 1247676 1232047 108989
42931 108989 -423827 -159157 -28245 100354 1087519 2359056 2273633 613554 -1187123
42922 -1187123 -2167798 -2398899 -1809967 -522031 55646 -1192964 -2709867 -2067934 18655
42913 18655 492014 -1068109 -1673478 2243 1327503 203547 -1385400 -701135 1544380
42904 1544380 3023729 3583961 4180182 3853361 1238691 -1943191 -2402513 13349 2303470
42895 2303470 2927635 3173823 3575132 2502794 -311860 -2035613 -720657 1405600 1267159
42886 1267159 -279951 -96035 1868916 2397753 358989 -1205641 290631 3056200
42878 3056200 3800573 2553057 1898506 2488543 2334982 561112 -1006123 -859207 -23785
42869 -23785 169386 544938 2334873 4276137 3772546 594169 -2574803 -3397261 -2102448
42860 -2102448 -247572 1189251 1910966 1751406 883759 -79950 -788558 -1438440 -1969788
42851 -1969788 -1619445 89370 2264910 3227307 2245133 353046 -761454 -605859 -315256
42842 -315256 -1007535 -2110585 -2144108 -1088095 -726829 -2087205 -3801323 -4103370 -3335961
42833 -3335961 -2896805 -2535775 -810721 1940407 3372206 2471280 1086977 1010723 1279663
42824 1279663 64433 -1967912 -2309102 -366317 1422775 778585 -1540734 -2946874
42816 -2946874 -2176806 -152144 1800448 3273793 4214118 4284599 3530950 2854440 2856642
42807 2856642 2732392 1391825 -645485 -1705932 -1187542 -9169 1131182 2329435
42799 2329435 3057227 2107588 -183919 -1520126 -731977 413574 60729 -806871 -408337
42790 -408337 372812 -626052 -2776763 -3062519 -692795 1483654 961741 -1239654 -2342614
42781 -2342614 -1050225 1802128 4349674 4763315 2617872 -187511 -1174219 -314865 170115
42772 170115 -723813 -1505901 -1000789 -270746 -529972 -1065966 -759332 -55763 222451 609653
42762 609653 1750222 2630923 2022301 785498 686338 1474756 1254463 -380319 -1593242
42753 -1593242 -985200 666107 1880968 2312130 2383036 2115522 1201604 -191356 -1320511
42744 -1320511 -1525547 -864864 -218516 -589989 -1933799 -2841952 -1930226 472616 2529776
42735 2529776 2866198 1832795 595448 -507570 -2045352 -3988282 -4959985 -3738129
42727 -3738129 -1161540 544314 528093 210566 833749 1485882 842733 -357986 -528646
42718 -528646 -129576 -929534 -2541322 -2416889 49875 1993867 960250 -1818003 -3593618
42709 -3593618 -3712979 -3258696 -2670291 -1784785 -1127807 -1115430 -755234 969067 3106768
42700 3106768 3946893 3508303 2924032 2065403 19003 -2467734 -3437589 -2711319 -2178188
42691 -2178188 -2771768 -3294885 -2799267 -2053586 -1788481 -1351284 -207601 766422 674712
42682 674712 57951 -141890 -56477 -369022 -1226406 -2423670 -3666728 -4048345 -2628580
42673 -2628580 -372560 79471 -2158168 -4549894 -4466065 -2645941 -1384829 -863641 -65038
42664 -65038 -172839 -3349825 -8068114 -9531532 -6095964 -1918504 -1119985 -2212693 -1191751
42655 -1191751 2071044 4086980 3292169 1711070 1194856 1239757 1018143 752815 337816
42646 337816 -864797 -2038468 -1233918 1330584 2815995 1826374 334549 63131 -237323
42637 -237323 -1795794 -2938225 -2063749 -1021285 -2044814 -3366600 -1925706 1024572
42629 1024572 1548356 -487571 -1431174 -390741 -594183 -3079515 -4140596 -1428825 1803280
42620 1803280 1641135 -876334 -2400420 -2492619 -2587028 -2229856 -292411 1738683 1509090
42611 1509090 -222454 -788042 122647 741647 938616 2119250 3778838 3617009 1224574
42602 1224574 -1289865 -2403854 -2235924 -877397 1274531 1938908 -686911 -4018267
42594 -4018267 -3467617 832076 3870193 3244973 2234818 3542775 4667084 2685761
42586 2685761 -352644 -926009 49482 -689653 -2776207 -3052674 -1378682 -933305 -2708701
42577 -2708701 -3897988 -2489556 81354 1860908 2859492 3443884 3013289 1657490 790609
42568 790609 757696 -56537 -2311472 -3917860 -2785962 291943 3040697 4419814 4441796
42559 4441796 2977103 656072 -436248 897534 2869780 2890424 943433 -1124272
42551 -1124272 -2587385 -3742948 -3763518 -1611324 1150188 1567352 -266535 -993429 902206
42542 902206 2783080 2200958 692787 887959 2131334 2018803 882151 1369398 3868438
42533 3868438 5570652 4800305 3618312 4596405 6704601 6349467 2123388 -2953388 -4470692
42524 -4470692 -1432917 2664810 3852054 2077962 426840 280632 -534158 -3748113
42516 -3748113 -7020165 -6720875 -3163979 -232981 -43525 -812791 -533452 -13475 -812852
42507 -812852 -2155676 -1836491 655256 3397228 4113864 2228577 -737753 -2355881 -1447327
42498 -1447327 632479 1532760 793666 147226 804386 1885976 2147238 1825163 1740328
42489 1740328 1670590 848129 -543041 -1413619 -1034022 362677 1958745 3036121 3638024
42480 3638024 4474471 5566191 5475598 3196914 413243 -70322 1785111 3105004 2228880
42471 2228880 520547 -736328 -2366896 -4520527 -4641622 -968746 3817131 5428415
42463 5428415 3351592 659797 -598262 -869481 -493638 1152877 3520494 4645603
42455 4645603 3985268 3444605 4554284 6163157 5983890 3475837 423507 -814401 627759
42446 627759 3284901 4625305 3625262 1691081 497102 -191368 -1488392 -3119555
42438 -3119555 -3716259 -2836604 -1234545 397223 1521565 1203448 -857945 -3139602 -3744776
42429 -3744776 -2664483 -1134879 475639 2230156 2904138 1237020 -1366548 -2015512
42421 -2015512 -398244 822898 76968 -1153384 -1175990 -532423 -459008 -825998 -871550
42412 -871550 -595665 -405234 -452542 -919333 -1859685 -2493115 -1927032 -671653 -21519 -94606
42402 -94606 -212568 -814131 -2598849 -4020703 -2689252 404434 1438739 -502002 -1760655
42393 -1760655 153396 2644119 2356844 362126 -201714 647900 476356 -1001430 -1658356
42384 -1658356 -725587 273208 311281 67863 305370 1136922 2824081 5257958 6666184
42375 6666184 4927358 604341 -2957265 -3144812 -715407 1333926 842302 -1525422
42367 -1525422 -2909536 -1293406 1832147 2904735 869454 -1278348 -570524 2064676
42359 2064676 3586296 2857785 1000301 -689720 -1024821 1215936 5019274 6213834
42351 6213834 2124665 -3791613 -5574141 -2556988 344176 162984 -705306 239628 1328811
42342 1328811 218538 -1806506 -2236551 -1632377 -2109068 -3099331 -2202326 339735 1498636
42333 1498636 245986 -503312 1873549 5589769 6535825 3630003 120599 -705581 454819
42324 454819 393383 -1886141 -3756137 -2704926 242772 2218533 2392584 2199474 2275630
42315 2275630 1486338 -695254 -2855596 -3471707 -2610302 -1145399 345162 1291026 1150680
42306 1150680 424429 335914 942094 1050493 512739 627395 1381632 630822 -2320501
42297 -2320501 -4528804 -3156387 286839 2110882 1558813 797642 698005 -5365 -1446440
42288 -1446440 -1886774 -864219 -87682 -272249 48736 1338171 1622628 92249 -611528
42279 -611528 1717537 4843128 5005849 2351910 146548 -533144 -1669920 -3862993 -4738434
42270 -4738434 -2990209 -937131 -1180297 -2972568 -3966018 -3837383 -3937063 -4508640 -4550997
42261 -4550997 -3839899 -3009630 -1983826 -326588 1033490 563636 -1152169 -1542684 372611
42252 372611 2347993 1938604 -249098 -1586402 -722032 1325085 2651765 2007920 -511460
42243 -511460 -3297310 -4270952 -3007846 -1310614 -900264 -1338918 -1277925 -827284 -1097035
42234 -1097035 -1950131 -2061592 -1169499 -529479 -884730 -1572050 -2013318 -2527433 -3116748
42225 -3116748 -2985809 -2014211 -1269845 -1210860 -826535 420972 1312410 860698 143785
42216 143785 494216 1176398 899708 521516 1704365 3505542 3225180 784744 -706388
42207 -706388 373238 1709702 855544 -965825 -1167955 -193675 -761221 -3299294 -4857060
42198 -4857060 -3084931 620149 2908394 2344534 540713 -162174 622299 1208474 186972
42189 186972 -1729259 -2766069 -2480745 -1937521 -1722377 -1426105 -1301568 -2388773 -4180705
42180 -4180705 -4408680 -2639998 -1799799 -3826173 -5880713 -4028572 699203 3551155
42172 3551155 2731049 987289 456040 -68098 -1694790 -3007510 -2848135 -2444028 -2758220
42163 -2758220 -2414332 -396925 1638169 2053213 1976896 2904765 3697099 2793342 1556481
42154 1556481 2168396 3491535 2489884 -780562 -2891638 -1807600 878190 2735766
42146 2735766 3059689 2258004 897483 -81928 41224 550533 122019 -1046376 -1438391
42137 -1438391 -507864 778865 1577029 1791913 1308980 244511 -327747 364279 1202992
42128 1202992 763671 -34938 806435 2792086 3312578 1696475 99669 -136466 -226714
42119 -226714 -1133709 -1664632 -730352 699172 1377123 1686898 2310318 2559793 1529539
42110 1529539 -230912 -1412945 -1442694 -534181 740622 1405152 744463 -569665 -1197146
42101 -1197146 -1097302 -1323536 -1908300 -1864131 -1348273 -1565283 -2247346 -1753459 -168398 506068
42091 506068 73781 934145 3689847 5100254 2657074 -1427264 -3408020 -3077584 -2868077
42082 -2868077 -3478378 -3326347 -1636609 340906 980968 -324580 -2897185 -4898349 -4704780
42073 -4704780 -2978055 -2013156 -2414950 -2453531 -1508940 -1388431 -2713166 -3042273 -923723
42064 -923723 1073848 299641 -1625232 -1791315 -1031102 -2041733 -4209369 -4555098 -2879822
42055 -2879822 -1820705 -2207596 -2273825 -1377628 -779428 -578983 556474 2267459 2498821
42046 2498821 1125486 388853 1153872 1841387 1715622 2083497 3341185 3881180 3092404
42037 3092404 2657026 3594752 4551511 4274576 3376999 2410642 625441 -1912803 -3271400
42028 -3271400 -2385381 -905371 -688956 -1175736 -852058 264883 1263563 2113878 3157085
42019 3157085 3842154 3467887 2458624 1739664 1513562 1538162 1839449 2323417 2439620
42010 2439620 1977187 1499212 1387043 1164192 315191 -836670 -1484986 -1145402 -68517
42001 -68517 725656 262530 -860225 -613794 1642871 3590175 2974305 1097319 829712
41992 829712 1994573 1841151 -156619 -1495152 -1108857 -1048476 -2468742 -3330625 -1994468
41983 -1994468 -205506 -268691 -1621263 -2454836 -2587848 -2373412 -828463 2343756 4479944
41974 4479944 2885239 -706020 -1638005 1638261 5559797 6041587 3214693 730775
41966 730775 1407834 4383211 6331251 5117318 1925406 -528766 -1291682 -1510237 -1851350
41957 -1851350 -1523647 -324070 325333 -500880 -1636205 -1578377 -528439 505044 1333515
41948 1333515 2026461 1958710 878322 -90817 -4480 169465 -1102917 -3356364 -4296493
41939 -4296493 -2404462 1460204 4829433 5592956 3793829 1767639 1673755 2780318 2484981
41930 2484981 160512 -1914972 -2105639 -1739696 -2568174 -3880139 -3995692 -3108200 -2570537
41921 -2570537 -2408836 -1648267 -497051 -188380 -777139 -789426 639917 2359821 2367710
41912 2367710 110291 -2471766 -2560930 271761 3005647 2662732 245788 -806960 368145
41903 368145 1393202 1039441 801589 1130658 -102620 -3291272 -4793160 -2047911 1753523
41894 1753523 1652621 -2300306 -5686883 -5758551 -3563815 -1106557 482612 659565 67476
41885 67476 624642 2665421 3413365 1040757 -1511537 -320937 3352297 4786363 2781510
41876 2781510 525761 -156786 -761224 -1927615 -1956759 -648568 -360366 -1649072 -1810807
41867 -1810807 318762 1888136 751422 -799884 33919 1829145 1553346 -239009
41859 -239009 -524615 1018685 1535838 -431335 -2847708 -3217644 -1629843 -37150 134251
41850 134251 -1050224 -2633611 -3644446 -3530208 -2134255 207185 2177249 1848428 -1172186
41841 -1172186 -4278914 -4277521 -1476743 498090 -376718 -1824455 -829241 1912919 3180295
41832 3180295 1855285 100183 53243 1346497 2400772 2665014 2648233 2630382 2427206
41823 2427206 2168224 2307624 2618555 2004026 30309 -1835572 -1566753 867942 3341603
41814 3341603 4135929 3539014 2614538 1823207 1502823 2115572 2993982 2522104 935203
41805 935203 1063014 4256484 7326624 6237870 1593250 -2497666 -3984441 -3982769 -3113155
41796 -3113155 -758261 1915658 2350396 951405 1128145 3575166 4454654 1433267 -2162718
41787 -2162718 -2129061 750208 2889666 3384768 3653828 3578828 2038545 246351 615441
41778 615441 2534899 2764433 190235 -2892063 -4467725 -4756621 -4054636 -1795135 1099422
41769 1099422 1748510 -1047654 -4691338 -6011283 -5063863 -4124325 -4253426 -4660430 -4587404
41760 -4587404 -4046189 -3077689 -1785154 -957827 -1391623 -2573565 -3076654 -2320252 -1051404
41751 -1051404 -62436 598120 933294 511556 -726277 -1795456 -1510663 173195 2066210
41742 2066210 2839299 2001834 123882 -1574677 -2154627 -1822588 -1546724 -1541931 -827498
41733 -827498 1005553 2348858 1250674 -1700145 -3683216 -3083662 -1207953 -121720
41725 -121720 -244526 -858774 -1541318 -1899446 -1094617 935729 2655085 2750593 2059387
41716 2059387 2264628 3373047 4053108 3899987 3638054 3413266 2646071 1475285 672857
41707 672857 121689 -993801 -2393221 -2698183 -1459912 203936 1148353 1114734 270081
41698 270081 -669076 -178756 2252111 4210396 2646083 -1645916 -4380697 -3397252 -1355504
41689 -1355504 -1516149 -3257366 -3771150 -2404925 -1032783 -1112769 -2375746 -3853405 -4550474
41680 -4550474 -3519653 -750978 2138974 3155985 1837573 -540615 -2254076 -2383817
41672 -2383817 -1580418 -1807638 -4245404 -7230758 -7741750 -5284452 -2459054 -1035912 182059
41663 182059 2221761 3199674 1231219 -1676192 -1702559 1478513 4269920 3958842 1521645
41654 1521645 -620045 -1442802 -1270801 -640025 -149893 -398569 -1297484 -1929427 -1356423
41645 -1356423 676067 3461568 5270991 4368696 1116452 -1681942 -1907113 -993093 -1995930
41636 -1995930 -5136524 -7276308 -6125520 -3065811 -913078 -370262 15157 1198705
41628 1198705 2306309 1929022 -66068 -2291438 -3162399 -2320364 -775192 220417 231119
41619 231119 -334553 -810749 -765611 -360135 -400118 -1556619 -3337312 -4344677 -3751642
41610 -3751642 -2016566 -140983 982857 529913 -1667943 -4086112 -4374118 -2014928
41602 -2014928 931859 2386237 2384135 2023282 1734411 1581668 1827007 2007025 919536
41593 919536 -1135646 -1783179 -28589 1413809 -316599 -3656971 -4534368 -2171681 115108
41584 115108 -60889 -1335439 -1472937 -497725 158273 -272372 -1684493 -3424084 -4069747
41575 -4069747 -2446448 396284 1784313 853648 -136584 1014797 3323833 4030216 2262187
41566 2262187 -72777 -794472 140392 906520 165066 -1156871 -1000681 781999 1772759
41557 1772759 429824 -1172340 -85528 2941565 4339681 2951742 1347818 1350470 1378400
41548 1378400 -287118 -2334681 -2612947 -1415374 -380283 208165 763213 512470 -1212340
41539 -1212340 -2824676 -2208945 -55278 934450 -160163 -1791828 -2797781 -3458619 -3657211
41530 -3657211 -2623869 -1122427 -1334952 -3385590 -4211478 -1572263 2503752 4202520
41522 4202520 2769410 955189 1195514 3139548 4860237 5001738 3551354 1636586
41514 1636586 798939 1633874 3054395 3596344 3250802 3046312 3063117 2268076 503819
41505 503819 -868546 -935478 -430975 -53615 974115 3156335 4700605 3429414 385158
41496 385158 -828103 1136434 3321626 2539437 -141789 -955725 1228038 3306408 2070106
41487 2070106 -1749676 -4623173 -4457135 -2368423 -507047 442402 989257 1145849 310326
41478 310326 -1340861 -2564286 -2513410 -1635449 -769694 -245862 -246808 -892847 -1268096 247506
41468 247506 3394043 5076365 2864874 -1408675 -3667990 -2648306 -601710 716085
41460 716085 1933819 3537535 4330009 3609304 2546213 2059678 1430242 388023 373565
41451 373565 1973391 3140795 2050415 19676 -596545 61966 202407 -542397 -1228677
41442 -1228677 -1720412 -2345610 -2364156 -1101267 259615 329440 9867 854406 1951607
41433 1951607 1356575 -124459 162561 2299273 3569368 2779158 1589854 1146093 562408
41424 562408 -547203 -1127740 -1177250 -2186157 -4020468 -4358718 -2564233 -1199529 -2100725
41415 -2100725 -3739253 -4238864 -4193900 -4369167 -3356919 -220304 2782281 3062738 1617513
41406 1617513 1214831 2050396 2107946 816625 -547645 -1472251 -2491519 -3232526 -2720784
41397 -2720784 -1487239 -1076564 -1536255 -1491324 -550734 499837 1737592 3965663 6350691
41388 6350691 6579580 4091668 1228018 302634 1012175 1473352 543952 -1515806 -3586305
41379 -3586305 -4436458 -3919678 -3548670 -4670523 -6112143 -5342111 -2267624 74183 -545059
41370 -545059 -2728153 -3808220 -3385149 -2796315 -2285485 -901366 1129253 2069059 1188472
41361 1188472 8466 165522 1162726 1341922 395700 -409587 -358396 -220965 -593246
41352 -593246 -596220 646578 2128168 2147805 1032704 821483 2028023 2744327 1803414
41343 1803414 738705 949439 814201 -1760897 -5026036 -4887383 -882803 2507700 1784752
41334 1784752 -947317 -1306396 1291190 3501205 3216444 2143790 2780246 4905583 6314743
41325 6314743 5951019 4930783 4610783 4694873 3799072 1563013 -495723 -623609 992958
41316 992958 2355523 2010647 585268 -339593 -197907 288268 247935 -627525 -2054880
41307 -2054880 -3051853 -2316134 255053 2729729 3049329 1630822 627352 592706 -172160
41298 -172160 -2287534 -3497162 -1860349 1022024 2298360 2168477 3033203 4873222 4862178
41289 4862178 2226682 159122 1047302 2459129 556236 -4104940 -7118325 -6023108
41281 -6023108 -2903594 -993756 -850248 -693052 792861 2890916 3675006 2155417 -330333
41272 -330333 -1437845 -833678 -759450 -2710817 -4901211 -4593892 -1859361 921821 2447142
41263 2447142 3157856 3116427 1813164 113809 -101079 1303408 2470631 2480000 2355507
41254 2355507 2700314 2686184 2193032 2624907 4458853 6054676 6112964 5379790 4720618
41245 4720618 3549382 1608069 292181 447358 591304 -782975 -2587212 -2665704 -700588
41236 -700588 2047480 4567404 6051967 5564065 3662685 2920157 4725423 6898385 6706772
41227 6706772 4974287 4701342 6673895 9145635 11137339 13274538 15751443 18132387
41219 18132387 20919753 24706003 28027384 28929063 28722398 31184258 37481518 44732363
41211 44732363 50405981 55297798 60825163 65956386 68648575 68424002 65756167 60548324
41203 60548324 53159089 45735242 40484005 37128612 33697125 29526132 25990001 24176736
41195 24176736 23109357 20943437 17441145 14433638 13411217 13181260 11163962 7255625
41187 7255625 4704203 5840047 8460940 8639835 6159710 4428048 5227723 6538446
41179 6538446 6207224 5024147 4848796 5854066 7087114 8036851 8307226 7354693 5886550
41170 5886550 5941866 8149086 10378478 10589524 9532212 8992934 8874315 8068868 7056269
41161 7056269 7301784 8655689 9527215 9430097 9420745 10019557 10427142 9963940 8832397 7288423
41151 7288423 5377296 3725087 3440668 4860813 7070691 8718798 8850101 7432078
41143 7432078 5811472 5937712 8023268 9687606 8819316 6615194 6029651 7679259 9374194
41134 9374194 9628521 9300757 9241485 8635301 6897756 5392839 5697268 7342862 8718763
41125 8718763 9296215 9577964 9590316 8890717 7699191 6737896 6101470 5317117 4389683
41116 4389683 3886992 4109692 4943660 6333202 8162786 9958628 11487109 13258095 15490360
41107 15490360 17035007 16669981 15328374 15481684 17905549 20446050 20798147 19493574
41099 19493574 19165625 21457142 25616025 30006018 34368194 40433661 50285019 63982944
41091 63982944 79210560 93882979 108599290 125382493 144495934 164325588 184353479
41084 184353479 206196232 232019839 265506789 314787540 387593924 476598485 551978020
41077 551978020 577656479 539925202 458208640 366787835 289326922 231407151 189937408
41070 189937408 161490686 142252969 126988102 111871943 96735744 83247156 72299216
41063 72299216 63824042 57508859 52557708 47573590 41503791 34505179 27846757 23202236
41055 23202236 21452000 21474368 20784077 18255908 15396705 13862229 12923832 11144122 9408071
41046 9408071 9742915 11628487 12331088 11066778 9937242 9990103 9261405 6263136 2939020
41037 2939020 2031093 3193855 3861866 2827063 976567 -620809 -1387187 -597322 1980844
41028 1980844 4962733 6451667 6218282 5504465 4908676 3910603 2430734 1381443 1398406
41019 1398406 2189179 3365710 4811463 5959847 5858783 4492047 3163073 2987927 3634040
41010 3634040 4011814 3640761 2889537 2372849 2536071 3389118 4269651 4329937 3672890 3555933
41000 3555933 4982799 7452707 9541913 10293365 9524067 7341670 4275764 1583715
40992 1583715 351064 263750 225297 148040 864288 2067509 1993078 29435 -1899463
40983 -1899463 -1978748 -1233379 -1762866 -3235786 -3434454 -1818973 -58483 967484 2083660
40974 2083660 3367527 3557264 2768529 2957293 4335836 4307582 1993587 823088 3631433
40965 3631433 7658561 8129203 5108322 2764684 2869239 3367290 3116022 3490817 4614304
40956 4614304 4325841 2352769 1593265 3288027 4470624 2656423 -123387 -905035 -687905
40947 -687905 -2258753 -5020246 -5774363 -3833520 -1845638 -1583795 -1927604 -1455050 -513865
40938 -513865 85715 524651 1183469 1674232 1467692 727649 52417 -144640 68412 49669
40928 49669 -933493 -2613761 -3623611 -3164261 -2130549 -1713676 -1677076 -1253467 -1022569
40919 -1022569 -2172851 -4099442 -4579596 -2801623 -736184 -621999 -2014121 -2351602 -217063
40910 -217063 2764115 3665536 1779960 -214129 655873 3684663 5024519 2673726 -725409
40901 -725409 -1523588 -158717 -253397 -2998085 -5195306 -3884776 -652239 673329 -614820
40892 -614820 -1489359 100955 2296874 2287021 521918 -22196 1821053 3966930 4241580
40883 4241580 2951450 1368969 -458764 -2741388 -4223095 -3596190 -1893331 -1264072
40875 -1264072 -1716932 -1354405 156020 765467 -721944 -2757361 -3354941 -2590027 -1811686
40866 -1811686 -1744401 -2236052 -2750417 -2532677 -1367063 -335323 -506242 -1093815 -817590
40857 -817590 -729096 -2888378 -6107034 -6462772 -3087565 60932 -59842 -1447786 -971228
40848 -971228 803189 1636469 1711367 2363668 2887753 1960295 473171 -208193 -973194
40839 -973194 -2733792 -3540089 -1691786 208619 -1312605 -4557181 -4765671 -1379686 1693983
40830 1693983 2608519 3176493 3810419 2372418 -728132 -1522840 1330106 3866111 2798958
40821 2798958 259223 -118863 1617996 3296612 4334898 4971601 4334054 2220685 759492
40812 759492 1581606 3143129 3302417 2705719 3099158 4052312 4046665 3358924 3193193 3121915
40802 3121915 1933585 52801 -1233727 -2007144 -2889329 -2996921 -1215039 1226135 2021567
40793 2021567 1314280 1553105 3816285 6350773 7021872 5619656 3542981 2418206 3004394
40784 3004394 4456091 4933734 3794627 2545618 2708026 3717240 4153732 3913918 3522128
40775 3522128 2341537 -443604 -3617919 -4813132 -3540704 -1660950 -859560 -1089066
40767 -1089066 -1364993 -747807 1227106 3763679 4794076 3137725 278718 -1415307
40759 -1415307 -1677090 -1869391 -2136862 -1221559 895347 2317248 1686806 -338364 -2462004
40750 -2462004 -4074629 -4863108 -4631749 -3952267 -3611924 -3118360 -1280121 1388763 2630747
40741 2630747 1558227 119408 375749 1770957 2434986 2024778 1697558 2002764 2464102
40732 2464102 3010859 4207825 5743766 6024216 4116419 1372248 85175 676709 1246762
40723 1246762 300425 -1059213 -713264 1276956 2669331 2417542 2279077 4020200 6449322
40714 6449322 6841434 4485574 1121119 -1656043 -3610817 -4675604 -4514400 -3690590 -3571353
40705 -3571353 -4370333 -4700130 -3825825 -2947481 -3170005 -3482566 -2308577 -310286 142363
40696 142363 -1701072 -3734552 -3640282 -1672047 22530 179691 -475613 -695204 -250924
40687 -250924 309737 682367 952242 1163890 1425206 2121548 3203890 3482309 1779738
40678 1779738 -972948 -1994144 206333 3755337 5458602 4455145 2829054 2716960
40670 2716960 3796762 4009363 2248343 -204739 -1072299 224396 1696213 1008400 -1790569
40661 -1790569 -4510180 -5552355 -5301822 -4713844 -3893871 -2765195 -2021125 -2376592 -3426173
40652 -3426173 -3970079 -3080686 -651836 2230579 3352265 1326940 -1963689 -2760727 -374306
40643 -374306 1349615 -588651 -3547423 -2831957 1182245 3270566 787975 -2834332
40635 -2834332 -3351725 -1359964 -393147 -1445614 -2232467 -1233458 144211 -2500 -1200521
40626 -1200521 -1381433 28759 1080832 -54647 -2142614 -1970208 1345127 4655465
40618 4655465 4564849 1661169 -843704 -1771037 -2688888 -4062152 -3771770 -837547 1888320
40609 1888320 1105603 -2217682 -4046497 -2769876 -1042362 -1652718 -3595589 -3641144 -810053
40600 -810053 2306466 2760197 671220 -1186294 -721148 1368350 2881633 2752498 1826942
40591 1826942 1346291 1387919 1031778 -252728 -1712880 -1981267 -710209 761332 882874
40582 882874 -118923 -539019 456130 1862879 2613664 2988960 3315975 2579791 -47189
40573 -47189 -3130902 -4353646 -3658085 -3086627 -3468686 -3318681 -1569965 543839 1415546
40564 1415546 1342660 1553386 2078821 2064487 1508514 1194411 1149787 562158 -615173 -1134595
40554 -1134595 -79877 1666097 2270722 1119528 -387782 -417841 1149953 2549678 2227041
40545 2227041 749761 175569 1594602 3808274 4682868 3513589 1687725 1041508 1930012
40536 1930012 3201326 3811473 3761700 3283001 2090632 363067 -319247 1442214 4507504
40527 4507504 6080051 5159743 3403115 2129937 589440 -1682607 -2958496 -1784154
40519 -1784154 235571 536344 -500952 -326347 1524222 2613024 1327404 -907599
40511 -907599 -1916467 -1497954 -966812 -1239674 -2152511 -2801800 -2117076 103091 2507725
40502 2507725 3354946 2414559 909116 -230951 -994120 -1407097 -1313593 -990367 -796694
40493 -796694 -335201 833868 1956820 2025902 1603836 1916768 2358412 1105761 -1553034
40484 -1553034 -2893113 -1601628 215014 153939 -1209137 -1823486 -1509473 -1731573 -2619718
40475 -2619718 -2315029 226060 3167490 3674554 1516547 -414816 250568 2215004 2377233
40466 2377233 179611 -2064760 -3106520 -4070192 -4898239 -2963416 2296635 6414902
40458 6414902 5153881 568711 -2104196 -1847243 -1685300 -2403690 -1675835 635011 1512342
40449 1512342 18945 -1121961 -329292 743335 1047555 1687010 2365316 964553 -1633078
40440 -1633078 -1177715 3163690 6436225 5151213 2269720 1667319 2256602 1610611 1092995
40431 1092995 2623146 3938179 2159237 -769765 -1180334 283299 639215 164104 780948
40422 780948 979880 -1930806 -5862769 -6039844 -2512562 -174707 -1416610 -3818252 -5153944
40413 -5153944 -5671059 -5049861 -2024142 2068927 3672062 1931278 -333861 -902465 228238
40404 228238 3201996 7847135 10886464 8576899 2786471 -464471 607719 1744600
40396 1744600 400756 -395005 1717539 3803168 2775078 696749 973714 2748795
40388 2748795 3107088 2141142 1906092 2366239 2022501 1092366 830975 814964 -281939
40379 -281939 -2110408 -3215354 -3339965 -3161339 -2593874 -1107047 1022604 3012081 4172137
40370 4172137 3536070 604214 -2712355 -3077776 67568 3401957 4070612 2825131 1535094
40361 1535094 380795 -565953 207231 3075682 5499317 5461657 4616602 5404895 7091839
40352 7091839 7441474 6363751 4966300 2914395 4689 -1370718 961509 4809844
40344 4809844 5988902 4163125 2736378 3314409 3982543 3309419 2543191 2898521 3428088
40335 3428088 2690129 564983 -2237743 -4693162 -5150680 -2478132 1918399 4890232
40327 4890232 4899600 3229777 1657587 469218 -816681 -2145943 -2966776 -2802953 -1602606
40318 -1602606 -51647 770230 650306 534052 927806 1081116 653866 756169 1945173
40309 1945173 2719213 1838895 670674 1020472 2031659 1831804 1016738 1412616 2200841
40300 2200841 736534 -2885301 -5429450 -5064424 -3280299 -1765278 -355771 1129493
40292 1129493 1901531 2111374 3115701 4703027 4643247 2352432 473448 1056291 2365720
40283 2365720 1538267 -1254921 -3378154 -3335299 -1976623 -854982 -829586 -1769051 -2679572
40274 -2679572 -2705632 -2407826 -2953440 -3839274 -3279734 -1453432 -960364 -2652567 -3498847
40265 -3498847 -919178 2816416 3553343 1298791 -153038 781570 1518271 68190 -1615981
40256 -1615981 -929758 1179891 1758998 245500 -1195732 -1260122 -1008123 -1428285 -1575916
40247 -1575916 -264321 1745016 2663014 2116459 1300293 930905 398759 -794460 -1838072
40238 -1838072 -1425889 755390 3634263 5438161 4831339 2083378 -898911 -2447368
40230 -2447368 -2838389 -3126367 -2815520 -670426 2160370 2527055 -114481 -2134721 -779433
40221 -779433 1567409 981800 -1981048 -3439843 -2399463 -1755531 -2894949 -3393736 -1577393
40212 -1577393 186210 -720429 -2639520 -2031286 956400 2565514 998394 -947944
40204 -947944 126943 3522385 5419629 3824601 791414 -569249 131875 890864 552639
40195 552639 -2245 122314 526129 930054 2105528 4085073 5019847 3619212 1530031
40186 1530031 1215812 2335845 2499915 1055147 -340499 -719115 -805936 -817822 156592
40177 156592 1907075 2631062 1727369 937232 1494297 2086783 1165523 -312718 -190901
40168 -190901 1809496 3838747 4186691 2691388 403532 -1224465 -1213437 165568 1701922
40159 1701922 2506226 2474047 1635725 51776 -1588415 -2399578 -2520505 -2842908 -3510755
40150 -3510755 -3934617 -4206109 -4900707 -5434900 -4491084 -2379149 -1001896 -978905 -897659
40141 -897659 -123298 -61124 -1462812 -2687455 -2235806 -1135062 -1042756 -1588221 -1459314
40132 -1459314 -782943 -516236 -534756 -162163 250435 -21356 -573855 -591349 -376067 -684948
40122 -684948 -1193399 -1066693 -517871 -455807 -998468 -1409538 -1062111 276180 2328111
40113 2328111 3820516 3308942 1349413 457043 1838718 3705141 4097527 3629846 3697428
40104 3697428 3708902 2382404 508655 5938 1074563 2462070 3635912 4432799 3564339
40095 3564339 209955 -3451109 -4111060 -1641908 1039137 2356639 3568048 5476272
40087 5476272 6413980 4700723 1205314 -1729046 -2717123 -2000263 -735871 -47169 25470
40078 25470 532320 1752603 2152731 751286 -473468 1036615 4165593 5172798 3117030
40069 3117030 1109574 1318353 1836135 224550 -2442551 -3398430 -2260336 -849563 -5902
40060 -5902 1033855 2415576 2879753 1514662 -973450 -3124050 -4168944 -4429815 -4677484
40051 -4677484 -5197768 -5439898 -4752532 -3314540 -1830838 -472299 1079357 2597532 3392887
40042 3392887 3646905 4506401 6273156 7517658 6865604 4976612 3745995 3811192 3807842
40033 3807842 2305663 -186853 -1757661 -1484998 -483903 -49996 423746 2314700 4858400
40024 4858400 5353999 2946248 331637 418098 2848811 5329179 6851119 7740104 7966977
40015 7966977 7700240 8332688 10409541 11577473 9545624 6395744 6633514 11043232 15770921
40006 15770921 17746963 17600138 16543675 14041662 10193884 7353968 7228742 8453904
39998 8453904 8730050 7519177 5409775 2976620 1535743 2656031 5427724 6601787
39990 6601787 5040623 3496372 4136065 5070746 3793857 1501014 982389 2250300 3402523
39981 3402523 4164420 5329252 6005368 4749723 2556143 1597055 1737859 1282971 353193
39972 353193 328125 642778 -409568 -2093548 -2039559 -524370 -218133 -1401298 -1331202
39963 -1331202 785581 2036354 443120 -2168726 -3686172 -4703114 -5804572 -5079421
39955 -5079421 -1290211 2904200 4047776 2541757 1305244 1251750 1113094 621975 616582
39946 616582 504092 -1180363 -3638824 -4177207 -2159547 9577 478731 75425 45694
39937 45694 115390 -22071 410933 1384702 1210660 -519315 -1182944 1180520 4102770
39928 4102770 3758892 802481 -534467 939207 1694671 -465567 -2638494 -1542923
39920 -1542923 1237316 2064460 918791 371781 486327 -790940 -2691014 -1890463 1541017
39911 1541017 3113095 736047 -1598635 168820 3928191 4835458 2518346 765466
39903 765466 1408464 2634896 3033032 3490889 4519020 4768840 3227279 765735 -1215966
39894 -1215966 -2045684 -1466871 219922 1673778 1894057 1831180 2681637 3174189 1248689
39885 1248689 -1868419 -2567213 -227405 1734971 1166010 66666 640382 1850983 2128550
39876 2128550 2377589 3526791 3854111 2022442 456693 1944331 4588991 4284222 1246222
39867 1246222 -274537 1322478 2990656 2566936 2142639 3981226 6413953 6442840 4232097
39858 4232097 2307959 1580910 695460 -1153829 -2865137 -3040422 -1657868 76593 879344
39849 879344 449796 -205031 233576 1832431 3308371 3623365 2932890 1802187 544242
39840 544242 -282904 26562 973311 767561 -1360936 -3690495 -3942243 -1938864 685321
39831 685321 2608046 3501113 3414086 2870659 2974820 4002488 4426412 2849287 367489
39822 367489 -777078 -524222 -842188 -2203073 -2591603 -836417 1164127 887159 -1616387
39813 -1616387 -4262597 -5455842 -4840144 -2762988 -495901 -44062 -2086311 -4632024
39805 -4632024 -5162668 -3623421 -1898806 -923745 -109971 584628 44735 -2026182 -4082284
39796 -4082284 -4482097 -3230174 -1362924 443206 1926253 2650823 2252739 1110799 299068
39787 299068 784385 2538302 4243268 4241067 2263866 -163096 -1625165 -2516460 -3928553
39778 -3928553 -5548922 -6065796 -5213168 -3806734 -2094398 -12194 1088518 -547478
39770 -547478 -3814901 -5067450 -2946507 -608165 -1455239 -4646078 -6881161 -6948532 -6059190
39761 -6059190 -4865921 -2867634 -426425 945259 414300 -1603475 -4337070 -6584632
39753 -6584632 -6503700 -3562324 -231213 513250 -859303 -1288793 210908 1418636 836780
39744 836780 4088 719229 2159572 2244161 393869 -2211791 -3906168 -3340499 -459204
39735 -459204 2641509 3365415 1774552 459366 780522 1381715 1159870 1046667 1395562
39726 1395562 360365 -2868229 -5591274 -5088550 -2618109 -973877 149292 2805336
39718 2805336 6097115 6905831 4996979 3393473 3348200 2926394 1521234 1704132 4569391
39709 4569391 6765317 5037546 1195803 -593259 256021 818870 -211624 -828059 578219
39700 578219 2547675 2719256 1043444 -357943 169181 2120356 3554577 3121222 1349378
39691 1349378 -73951 -142671 758734 1803756 2503630 2439376 1340671 -123403 -777976
39682 -777976 -778081 -1731950 -4077867 -5681636 -4435579 -1236398 1128834 1271694 -66203
39673 -66203 -1688404 -2651125 -2055916 -66560 1351747 618950 -1013423 -1260298 -496662
39664 -496662 -1074593 -3147457 -4174761 -3034472 -1539393 -870525 304428 2439558 2946930
39655 2946930 92616 -3303157 -3187982 186648 3080978 3557743 2890689 2335945 1677816
39646 1677816 1013529 1109923 1584117 1208083 412285 1013104 2872271 3340796 1075526
39637 1075526 -1737169 -2218980 -201902 2236557 3111546 1588039 -1607620 -3927587
39629 -3927587 -2887313 754998 3341994 2761327 692409 -553505 -1118528 -1927119 -2217935
39620 -2217935 -965513 1019821 2647537 4462114 6612337 6851191 3724799 230642
39612 230642 527096 3746895 5028189 2608663 -159395 -487127 197906 -233139 -1053358
39603 -1053358 -850812 -414875 -951271 -1474531 -410137 1637064 2777215 2354966 987928
39594 987928 -615909 -1467324 -488692 1586782 2239259 753778 -181522 1466718 3523691
39585 3523691 2817570 52268 -1830568 -2667168 -4515244 -6762918 -6074664 -1743271 2663818
39576 2663818 4099748 3294287 2043430 375434 -1874758 -3329720 -2939575 -1661060
39568 -1661060 -608012 607459 2144931 2596570 1260685 -105793 93145 558721 -711823
39559 -711823 -2855409 -3308162 -1725521 -273931 -347460 -1152010 -1496890 -1218887 -788116
39550 -788116 -807077 -1708111 -2961672 -3279483 -2601478 -2573079 -3569450 -3004695 908210 5187624
39540 5187624 5231434 1340227 -1511363 -629617 1292087 1043458 -496721 -523748 1417718
39531 1417718 3451149 4054538 2985158 786089 -1215196 -1532275 -248768 972597
39523 972597 1305751 1676485 2549263 2707483 1359364 -403778 -1530443 -2530481 -3719409
39514 -3719409 -3977595 -2953578 -2489394 -3839094 -5349286 -5111457 -4068684 -3982504 -4086714
39505 -4086714 -2673836 -549298 209361 -260874 -565265 -1291075 -3620373 -5645471 -4351149
39496 -4351149 -1072985 -421686 -3124697 -4520433 -1727572 1992800 2431181 316867
39488 316867 -933022 -456449 271092 818932 1822848 2968324 3596381 4148838 4737854
39479 4737854 3753787 496109 -2200575 -1052958 2740224 4781149 3418236 1328350
39471 1328350 962159 1531952 1544854 1588023 2752387 4056474 3537139 1203914 -832630
39462 -832630 -1113932 -410442 -236610 -777007 -1080968 -896803 -1202785 -2529653 -3692756
39453 -3692756 -3163910 -1189080 607137 1419727 1750496 1883154 1485156 875101 957293
39444 957293 1468754 1070439 -205725 -545821 671581 1518094 509282 -961431 -932970
39435 -932970 85924 447817 310098 911051 1867387 1587655 -58493 -1564926 -2023571
39426 -2023571 -1765213 -1084936 -398 1006790 1507856 2002894 2939508 3535114 3056989
39417 3056989 2419873 2736372 3064308 1584378 -1508852 -4160180 -5003364 -4115746 -2079433
39408 -2079433 -123441 -115126 -2199963 -3537391 -1872742 768776 816044 -1542525 -3112038
39399 -3112038 -2757654 -1834214 -245476 3323727 7093741 7022638 3130002 384256 1519013
39390 1519013 3320549 2292471 -206218 -1325347 -1380880 -1783599 -1585407 251722 1834800
39381 1834800 1295477 434771 1624656 3168893 1901721 -1137659 -2006610 -66833 1311603
39372 1311603 136349 -1913569 -2852430 -2671489 -1760508 -13743 1887515 2838647 3373966
39363 3373966 4954948 6957480 6970968 4579625 2301315 2040638 2902009 3248336 2711256
39354 2711256 1389665 -723785 -2567977 -2396072 -477475 508769 -960894 -3022838
39346 -3022838 -3091781 -1206088 717600 1615424 1712196 1303568 751616 1056719 2907783
39337 2907783 5402633 6883754 6898159 6366676 5930476 5094373 3231119 793255 -924213
39328 -924213 -1155650 -553386 -468351 -1338552 -2200828 -2054302 -1213545 -785428 -1202447 -1904100
39318 -1904100 -2190914 -1854474 -1310231 -1537245 -3229532 -5439956 -6025417 -4354060 -2471432
39309 -2471432 -2289224 -2851895 -2285170 -1326944 -2253498 -4727837 -5698182 -3816681 -1182763
39300 -1182763 115968 519957 867263 401183 -1242513 -2229413 -921773 1463094 2695616
39291 2695616 2692860 2675794 2420360 883389 -1174564 -1824026 -1031298 -692015 -1594777 -2694118
39281 -2694118 -3554389 -4922721 -6200050 -5050918 -1068318 2409729 2250738 -260896
39273 -260896 -1466530 -514013 128422 -1011522 -2360382 -2206132 -1291691 -1156633 -1562106
39264 -1562106 -1230842 -203152 148297 -924037 -2764067 -4190489 -4252817 -2686718 -697039
39255 -697039 -620105 -3362909 -6623326 -7261186 -5157373 -2951737 -2157881 -1787630 -1162841
39246 -1162841 -1552493 -3723673 -5889514 -5831716 -3758859 -1536207 -206486 307960 157632
39237 157632 -298104 -292737 66989 -566621 -2537131 -3984674 -3545887 -2685118 -3206900 -4011517
39227 -4011517 -3058284 -1277283 -1245193 -2718915 -3119641 -2290648 -2819815 -4956817 -5194110
39218 -5194110 -1604274 2776426 4083209 2439629 410886 -887388 -1591141 -1091766
39210 -1091766 888078 2638357 2602920 2053613 2971735 4328417 3541214 1107096 433444
39201 433444 2654143 4719998 3896208 1693905 1505281 3884422 6131248 5927505 3763713
39192 3763713 1793521 1426514 2355513 3338844 3532061 3123889 2816693 2859780 2815405 2255367
39182 2255367 1381213 772931 668535 709496 449312 -1672 -22091 745898 1811471 2234897
39172 2234897 1629407 649825 401422 1240031 2106833 1460959 -633231 -1847702 -184221
39163 -184221 2934311 3893490 1679444 -611066 -288848 1105800 727079 -801419 -828141
39154 -828141 285126 -405937 -2984133 -3893112 -1701753 400111 -101747 -993339 435481
39145 435481 2257634 972277 -2274096 -2941565 -4304 2550714 1693433 -737733 -1513606
39136 -1513606 -655518 -489262 -1593952 -1977320 -190656 2327576 2863024 927447 -919581
39127 -919581 -349776 1498036 1561315 -646205 -2196007 -1039814 1021235 1095540 -855462
39118 -855462 -2665937 -3186099 -2885694 -2280437 -1695744 -1761056 -2362673 -2049566 -267017
39109 -267017 1042678 233132 -969039 66073 2353645 2506709 30556 -2043823 -1990709
39100 -1990709 -1439450 -1884722 -2385397 -1940040 -1304830 -1052175 -370566 770541 734086
39091 734086 -914240 -2039227 -1258843 -354609 -1242572 -2638473 -2283712 -837579 -705581
39082 -705581 -1994777 -2499945 -1372173 -184196 -181084 -724456 -996086 -1349751 -2039363
39073 -2039363 -1951043 114295 3302200 4970906 3629739 1199585 1258785 4504600 7165571
39064 7165571 5469742 827943 -1810816 -571799 1348913 1011597 -224567 80751
39056 80751 1127384 756577 -385947 -32824 1443069 1451416 -409470 -1655215 -956673
39047 -956673 76600 -44575 -384861 506373 2355140 4048904 5273641 6155482 6383464
39038 6383464 5612521 3979667 1772083 -598483 -2181423 -2164065 -1085587 -217448 193443
39029 193443 635727 534788 -1153524 -3322471 -3143978 -110014 2600366 2257702 150888
39020 150888 -743351 1520 484678 -187390 -1042758 -1248375 -1042003 -811405 -741046 -1163896
39010 -1163896 -1966808 -2047484 -742651 684841 579886 -484674 -469344 886049 1628554
39001 1628554 726373 -410340 -374236 88472 -352469 -1257396 -1142904 265820 1957359
38992 1957359 3318286 4497443 5274964 4944600 3593223 2443016 2420511 3058252 3278972
38983 3278972 2744217 1927087 1275311 960276 1276135 2513256 4182713 4945483 3856456
38974 3856456 1495257 -591517 -1508255 -1662318 -1836469 -2117705 -1952370 -928533 728067
38965 728067 2252936 2855968 2401494 1674228 1715157 2827252 4445503 5829925 6414948
38956 6414948 5649497 3329831 303656 -1889809 -2411502 -1593416 48152 2327805 4625181
38947 4625181 5725591 5094753 3388760 1114092 -2015450 -5528460 -7446700 -6593288
38939 -6593288 -4541850 -3518545 -3298097 -2236888 -631986 -459684 -1858043 -2612763 -1806228
38930 -1806228 -1435640 -3099573 -5156661 -4932509 -2401890 23781 536438 -677764 -2449808
38921 -2449808 -3708356 -3867332 -3113899 -2137891 -1129795 383928 2322114 3587238 3498175
38912 3498175 2839244 2754922 3382747 4216841 4896250 4927691 3696117 1679271 638520
38903 638520 1533459 3125987 3709096 3337125 3210444 3678533 4051797 3726471 2483534
38894 2483534 456524 -1266993 -1075854 1005536 2730654 2438267 1123364 266167 -748229
38885 -748229 -2899994 -4709067 -3941008 -1316921 376864 490696 892699 2232210 2903759
38876 2903759 2212529 1636302 2012018 2082202 965960 -291850 -845356 -1457014 -2450862
38867 -2450862 -2517853 -1239863 -695363 -2413274 -4378404 -3525604 -262299 1926873 1115443
38858 1115443 -941189 -1565029 -377103 914506 951414 74302 -615774 -897088 -1506447
38849 -1506447 -2568133 -2936217 -1900524 -617258 -457073 -670243 417894 2307934 2725317
38840 2725317 1196428 -237866 -429149 -725009 -2138483 -3327405 -2894398 -1660010 -1031851
38831 -1031851 -940726 -1023728 -1974599 -3776703 -4332272 -2163235 801262 1492040 -126596
38822 -126596 -1373657 -694890 927291 1981937 1888411 677122 -1086252 -2195890 -1972433
38813 -1972433 -1226359 -950097 -765727 41693 847164 616772 -291161 -902465 -1393430
38804 -1393430 -2313992 -2878834 -2069000 -808085 -864525 -1963105 -2199283 -1194044 -639649
38795 -639649 -1533431 -2849796 -3306354 -2784976 -1726456 -598264 -111780 -602385 -1254715
38786 -1254715 -1295214 -1531407 -2934583 -4140378 -2721417 904298 3251018 2195682 -391598
38777 -391598 -1410935 -239454 1422449 2090640 1701028 1028417 780910 937109 742010
38768 742010 -202182 -1043681 -680756 587629 1379258 966412 -286581 -1851060 -3268635
38759 -3268635 -3882244 -3598412 -3513555 -4510958 -5770782 -6031062 -5578679 -5350883 -4918677
38750 -4918677 -3392451 -1582061 -945926 -974451 -82566 1424820 1967864 1751128 2129643
38741 2129643 2294707 215715 -2992350 -3645064 -1233384 504108 -334321 -867307 1177028
38732 1177028 3185836 2037800 -613062 -1350653 -786135 -1978990 -4550196 -4908441 -2159719
38723 -2159719 286795 -175062 -1903131 -2086595 -874690 -542082 -1777116 -2734682 -1833473
38714 -1833473 -177222 -180667 -2048622 -3028898 -1048343 2147822 3246394 1961442 1021221
38705 1021221 1786546 2621798 2108716 1126673 704753 340282 -265565 -165660 790214 1207360
38695 1207360 790318 1205757 2807303 3339353 1832619 759442 1793199 2491994 465412
38686 465412 -1981066 -1394787 843476 683652 -1788829 -2581633 -516700 1021301 -241405
38677 -241405 -2231119 -2428647 -1669104 -2138500 -3845566 -4939739 -4320706 -2677095 -1478056
38668 -1478056 -1340416 -1140546 673722 3449431 4477890 2835269 1063856 1191869 1352614
38659 1352614 -906998 -4089340 -4949573 -3423427 -1527825 849235 4403915 6158262
38651 6158262 2503385 -3802997 -5761063 -2042641 1249761 315381 -1072395 1121979
38643 1121979 4449714 4659348 2387175 567333 -1021954 -3808512 -6109396 -5720025
38635 -5720025 -4449825 -5170133 -6278170 -4219842 -193609 1040991 -1295510 -2811211
38627 -2811211 -856007 1965013 2397307 793241 -789406 -1650436 -1986474 -1698523 -984881
38618 -984881 -353968 588252 2464212 4035017 3229498 669716 -563720 528970 1393424
38609 1393424 191927 -1303907 -920827 321551 181484 -1069086 -1389101 -327841 636235
38600 636235 439324 -772137 -2561272 -4144090 -3993206 -1357657 2045087 3468016 2186231
38591 2186231 -150971 -1845523 -2383112 -1737601 -251983 710638 -278160 -2655886 -4133339
38582 -4133339 -3462886 -1773824 -854211 -1353597 -2917175 -4560670 -4506658 -1538537 2552586
38573 2552586 3857030 1237962 -1519775 -644739 2151167 2180291 -1142453 -3528672 -2511685
38564 -2511685 -914813 -1714895 -2916826 -882836 3354879 5048051 2399444 -1361602
38556 -1361602 -2898041 -2486675 -1829857 -1141867 -215644 -73217 -1279995 -2155463 -1003005
38547 -1003005 937293 1250037 466464 1627538 5402716 8315487 7157266 3238348
38539 3238348 477016 484081 1528063 1799299 1512706 1406981 1022337 -378654 -2221546
38530 -2221546 -3194191 -2944500 -2174752 -1379675 -588507 -225885 -976245 -2480154 -3253167
38521 -3253167 -2492697 -1139928 -500260 -531531 -270720 594477 1416915 1538800 886858
38512 886858 -84879 -552789 69914 1133570 1077254 -464810 -1747047 -1300222 -434269
38503 -434269 -1631859 -4757110 -6801193 -5712714 -2771620 -544072 4621 -487458 -1327052
38494 -1327052 -2148821 -2538197 -2314866 -1823802 -1385777 -948811 -609351 -687780 -872345 -261745
38484 -261745 1094319 1686087 491725 -1352251 -1867446 -701558 696995 1013643 264995
38475 264995 -752062 -1424657 -1698879 -1872195 -1995665 -1581117 -422261 483616 -92262
38466 -92262 -1658134 -2454695 -2228988 -2761202 -4703090 -5884440 -4488991 -2180638 -1713011
38457 -1713011 -2694156 -2544632 -962587 -221329 -940501 -936409 690406 1503069 -282413
38448 -282413 -2351137 -1518239 1309753 2465756 1059567 11665 1249273 2781335
38440 2781335 1941835 -547795 -1790969 -996363 -426728 -1985004 -4516536 -5343399 -3625511
38431 -3625511 -1199117 -230849 -829494 -1292104 -343365 1338040 1945430 688827 -1220594
38422 -1220594 -1912473 -931875 494507 1200895 1340495 1532473 1542818 706444 -785899
38413 -785899 -2081713 -2913850 -3479171 -3232690 -1371150 1221866 2305363 1362704 559833
38404 559833 1326109 1816924 -118408 -2910552 -3100323 -628631 890817 -370966 -1788516
38395 -1788516 -460774 2443432 3574234 2006407 -193826 -1067780 -452172 926619
38387 926619 2258594 2662434 1784899 397636 -552617 -1192563 -2083992 -2863363 -2712128
38378 -2712128 -1767798 -825588 -28932 843847 1260048 670632 18706 711811 2226357
38369 2226357 2709338 2030926 1985469 2977201 2971425 883021 -1327017 -1663123 -1201879 -2014199
38359 -2014199 -3556458 -3696329 -2355871 -1393047 -1239352 -456159 1101451 1406905 -421757
38350 -421757 -2164700 -1453830 778556 1545084 -217935 -2503752 -2988748 -1736967 -755999
38341 -755999 -1437585 -3039370 -3876226 -3627464 -3643103 -4744204 -5807669 -5488446 -4434886
38332 -4434886 -4285456 -4957636 -4742500 -3115009 -1612024 -1430848 -1806296 -1571893 -978740
38323 -978740 -1013350 -1867732 -2881935 -3302643 -2695264 -1406218 -689595 -1213830 -1542102
38314 -1542102 142506 2703542 2818355 -161473 -2705284 -1967842 299033 848568 -204330
38305 -204330 -399248 725660 1416406 1126283 1195513 2173525 2936539 2637903 1582116
38296 1582116 220492 -922243 -688368 1354072 3444937 3715431 3201387 4188463 6009653
38287 6009653 5721778 3166332 1843672 3642392 5933464 5690725 3793590 3030017 3878837
38278 3878837 4624810 4290646 3289173 2042902 783619 130134 421457 945768 836503
38269 836503 107165 -932983 -2320779 -3672724 -3859532 -2440575 -553549 407755 134263
38260 134263 -998931 -2384008 -2838173 -1553413 -15124 -885487 -3986756 -5759183 -4210630
38251 -4210630 -1861958 -1564039 -1889029 138577 3535821 4423240 1961627 -451720 -178466
38242 -178466 1616558 2583600 2130112 780171 -1111225 -2798362 -3042827 -1761905 -555920
38233 -555920 -729236 -1864611 -2983015 -3922597 -4809130 -5216846 -4761325 -3864711 -3199551
38224 -3199551 -2793749 -2200256 -1277478 -461491 -313424 -783105 -984123 -177477 993809
38215 993809 1167818 409340 333694 1400588 1786065 317018 -1221828 -805915 296033
38206 296033 -565871 -2940520 -3839266 -2480658 -1224769 -1479230 -1900176 -1490703 -1340427
38197 -1340427 -1920556 -1601511 251428 1321756 -183856 -2240627 -1846602 418370 1549698
38188 1549698 899344 824989 2647077 4602555 4470725 2341073 -58976 -1496888 -1889395
38179 -1889395 -1664027 -1248392 -957721 -997095 -1436204 -1970459 -1820973 -577331 737042
38170 737042 521542 -927249 -1062088 1628322 5012786 5609531 2925008 -236481 -1618246
38161 -1618246 -1778751 -2096925 -2284911 -1096642 1399109 3512643 3772371 2370847 788986
38152 788986 363946 1192419 2199875 2271701 1352068 378356 266828 1207750 2809239
38143 2809239 4456592 5443281 5220029 3852666 2059779 588808 -306731 -637604 -178709
38134 -178709 1432558 4044152 6659809 7961262 7270340 5121633 2949109 2024213 2400161
38125 2400161 2881581 2318529 978091 235166 754850 1592363 1593800 1024788 834089 777513
38115 777513 -258633 -2027870 -2718456 -1660910 -626605 -1172814 -2044141 -1005209 1518307
38106 1518307 2644677 821361 -2300533 -4042533 -3414374 -1392933 323046 528805
38098 528805 -563021 -1477420 -1347395 -1231137 -2268225 -3107813 -1388792 2115817 3476249
38089 3476249 845757 -2652067 -3129891 -1128036 -130718 -1085100 -1401283 503000 2439927
38080 2439927 1544372 -1585680 -3618814 -2807085 -967547 -837942 -2648086 -4321501 -4521818
38071 -4521818 -4013676 -3680119 -2769939 -411385 2235192 3194956 2554148 2093103 2176352
38062 2176352 1331282 -653833 -1717477 -755827 460105 322684 301367 2513355 5854421
38053 5854421 7226042 5951385 4428410 4493824 5361657 5402306 4150069 2252746 867391
38044 867391 1109467 2650172 3125721 765118 -2602204 -3414142 -1395105 -90366 -1554924
38035 -1554924 -3233234 -1958135 1113035 2115025 -75426 -2545055 -2297883 522753
38027 522753 3513698 4495641 2841848 -288967 -2578610 -2422070 -594292 684157 446871
38018 446871 -183192 45008 931185 1643922 1864150 1332095 -483820 -2988699 -3800645
38009 -3800645 -1364530 2241252 3296519 1436006 288735 2143572 4437242 3716813
38001 3716813 1156005 823933 3155264 3976512 908929 -2805007 -3062630 -773595 89196
37992 89196 -1333060 -2096084 -574418 1146537 790347 -906240 -1871200 -1644602 -1173535
37983 -1173535 -1025358 -1180503 -1591193 -1753763 -646666 1776523 3936990 4590616 4401173
37974 4401173 4193515 2810816 -1166703 -6122163 -8314620 -6489978 -3431109 -2042403
37966 -2042403 -1828602 -703170 1236073 1812292 151043 -1941109 -2250421 -543098 1690362
37957 1690362 2916940 2552727 1016495 -655588 -1580717 -1724394 -1676102 -1836845 -2218054
37948 -2218054 -2769288 -3151088 -2424611 -158752 2067375 1795872 -968470 -3038008 -1931115
37939 -1931115 789476 1831320 875825 614849 2287513 3804373 3124389 1198473 24745
37930 24745 -472664 -1612730 -3050210 -2923511 -769149 1534332 2060552 817030 -820767
37921 -820767 -1576773 -945742 584123 1700345 1570650 1171489 2257781 4690650 6021964
37912 6021964 4484597 1355734 -665825 -643324 229788 890985 1527751 2332019 2520356
37903 2520356 1369893 -451769 -1364425 -505403 1535384 3434736 4239615 3896847 3072827
37894 3072827 2529833 2536973 2835689 3089934 3134176 2803130 2003339 1227859 1471104 2978775
37884 2978775 4367060 3844077 1377205 -1158530 -2208532 -2063979 -1769204 -1519141 -1042633
37875 -1042633 -760766 -1229258 -1787605 -1242924 40456 262460 -1093646 -2107052 -981178
37866 -981178 1328364 2296510 937673 -1553863 -3747151 -5051743 -5018042 -3266888 -634252
37857 -634252 1001727 925004 629847 1689887 3388876 3722016 2304869 821220 469050
37848 469050 377526 -753421 -2512802 -3343129 -2694946 -1516053 -775354 -567360 -770564
37839 -770564 -1520481 -2563316 -2991485 -2288881 -1065495 -133474 573846 1415464 1952083
37830 1952083 1529892 711643 874992 2138357 2788134 1427145 -972159 -1894960 31003
37821 31003 3590182 6094866 5750208 3113733 411384 -624518 -156143 565298 878507
37812 878507 991067 1053135 1035391 1459294 2986999 4921976 5359550 3618876 1524848
37803 1524848 1198934 2231888 2276067 236866 -2285849 -3005992 -1660018 -236355 -648685
37794 -648685 -2464378 -3329578 -1989056 -353624 -1342501 -4610768 -6146518 -3195358 1881377
37785 1881377 4458721 3400363 1623187 1140288 348324 -2598811 -6041201 -6695235 -4233693
37776 -4233693 -1644089 -1124244 -1736498 -1697611 -1106202 -1085499 -1473502 -1082119 229514
37767 229514 1388879 1946675 2426869 2563367 1049811 -1898036 -3362261 -931450 3745657
37758 3745657 6568964 5885550 3844334 2715264 1955775 -7372 -2603626 -3374729 -1104473
37749 -1104473 2341005 3505379 591336 -4532270 -7736838 -6653329 -3063898 -475654
37741 -475654 143387 615096 1825702 2177688 596570 -1238951 -1397277 -705113 -1154144
37732 -1154144 -2460094 -2547214 -962761 463230 445137 -225735 -395272 -180727 -235856
37723 -235856 -597436 -1005465 -1527176 -2121568 -2104462 -816532 1202965 2284142 1368520
37714 1368520 -381804 -551434 1337579 2569120 662070 -2628703 -3090685 96260
37706 96260 3112873 3070644 1832586 2299218 3661540 3306360 1404731 179506 -115444
37697 -115444 -993705 -2293446 -2415181 -1602360 -1579951 -2171308 -1790673 -1111133 -2226188
37688 -2226188 -3912781 -2299264 2518347 5145159 2420392 -1926756 -3143178 -2181851
37680 -2181851 -2753487 -4719934 -5040921 -3560799 -3129090 -4386262 -4650706 -2535311 -285927
37671 -285927 -434983 -2489693 -4027362 -3567156 -1658101 -118574 -387692 -1900380 -2533852
37662 -2533852 -1466114 -534927 -1449940 -2962688 -2767952 -1108942 -103657 -236974 -109202
37653 -109202 727711 1327613 1605054 2377693 3075683 2092082 -274179 -1897717 -2276763
37644 -2276763 -3083679 -4590807 -4626120 -2423746 -601980 -1418989 -3527022 -4525491 -4497004
37635 -4497004 -4658711 -4523907 -3190514 -1982808 -2851379 -5002309 -5941152 -5331743 -4992239
37626 -4992239 -5265913 -4380493 -1907770 -111436 -685587 -2245288 -2465707 -1240276 -320399
37617 -320399 -790961 -2150167 -3346869 -3798139 -3672789 -3662423 -4146626 -4496870 -3909346
37608 -3909346 -2952508 -3142404 -4604918 -5433244 -4164824 -1771117 -113719 626784 1599898
37599 1599898 2960452 3523349 2824390 2139538 2853241 4617802 5778307 5264295 3570813
37590 3570813 1983687 1222303 1037976 1009969 1220410 1678735 1512230 -179992 -2524242
37581 -2524242 -3181735 -1193770 1537968 2612181 1981441 1143219 463417 -747447 -1962970
37572 -1962970 -1613625 112539 880496 -414564 -1809739 -1186002 587835 1159553 203416
37563 203416 -515406 -19892 788152 816062 27678 -1063236 -1892227 -1797266 -628319 548649
37553 548649 425332 -855213 -1974010 -2254143 -2038920 -1446909 -235157 1003752 1079937
37544 1079937 18092 -853709 -1072578 -1660472 -2838370 -2895842 -729045 1861152 2161428
37535 2161428 90048 -1928097 -2248984 -1558840 -1160890 -1234501 -1290921 -1327808 -1814072 -2894801
37525 -2894801 -4050873 -4537072 -4138564 -3482913 -3347547 -3596904 -3232484 -1665306 537874
37516 537874 2341776 3105642 2661624 1386549 459097 1023802 2655785 3792239 4200965
37507 4200965 5447623 7846215 8724248 5720997 607713 -2562681 -2486813 -1320956 -668537
37498 -668537 298915 2177312 3481233 2827180 1082325 -57811 -227692 44164 570610
37489 570610 1123004 1098867 758795 1482649 3502659 4789658 3825860 2163891 2180932
37480 2180932 3288714 2788067 83159 -2423621 -2830400 -1891399 -1071425 -393830 763948
37471 763948 2108113 2714373 2111009 542002 -1086073 -1360421 390250 2739489 3360960
37462 3360960 1980738 713373 934946 1496811 1002969 172951 452258 1590138 2280876
37453 2280876 2211436 1762752 606539 -1412130 -2666050 -1300432 1748395 3536772 3146751
37444 3146751 2715136 3813718 5008565 4269252 2032576 263982 -311068 -399664 -426375
37435 -426375 -312876 -496876 -1492277 -2498745 -2031742 -293597 452692 -1322926 -4129307
37426 -4129307 -4945355 -2671205 782290 2831240 2800486 1831352 1018337 559582 444974
37417 444974 812000 1350684 1372965 946973 984048 1651533 1913577 1489834 1743898 3124698
37407 3124698 3314770 335261 -3593979 -4316786 -1490599 1159735 1444428 935454 769366
37398 769366 -753458 -4289573 -6806417 -5846117 -3573639 -3187305 -3723738 -2295098 431613
37389 431613 1376427 511638 560111 1607719 776872 -2213035 -3806425 -2309509 -611395
37380 -611395 -1218458 -2319661 -1308783 971711 2352393 3023903 3991999 4003371 1431496
37371 1431496 -2145827 -3625846 -2925499 -2725190 -3960178 -4580439 -3104121 -734202 858434
37362 858434 1714504 2501437 2903226 2356401 1380548 954022 987178 395128 -1287781 -3016015
37352 -3016015 -3316998 -2037634 -446613 600839 1864438 4260391 6764211 7165687
37344 7165687 4938282 1961296 98012 -561790 -656508 -329004 180943 153171 -461452
37335 -461452 -737982 -444439 -632059 -1661879 -2193905 -1289052 51845 740502 1293483
37326 1293483 2118860 1974678 233372 -1043443 107107 2097499 2123887 901564 1566790
37317 1566790 4170841 5050431 2429798 -761392 -1168091 634354 1904824 1700092 998959
37308 998959 367220 -382171 -986037 -988589 -854548 -1458121 -2665220 -3491138 -3500942 -3124550
37298 -3124550 -2640808 -1687321 -17476 1712750 2273365 1072401 -982745 -2088472 -1266464
37289 -1266464 667141 2033196 1874607 422925 -1407032 -2510486 -2220292 -1098977
37281 -1098977 -516747 -835463 -865997 80891 795645 168376 -600005 223985 1670067
37272 1670067 968953 -2411091 -5889355 -7208842 -6700875 -5717543 -4829264 -4261329 -4312977
37263 -4312977 -4514009 -3818771 -2213243 -696437 581303 2288561 3698015 2862784 -90007
37254 -90007 -2187764 -1466162 543554 1618287 1855666 2015233 1156763 -1462614 -3911573
37245 -3911573 -3963374 -2734494 -2862699 -3884531 -2848350 563542 3028221 2508018 1100838
37236 1100838 1519445 3232216 3977410 3257440 2257779 1501327 649510 9376 333110
37227 333110 1261547 1564384 1032972 744356 1130211 1055666 -498553 -2740135 -3907552
37218 -3907552 -3332561 -1893281 -715395 -234580 -449745 -1197994 -1880941 -1642748 -360653
37209 -360653 953719 1225714 490796 -383071 -739286 -428285 441131 1315622 1152530
37200 1152530 -488033 -2407371 -2750232 -1128441 977241 1979420 1617918 671034 88970
37191 88970 418665 1180666 864688 -1318233 -3648765 -3311427 1985 3378423 4243829
37182 4243829 3113463 1810667 599017 -1199007 -2912311 -3042789 -1748469 -815685
37174 -815685 -990911 -1056244 -33488 1178613 1205716 240181 -254300 551344 1907755
37165 1907755 2346148 1265306 -217839 -190547 1795054 3615666 2610192 -1195486 -4832522
37156 -4832522 -5680205 -4092911 -2241568 -1356917 -1114287 -1015550 -1003448 -850363 -250000
37147 -250000 249629 -428583 -2173220 -3369244 -2970675 -1856096 -1201432 -575215 905067
37138 905067 2337071 1928636 -56443 -1358277 -1077905 -826502 -1664684 -2081533 -603033
37129 -603033 1416356 1695170 439273 -353921 -57986 427663 917707 1739753 1766055
37120 1766055 -388108 -3116045 -2959967 192141 2202344 508358 -2079252 -1693541
37112 -1693541 910306 1964761 402436 -1335460 -1599177 -1385106 -1563344 -1175306 286956
37103 286956 1094653 -439182 -3082617 -3900648 -2022041 311069 675498 -734351 -1888678
37094 -1888678 -1655816 -669332 211139 946671 1488482 1197486 -46073 -1183762 -1459432
37085 -1459432 -1539519 -1916961 -1448186 605503 2213709 968341 -1691522 -1856529 1020622
37076 1020622 3114050 2061858 266017 384046 847059 -1092382 -4312638 -5396412
37068 -5396412 -3791404 -1861621 -593582 1202645 3507571 4317920 2981738 1554233
37060 1554233 1738122 2562501 2241847 751922 -548757 -760700 -22044 1012319 1690816
37051 1690816 1803766 1583039 913909 -815477 -3189493 -4017094 -1787741 1651572 2894502
37042 2894502 1405192 63803 907275 2421420 2083115 -57974 -1745167 -1562586 -325436
37033 -325436 321849 -161290 -857264 -798881 -487136 -1362955 -3473639 -4666944 -3139570
37024 -3139570 -65361 1617406 632189 -1626314 -3088796 -2811895 -1263212 -28372
37016 -28372 -602255 -2215628 -1929298 1327465 4091213 2415091 -2224050 -4342391 -1732602
37007 -1732602 2089706 3355007 2526439 1935209 2038693 2068109 2019574 1856690 522370
36998 522370 -2321527 -5025073 -5963145 -5345033 -3887345 -1736115 -29564 -914976 -3931920
36989 -3931920 -5031010 -1996305 1615133 1455932 -832971 -268824 3283381 4733006
36981 4733006 1839312 -1431067 -1299214 537204 762374 -4136 837170 2684149 2584549
36972 2584549 415009 -595335 1182196 3465569 3695125 2413018 1515840 1134495 254841
36963 254841 -792747 -727957 191501 248638 -906583 -1487209 -424684 721682 -15338
36954 -15338 -2202433 -3957036 -4708025 -5236018 -5639807 -5278370 -4518857 -4499124 -5006656 -4582024
36944 -4582024 -3103248 -2234693 -2626036 -2689644 -1215460 634679 1208409 592182 -380021
36935 -380021 -1721383 -3328547 -3941085 -2889326 -1637725 -1713696 -2215178 -1338416 639065
36926 639065 2006508 2366798 2518865 2357132 1291109 228861 610255 1714722 1472871
36917 1472871 -122028 -1024000 -626023 -458945 -1015883 -786696 686909 1598653 931538
36908 931538 106570 157758 -179318 -1818039 -3207991 -2965237 -2378046 -2876285 -3044801
36899 -3044801 -1040518 1602004 1829262 -160479 -1251429 -176760 1191996 1420796
36891 1420796 1294292 1393448 784398 -680049 -1211390 164213 1603897 972570 -976394
36882 -976394 -1750314 -615847 789221 1034036 553501 500275 996423 1137273 402669
36873 402669 -525581 -690754 -323503 -510988 -1168593 -597327 1874656 3985199 3099649
36864 3099649 5606 -2048106 -1870499 -1374535 -1826070 -1867597 -430067 1010737 933394
36855 933394 389120 918048 1546232 352558 -2132142 -3661326 -3723795 -3746307 -4120735
36846 -4120735 -3442077 -952254 2164220 4246719 4516921 3044110 793992 -500617
36838 -500617 6029 1071764 1244092 1155390 2020111 2781397 1472781 -1018159 -1629792
36829 -1629792 283277 2096426 2086501 1325588 729826 -411078 -1803435 -1518263 334658
36820 334658 731367 -1334153 -2485562 -272756 2500297 2249627 435424 664743 2272897
36811 2272897 1676009 -1127154 -2472081 -1295445 -725453 -2668586 -4923937 -4939680 -3094785
36802 -3094785 -1004285 553904 955294 -291389 -1879394 -1619165 140810 702094 -625549
36793 -625549 -1412794 -408566 357877 -607319 -1560360 -748894 605025 987703 1490316
36784 1490316 3157873 3942221 1757522 -1241921 -1231478 1363495 2262300 -400228 -3549083
36775 -3549083 -3620054 -925428 1518628 1789651 601170 -70389 757798 1987343 1842438
36766 1842438 496849 127730 1595917 2664194 1091950 -1947719 -3655674 -3598693 -3318581
36757 -3318581 -2831885 -760687 2018139 2291851 -730563 -3441873 -2502392 652843 2238175
36748 2238175 1583528 1462483 3299993 4753677 3126087 -546436 -2579127 -1320325
36740 -1320325 994061 1537582 578549 544659 2235169 3834357 3771400 2723525 2030799
36731 2030799 1677603 1013201 292588 127780 180059 -272429 -960936 -1002969 -317849 316539
36721 316539 356425 -60411 -365753 204727 1904047 3561669 3429936 1467984 -575772
36712 -575772 -1956219 -3862419 -6416505 -7106188 -4384536 -819653 157784 -855586 -742417
36703 -742417 861874 1407457 160263 -628297 260325 1150179 531320 -839034 -1833759
36694 -1833759 -2403332 -2296581 -934816 517119 -338464 -3311326 -4900373 -2896407 606896
36685 606896 2333846 1755262 349572 -829960 -1103496 177275 1987044 1615479 -1675507
36676 -1675507 -4827355 -4918501 -3151432 -2669236 -4044498 -5342969 -5240324 -3668173 -737139
36667 -737139 2487002 3484256 1259435 -1347632 -1063027 1321558 2811908 3222077 4589099
36658 4589099 6414063 5835227 2778375 693434 1118126 1386252 -676164 -3304717 -4096546
36649 -4096546 -3696292 -3803530 -4033075 -3306773 -2345957 -2241453 -2184950 -1033845 361734
36640 361734 777110 1058227 2339912 3209902 1671250 -1036977 -1867566 -746931 -487682
36631 -487682 -1872153 -2479473 -1262614 -648354 -2250106 -3691043 -2385151 -57496 -189961
36622 -189961 -2361040 -2711057 165125 3123315 3042832 785859 -797219 -761810 -158787
36613 -158787 444515 1464093 2683235 2917489 1680675 150703 -11050 1631445 3883780
36604 3883780 4849517 3359446 59429 -2838899 -3402341 -1783711 59625 418121 -757581
36595 -757581 -2364239 -3410085 -3581640 -3106645 -2439497 -1844195 -1143428 -186474 464166
36586 464166 11034 -1136226 -1245238 629717 3029920 3699027 2559283 1712911 2200736
36577 2200736 2296183 188677 -2744958 -3264085 -748059 1638745 1079543 -1279359 -2361990
36568 -2361990 -1583404 -1044849 -1710897 -1935250 -480669 1285611 1701692 1528229 2364055
36559 2364055 3602389 3348493 1761021 930724 1414431 1439677 126679 -1013627 -960934
36550 -960934 -1206556 -3066420 -4893272 -4334432 -2089940 -760443 -578158 828671 4166807
36541 4166807 6726442 6062357 3359929 1539197 1384709 1305868 186674 -1278812 -1987758
36532 -1987758 -1746747 -926881 175596 1244503 1941616 2418843 3285708 4622731 5473680
36523 5473680 4897100 3292505 2037675 1787538 1760440 962084 -461379 -1579851 -1932047
36514 -1932047 -1729831 -1104818 -57135 848989 734618 -336012 -1271804 -1602672 -2228273
36505 -2228273 -3737630 -4940485 -4326050 -2418905 -1239196 -1552855 -2072805 -1582437 -531311
36496 -531311 -52657 -520101 -1669742 -3149125 -4234640 -3914069 -2131769 -251975 608343
36487 608343 1051723 2165891 3391195 2998188 594516 -2214079 -3955611 -4820002 -5423663
36478 -5423663 -5229622 -3459229 -1028359 -41401 -1028399 -1902129 -574540 2105950 3313860
36469 3313860 2073862 692613 1595106 3844316 4291365 1854874 -1011599 -1569797 -90873
36460 -90873 1083166 748705 -234893 -759460 -778824 -698139 -591199 -396369 -103566 539112
36450 539112 1747370 2854570 2634879 1001300 -470800 -513634 65204 -325661 -1502174
36441 -1502174 -1721714 -560774 41149 -1417893 -3325441 -2709495 568938 3069699 1902735
36432 1902735 -1608261 -3626767 -2612166 -917719 -1306333 -3226272 -3697760 -1381743
36424 -1381743 1593237 2271697 456499 -1231097 -678790 1272522 2178075 1109035 -601969
36415 -601969 -1624698 -2235854 -2848629 -2229873 937614 5065970 6510511 4164235 1233905
36406 1233905 999855 2453463 2245924 -120609 -1716527 -676796 1353089 1974991 1062468
36397 1062468 -92818 -866123 -1126706 -349744 1547333 3339150 3792673 3171765 2387066
36388 2387066 1466686 26469 -1537234 -2562921 -3151584 -3573282 -3494438 -2963913 -3072621
36379 -3072621 -4124106 -4322151 -2225293 556041 1474718 1000830 1645348 3490438 3957580
36370 3957580 2312298 1040305 1674805 2336333 1049874 -1124729 -2179397 -2195820 -2400081
36361 -2400081 -3094902 -4277543 -6279012 -7941738 -6491802 -1662397 2267636 1541136
36353 1541136 -1825854 -3190485 -2048675 -1690967 -3108385 -3773917 -2635886 -1903043 -2766429
36344 -2766429 -3285951 -2171482 -1123434 -1333328 -903410 1552346 3429106 1554907 -2567353
36335 -2567353 -4278945 -1835979 1924765 3773302 3366991 2127345 1070847 478102
36327 478102 222210 -280483 -1503939 -2809140 -2829341 -1158476 1017173 2199317 1991268
36318 1991268 1189815 959143 1898820 3469415 4359016 3744429 2055537 308355 -845582
36309 -845582 -1071765 -130016 1445831 2007495 324816 -2595762 -4294819 -3668493 -2065797
36300 -2065797 -1205733 -927517 93323 1839975 2417976 544288 -2240331 -2997147 -1037189
36291 -1037189 1031039 541552 -1928305 -3627078 -3324660 -2394851 -2336463 -2880028 -3038566
36282 -3038566 -2645523 -2062990 -1407525 -889189 -1096413 -2136379 -3102497 -3042075 -1930632
36273 -1930632 -311779 1289580 2262878 2204451 1789596 2272025 3525828 3784236 2096425
36264 2096425 -219581 -1529443 -1961131 -2344941 -2460773 -1930840 -1656183 -2456666 -3168427
36255 -3168427 -2155586 -123108 712805 -70974 -801606 -593274 -256701 -120685 708690
36246 708690 2221721 2800177 1711781 453015 284691 26888 -2010830 -4935576 -5899725
$$ [...]
##END NTUPLES=NMR SPECTRUM
##END=
