##TITLE=31Pdec_4C1011RSA
 CDCl3, 24 sc
 17.11.2021
##JCAMPDX= 6.0         $$ Bruker NMR JCAMP-DX V2.0
##DATA TYPE= NMR SPECTRUM
##DATA CLASS= NTUPLES
##ORIGIN= UXNMR, Bruker Analytische Messtechnik GmbH
##OWNER= root
$$ XWIN-NMR		Version 3.5
$$ Wed Nov 17 10:55:04 2021 Russian Standard Time (UT+4h)  she@DPX200
##.OBSERVE FREQUENCY= 81.013821
##.OBSERVE NUCLEUS= ^31P
##.ACQUISITION MODE= SIMULTANEOUS
##.ACQUISITION SCHEME= undefined
##.AVERAGES= 24
##.DIGITISER RES= 16
##SPECTROMETER/DATA SYSTEM= spect
##.PULSE SEQUENCE= zgpg30
##.SOLVENT NAME= CDCl3
##.SHIFT REFERENCE= (INTERNAL, CDCl3, 0, 248.564)
##AUDIT TRAIL= $$ (NUMBER, WHEN, WHO, WHERE, WHAT)
$$ ##TITLE= Audit trail, XWIN-NMR		Version 3.5
$$ ##JCAMPDX= 5.01
$$ ##ORIGIN= Bruker BioSpin GmbH
$$ ##OWNER= she
$$ F:/spectra/data/she/nmr/P31/1/pdata/1/auditp.txt
$$ ##AUDIT TRAIL=  $$ (NUMBER, WHEN, WHO, WHERE, WHAT)
(   1,<2021-11-17 10:54:05.60 +0400>,<she>,<DPX200>,
      <created by zg, POWCHK disabled, PULCHK disabled
       configuration hash MD5:
       00 E9 B6 7A A2 85 ED C7 34 08 36 98 17 FE 4E 26
       data hash MD5: 32K
       DB 73 73 D7 7D 54 98 7B 35 0A 0A D0 12 7C 59 4D>)
(   2,<2021-11-17 10:54:10.09 +0400>,<she>,<DPX200>,
      <Start of raw data processing
       efp BC_mod = 2 LB = 1 FT_mod = 6 PKNL = 1 PHC0 = -9212.853 PHC1 = 149.2695 SI = 64K 
       data hash MD5: 64K
       0B 0D 93 A6 41 8E 4B D6 A7 83 09 5A 3C 2F DC C8>)
(   3,<2021-11-17 10:54:26.98 +0400>,<she>,<DPX200>,
      <pk PHC0 = 9.345913 PHC1 = 0 
       data hash MD5: 64K
       62 9A CE 85 F7 6C C4 2D FA 36 BC F9 3F 2A E4 2A>)
(   4,<2021-11-17 10:54:29.50 +0400>,<she>,<DPX200>,
      <abs ABSG = 5 
       data hash MD5: 64K
       63 D7 CD 4F DB BD 62 CB DC D3 46 1C 4F 31 DE 72>)
$$ ##END=
$$ 
$$ hash MD5
$$ EF 3F FD 7E DD 73 C2 62 FD 3B F2 F5 6B 99 E7 7C
##$RELAX= 
##$RELAX= 
##$RELAX= 
##$RELAX= 
##$RELAX= 
##$RELAX= 
##$RELAX= 
##$RELAX= 
$$ Bruker specific parameters
$$ --------------------------
##$DU= <F:/spectra>
##$EXPNO= 1
##$NAME= <P31>
##$PROCNO= 1
##$TYPE= <nmr>
##$USER= <she>
##$AMP= (0..31)
100 100 100 100 100 100 100 100 100 100 100 100 100 100 100 100 100 100 
100 100 100 100 100 100 100 100 100 100 100 100 100 100 
##$AQSEQ= 0
##$AQ_mod= 1
##$AUNM= <au_zg>
##$AUTOPOS= <>
##$BF1= 81.014009
##$BF2= 200.13
##$BF3= 200.13
##$BF4= 200.13
##$BF5= 200.13
##$BF6= 200.13
##$BF7= 200.13
##$BF8= 200.13
##$BYTORDA= 1
##$CFDGTYP= 0
##$CFRGTYP= 5
##$CHEMSTR= <none>
##$CNST= (0..31)
1 1 145 1 1 1 1 1 1 1 1 1 1 1 1 1 1 1 1 1 1 1 1 1 1 1 1 1 1 1 1 1 
##$CPDPRG= <waltz16>
##$CPDPRG1= <>
##$CPDPRG2= <waltz16>
##$CPDPRG3= <>
##$CPDPRG4= <mlev>
##$CPDPRG5= <mlev>
##$CPDPRG6= <mlev>
##$CPDPRG7= <mlev>
##$CPDPRG8= <mlev>
##$CPDPRGB= <>
##$CPDPRGT= <>
##$D= (0..31)
0 1 0 0 0 0 0 0 0 0 0 0.03 2e-05 3e-06 0 0 0 0 0 0 0 0 0 0 0 0 0 0 0 0 
0 0 
##$DATE= 1637132045
##$DBL= (0..7)
120 120 120 11 120 120 24 19 
##$DBP= (0..7)
150 150 150 150 150 150 150 150 
##$DBP07= 0
##$DBPNAM0= <>
##$DBPNAM1= <>
##$DBPNAM2= <>
$$ [...]
##$SUBNAM3= <"">
##$SUBNAM4= <"">
##$SUBNAM5= <"">
##$SUBNAM6= <"">
##$SUBNAM7= <"">
##$SUBNAM8= <"">
##$SUBNAM9= <"">
##$SW= 501.771253377433
##$SWIBOX= (0..15)
0 1 3 0 0 0 0 0 0 0 0 0 0 0 0 0 
##$SW_h= 40650.406504065
##$TD= 32768
##$TD0= 1
##$TE= 0
##$TE2= 300
##$TE3= 300
##$TEG= 300
##$TL= (0..7)
0 120 53 12 22 120 120 120 
##$TP= (0..7)
150 150 150 150 150 150 150 150 
##$TP07= 0
##$TPNAME0= <>
##$TPNAME1= <>
##$TPNAME2= <>
##$TPNAME3= <>
##$TPNAME4= <>
##$TPNAME5= <>
##$TPNAME6= <>
##$TPNAME7= <>
##$TPOAL= (0..7)
0.5 0.5 0.5 0.5 0.5 0.5 0.5 0.5 
##$TPOFFS= (0..7)
0 0 0 0 0 0 0 0 
##$TUNHIN= 0
##$TUNHOUT= 0
##$TUNXOUT= 0
##$USERA1= <user>
##$USERA2= <user>
##$USERA3= <user>
##$USERA4= <user>
##$USERA5= <user>
##$V9= 5
##$VALIST= <valist>
##$VCLIST= <CCCCCCCCCCCCCCC>
##$VD= 0
##$VDLIST= <DDDDDDDDDDDDDDD>
##$VPLIST= <PPPPPPPPPPPPPPP>
##$VTLIST= <TTTTTTTTTTTTTTT>
##$WBST= 1024
##$WBSW= 4
##$XGAIN= (0..3)
0 0 0 0 
##$XL= 0
##$YL= 0
##$YMAX_a= 3282
##$YMIN_a= -3252
##$ZGOPTNS= <>
##$ZL1= 120
##$ZL2= 120
##$ZL3= 120
##$ZL4= 120
##$ABSF1= 248.5645
##$ABSF2= -253.2056
##$ABSG= 5
##$ABSL= 3
##$ALPHA= 0
##$AQORDER= 0
##$ASSFAC= 0
##$ASSFACI= 0
##$ASSFACX= 0
##$ASSWID= 0
##$AUNMP= <proc_1d>
##$AZFE= 0.1
##$AZFW= 0.5
##$BCFW= 0
##$BC_mod= 2
##$BYTORDP= 0
##$COROFFS= 0
##$CY= -3
##$DATMOD= 1
##$DC= 0
##$DFILT= <>
##$DTYPP= 0
##$F1P= 0
##$F2P= 0
##$FCOR= 1
##$FTSIZE= 65536
##$FT_mod= 6
##$GAMMA= 0
##$GB= 0
##$INTBC= 1
##$INTSCL= 5.30512e-09
##$ISEN= 30
##$LB= 1
##$LEV0= 0
##$LPBIN= 0
##$MAXI= 10000
##$MC2= 0
##$MEAN= 0
##$ME_mod= 0
##$MI= 50
##$NCOEF= 0
##$NC_proc= -8
##$NLEV= 6
##$NOISF1= 182.463
##$NOISF2= 159.3651
##$NSP= 0
##$NTH_PI= 0
##$NZP= 0
##$OFFSET= 248.5645
##$PC= 4
##$PHC0= -9203.507
##$PHC1= 149.2695
##$PH_mod= 1
##$PKNL= yes
##$PPARMOD= 0
##$PSCAL= 0
##$PSIGN= 0
##$REVERSE= no
##$SF= 81.014009
##$SI= 65536
##$SIGF1= 159.3651
##$SIGF2= -187.1042
##$SINO= 113.3802
##$SIOLD= 16384
##$SREGLST= <1H.CDCl3>
##$SSB= 0
##$STSI= 65536
##$STSR= 0
##$SW_p= 40650.406504065
##$SYMM= 0
##$S_DEV= 0
##$TDeff= 32768
##$TDoff= 0
##$TI= <>
##$TILT= no
##$TM1= 0
##$TM2= 0
##$TOPLEV= 0
##$USERP1= <user>
##$USERP2= <user>
##$USERP3= <user>
##$USERP4= <user>
##$USERP5= <user>
##$WDW= 1
##$XDIM= 65536
##$YMAX_p= 483954836
##$YMIN_p= -83594413
$$ End of Bruker specific parameters
$$ ---------------------------------
##NTUPLES= NMR SPECTRUM
##VAR_NAME=  FREQUENCY,     SPECTRUM/REAL,   SPECTRUM/IMAG
##SYMBOL=    X,             R,               I
##VAR_TYPE=  INDEPENDENT,   DEPENDENT,       DEPENDENT
##VAR_FORM=  AFFN,          ASDF,            ASDF
##VAR_DIM=   65536,         65536,           65536
##UNITS=     HZ,            ARBITRARY UNITS, ARBITRARY UNITS
##FACTOR=    0.620285442955139, 1,           1
##FIRST=     20137.2065510759, 0,            0
##LAST=      -20513.1999529892, 0,           0
##MIN=       -20513.1999529892, -83594413,   0
##MAX=       20137.2065510759, 483954836,    0
$$ Real data points
##PAGE= N=1
##DATA TABLE= (X++(R..R)), XYDATA
$$ [...]
42315 1299390 2136726 2456613 440663 -2690266 -4451142 -4860919 -5543891 -5788050 -3021140
42306 -3021140 2292834 5558328 3518699 -1367009 -3860005 -1967747 1538790 2866488
42298 2866488 1159699 -1019657 -490109 3083891 6500410 6470279 3613577 1722810 2819888
42289 2819888 4600496 3760739 404221 -2478269 -3049708 -2167076 -981134 867541 3596517
42280 3596517 5337646 3761902 -568061 -4178788 -4557363 -2764199 -1402928 -1258587
42272 -1258587 -1358561 -1463639 -2485203 -4422691 -5722972 -5240463 -3489783 -1530953 4682
42263 4682 372549 -1105419 -3481234 -4412092 -3058837 -1281465 -746385 -435228 1390494
42254 1390494 4272050 6568132 8059328 9263170 9326826 7383268 5230488 5372280 6495221
42245 6495221 4596482 -467121 -3331948 -230688 5416745 7709755 6290346 5624963
42237 5624963 7277042 7570306 3989329 -192355 -470715 2187238 2669452 -999719 -4940899
42228 -4940899 -4639130 -554937 2829645 2330200 -909693 -3299093 -2779116 -715240 141937
42219 141937 -657460 -761345 972608 1642958 -1930858 -7489688 -9239257 -6128988 -3890183
42210 -3890183 -6428024 -9382870 -6576228 171526 3325892 493347 -3040990 -3040464 -1661614
42201 -1661614 -2082785 -3052086 -2127690 -374926 12240 -79131 1252626 2719504 1660983
42192 1660983 -1185329 -2523343 -1557080 -695043 -1146021 -1018739 1347208 4520890 5678498
42183 5678498 3955236 1191927 -360323 -864794 -3035029 -8366121 -13505927 -12884157
42175 -12884157 -6034084 398208 250832 -4612545 -7149424 -4029632 1416217 4337915
42167 4337915 3384345 617518 -1136523 -549033 1156658 1666952 837389 886964 2199389
42158 2199389 1724497 -1990390 -5301349 -4798531 -3222879 -5001040 -8245733 -7577608 -3680377
42149 -3680377 -2677727 -5646459 -6559734 -2744334 379818 -1184932 -2997046 -210667
42141 -210667 3427190 1513417 -4384199 -7418126 -5971865 -3973583 -2359820 1817327
42133 1817327 7548376 8733134 3035708 -4086109 -6826974 -5702747 -4245845 -3568598
42125 -3568598 -3346869 -4398841 -6668671 -7395345 -4770361 -1394982 -933654 -3011018 -4476914
42116 -4476914 -4340771 -4368649 -5692293 -7691146 -9635817 -10839990 -9761778 -5670628 -990201
42107 -990201 647483 -1129110 -3146668 -3073685 -1963020 -2021510 -3669630 -5236505 -4226919
42098 -4226919 834840 8031587 12048194 9145079 2203508 -1911272 -362230 3206433
42090 3206433 4772600 4925444 6120045 8307352 9830625 10110186 8923685 5481891
42082 5481891 917813 -946146 1307463 3328943 875951 -3122366 -2539489 2167206
42074 2167206 4168476 565617 -3587919 -3370085 -532176 1026527 1484253 2711788
42066 2711788 3290707 665853 -3716618 -5831458 -4712904 -2926180 -1896797 -271550
42058 -271550 2832738 5875217 7081473 6785981 6710414 7662974 8376070 6811861 3212136
42049 3212136 1122800 3219782 6402627 4641982 -2193441 -6538774 -2874523 4623194
42041 4623194 8144986 6634291 4966731 5125957 4526606 2725914 3410605 7929813 11737669
42032 11737669 9925094 3241492 -3445927 -6361047 -5009260 -1331161 1911549 3353719
42024 3353719 4220344 6009252 7551670 6659066 3976811 2102209 1311496 -228733 -2138762
42015 -2138762 -1839368 651318 2145933 1356681 267617 -533807 -3080580 -6894084 -7724290
42006 -7724290 -4166164 -859157 -1771763 -4600863 -5508521 -5152383 -5593684 -5157682 -1704398
41997 -1704398 1971759 1712517 -1010627 -1248243 1597894 3554495 2900871 1800271 1260404
41988 1260404 -306931 -2950922 -4286779 -3607968 -2869765 -2935528 -2806463 -3131211 -6189803
41979 -6189803 -11311823 -14444013 -13745861 -11818427 -10826289 -9255089 -5599432 -1786823
41971 -1786823 -372029 -938564 -1502391 -1169424 433934 3795633 7506611 8097643 4283268
41962 4283268 -566821 -2326013 -682442 2012732 4334137 6030341 6632335 6207286
41954 6207286 5993760 6252902 5215052 2290234 363421 2185044 6000823 7633984
41946 7633984 5854462 2987701 1091308 211295 -154779 -277605 -425745 -37917 2209681
41937 2209681 5497489 5839006 992255 -5197515 -7161722 -5224307 -4415443 -6045545
41929 -6045545 -5637964 -497219 5507278 7372109 5588918 4295641 5300749 6951082
41921 6951082 7362911 6189319 4139999 2567774 2566009 3327684 2921715 1601271 1909509
41912 1909509 4080862 4503693 1415327 -995416 1797432 7121319 8029535 2952940
41904 2952940 -2389530 -2948805 236747 3332105 4073994 1494805 -4423585 -10504443
41896 -10504443 -11447697 -6063190 300417 2228008 449897 -1241908 -2269903 -4419183
41888 -4419183 -6907669 -7176512 -5872289 -6363348 -9032922 -10287715 -8058961 -4403938
41880 -4403938 -1551652 646055 1609395 -1387123 -8307952 -13306860 -10829268 -3147164
41872 -3147164 2233601 1918213 -604869 -1455045 -1279785 -2153029 -3232384 -2483759 -698468
41863 -698468 -507059 -1987157 -2252527 131317 2826996 3026344 1150504 -504917 -1438737
41854 -1438737 -2867399 -4481812 -4077551 -1199803 1264642 803562 -1147902 -1429740 188939
41845 188939 947966 -717230 -3168472 -3881197 -2009487 1417405 4228937 4200375 1255147
41836 1255147 -1599852 -1583461 -23219 -322778 -2454605 -3184466 -2159117 -3118187 -7087087
41827 -7087087 -9140198 -5656650 -779040 -582553 -3647754 -3479787 996744 3950602
41819 3950602 2192841 -179291 889996 2800391 832525 -4383126 -8189562 -8533866
41811 -8533866 -7180901 -5351378 -2084667 2707381 6536530 6923653 4288316 1423207
41803 1423207 726656 2268592 4166778 4637129 3528214 1618079 -896711 -3887873
41795 -3887873 -5695421 -4327454 -908606 442552 -2218249 -5551294 -5153390 -1474515
41787 -1474515 1098297 431260 -868356 461060 4063664 6865741 6782288 4291415 1107989
41778 1107989 -1411624 -2536400 -1885778 218937 2223478 2202833 23479 -2023472 -1788162
41769 -1788162 164208 1938539 3495993 6143714 9103106 9670463 7600924 6160712
41761 6160712 7146311 7902693 5700115 2239584 685149 699737 179985 -197203 1329717
41752 1329717 2860394 993980 -2784848 -3485152 -823647 -75198 -3009922 -4184430
41744 -4184430 214639 5355331 4659269 -397855 -3200295 -1883149 -29901 899413
41736 899413 3051979 6030245 5886013 1989309 -821420 403543 2162581 583151
41728 583151 -2338300 -2741495 -1604324 -2504317 -5009809 -5567857 -3872329 -3112369 -3947734
41719 -3947734 -3284269 67891 3129767 3657068 3127384 2977719 1972033 -280323 -1305671
41710 -1305671 -476978 -1745924 -7400422 -12611081 -11562889 -6355544 -3532796 -3505173 -882401
41701 -882401 4704619 6369246 1076570 -4548860 -3964420 18187 1354717 991688 3922586
41692 3922586 9233513 10687695 6363550 1031248 -1287680 -1281055 -215076 2585246 6582527
41683 6582527 9015165 8833076 7872614 6845301 4098106 -290779 -3345934 -3932637 -4621280
41674 -4621280 -6664999 -7135049 -3886871 161357 1003790 -901240 -2128530 -1072085
41666 -1072085 1454850 4127353 5101864 2597933 -1843011 -3265596 613780 5756375
41658 5756375 7241758 5602203 4279370 3688231 2190736 616892 863162 1497346 -285893
41649 -285893 -3309546 -3940908 -2392877 -2512134 -5263780 -7172844 -5669114 -1677254 3339512
41640 3339512 8417906 10875647 8000680 2009719 -1337741 -350835 957525 176343
41632 176343 242694 3374933 6097495 4038716 -1592558 -5769660 -5581076 -1886616 2586483
41623 2586483 4708142 3068940 487677 1566620 6166482 8874845 6798152 3514558
41615 3514558 2567411 1870839 -1312453 -4347375 -3545756 -1014319 -1248600 -3391802 -3054981
41606 -3054981 -110666 1772820 2439697 5316170 9933819 11124511 7333599 3755035
41598 3755035 4585970 7182950 7045233 4452154 2559476 1954984 824500 -1259103 -2920535
41589 -2920535 -3467082 -3456727 -3272061 -2582616 -803863 2404914 6113714 7663311 5222256
41580 5222256 1023882 -514495 1399584 2943072 1779474 808915 3252941 6841656
41572 6841656 6691656 2630459 -336402 953712 3715228 3470360 133764 -2223698
41564 -2223698 -973960 1688167 1825897 -743802 -1898630 1171035 5616454 6419449
41556 6419449 3357963 1363869 3362284 5941137 4194985 -1412174 -5788527 -5651888
41548 -5651888 -2466484 668114 2379314 2841437 2541116 2387245 3540140 5775317 6935659
41539 6935659 5455824 2990451 2832545 5274766 6114919 1341816 -7214747 -12775935
41531 -12775935 -10740788 -3573345 2357146 3655392 2213470 1416703 2011183 2247247
41523 2247247 931136 -686281 -206648 2854211 5787761 5379883 1873447 -1050538
41515 -1050538 -640684 2115446 4707394 6114067 6213363 4294171 440354 -3100264 -4332719
41506 -4332719 -4091449 -4015272 -3689650 -2617249 -3001823 -6558370 -10030207 -8774485 -4220161
41497 -4220161 -2318468 -4181769 -4168093 871801 6120457 5827763 1193784 -2679682 -4098422
41488 -4098422 -4873606 -5765455 -5931443 -5257798 -3926974 -1253038 2209849 3375698 572128
41479 572128 -3001914 -2946245 688796 4264723 5380789 4013005 838310 -2337913 -2378252
41470 -2378252 1494465 5486649 5995768 4428448 3579101 1952437 -3151285 -9001838
41462 -9001838 -10204462 -7510369 -7472523 -12513625 -17079638 -15287080 -7643227 1282889
41454 1282889 7359292 7762057 2222759 -4554234 -6050732 -1672800 2510035 2380798
41446 2380798 634229 969065 2402895 2599282 2402245 3177385 3388720 1892825 1298950
41437 1298950 3689963 5892480 3742701 -1065487 -3130056 -893226 2428191 4400252
41429 4400252 5434034 5749013 4420971 1734684 -677581 -2180863 -3131088 -2973557 -825158
41420 -825158 2677241 6331749 9941255 12583436 11389073 5523346 -439379 -1297968
41412 -1297968 1877589 3899337 3219691 2587035 2838279 1758739 -655693 -1472419 -251379
41403 -251379 272739 30837 2229338 6285261 6460299 751187 -4749537 -4574311 -1618022
41394 -1618022 -1126023 -1809137 762257 5462347 7330244 6106733 6132250 8268967 8572328
41385 8572328 5769557 3991301 5960978 8208511 5840397 -933617 -7303996 -8957688
41377 -8957688 -5452450 -331820 1561919 -1117259 -4044519 -2299978 2644836 4508716
41369 4508716 1161008 -2166791 -426449 4223375 5852537 2680979 -1622323 -3239294
41361 -3239294 -2000837 -306218 -234939 -1750026 -2869204 -1965536 -112780 40250 -1935116
41352 -1935116 -3291486 -1810197 1150147 2466141 877278 -2189782 -4353360 -4089532
41344 -4089532 -1787054 691485 2493971 5218321 9803680 12845948 9786360 2278001
41336 2278001 -1865239 1904469 8975729 11524006 7318706 131042 -5540174 -7181808
41328 -7181808 -4580446 -824730 -693836 -4869590 -8095655 -6153012 -1714797 426780
41320 426780 541620 1360868 1412150 -2520342 -7893802 -8369086 -3251766 1483168 2209306
41311 2209306 1423686 1362705 259706 -2663789 -4143713 -1874757 1958747 4854037 7389900
41302 7389900 9886853 10113966 7318957 4429456 3209123 1314931 -2660647 -5548831
41294 -5548831 -4789986 -3091938 -3549719 -4006737 -1309745 2175497 1975866 -995422 -2241950
41285 -2241950 -1436560 -2389934 -5714842 -7183193 -4166540 744311 3621332 3465362 2023577
41276 2023577 1935644 4965792 9731042 12000995 9719856 6177507 5167126 5154961 2469619
41267 2469619 -1723016 -3041244 -1427343 -1116586 -3000856 -2995468 833452 4991801 6154644
41258 6154644 5192773 3779809 1654962 -629436 -719842 1352456 2136795 388149 -392404
41249 -392404 2168873 4946878 4164566 1060249 -888999 -1295297 -1595929 -1119392 1448093
41240 1448093 4383337 4535281 1672026 -1662408 -3553577 -3594711 -1862855 502102 1136173
41231 1136173 -834286 -3384100 -4741330 -5792079 -7289339 -7421986 -4950755 -2034206
41223 -2034206 -737663 443012 2867573 3602816 -206206 -5263133 -5989019 -2918425
41215 -2918425 -1347265 -2423703 -1948933 1574335 4103050 3050807 1553847 3093285
41207 3093285 6236637 7466142 5815542 2512040 -728270 -1305329 2605106 7954520
41199 7954520 8432433 2845472 -2207143 -1526419 780105 -2577726 -10789417 -15431370
41191 -15431370 -11466781 -2712532 4143557 6773825 7091346 7039859 6640025 5070388 2342752
41182 2342752 -155661 -1021593 -872342 -1811199 -4085294 -4951184 -2462217 1164100 2113514
41173 2113514 -208286 -3156720 -4677970 -4760557 -3886103 -2710941 -2830842 -5068297 -7096325
41164 -7096325 -5622699 -1271178 1502734 169957 -2658522 -2830668 614058 5355699
41156 5355699 8458937 7946252 3648360 -1846646 -4444181 -2502925 1128165 2386090
41148 2386090 789915 -342156 1608975 4938847 5156907 155119 -6690922 -9573881
41140 -9573881 -6643467 -2014526 -533946 -2209015 -3635618 -3323338 -2647388 -2307986 -1335369
41131 -1335369 170102 693066 508658 1979428 5315312 7069369 4678247 -44013
41123 -44013 -3745192 -5413429 -5561194 -4098308 -1297889 1390673 3767241 7663399 12669439
41114 12669439 13815986 7353509 -2894388 -9046269 -8239502 -4506617 -2250103 -1890159
41106 -1890159 -2220601 -3159401 -4712657 -5778000 -5436089 -4108002 -2924997 -2960419 -4682930
41097 -4682930 -6917304 -7337235 -5586228 -4357961 -5193131 -5324679 -2118729 1320506 -234101
41088 -234101 -5699119 -8078452 -3752505 3476229 8570432 10657327 10623580 8062682 3383987
41079 3383987 -508792 -1314428 306434 2899074 5774246 7358203 5848614 3047698
41071 3047698 3306925 6672480 7725342 3930410 167177 1149905 4154245 4286390 2833777
41062 2833777 4226690 7467366 7239098 2571532 -1559477 -1378876 1722597 4506675
41054 4506675 5013281 2358644 -2645747 -6485150 -5977342 -2344968 623952 1695204
41046 1695204 2251605 2504312 1659853 902370 1837324 2671303 585553 -2632769 -2464645
41037 -2464645 963031 2981623 2409457 3374403 7312076 9187454 5102726 -1179471
41029 -1179471 -3519985 -1858459 -1160100 -3885865 -7239082 -7195348 -2835763 2956391 5971845
41020 5971845 4622487 1752345 1232369 3200569 4971459 5857771 7356100 8731824
41012 8731824 7149630 3163779 1138241 2302854 2326130 -1442631 -5142184 -4568295 -1939444
41003 -1939444 -1980260 -4589992 -6243284 -6133645 -5940029 -5323386 -2751915 169972 107440
40994 107440 -2443058 -3409776 -1356936 402704 -1241711 -5185352 -8006761 -7670141 -4720710
40985 -4720710 -1511393 -437027 -1540232 -2216208 -580703 1944863 3117662 3404329
40977 3404329 4509483 5741118 5027475 2832699 1741589 2317698 2536056 1448818 357488
40968 357488 -3244 -465650 -1073470 -710835 38995 -1387164 -5528243 -9143732 -9186380
40959 -9186380 -6443068 -3375477 -285430 3841245 7776816 8331299 4680003 200334
40951 200334 -1422562 -707561 -1111024 -3564364 -4771957 -2272432 1068353 592343 -3212823
40942 -3212823 -5208432 -3322471 -1400919 -2504797 -3726375 -1321337 2445680 2575262
40934 2575262 -447313 -1257419 1765429 3867524 1273847 -3368918 -5298212 -3985859
40926 -3985859 -2267982 -1335164 289379 3484762 6654642 7413848 5132747 1678735
40918 1678735 -159415 649043 2322077 2544386 1415872 831280 1182751 627935 -1853864
40909 -1853864 -4588770 -5563079 -5226581 -5474038 -6715970 -7528268 -6874842 -5175212 -2989487
40900 -2989487 -25908 3709002 6687013 7118516 5264729 3148242 1783315 309266
40892 309266 -1483601 -1860049 -17057 1804476 1629539 1211900 2624890 3211400 -862822
40883 -862822 -6690621 -6780071 -399352 4129587 1654169 -2088371 -129790 4462286 4167664
40874 4167664 -542463 -2762782 -858534 97842 -1748152 -2073739 1196214 3829608
40866 3829608 2213906 -1543059 -4054442 -5138417 -5422201 -4207449 -2250930 -2326471 -4585014
40857 -4585014 -5507196 -3710884 -2397195 -3548567 -4324724 -2305645 160197 450806 354566
40848 354566 2217542 4156263 3553408 2088748 2530401 3208652 810245 -3153316 -3866961
40839 -3866961 -446020 2956303 3177153 1368108 199675 891839 3108029 5234929
40831 5234929 4926200 1574812 -2188454 -3377869 -2191039 -858747 -293794 44158 422870
40822 422870 1167636 3084939 5355491 5052697 1328143 -2200996 -2197487 -251895 582246
40813 582246 990682 2735523 3621835 783274 -2976397 -2541605 782013 762166 -3443902
40804 -3443902 -5696010 -3073687 -555294 -2486888 -5649231 -4981357 -1276271 1291172
40796 1291172 1468045 446743 -1637898 -4391940 -5041825 -1989103 1594088 1877948 312425
40787 312425 1242269 4879630 6939924 4838054 529731 -2724874 -3344442 -1462806 1042581
40778 1042581 855774 -3449265 -8431811 -8870113 -3841553 2619269 6450485 6521210 3446199
40769 3446199 -1104652 -4099343 -3794005 -2958616 -5734952 -10793274 -11920402 -6835092
40761 -6835092 -964055 124645 -2054282 -2820031 -1922844 -2448181 -4309247 -4218620 -1739480
40752 -1739480 -385149 -1835149 -3204174 -1550458 2281737 5958620 8721439 10215697
40744 10215697 9117633 5462339 2121297 1251876 1084253 -927094 -3498665 -3581459 -1821492
40735 -1821492 -1680685 -3159302 -2029604 3172469 7605836 6463992 1798790 -539663
40727 -539663 1124103 3184488 2820674 1405723 1472836 3288040 5314042 5886423 3851737
40718 3851737 -271867 -3263999 -1884328 2451925 4366072 1412478 -2476127 -2761147
40710 -2761147 -796584 -906059 -2767227 -1577700 3962000 8648622 7938170 4408042
40702 4408042 3643728 5928192 6269681 2459747 -989225 1156695 7383849 10774719
40694 10774719 7330515 484456 -3545608 -3126840 -1997959 -3292512 -5366005 -4808612
40686 -4808612 -1700922 536394 -98285 -2134773 -3579855 -4420971 -5194880 -5305826 -4358797
40677 -4358797 -3348900 -2682746 -688776 3581506 7413423 7158061 3339986 186754
40669 186754 106291 1402517 1810699 1510767 1704846 2543902 3522947 4023215 2839866
40660 2839866 -573256 -3839167 -3535426 -353615 1016561 -1055591 -2056475 1521636
40652 1521636 5596399 3948308 -1983913 -4537817 -663783 4317233 4889478 2204652
40644 2204652 463623 582050 700642 295516 426839 1264743 2007766 2422423 2556410
40635 2556410 1879278 379869 -590610 -280399 -178490 -1790700 -3808297 -3617388 -956425
40626 -956425 1978325 3514099 3497839 1864636 -1242000 -3852417 -3271607 405800 3977222
40617 3977222 5216133 5218784 5526722 5225719 3142244 1212383 2443236 5781182 6307226
40608 6307226 1766735 -3639310 -4121861 526977 5046833 5316549 2272997 -890815
40600 -890815 -2742358 -3550086 -3282409 -1704309 445362 2101577 3197091 3974294 3649221
40591 3649221 1437522 -1449482 -2628944 -1474439 261103 885121 443092 -158737 -243751
40582 -243751 687651 2659938 4468476 4551993 2991790 1271479 -281087 -3088224 -7571076
40573 -7571076 -11492300 -12384753 -10525027 -8230457 -7089663 -7129650 -7960828 -9262305 -10220537
40564 -10220537 -9534976 -6329605 -1047007 4252894 6788904 5415858 2260431 679279
40556 679279 1221517 1219673 -962268 -3320834 -3366095 -2050124 -2250875 -4456490 -6550296
40547 -6550296 -7443862 -8198285 -9233304 -9071618 -7000834 -4814230 -4127433 -3462190 -274429
40538 -274429 4637711 7143367 4831243 238144 -2284863 -1757327 -833088 -1351434 -1863892
40529 -1863892 -354856 2447100 4152127 4115278 3878428 4442957 4814057 3580215 748266
40520 748266 -2297020 -3780362 -2515972 960062 4108258 4355969 1648606 -1729749
40512 -1729749 -3774892 -4283114 -4133854 -4353807 -5549144 -6772889 -5477840 -659715 4336288
40503 4336288 4888038 1237100 -1440493 18309 2929523 3542448 2465125 2506009 3483869
40494 3483869 2700920 -503258 -3931146 -5947040 -6915105 -7105105 -5614344 -2029962 2447506
40485 2447506 6053610 7613224 6716294 3951114 950319 -877460 -1664411 -2398900 -3392470
40476 -3392470 -4374060 -5456899 -6675319 -6979525 -5203182 -2072264 24807 -312682 -1686163
40467 -1686163 -1026638 3373165 9514381 12619908 9640414 2958269 -2026790 -3346546
40459 -3346546 -4266477 -7698322 -11615755 -12342814 -10107557 -8124817 -7525843 -6670708 -4942598
40450 -4942598 -3707566 -3206825 -1666773 1567194 4554581 5515436 4993882 4213554 3212986
40441 3212986 1930447 1490118 2736083 4474762 4814536 3811309 3263273 3837017 3904113
40432 3904113 2114481 32053 379080 2695614 3119561 -107126 -3156846 -1417469
40424 -1417469 3754846 6821006 5898473 4320813 4169350 3557490 1931717 2321728 5035112
40415 5035112 4666691 -1663101 -7786382 -6336844 471781 4749260 4874677 5754001 8498798
40406 8498798 8384298 3987727 588292 2112887 5968875 8221820 8281877 6423547 2457584
40397 2457584 -951874 263055 4306014 4250314 -813424 -2648958 3384453 9845008
40389 9845008 8264562 2302819 1273841 5175245 6010639 1801995 -815907 1768606
40381 1768606 5138786 5434706 4894761 5679093 5027638 769483 -3568508 -3636732 -577665
40372 -577665 1501621 1413526 532033 -960525 -3601670 -5920008 -5670209 -3232434 -1346640
40363 -1346640 -1995754 -5171367 -9538914 -12562588 -11405132 -5913698 314106 3847302
40355 3847302 5244955 6812829 7987125 6163473 1684089 -1457805 -690078 2079791
40347 2079791 3632383 3374455 2690478 2416483 2895509 4982179 8560292 10812254 8563926
40338 8563926 2541694 -2938313 -5148210 -5705668 -7034364 -8243177 -6887138 -3674919
40330 -3674919 -2429586 -5009432 -8794904 -10405497 -9860369 -9147636 -8130265 -4715513
40322 -4715513 786733 4176472 1954992 -3915073 -7921957 -7432888 -5100045 -4223048
40314 -4223048 -4056621 -2055840 651263 -124856 -4805338 -7715199 -4488021 977060
40306 977060 1301602 -3780465 -6733278 -2963839 2753452 3410964 -634534 -3393174 -2172673
40297 -2172673 59772 538207 87745 -308374 -2213604 -6666065 -10979901 -11245129 -6913429
40288 -6913429 -1077145 2937811 3782492 1882529 -1161109 -3290446 -3506858 -2568549 -1460632
40279 -1460632 -116274 1032514 -492621 -6553011 -14268039 -17511039 -13813498 -7525960
40271 -7525960 -4290559 -4233070 -3164204 650668 4214183 4575192 2861483 1938443 1996702
40262 1996702 671720 -2980377 -6415472 -6026788 -1168465 4511201 6113256 2424503
40254 2424503 -2520602 -3804404 -1212054 1068918 154319 -2340961 -3343184 -2129466
40246 -2129466 174995 2610328 4024838 2674901 -1538363 -5839553 -7630861 -7283928
40238 -7283928 -5959760 -2917184 1993924 5374721 4105076 922201 1308620 4904895
40230 4904895 5130721 -1376226 -9572756 -12547584 -9655577 -5579567 -4066687 -5188068
40222 -5188068 -6873940 -6989537 -5175601 -3668428 -4506493 -5608817 -2777921 3426974
40214 3426974 6665035 2767180 -4827059 -10128331 -11579505 -10914617 -8649174 -4902241
40206 -4902241 -1978995 -1515010 -904238 2888768 7399501 7239894 1823858 -3917709 -6037130
40197 -6037130 -4531392 -471882 4845717 7642826 3673304 -5884791 -14373238 -16943173
40189 -16943173 -14764905 -11314837 -8320532 -6530229 -6504125 -6801579 -4823328 -1170367
40181 -1170367 306748 -1511133 -2935914 -1674980 -850218 -3303127 -5693895 -3072889
40173 -3072889 3003689 5994387 3161068 -1588845 -3526148 -1918504 1260693 3973934
40165 3973934 4627677 2678822 -196433 -1370797 -328162 998323 1041357 162113 -557025
40156 -557025 -426290 880234 2919340 4326257 4555426 4951330 6148723 5721389 1524348
40147 1524348 -3549845 -4292886 -802581 1148756 -1383502 -4294175 -3216299 -210325
40139 -210325 95185 -2385602 -4539452 -6116259 -9267162 -13075442 -13718704 -10272925 -5844092
40130 -5844092 -2399451 1081552 4336221 4436357 900268 -1873319 -316991 3165295
40122 3165295 3817199 827192 -3036943 -5894977 -7543338 -7482509 -5622372 -3935091 -4308238
40113 -4308238 -5615267 -5712737 -5121881 -5528314 -5901492 -4024875 -1156569 -835272 -3040916
40104 -3040916 -3937189 -2024346 -143492 -221162 -506681 84421 -725100 -4159730 -7136439
40095 -7136439 -6813383 -5243998 -5778098 -7352735 -6420744 -2946736 -582050 -1659377 -5088543
40086 -5088543 -8304378 -8665687 -4542238 1833435 4499619 768556 -3645457 -1580361
40078 -1580361 4584993 5296869 -2080913 -8425130 -5351259 3262267 7326488 4085717
40070 4085717 -528880 -2127110 -2803213 -5166727 -7160330 -5748531 -2284836 -740065
40062 -740065 -2154885 -3917132 -4066075 -3563245 -3791438 -4068413 -3090556 -1518270 -1197456
40053 -1197456 -2027255 -1460266 2112638 6798239 9370741 9347837 9165802 10075519 9747764
40044 9747764 5560904 -627424 -3380966 -185040 4745314 5057473 -84961 -5227697
40036 -5227697 -5694937 -2946820 -1513764 -2689229 -3716071 -2291426 716783 3101480
40028 3101480 3840648 3421573 2969398 3006855 2050959 -2488634 -10059734 -15013422 -12276265
40019 -12276265 -4432296 846993 604591 -810606 -17653 125797 -3154312 -5989135
40011 -5989135 -3111017 3225515 5567744 1686479 -2708313 -2139176 2199062 5357433
40003 5357433 4561011 738706 -3512439 -6164477 -7194725 -8094052 -9104206 -8102613
39995 -8102613 -4044515 125047 946449 -478566 -481943 1102961 1238359 -237644 152659
39986 152659 3179440 4667851 1857235 -2042826 -2519606 70862 1883673 839135
39978 839135 -2068899 -4776867 -5251014 -2527051 1256714 1907757 -1536437 -4621719 -2965800
39969 -2965800 2037344 5558498 5407123 2855363 -667550 -3984388 -4418769 173699
39961 173699 7319945 11254920 9179078 3767218 -969915 -3679623 -4762610 -4191307
39953 -4191307 -1993154 642353 2352202 2945159 2870534 2232543 1152800 220293 -330323
39944 -330323 -1133034 -2404614 -2790595 -768106 2938740 5622993 5669866 4303496 3477344
39935 3477344 3014765 1420768 -887788 -1532713 -221444 -404271 -4558141 -9468562 -9527073
39926 -9527073 -4283628 897413 2268721 1977162 3153178 4398105 2490331 -1836662
39918 -1836662 -4796519 -5146815 -4970362 -5027202 -3251589 1024150 4563634 3893567 -490473
39909 -490473 -5305708 -8303523 -9120670 -7580726 -3524801 1559623 4485843 2991872
39901 2991872 -1810523 -6091586 -6739980 -4293809 -2117967 -2370257 -3541619 -3024810 -1346737
39892 -1346737 -1739616 -5260052 -8709884 -8824851 -6674652 -5820338 -7289791 -8799372 -8425169
39883 -8425169 -6497838 -3839387 -794238 1354071 754050 -1789018 -2477367 393714
39875 393714 3069194 930989 -4839143 -8439679 -6811105 -2535131 714812 2134828
39867 2134828 2235208 700876 -2157732 -4224771 -3984411 -2345719 -412681 2385806
39859 2385806 5897486 7426967 5296543 2247916 1701040 2118683 -516889 -5141318
39851 -5141318 -5612990 383438 6948378 7313175 2487932 -747227 1347781 6101280
39843 6101280 9236343 9815533 9626015 9784111 9472385 7507209 4147586 1061323 -285882
39834 -285882 139317 1383102 2620767 3369088 3247667 2455360 1959411 2025827 1128461
39825 1128461 -1901113 -4876982 -3879101 1289900 5653935 4997889 1615455 1483937 6181857
39816 6181857 10497097 9093649 3353831 -550364 555590 3574767 4016791 1592429
39808 1592429 -778082 -1525868 -1154799 469978 3804045 6458273 4616605 -682523
39800 -682523 -2813607 1758521 7649075 7743024 3339999 1396214 3163071 2603088 -2863559
39791 -2863559 -7070782 -4382315 1035546 770823 -5756139 -10636225 -8507055 -3053202
39783 -3053202 -977566 -3352586 -5786900 -5109679 -2527394 -310764 1490591 3375487
39775 3375487 3608867 143206 -5115753 -7233260 -4428708 -455965 933639 1099338
39767 1099338 3317013 6843238 8052221 6407800 5160588 5901809 6129369 3425437
39759 3425437 -583654 -1932218 1205392 6251761 7956999 3516993 -2966195 -3505042
39751 -3505042 3827549 10767914 8753726 464247 -4121531 -1641552 1606120 709520
39743 709520 -1229330 123756 3472919 5453639 5893614 5702840 3842122 212571 -2113517
39734 -2113517 -1138566 827200 1184619 737559 464462 -1307373 -5065077 -7558286 -6834885
39725 -6834885 -5642705 -5831292 -4130255 1429256 5681647 3359233 -1999801 -3416765
39717 -3416765 -1596863 -2644162 -6721025 -7802626 -4437558 -2019582 -3054213 -3292816
39709 -3292816 -61872 2906822 2463313 1531255 3490570 6371514 7179524 7631822 10610726
39700 10610726 14072112 13569546 9054585 4697786 2999356 2993959 3578974 4714548 5216457
39691 5216457 2981591 -1450358 -4258294 -2927033 242969 1051664 -1105904 -2715753
39683 -2715753 -1191384 1504898 1457535 -2164634 -6227427 -7264773 -4563916 -183406
39675 -183406 2409881 415656 -5131496 -8591485 -5215404 2212707 5602472 1436172
39667 1436172 -5045921 -7024121 -3772346 994343 4590393 5968098 4137640 -129035
39659 -129035 -3217448 -2788220 -1093783 -1219448 -2369520 -2131665 -973811 -914190 -1908739
39650 -1908739 -2877850 -3836026 -3884462 -571622 4895898 5998714 -383017 -7753618 -8722651
39641 -8722651 -5848629 -6217446 -8998734 -7914635 -3912529 -4572152 -10597158 -13455053
39633 -13455053 -8667429 -1920314 1035399 1532400 1397093 -1821284 -7935485 -10339282
39625 -10339282 -5164369 2147777 5162880 5353933 6667218 6963007 2173818 -4954010
39617 -4954010 -7536320 -3834248 1955048 6200024 7847886 5830088 -139970 -6849359
39609 -6849359 -9842387 -8129211 -4193971 -686160 843440 98821 -985420 89197
39601 89197 2159851 1293580 -2561671 -4535784 -2733468 -1540479 -3564599 -4377085 -264786
39592 -264786 4664778 5395060 4693141 7477152 10896673 8466484 1291715 -3261262 -2470606
39583 -2470606 70169 2304885 5110190 6599485 3444124 -1775070 -2538413 1448651
39575 1448651 3907261 2959834 4015276 9088478 11590390 6398499 -1612446 -4614709
39567 -4614709 -2463174 -780111 -2009799 -3846193 -4499098 -4635909 -4728773 -4027598 -2187502
39558 -2187502 102117 1864920 2202043 779286 -1323968 -2291741 -1443218 636454 3357824
39549 3357824 5767134 5843987 2884725 -91087 443681 3360481 4484018 2873181 1294093
39540 1294093 726896 -516954 -1737074 404149 5425363 7884659 5207841 1458170
39532 1458170 370678 -32609 -2040391 -2757067 706819 4692348 3702755 -994356 -3437349
39523 -3437349 -1992390 -537937 -1436767 -2838802 -3101780 -3072160 -3390276 -3590778 -4343354
39514 -4343354 -6740044 -8917333 -7324937 -2156154 2281422 3704451 4663335 7691282
39506 7691282 11109086 11748387 9093016 4697857 10730 -3180818 -2662155 1281985
39498 1281985 4763949 4600642 2067354 56086 -1366432 -3359484 -4238699 -1553221
39490 -1553221 2298646 1532467 -4762366 -10340032 -10114920 -6809269 -5910692 -7335773 -6876855
39481 -6876855 -4087690 -3138668 -5649639 -7965784 -7293359 -5929965 -6482166 -6719849 -3319366
39472 -3319366 1710748 3115826 216921 -1823700 753725 5449041 7355962 5082069
39464 5082069 928608 -2828465 -5555320 -7025534 -6643577 -4215751 -616872 2597558
39456 2597558 4092601 3461125 1292687 -1357411 -3327044 -3274263 -285484 4605604 8319608
39447 8319608 8485733 6042966 3965351 3671845 3931292 3137678 1279972 -534521 -1463929
39438 -1463929 -1685403 -2432882 -4873755 -8119493 -9335248 -7410376 -5449354 -7013055
39430 -7013055 -10319656 -9611350 -3280640 2664541 1708549 -4664000 -8534453 -4901158
39422 -4901158 3219859 9130918 9424208 5604958 740480 -3263087 -5385508 -4857873
39414 -4857873 -2227841 57876 27 -1230703 -756456 1674099 3033598 1593888 -170993
39405 -170993 933286 4334694 6962857 7447496 6390241 3731557 -830977 -5177004
39397 -5177004 -5864045 -2431847 1915311 4253243 4212345 2377605 -609179 -2915618 -2539904
39388 -2539904 -370253 504989 -693383 -1599524 -1245489 -1934671 -4947437 -7829909 -8185765
39379 -8185765 -6904189 -5046797 -1073778 5099658 8443313 4376297 -3478207 -6475772
39371 -6475772 -1948773 3877554 4961173 2759455 2144930 3895239 5006658 4484606
39363 4484606 4689073 6802203 8211610 5893350 612496 -3958057 -5423340 -4258942
39355 -4258942 -1718749 1542952 4165555 3816062 178044 -3368597 -3454477 -1075430 355286
39346 355286 266836 707708 1317795 -851486 -5379346 -7158883 -3823524 -297247 -1903910
39337 -1903910 -6225124 -6886807 -3441672 -1677051 -4294616 -6984579 -5353125 -1017498
39329 -1017498 1988852 3443406 5970783 9511518 10343735 6007283 -913493 -5111096
39321 -5111096 -4235669 -1361182 -1062780 -3426322 -3873213 99735 4451719 3761534 -754272
39312 -754272 -2698899 72776 2494081 700820 -1544322 844387 5094435 3953291
39304 3953291 -2580845 -5657710 68278 8103645 8714156 2323178 -1610488 1923068
39296 1923068 7416633 7862688 4291468 2451581 3797854 4938982 4310493 3991499 4811215
39287 4811215 4535761 2139770 -270209 -1423029 -2870019 -4967389 -4860041 -1419788
39279 -1419788 1526490 788989 -562589 1972195 6153757 5447626 -922012 -6019543
39271 -6019543 -4238278 2358984 8075041 9796295 7546804 2824699 -1208784 -1050343
39263 -1050343 2999219 6307654 5705308 3532475 3662478 5716086 5979999 2655827 -2319085
39254 -2319085 -5803289 -5926161 -3031001 240739 923407 -823544 -1634284 411760 2985406
39245 2985406 3015665 769033 -1792802 -4345915 -6850220 -6980425 -2888313 2521771 4168860
39236 4168860 1536164 -793505 446533 3646430 5636824 5348478 3389437 800820
39228 800820 -962849 -1181936 -1193680 -1952003 -805776 5192228 12604094 13524026 6170726
39219 6170726 -1474802 -1928022 2348247 4064174 1863007 387382 1849422 3542184
39211 3542184 3277328 1958671 335199 -2118801 -4277439 -3623282 -577964 1375070
39203 1375070 1129775 1492532 3699618 4748882 2826308 1281774 3366585 6182567
39195 6182567 4522464 -1095963 -5048447 -4614858 -2701052 -2129372 -1673813 400916 2338455
39186 2338455 1265693 -2203339 -4389866 -3102113 52283 1930499 1316976 -133239
39178 -133239 -14215 1981468 3735530 3629761 2943194 3834124 5423762 4366480 49365
39169 49365 -3341367 -1930323 2519460 5048918 4227666 3302077 4622748 6167418 4903167
39160 4903167 1139203 -2262812 -3266214 -1521616 2423294 6622982 7924274 5314580
39152 5314580 2099334 1859224 3062282 1354004 -2944801 -4198062 186485 5171723
39144 5171723 4880703 405794 -3072448 -4124633 -5104259 -5986031 -3911279 812744 3630613
39135 3630613 2422893 791712 2072336 3811077 1708208 -3513723 -7185449 -7527077
39127 -7527077 -7578908 -10037988 -13268477 -13805578 -11012015 -7579243 -6056964 -6472345 -7672893
39118 -7672893 -9454484 -11670904 -12039777 -7847836 -804147 3000531 528526 -3567793
39110 -3567793 -3398187 -482176 -834240 -4890879 -6808547 -4124648 -1274763 -1529432 -2217588
39101 -2217588 -1373523 -2486429 -7501268 -10899615 -7355539 -939033 590469 -2426356
39093 -2426356 -3235518 -340503 691730 -2887503 -6903187 -7373005 -5314970 -2782339
39085 -2782339 188670 2862209 3227961 1908228 1844997 2832585 1683137 -905221 -49999
39076 -49999 4317387 4984475 -1840554 -9522224 -10123717 -5369662 -2114366 -947836 3139942
39067 3139942 10644470 15653456 14509325 10392891 7890891 7523560 7324372 6482464 5657569
39058 5657569 5612461 6375619 6498515 3694283 -1810332 -5533669 -3265624 3095379 7389186
39049 7389186 6884947 4788123 4494995 4885935 3117404 -633735 -3659217 -4429562 -3555826
39040 -3555826 -1853540 414399 2416518 2733777 1236224 -115986 536161 2384748
39032 2384748 2888104 1465991 747903 3004242 6560422 7698094 5646466 3504597
39024 3504597 3966197 6085602 6864433 4458823 -575745 -5552591 -6883473 -3052511
39016 -3052511 3071180 6810125 6987017 6486236 7229245 7560192 5705832 2784973 563687
39007 563687 -1197890 -3189920 -4622250 -4779823 -4461953 -4254336 -3580220 -2798291 -3389453
38998 -3389453 -4531983 -3022435 1193561 3291375 396105 -3712823 -4442247 -3118937
38990 -3118937 -3370162 -4352363 -2977758 44560 2203803 4594481 8894187 11316818
38982 11316818 7317109 1192325 2292910 10757494 15628248 10028710 514698 -2986244
38974 -2986244 -65650 2730404 2458333 1605041 1940457 2194019 1379359 605463 1313335
38965 1313335 3514110 5438111 4418698 -226332 -4789861 -4247687 1377046 6519936
38957 6519936 6951372 4071256 1263638 -371125 -902454 95510 1754155 1769958 381501
38948 381501 1142991 5307478 8995211 8764050 6417559 5105685 4264528 2120128 -163884
38939 -163884 -848702 -1036958 -1815933 -1406744 567130 -54939 -5386613 -9656176 -6742811
38930 -6742811 -435709 628714 -3904392 -6715080 -5426815 -4953247 -6675451 -5550305
38922 -5550305 -703823 1252537 -1855763 -2313672 4257111 9275286 4098797 -4667201
38914 -4667201 -4268702 4087544 6946326 -400482 -7341968 -5066711 1118166 2172563
38906 2172563 -1056156 -2068461 -188766 490571 -67302 1740587 5368037 6155196 3310730
38897 3310730 1473028 3160068 5164026 4284653 1848905 106118 -1705335 -4634731
38889 -4634731 -6718838 -5948753 -4209644 -4665205 -6768758 -7481138 -6532131 -6676392 -8617434
38880 -8617434 -9266120 -6313730 -1926540 -108055 -1819426 -4213686 -3924510 -83843
38872 -83843 5256081 8776095 8417571 5111206 1934193 1203051 2602272 4348936 5632546
38863 5632546 7106145 8832435 8584627 3608796 -5192340 -12098638 -11833435 -6122112
38855 -6122112 -2474127 -5119390 -9631645 -9107185 -3693250 -29897 -1674814 -4599607
38847 -4599607 -3783777 -454412 414253 -2427381 -5251042 -4960496 -2523937 -196745 1790364
38838 1790364 4060623 5435072 3765936 -886018 -5639599 -7633207 -6353189 -3033650
38830 -3033650 791126 3464970 3456774 964403 -1508231 -1774046 -703705 -745118 -2210814
38821 -2210814 -3128391 -2613961 -1893862 -1649884 -1157259 -950222 -3177106 -7441251 -9396975
38812 -9396975 -6447157 -2355672 -2406528 -5519749 -5528020 -127401 5628081 5982365 1542335
38803 1542335 -2129313 -1237206 2595429 4838792 3292521 400223 -294623 440974 -1805094
38794 -1805094 -7909804 -11994634 -8654692 -1071221 2509120 -497999 -4311635 -3054802
38786 -3054802 2344097 6610361 6396709 2912984 309608 1826089 6029131 7834919
38778 7834919 5253058 2844217 4949472 8228224 6497019 968235 -1527741 119979
38770 119979 -12947 -3885367 -6062362 -4217819 -4068566 -8683829 -11148538 -5087035 4144921
38761 4144921 7125837 4237632 2914828 4568349 3988323 395029 -670709 2571150
38753 2571150 4800318 2795105 648500 2188267 4060771 1051855 -5329209 -8263861
38745 -8263861 -4281486 2892636 7023049 5843517 2323753 344677 352471 276294 -342065
38736 -342065 -38357 622610 -1201333 -5177141 -6351195 -2313198 2167462 1782925 -1720698
38727 -1720698 -3542406 -3963902 -6391663 -9835650 -10169047 -7567752 -6040326 -6329308 -5779032
38718 -5779032 -4463988 -4455369 -3612753 1979299 9198347 10146160 4561395 905976 2492319
38709 2492319 2202541 -4300478 -9618258 -6133310 1227948 2511381 -2453504 -5962326
38701 -5962326 -5568651 -5911883 -8953736 -11283792 -11449258 -12203315 -14030314 -13031354 -7430734
38692 -7430734 -811713 3560780 7092462 11708420 15019468 13162094 6701146 792100
38684 792100 -195599 3217022 6563171 5770039 982045 -3567160 -3877388 -489302 1878968
38675 1878968 -919518 -8052894 -13901193 -13212894 -6826091 -1317425 -1475945 -4518176
38667 -4518176 -4564546 -1398335 -11022 -1617704 -1360276 2887026 5724082 2558786 -2592919
38658 -2592919 -3367569 -923307 -730056 -2311963 56459 7080159 12314270 11452911 7625872
38649 7625872 5697098 6442119 8257091 10008321 10127214 7040620 2626097 1417828
38641 1417828 4241610 6325783 4046837 -32826 -1503364 -108636 1715061 3435074
38633 3435074 5957432 8434448 9003642 7805293 6631995 6377284 6913238 8389945 10477354
38624 10477354 11323716 9480411 6148961 3600689 2172031 768358 -469274 -244313
38616 -244313 1405438 2647555 2020898 -173354 -2416765 -2866451 -413880 3653940 5580252
38607 5580252 2480184 -4184632 -9764105 -11089503 -8955295 -6163219 -4449092 -3643908
38599 -3643908 -2888564 -2067934 -2105527 -3671256 -5556903 -5199578 -1587123 2955761 4868030
38590 4868030 3068255 -132709 -1691091 -832588 542373 110533 -2258350 -4333968
38582 -4333968 -4248408 -2705747 -1474318 -504784 1452045 3676018 3625202 822707 -2170911
38573 -2170911 -3758042 -5283089 -7299513 -7227281 -3730777 -461449 -1325475 -4084487 -3413147
38564 -3413147 783943 3270454 1651576 -591627 -306483 1022640 1094313 480403 13753
38555 13753 -1519429 -4201223 -5186542 -3350860 -2226524 -4460616 -6630903 -4329659 125625
38546 125625 497980 -4250736 -9132641 -10817846 -10527387 -8976846 -4229171 3577718 10051144
38537 10051144 11490697 8768684 4877910 2067246 2341276 6384364 10389992 8731182
38529 8731182 2019321 -2569738 -1840953 -1556474 -6360422 -10849470 -7816989 -817831
38521 -817831 465774 -4712476 -7299428 -2988732 1712461 696554 -2689507 -2414069
38513 -2414069 819316 2496101 2189587 2852338 4899994 6001589 5147336 2961105 -442817
38504 -442817 -4327243 -5819008 -3378930 -402555 -1392795 -5373300 -6970331 -3729391
38496 -3729391 1252976 4074457 4094816 2778750 1299024 130906 -868199 -2427491 -4607330
38487 -4607330 -5994760 -5631219 -4722070 -4452121 -3491232 -449501 2522919 2265600 -1710
38478 -1710 -117049 2040766 1675053 -3399432 -8727729 -9329961 -6419870 -4816334 -6051686
38469 -6051686 -7457668 -6744195 -4315346 -1599066 246892 122353 -2214663 -4911327
38461 -4911327 -5371608 -3178868 -298287 1833310 3937758 6966881 9769646 9974494
38453 9974494 6938591 2598041 -1105910 -4603049 -9144380 -13361931 -13640953 -8881978
38445 -8881978 -2857849 72513 65093 219159 1232741 968488 -958521 -1846755 -43036
38436 -43036 2784852 4826337 6566040 8284041 8088261 5046803 1949303 1848165 3406124
38427 3406124 2952198 270712 -1130437 399716 2080603 894780 -1944878 -2449590
38419 -2449590 1219625 6634262 9727984 8877164 6224370 4980461 5674038 5852528 3734206
38410 3734206 938895 445826 2604218 4722140 4577598 2965440 2237268 3178750 4230937
38401 4230937 3864369 3054198 4388181 8363912 11784387 11274795 7678078 4968178 5050233
38392 5050233 6025394 5777216 4372861 2017928 -2061731 -6649080 -7533507 -2667281 3756585
38383 3756585 5853395 3370096 1076901 1827544 3851162 4618315 3849773 2393081 1135526
38374 1135526 1327092 3214575 4339184 2211631 -1355340 -2061733 525638 2384131
38366 2384131 1527621 701052 1967982 3112619 2196755 1668582 4274201 8056496 9456192
38357 9456192 8915492 9146461 9735493 8062173 4545222 2408943 2436652 2104068 115317
38348 115317 -2068722 -3652893 -5671141 -7888741 -8089269 -5706314 -3143589 -2297476 -2567423
38339 -2567423 -3223574 -4545120 -5416571 -3294830 1628394 5580543 6512989 6595869 6881117
38330 6881117 3817551 -4461518 -11923887 -10851451 -2841545 2636394 803975 -3329243
38322 -3329243 -3831028 -1879496 -1590233 -2486162 -1002903 2800592 4834704 2928667 -486300
38313 -486300 -2132230 -1632159 -594438 225365 1622985 4379874 7667688 9255362 7770291
38304 7770291 4718271 3138427 3826543 4283267 2236185 -1388410 -4317765 -6074612
38296 -6074612 -7334077 -7621517 -6180517 -4163996 -3182875 -2302295 450177 3932997 4899064
38287 4899064 3529092 3854500 7158605 9131847 6467059 2629735 2927073 6418385
38279 6418385 7735502 5697018 4536942 6090381 6237942 1459864 -5427095 -9392189
38271 -9392189 -9866242 -9550376 -8909802 -6274888 -2409479 -443669 -979645 -1381098 -917937
38262 -917937 -2477865 -6982742 -9888604 -6901136 -715566 2279616 898439 105964
38254 105964 2841214 5663285 4567859 1178801 -223066 764544 1092348 -31696 -81018
38245 -81018 1919221 3290780 1940839 -202122 -136671 1700992 2266534 426488 -1542857
38236 -1542857 -1090880 1471772 3579317 3537365 2410201 2500932 4157853 5204573 4382505
38227 4382505 3921599 6311342 9204163 7134764 -641912 -7582844 -7599486 -2558682 1196104
38218 1196104 1559134 1668019 3306604 4201417 2732226 1256239 2760183 6764677 10238035
38209 10238035 10776875 7995048 3835942 2100264 4998007 9370980 9553761 5259184
38201 5259184 2748982 5770118 9434358 7162549 427172 -3699637 -2783641 -955937
38193 -955937 -1113376 -1310044 -158045 -172235 -2864337 -4813272 -2279575 3050256 6470012
38184 6470012 6554383 5701134 5514605 4946527 2968627 529141 -768151 -598152 -213344
38175 -213344 -1382633 -4626284 -7999484 -8526004 -5587597 -1884701 -220375 -503535 -871216
38166 -871216 -390843 672991 2073740 3626622 4946069 6159955 7618651 8028798 5022414
38157 5022414 -691280 -4078847 -1504711 3912559 5816563 2451502 -2237859 -4600843
38149 -4600843 -4770869 -4146202 -2997709 -1608221 -1051662 -1618157 -2318826 -2619079 -3004474
38140 -3004474 -3647386 -4290025 -5307214 -6924806 -7888666 -7257551 -6641933 -7550081 -7510740
38131 -7510740 -3114701 3469820 6207941 4089463 2676069 4987800 6795898 4279247
38123 4279247 704675 704817 2589530 2066068 11203 204832 1776868 622084 -2857968
38114 -2857968 -4126412 -2490017 -2108597 -4065854 -3880641 611441 4446427 2318556
38106 2318556 -3654716 -6842992 -4434324 531064 3962134 4581948 3685379 3322392 4598480
38097 4598480 6506019 6712823 4179874 380097 -2524168 -3812650 -4055442 -3834335 -3295946
38088 -3295946 -2430298 -1463092 -1219989 -2634079 -5190887 -6639905 -5502071 -3295906 -2967442
38079 -2967442 -5573312 -9513289 -12115618 -11010345 -5635334 1027214 4230246 3077459
38071 3077459 1989975 3898252 5098296 1230290 -4438896 -4730556 804142 5429513
38063 5429513 5129220 2304996 -825896 -5210883 -9535441 -9183865 -3970042 -344103
38055 -344103 -1819950 -3272009 454348 5883713 6547198 2609916 -1203856 -3440794
38047 -3440794 -5304409 -5337590 -1544082 2953558 2799262 -1849211 -5914724 -6900372 -6583178
38038 -6583178 -5993869 -4011186 -874761 1468993 2443821 2510684 820043 -2674897 -4344748
38029 -4344748 -1130801 3679157 4481284 2091958 2189253 5434790 6159295 1992798 -1941142
38020 -1941142 -859888 3322542 6326172 7435692 8084380 8384994 8048682 7969446 8716625
38011 8716625 9697614 10789433 12166753 12332313 9753165 6371010 5358242 5744548 4459290
38002 4459290 3317954 7040267 13436786 13726484 5775190 -885470 1796334 9199589
37994 9199589 12062351 9622501 7486960 7116248 5616441 3404343 4231288 8351398
37986 8351398 11924944 12603364 10551023 5449512 -1856120 -6369024 -4072911 902749
37978 902749 1053261 -2984325 -3190051 2821893 7675087 5991244 2686984 4519088 9284304
37969 9284304 9898572 5621145 2364521 3121764 4461345 3185336 1062811 750676 1075472
37960 1075472 -343443 -2277170 -1549068 1443639 2938942 2053156 2675716 6954617 10698182
37951 10698182 9251689 5211380 4877661 8270464 9067347 5064747 1852543 3391922
37943 3391922 5418790 2834360 -1684991 -2293825 833222 3374781 4995713 8505190
37935 8505190 12420517 11794532 6686580 3020675 3636745 4408217 1275979 -3971267 -7352522
37926 -7352522 -7892021 -6745113 -4651497 -2442974 -1081409 451383 4202385 8865381
37918 8865381 10010508 6530845 3189149 4294784 8019548 9621661 7599855 4085507
37910 4085507 1557759 1610089 4673788 8562039 9430840 6461482 3514207 4080179 6902821
37901 6902821 8657633 8299570 6406497 3230322 388419 1398260 6729863 11099600
37893 11099600 10121454 7168151 8301708 12310754 12388847 7401481 4186785 6622959
37885 6622959 9150312 5339808 -2225260 -6007512 -4171170 -1346425 -333626 933139
37877 933139 3848381 6096578 6073484 5931731 7408884 8108913 5514823 2206704 2812484
37868 2812484 6885750 9162075 6950489 3194705 1358814 1225512 1462774 2613713
37860 2613713 4794135 5464614 3008859 511195 2202484 7185459 10301930 8863628
37852 8863628 5148275 2146201 211332 -1100229 -678356 2762533 8062382 11701973
37844 11701973 10664295 5456988 262743 -1155247 44995 -427173 -2950785 -2262649
37836 -2262649 4690819 12734310 14454388 9543894 3504587 -425264 -2309248 -684101
37828 -684101 5876592 12730925 12508671 5831878 1440103 3644647 7072768 6713551 5205074
37819 5205074 5482543 3937312 -2259301 -7231909 -4009530 4020730 7634390 5260893
37811 5260893 3661923 6246910 8980359 8608638 7509631 8189608 8935262 7826667 6674337
37802 6674337 8033829 11270222 13878588 14482902 12889062 9240899 4762106 1937288
37794 1937288 2582155 6126316 9968854 11235390 9103020 6169568 6127283 9090500 11216559
37785 11216559 10176176 8115541 7250991 6242176 4171242 4025889 7361810 9336468
37777 9336468 5591090 1130095 4247532 12926401 16446394 11406419 6708753 9311643
37769 9311643 13914193 12618966 7749829 7432882 12741949 17126271 16849288 14897191
37761 14897191 14456380 14448911 13004910 11070967 10493589 11114761 11656686 12080384 13504322
37752 13504322 16147343 18355625 18257926 16434988 15985069 18738556 22092786 21631158 16898144
37743 16898144 12387151 12290971 16294483 21128873 24149860 24559164 23137295 21820949
37735 21820949 22022692 22883626 22748618 22056909 22322622 22770323 21584034 20446451 23222752
37726 23222752 29117897 32227409 30113303 27726378 29480187 32419332 31944876 29996795
37718 29996795 31521496 35633286 36816849 33710975 30510746 29814100 29856235 29465526 30359399
37709 30359399 33066341 35274476 36161870 38323024 43149244 47722685 48823405 47395392
37701 47395392 46625344 47660307 49441506 51077477 52315250 52999850 53829876 56387345
37693 56387345 60781629 64515326 65411214 64595788 64857175 67085157 70396458 75057393
37685 75057393 82610801 92527048 100955749 104565683 104856248 106929184 113718809 122802073
37677 122802073 129917376 134695098 141092520 152081268 165895339 178687223 189394292
37670 189394292 200221495 213122825 227712738 242498595 256577336 270078077 284300726
37663 284300726 301425387 322688543 346662854 370470992 392616714 413346608 432541776
37656 432541776 449154564 462856127 474101879 481930172 483954836 479913451 473259580
37649 473259580 467187257 460288968 448351022 429859873 407612140 385116008 363680578
37642 363680578 343452695 324982879 308234673 291395175 272468805 251773478 231758574
37635 231758574 214641542 201063358 190382161 180870370 170038606 156679359 142930928
37628 142930928 132535300 126290791 120875748 113204415 104238086 96918582 91868896 87262921
37620 87262921 81883487 75961414 69748299 63883464 60722286 62205164 66050513 67055759
37612 67055759 63116053 57302031 52958132 49641278 45604997 41596596 39748097 40468424
37604 40468424 42542863 44697727 45207063 41981570 35486933 29798935 28092470 28681787
37596 28681787 28292173 27327476 28176750 29845343 29065121 26483068 26630722 30543148 33161202
37587 33161202 30508232 25524693 23503143 24674061 25159550 23472229 21931296 22040736
37579 22040736 22232098 20954060 19114507 18131040 17605474 16498629 15293210 15338996 16634765
37570 16634765 17679229 17402078 16129638 14587745 13004670 11579184 10971606 11644007
37562 11644007 13120761 14390690 14666440 13462312 10780820 8017433 7714046 10815127
37554 10815127 14494456 14552895 10372585 5949557 5361388 8518102 12085390 13281920
37546 13281920 11845315 9467298 8457400 10071057 12989442 14030690 11273005 6012012
37538 6012012 1173181 -1361213 -1478533 -242490 687335 406466 358481 3057464 8303036
37529 8303036 12536539 13287050 12190850 11755431 11347129 9127327 6209604 5469587 7008365
37520 7008365 8070233 7154661 5126792 2446169 -1341995 -4955755 -5532511 -2580691
37512 -2580691 808893 1818987 785381 -555953 -1226074 -369475 2955291 7749689
37504 7749689 10948198 10966495 9559010 8678089 7597692 5103869 2478605 1654954 1863969
37495 1863969 1126748 283594 2210631 6839096 10223347 9866534 8286352 9107728 11457689
37486 11457689 11166710 7033732 2888818 2594007 5423844 8034782 9123557 9763227
37478 9763227 10222158 9322395 6965669 4703643 3260432 1790539 262616 165665 1813232
37469 1813232 3351800 3788357 4561647 6424682 7301280 5483845 2642231 1078646 206647
37460 206647 -1267041 -1802569 670933 4467366 6088302 5467982 5330700 6045192 5426596
37451 5426596 3612919 3743229 6898145 10093372 10466367 8384503 5500603 2729397
37443 2729397 1086606 1662988 3675093 4867457 4463821 3538041 2531138 1059908 -122142
37434 -122142 -59362 18041 -1229978 -1645806 1450129 5446485 5317466 2259343 2709049
37425 2709049 7572754 9838773 5699600 637792 173320 1654640 962987 795015 4798104
37416 4798104 8597471 5456877 -1974734 -4377813 725949 6281592 6781787 4489605
37408 4489605 3067403 1730122 -1268679 -4146707 -3906059 -470333 3610695 5832959
37400 5832959 5308548 3455237 3181553 5542170 7904823 7654316 6342770 7113889 9509842
37391 9509842 10695604 10580330 11218595 11950439 10203094 7084577 7024003 11157182 15847000
37382 15847000 18532607 20117631 20563049 17569467 11754118 8127071 9584515 13081522
37374 13081522 14985787 16225770 19133798 22901665 25512527 27148592 28660414 29602821
37366 29602821 30630276 34572921 41827033 47803037 48631565 46558532 45839669 46246527
37358 46246527 45319508 44560320 47689722 53708727 57219685 55902663 52869324 50799184
37350 50799184 48147157 42769483 35883463 30576540 28659032 30103841 33384569 35519285
37342 35519285 34139602 30499241 28190864 28001003 26630003 21898869 16518381 14319013
37334 14319013 14734196 14030706 11121789 8962856 9705193 11141527 9638985 5193821
37326 5193821 1551607 1523733 4002596 6199411 7191536 7756163 7801340 6309398 3858091
37317 3858091 2768155 3743067 4455349 3111629 1689175 3313115 7368656 9812518
37309 9812518 8350570 5034571 3065678 2766436 1825917 -1357695 -5587639 -7997176
37301 -7997176 -6934993 -3690881 -1179587 -952233 -2094597 -2999871 -2998157 -2026309 -546762
37292 -546762 -555829 -4161226 -9275518 -9432169 -1346471 9097731 12644968 7792697 1792623
37283 1792623 693310 3285177 5750727 6927968 6637789 3886934 267692 634111
37275 634111 5945666 9365138 4873264 -3360465 -6406717 -3092530 42533 259731
37267 259731 1884763 6725297 9226551 4983935 -2121882 -5874962 -5963550 -5568447 -4976656
37258 -4976656 -2963168 -1334562 -2449615 -4301545 -3418506 -1050704 -1141956 -3369530 -3764398
37249 -3764398 -1669494 -438727 -1166644 -1383081 -644194 -1690220 -4557067 -5087641 -1619673
37240 -1619673 1905064 2314203 1954260 3661614 5281772 3392085 -785440 -3513324
37232 -3513324 -4123562 -4289900 -3663842 -507484 4358391 7941571 8832592 7763780 5500076
37223 5500076 2993663 2339912 4441309 6754330 6394603 4371817 3577247 3818903 2599763
37214 2599763 -10924 -1401715 -1135360 -1505453 -2921654 -2770068 -86163 2214136 1607988
37205 1607988 -284205 -247733 2123669 4398964 4459126 2274546 -665151 -2750593 -3531915
37196 -3531915 -3891286 -4541891 -4769385 -3460428 -717934 2534533 5566562 7212071 5662552
37187 5662552 906894 -3753016 -4873319 -2725785 -75375 1499137 1796672 423439
37179 423439 -1771727 -1504687 2672718 6289917 3809179 -3201332 -7744967 -6961204 -4608696
37170 -4608696 -3751209 -3015583 -1564362 -1680566 -3705587 -3881440 -568501 2294905 1526335
37161 1526335 -310349 -349091 -968224 -4531000 -6814126 -2444078 5588295 8956780 5753050
37152 5753050 2353131 2957746 3957538 1295235 -2072032 -552900 5041093 7570197
37144 7570197 2723537 -5155731 -8097159 -4106155 494321 -956627 -7087399 -10598184
37136 -10598184 -7933055 -3235979 -1735922 -2882109 -2643146 68279 2604708 2812244
37128 2812244 1078666 -1062778 -2034877 -761707 1886662 3313365 2670586 2332690 3655114
37119 3655114 3687474 -311711 -5084740 -4846274 139284 3452136 1560168 -1809202 -2028416
37110 -2028416 -35533 416492 -1085937 -1709578 -189930 1624988 1876700 975053 229551
37101 229551 -264053 -1308771 -2691839 -2849951 -1176548 169335 -1492017 -5221734 -6860139
37092 -6860139 -4765488 -2764874 -4909785 -9139933 -9759128 -5646446 -2024461 -3099708
37084 -3099708 -6443842 -6920170 -3863963 -1469007 -2793132 -5998939 -7119785 -4891330
37076 -4891330 -1598419 257924 645496 869039 1015560 54300 -1860452 -2895893 -1692257
37067 -1692257 1295480 4702602 6914976 5945925 1194134 -4070975 -4930466 -993139
37059 -993139 2505754 1703388 -873509 -1004473 698274 967426 142810 1271615 4022903
37050 4022903 4614251 2019887 -295377 287509 2350634 3572732 3502630 2172641 -554726
37041 -554726 -2990118 -2402371 622511 1912378 -305012 -2401483 -864403 2059607
37033 2059607 1569002 -2562951 -5512004 -3684439 1175769 4481842 3757827 657705
37025 657705 -1171307 38019 2426491 2899482 799977 -1867769 -3463030 -4202651 -4536195
37016 -4536195 -3956558 -2037859 930155 4799708 9333431 12680367 12197735 7798502
37008 7798502 2654939 -494374 -1942746 -2798363 -2273493 784594 4970977 7187213
37000 7187213 6149127 3449531 1137674 -574599 -2863043 -6116173 -8791821 -9013352
36992 -9013352 -7372611 -6892473 -9050028 -11035625 -9070990 -3874391 -263429 -1111002
36984 -1111002 -4175787 -5711606 -5015336 -4105221 -4371044 -4864063 -3456321 518090 4373012
36975 4373012 3882391 -1498467 -6572529 -6183573 -2026732 -274090 -2929767 -5641209
36967 -5641209 -4475650 -602909 2932956 5000539 5278919 3321579 824233 1156239
36959 1156239 4328021 5943968 3525544 186268 -622086 -51088 -339803 -518961 279354
36950 279354 -734497 -5049821 -7711737 -3301501 5056858 9075570 6614537 3190509
36942 3190509 2422422 1692004 -1327902 -3912692 -2782214 1065653 4707120 7094143
36934 7094143 8261645 7794835 6280885 5735700 6755648 7679633 8097373 10377831 15722320
36925 15722320 21267914 23447698 22253672 20013528 17728967 14820688 11074669 6801547
36917 6801547 2200842 -1782418 -3285837 -1916080 -23761 142304 -685666 -553722 349535
36908 349535 248143 -1160354 -2438283 -2836858 -2996753 -3337012 -3480732 -3267933 -2819733
36899 -2819733 -1718740 235096 1511607 87170 -3254068 -4841851 -2744007 -74179
36891 -74179 -1618061 -7456403 -12100539 -10910501 -5819649 -2841076 -4454818 -6860225
36883 -6860225 -5622864 -1824529 -242704 -2391076 -4435531 -2762744 1034185 2776055
36875 2776055 1709040 1107292 3018377 5227897 4802743 2540924 1387707 1311398 -1018961
36866 -1018961 -6604826 -11193993 -10440041 -5984216 -3018497 -2731530 -1314390 3023333
36858 3023333 6508493 5580205 2460580 1329692 1539659 -902028 -6234930 -9959184
36850 -9959184 -9272378 -6548259 -5294492 -5850040 -6515500 -6301531 -4957966 -2409640 247115
36841 247115 896367 -1025936 -3506214 -4526422 -4156077 -3265170 -2081322 -1183487 -1948999
36832 -1948999 -4473079 -6702272 -7051475 -6138779 -4592080 -1488925 2906705 5254652
36824 5254652 3123170 -741756 -1604256 751775 2364821 1584411 1226465 3509044 6445392
36815 6445392 6830446 4036413 -628411 -5572216 -8187067 -5479938 1666654 7074368
36807 7074368 5646774 54645 -2505203 207894 3095905 1511863 -2397176 -3400019
36799 -3400019 -550738 2249493 1908136 -623978 -2738741 -3236635 -2206817 188787
36791 188787 3233361 4799221 2735871 -2271016 -5963635 -3857782 3878527 11338213
36783 11338213 12089400 6062414 34631 219789 5523351 9754554 9495330 7212406
36775 7212406 6589571 7668771 8008824 6627843 4869322 4302977 5239854 6720917 7019943
36766 7019943 4985904 1687005 -427892 -813508 -1570983 -3582559 -4048673 -413392 4863425
36757 4863425 6818923 4669087 2435393 2648553 3026081 715489 -3289522 -6065344
36749 -6065344 -6811309 -6657191 -5994636 -4430804 -2610762 -1920283 -2545093 -3339081 -3449327
36740 -3449327 -2902832 -1900510 -660203 310082 788669 1417269 2842167 4671354 6131069
36731 6131069 7233936 8299157 8834791 8133649 6785611 6432917 7856819 9932366 10438858
36722 10438858 7678116 2032019 -3498128 -5300751 -2722917 1248651 3847972 5657609
36714 5657609 8210904 10125697 8654709 4482854 1508532 1334678 1251545 -1115843 -4319818
36705 -4319818 -6140310 -7145524 -8416079 -8124002 -4095885 1371700 3193989 200011
36697 200011 -3153572 -2685151 507790 2201104 246153 -3715793 -6400470 -5620778 -1844792
36688 -1844792 2126418 3619668 2423510 17531 -2801400 -5712830 -6883597 -4148873
36680 -4148873 1187229 4630057 3955938 1876523 1662709 2679486 2415313 656262 -891900
36671 -891900 -1302629 -340643 2380387 5577280 5820749 2022617 -1743572 -1575634 301028
36662 301028 -538898 -2846213 -1623979 2958071 5261033 3426296 2119196 3981187
36654 3981187 4927471 1437273 -3242767 -4531248 -3322089 -2723704 -2329773 -826447 -419634
36645 -419634 -2986438 -5048957 -2680506 1213202 1064785 -1907411 -1594364 2598098 4777074
36636 4777074 2404826 -260975 -142796 230563 -1112381 -1448478 954909 2504625 -89066
36627 -89066 -4265748 -6093122 -6534297 -8539683 -10825091 -9557608 -4609452 294235 2745342
36618 2745342 3307444 2823036 1409838 -342831 -1837048 -3448251 -4945754 -4458811 -1581620
36609 -1581620 327328 -1746896 -5609278 -6825439 -5315285 -4725307 -5893704 -5729618
36601 -5729618 -3027033 -659714 -498962 -390110 1489914 2768970 295976 -5007901
36593 -5007901 -9560672 -11617112 -11662262 -9769637 -5640385 -917467 1208677 -640711
36585 -640711 -4360192 -6360798 -4712726 -810914 1432940 -963310 -6362450 -9378093
36577 -9378093 -6863066 -1824003 635118 95319 515050 3405550 5071466 2224380
36569 2224380 -2714990 -4725582 -2951428 -1411628 -3502084 -8403285 -12991274 -14940654
36561 -14940654 -13427134 -8953886 -3671886 -420249 -164406 -1122821 -1196934 -475987 -639860
36552 -639860 -2613404 -5489188 -7322568 -6794481 -4710271 -3614528 -4756825 -5866068
36544 -5866068 -3894914 218325 2273170 729430 -1389056 -1731647 -1915445 -3092356
36536 -3092356 -2202967 3112779 8825096 8944339 3992932 -253476 -1436096 -2264388 -3844042
36527 -3844042 -3787179 -1981439 -1772342 -3263357 -1879973 3116266 5180394 530162 -4181160
36518 -4181160 -999188 6740507 8854295 3178832 -2233253 -1668022 1445313 2123524
36510 2123524 1217284 1707079 2920788 2673339 1602969 1284875 447587 -3082162 -8070480
36501 -8070480 -10749321 -9199109 -4531549 1151493 5694706 7182920 6068090 5923350
36493 5923350 9021660 11990059 9578176 2743596 -1345387 996507 4309671 1432008
36485 1432008 -6058361 -9461306 -4536259 3078960 5535698 2351107 -497292 919189
36477 919189 4214725 4780061 1523358 -2383748 -3219867 -496326 2403828 1361865 -4047918
36468 -4047918 -9567940 -10537524 -6675207 -1539830 1929500 3452478 3499123 2040702 36659
36459 36659 -3147 3424556 8546678 11575191 9845765 3768898 -3232373 -6839239 -5440949
36450 -5440949 -1780994 336351 517148 945038 1907390 1588610 376331 1149760 3983921
36441 3983921 4889991 2150637 -312558 866619 3013796 2403192 988140 2525752
36433 2525752 4737626 2184126 -3996400 -6443947 -2696190 716170 -2074361 -8058565
36425 -8058565 -10433423 -7671847 -3370975 23389 2948368 5526889 6432009 4920284
36417 4920284 1796260 -1459731 -3293168 -2797527 -1107184 -734866 -2096193 -2295580 789866
36408 789866 4824237 5806376 3435761 1077659 889922 1492971 508966 -2604273 -6253700
36399 -6253700 -7532765 -3911337 3436871 8328303 5030143 -3896524 -8592804 -3255267
36391 -3255267 6046827 8490307 2172311 -3667193 -794403 7643035 11441473 5551747
36383 5551747 -5226742 -12619345 -12656249 -7106756 -370435 3591545 3122163 -502159
36375 -502159 -4533057 -7132746 -7760896 -5921217 -1600477 2978787 4618885 3217927
36367 3217927 2345817 4334967 6878570 6346106 2706695 -939675 -2347730 -1564435 389620
36358 389620 2103868 1992770 45214 -1309959 140649 3624190 6707387 8134631
36350 8134631 7788917 5638704 2928145 2532923 5307607 7718051 6272351 2792625
36342 2792625 1680714 3250249 3927246 2311912 602922 154489 40796 226284 1657511
36333 1657511 2704526 274366 -4440434 -6132481 -3016915 342645 75450 -1674408
36325 -1674408 -1444904 -357785 -1533174 -4560051 -6285683 -5223627 -2367248 471111
36317 471111 991567 -2264923 -6577597 -6277529 -444096 3977156 925520 -5718870 -6934784
36308 -6934784 -760550 5780895 6651593 3364509 498461 -674016 -1526247 -2057558 -750234
36299 -750234 2252139 4115726 2273866 -2209844 -5294190 -4561554 -2186324 -1799862 -3344786
36290 -3344786 -3799200 -2719126 -3245415 -6561621 -9328197 -8795978 -6832057 -6060654 -5414125
36281 -5414125 -2952894 -84669 920853 1086470 2387808 3655941 3118104 2682639 4712603
36272 4712603 6438435 3291110 -3092549 -6017354 -2943432 1859017 4282490 4638198
36264 4638198 4089528 2369152 846433 2637082 6893106 7459555 770739 -8156131
36256 -8156131 -11395572 -7921189 -4307583 -6193216 -11651522 -13811787 -9305767 -2985262
36248 -2985262 -2607770 -8711441 -13066501 -9511288 -2600406 -790092 -4039716 -4936083
36240 -4936083 -900462 2558823 1683230 -182685 324957 1233480 645048 1007736 3346716
36231 3346716 3092828 -2692917 -8718809 -8257671 -2920577 497127 -43332 -1381072 -2361508
36222 -2361508 -4728761 -7736519 -8143788 -5676257 -3272546 -1852867 286087 2875090
36214 2875090 3409389 1872296 1100213 1873578 1995270 787296 128488 356001 -456941
36205 -456941 -2313308 -2838822 -1939498 -2185189 -3346025 -1849161 2187159 2975691 -2267482
36196 -2267482 -7693913 -6820402 -2314317 -1826207 -6188534 -8233028 -3532403 3389566
36188 3389566 5649637 2860837 455449 2116722 5775133 7016118 4474032 719024
36180 719024 -1593141 -2798556 -4517417 -6199880 -5615506 -2559156 499035 2025416
36172 2025416 3040804 4042608 3277476 202883 -2074248 -905106 1459808 1295906
36164 1295906 -126394 1944874 7764771 11382261 8685045 3339003 1788959 4772379
36156 4772379 7157277 5239599 1037942 -1030862 520211 3290598 4152661 2253688
36148 2253688 -748789 -2484337 -1607839 1609645 5464167 7494177 6154802 2745633
36140 2745633 774840 2029355 3946358 2701882 -1532020 -4876366 -5458104 -5738036
36132 -5738036 -7708486 -8901157 -6210105 -1667292 -548243 -4258942 -8784840 -10501203
36124 -10501203 -9918418 -8595929 -6032592 -2083605 372410 -1335034 -5030949 -5666107
36116 -5666107 -1834018 2499298 3314222 1208382 -435857 -257493 -57551 -1433560 -2894112
36107 -2894112 -1607194 2068946 3616691 -196394 -5976199 -7262190 -3908063 -3402623
36099 -3402623 -9922100 -16440036 -13458074 -3141211 2714880 -829115 -5228269 -1594808
36091 -1594808 6423108 8796235 3541085 -2202925 -3584883 -3330975 -5147777 -7967184
36083 -7967184 -8926735 -7781381 -5904335 -3901476 -2386709 -2749423 -5068754 -6974714
36075 -6974714 -6302107 -3589009 -775583 1189845 2441944 3291457 4096177 4734505 3786945
36066 3786945 5199 -5008401 -7827226 -7547096 -6537114 -5973270 -3849744 680519
36058 680519 4233399 3476849 59528 -2088741 -2483897 -3466803 -5252767 -5621329 -3983986
36049 -3983986 -1855091 615020 4544920 8275123 7653606 2081938 -3231734 -3458987
36041 -3458987 -36159 2101338 1143597 -498335 -544181 489038 882465 -63924 -1846186
36032 -1846186 -3686509 -5255256 -6761503 -8155086 -8268889 -5729471 -1223792 2173923
36024 2173923 1901172 -1406022 -4847177 -6363993 -6244754 -5981546 -6346019 -6573769 -5302410
36015 -5302410 -2425380 372125 1511043 1380985 1267202 1096441 -94750 -1922417 -3032017
36006 -3032017 -3548892 -4584695 -5091754 -2369037 3151441 6815782 5509494 1787483
35998 1787483 -253331 -721486 -2324790 -4879471 -5307908 -2688484 -4861 -479047 -4275240
35989 -4275240 -8773630 -10378071 -6765091 515089 6317474 6943938 4184520 2236851
35981 2236851 1955343 1149763 -589772 -1225811 -149947 1058312 1864692 3039624 3483751
35972 3483751 977578 -3057191 -3875721 -140557 3632090 3406896 733973 -770034
35964 -770034 -461140 499838 1934617 3080431 1283391 -4091368 -8789439 -8317997 -3570478
35955 -3570478 1514200 5770566 10401286 14513473 15528618 13504796 11205235 9986941
35947 9986941 8759326 6674565 3948919 657258 -2387506 -2635273 876504 4256526
35939 4256526 2852075 -2016275 -4710856 -3368340 -1660223 -2244390 -3502744 -3901049
35931 -3901049 -4542435 -5375118 -3616494 1175616 4529541 2913122 -1094859 -2838632
35923 -2838632 -1891125 -794044 -172634 700155 307697 -3420014 -8080386 -7658491 361104
35914 361104 11129236 16794688 13726118 5384928 -947729 -584312 4454176 8015822
35906 8015822 6748476 3124605 1144974 1469074 2481224 3767626 5710633 7108914
35898 7108914 6206198 3444284 796627 -827710 -1249419 550600 4554179 7271951
35890 7271951 4984960 -663213 -4060087 -3057192 -1218054 -1633397 -2529621 -1286077
35882 -1286077 646473 145247 -2462871 -4131769 -3738385 -2682054 -1437338 1037867
35874 1037867 4042919 4509383 1149189 -3110550 -4810719 -4431121 -4862094 -6525973 -7045531
35865 -7045531 -5793235 -5334951 -6680229 -6189810 -653721 6198383 6686355 -970166 -9888193
35856 -9888193 -13188703 -11700270 -10346234 -10220262 -8555620 -4895665 -2469973 -3150937
35848 -3150937 -4961422 -5624503 -5401986 -5109881 -4170740 -2368555 -1163901 -1234852 -591859
35839 -591859 2574375 6424393 7223734 4113252 187945 -1130539 667542 3574971
35831 3574971 5450821 5774653 5786561 6995115 9166167 10142249 8210617 4188121 433166
35822 433166 -1754840 -2844694 -3541957 -3728297 -3099604 -1923156 -697933 390787 1223459
35813 1223459 1303405 129609 -1909108 -3383373 -2947573 -687132 1852202 3088731 2761934
35804 2761934 1949997 2054974 3660600 5795879 6417256 4673737 2841118 4326782 8781987
35795 8781987 11100369 7371358 404119 -3547639 -2781910 -1324948 -2001529 -2547958 -512678
35786 -512678 1726727 293807 -4034606 -6732761 -5655913 -2899231 -859515 329730
35778 329730 1104522 1140182 637395 682655 1426545 1893075 2347411 4501312 8013122 9127051
35768 9127051 5133751 -1234848 -4469470 -2840980 85355 470144 -1698016 -4277763
35760 -4277763 -6478191 -8808653 -10744735 -10765907 -8795472 -6714399 -5744507 -4838195 -2769237
35751 -2769237 -468663 455947 601214 1793248 3353001 2078294 -3023170 -8382675
35743 -8382675 -9995353 -8019038 -5239452 -2732154 203553 3021361 4191111 4266324
35735 4266324 5473681 7870282 8938181 7678068 6014748 5066079 3321724 352418
35727 352418 -969857 1167386 3539180 1797684 -3257243 -6919581 -7113271 -6025721
35719 -6025721 -5587621 -5109513 -3941789 -3016827 -2498684 -791938 2430783 4493466 2988188
35710 2988188 -663131 -2753033 -1634328 854991 1897038 690319 -922720 -559034
35702 -559034 1779748 3342746 1915591 -1358718 -3778435 -4634511 -4803254 -3822465 -660616
35693 -660616 2764720 2697208 -863565 -3359050 -2055954 355376 698409 219779 1479805
35684 1479805 3466709 3604365 2343149 1820664 1677803 159516 -1985158 -2687093 -2479147
35675 -2479147 -3121311 -3387970 -872671 2616489 2657294 -493111 -1518789 1785426 5080999
35666 5080999 4357281 1575756 589509 1439400 2099077 2658526 4088028 5188584 4354526
35657 4354526 2786350 2838682 4409734 5561315 5380029 3834763 437037 -4212795 -7006122
35648 -7006122 -5472361 -1441486 1159735 1365839 1407424 2621019 3798855 3307319 695561
35639 695561 -3295275 -6448423 -5887458 -1539376 2239374 1123745 -3906175 -8295364
35631 -8295364 -9789856 -9487086 -8092751 -5134332 -1878223 -1016620 -2533779 -3241008 -1501605
35622 -1501605 652108 1284207 1384309 2310688 3078788 2195824 274999 -950326 -743262
35613 -743262 782077 3342175 5870212 6858058 6406752 6249694 6739144 5825428 2379391
35604 2379391 -1493349 -3169031 -2781229 -1975880 -1063413 472785 1946083 2252014 1931036
35595 1931036 2366046 3360356 3323739 1598611 -920668 -3211191 -4800611 -5304053 -4557135
35586 -4557135 -3071764 -1464874 153022 1421703 1176261 -1126080 -4002158 -5245892
35578 -5245892 -4350087 -2686295 -1692253 -1670119 -1743329 -286061 3571210 7921210 8956551
35569 8956551 5399928 754829 -825041 278012 565067 -899478 -1472756 279225
35561 279225 2105974 1658966 -97929 -920737 -835448 -1521265 -3187191 -4113031 -3127756
35552 -3127756 -1156372 -137573 -988586 -2557934 -2539163 -76293 2633587 2677881 521608
35543 521608 -262413 1749553 3272653 1100852 -2635558 -3160352 103187 2914257 2198565
35534 2198565 -981452 -4760837 -8731750 -11509828 -10167742 -4773759 -84068 528808
35526 528808 -236293 1207749 2620488 -251022 -5320161 -6340824 -3130517 -2419412 -6786515
35517 -6786515 -9726765 -5489727 1975324 4940593 2502386 -141417 73410 2010578
35509 2010578 4221021 5477479 3190923 -3130784 -8112453 -6063227 318366 2847602
35501 2847602 -560942 -3675103 -2235203 390306 376279 -127080 2152964 5319991 5641287
35492 5641287 3633909 2149956 1014156 -1782155 -5185490 -5754639 -2681960 1141946
35484 1141946 2729082 1306907 -2195181 -5861232 -7818016 -8111382 -8252325 -7833973 -4271288
35475 -4271288 2078729 5735252 2514908 -4141782 -7012694 -3610077 2652888 7894603
35467 7894603 10149871 7886877 1287127 -5030750 -5278976 491040 6123828 6816107
35459 6816107 3695620 482868 -1097238 -1645818 -2630045 -5444932 -9648006 -11932949
35451 -11932949 -9437411 -4048737 -475064 -93192 -88977 1246630 2393265 2465596 2975159
35442 2975159 4307376 4477149 3196784 3086959 4471121 3176428 -3027767 -9427503
35434 -9427503 -10117025 -6203425 -3684662 -4799174 -6319769 -5900592 -5255544 -6090582 -6860779
35425 -6860779 -5511716 -2867244 -1260338 -1271710 -1556014 -1170776 -717104 -1252818 -2758346
35416 -2758346 -3824529 -2897998 -51814 2625403 2826167 281832 -2923653 -4259554
35408 -4259554 -3026486 -987324 -593640 -2236504 -3688020 -3015223 -1432985 -1794456 -4502281
35399 -4502281 -6913773 -7260446 -7006311 -7926354 -8536441 -5674644 652136 5905607 5425527
35390 5425527 -312635 -5829398 -6653364 -4534129 -4867255 -8797235 -10938994 -7041488
35382 -7041488 -754184 1374888 -642259 -1514480 -434863 -2306870 -7840845 -10163096
35374 -10163096 -5393825 237929 -149950 -3185208 -1399296 3854929 4734320 284245
35366 284245 -2245646 -77259 681285 -3638119 -7159030 -3979901 1961049 3171786
35358 3171786 149381 -509762 2979806 5623975 4052797 663221 -1530358 -3046825
35350 -3046825 -5060352 -6274034 -5219648 -3370001 -3537381 -6072686 -8193114 -6845996
35342 -6845996 -1766747 3921739 6275626 4447485 1726241 1680009 3787339 4372328 1520228
35333 1520228 -2789952 -5576986 -6069923 -5523952 -5312943 -5777923 -5858403 -3778744 427568
35324 427568 3198523 614162 -6024376 -10357969 -8286893 -2844132 355976 331385 285740
35315 285740 1491249 1727274 -133409 -2021733 -2498743 -3213804 -5317028 -6282496 -3408392
35306 -3408392 1348808 3543554 2502860 1929184 4053955 6521798 6310336 4041013
35298 4041013 2451709 2322296 2014095 261944 -2262641 -3889844 -3464292 -1396204 138057
35289 138057 -982806 -3875746 -4763106 -1571563 2595834 2702461 -1819271 -6156663 -6115295
35280 -6115295 -3110073 -1946115 -4734907 -8525562 -8977460 -5370583 -1196846 191051
35272 191051 -467918 126776 2839195 4750570 3575852 1202528 855623 2357972 2837471
35263 2837471 1244701 -732616 -1968035 -3096587 -4124734 -3788808 -2108806 -915537
35255 -915537 -873979 -616613 69946 -913673 -4293639 -7316106 -7396480 -5429934 -3339017
35246 -3339017 -975950 1847869 2868561 413434 -2940729 -3349578 -918963 1434622
35238 1434622 2666551 3360469 2637213 -10612 -1254748 2148808 6691176 5603667
35230 5603667 -694657 -4310731 -1380397 3114731 4493677 4971675 6946493 6878069 2016528
35221 2016528 -2741469 -2060282 538245 -1259998 -5032514 -3544962 2045581 3292971
35213 3292971 -1286546 -3672006 -222699 2203842 -1476654 -5414660 -2510909 4038744
35205 4038744 6590746 5164590 5556941 8760724 10398545 9066947 7729550 7240545
35197 7240545 5241033 1762301 -249612 -725505 -2965890 -7125705 -8799038 -6077457
35189 -6077457 -2938681 -2977833 -4159909 -2909262 200817 2218476 2506857 2341968 1833970
35180 1833970 285314 -1856616 -3894568 -6174697 -8186478 -7353093 -2759082 1514151
35172 1514151 541440 -4399556 -6620397 -2517955 3767338 5569006 1407676 -4219128
35164 -4219128 -6531229 -5209477 -3587183 -4239951 -6074751 -6026896 -3286723 -620141 -694590
35155 -694590 -2268897 -1864908 1171723 3652752 3367079 2637135 4831891 8444120 7778705
35146 7778705 511374 -7929212 -10019418 -5186693 -200362 -129514 -2155968 -655831
35138 -655831 4058163 6096445 2708500 -1663147 -1788693 1266427 2602980 1043000
35130 1043000 268681 2574301 5333034 5283015 3461590 3141286 4379436 3935306 649526
35121 649526 -2340156 -2278971 -1090289 -2254081 -4942705 -4948087 -1444318 1172882 -82448
35112 -82448 -1901237 210143 4325864 4207795 -1355162 -5954667 -3897412 2418163 6115489
35103 6115489 4597219 1544215 925898 2073849 1659192 -1148980 -3151226 -854873
35095 -854873 5062064 9917258 9941519 6310068 3488899 4089274 6478046 7285578 5083911
35086 5083911 1472117 -538442 848889 4462287 7199451 7304114 5723470 3569046
35078 3569046 303375 -3515898 -4146932 650965 6248149 5763152 216613 -1800262
35070 -1800262 3546670 9312218 7842591 1632085 -1283307 1067179 3993689 4887658
35062 4887658 5582019 6390889 4647360 578456 -1320295 682310 2092127 -931262
35054 -931262 -5186321 -4918659 -44407 4379484 5589410 5797953 7295397 8553178 6953832
35045 6953832 3359095 1652442 3910518 7699955 9016849 6970751 4103526 2396688
35037 2396688 1099582 -784308 -2273126 -2588951 -3489187 -6518404 -9281882 -7942334
35029 -7942334 -2933060 1413274 2910464 3286770 3383150 1118123 -3716439 -6724311 -4270558
35020 -4270558 1220415 4694933 5006075 4530948 4074352 2231047 -834357 -2842309 -2887163
35011 -2887163 -2355921 -2002948 -978059 711577 1588073 1436036 2031047 3896304 4679676
35002 4679676 2370342 -1748824 -4995914 -6415705 -6245845 -4086177 -178961 2715645
34994 2715645 1979649 -459268 175425 4385276 6411661 1952101 -4871144 -6420663
34986 -6420663 -2330778 -192352 -4133945 -7882477 -3390765 6890681 12146064 6971134
34978 6971134 -2637064 -8226384 -8441906 -6685871 -3933094 993841 6205797 7256328
34970 7256328 3071705 -2524513 -5757444 -6225167 -4939524 -2506412 -349200 -533458
34962 -533458 -2582492 -3021791 -44491 3616359 4688461 4212084 5568530 8913476 10744757
34953 10744757 8923153 5368096 3092857 2686585 2848416 2944813 3571159 4998632 6195587
34944 6195587 5789910 3785910 1896177 1695741 2532260 2087754 -605940 -3506317 -3607377
34935 -3607377 -148522 4791936 8396782 9291464 8188251 6816200 5770389 3675015
34927 3675015 -157531 -2639610 514526 8016287 12282023 8347597 644771 -2991482
34919 -2991482 -1622880 -354261 -853022 401677 3782204 3779932 -2076350 -7729580 -6878354
34910 -6878354 -1985322 624511 841587 3204431 7521591 8550014 4992217 1809169
34902 1809169 1968629 2004354 -1417581 -5523373 -5683352 -2164744 1004994 1607533 456881
34893 456881 -1244790 -2847108 -3599085 -3390648 -3398845 -4399509 -5492829 -5841725 -6192059
34884 -6192059 -7086432 -7121495 -4907275 -1576861 531389 848928 721930 1368613 2760216
34875 2760216 3539572 1501570 -4000591 -9456583 -9761013 -4871331 -807787 -1650207 -3792471
34866 -3792471 -1639192 3933024 7443461 7155449 6290971 6698247 6708967 5679046 5624283
34857 5624283 7164572 8264815 8302916 8970926 9546570 6126834 -1643973 -7588995 -6675256
34848 -6675256 -2181847 -747160 -2954941 -3938438 -1766154 384822 460178 561707 2157053
34839 2157053 2745264 99706 -3288174 -3327247 -169795 2259302 1858440 518750 564482
34830 564482 1604849 1866980 832439 -677476 -1865663 -2259751 -1523797 -62064 884847
34821 884847 714289 211000 -198161 -1694662 -4841395 -7333164 -6610398 -4039158 -3161699
34812 -3161699 -3764954 -1818478 3299370 5977567 2092961 -3981237 -4770379 -100256
34804 -100256 3111807 994729 -2614605 -2802726 -305601 870646 -562866 -2388945
34796 -2388945 -2389289 -357903 2410945 4016483 3081219 150582 -2635975 -3820831 -3680702
34787 -3680702 -2854091 -1520570 -467439 -1094166 -3213106 -4351853 -2540347 1300228
34779 1300228 4759647 6533610 6563475 4895057 1962699 -634172 -1084207 835786 3473499
34770 3473499 4742319 3877564 2245892 2135767 3933281 5074031 3190533 -321427
34762 -321427 -1939489 -914632 11282 -978314 -2384637 -2226174 -687096 1068769 2210987
34753 2210987 1397666 -2412706 -6839795 -7036530 -2103166 2439795 1530719 -2703923 -4553316
34744 -4553316 -2841905 -1323884 -2225059 -3710373 -3701596 -2508352 -1183637 -190597 -91188
34735 -91188 -1011932 -1299352 706664 3504827 3802200 1275519 -887659 -653239 566505
34726 566505 1005207 958360 952608 314260 -902325 -1084595 106243 415725 -1511378 -3492984
34716 -3492984 -3027298 -1327683 -1411946 -3433772 -4877780 -4792670 -4778999 -5571038 -5477942 -3235095
34706 -3235095 -207266 1643123 2367455 3025389 3303339 2185123 533364 630587 2412192
34697 2412192 2244357 -2587668 -9257150 -11884557 -8812532 -4633372 -3596334 -3707949
34689 -3707949 -362868 5879896 9390248 7511827 4253322 4132890 5997491 6011635 3994262
34680 3994262 2719807 2453114 789886 -2122083 -2752879 97891 2649946 1450079
34672 1450079 -1691822 -2779066 -1411104 -576893 -2088074 -4896580 -6986412 -6687134
34664 -6687134 -3266782 1469316 3502162 1113769 -2337168 -3034443 -2251914 -3308112
34656 -3308112 -4693956 -1830326 4491846 7543421 4029223 -1564439 -4242161 -4674729
34648 -4674729 -5083375 -4432302 -2089522 -1581737 -5421862 -9721350 -9288200 -5169249 -1827383
34639 -1827383 267540 3242907 5482225 3524708 -811477 -1916729 1132557 3692028
34631 3692028 3249380 2093318 1916985 1520315 597860 532721 989106 822826 1979060
34622 1979060 6448328 10012793 6595123 -952486 -3019016 2248620 5663859 1241663
34614 1241663 -5338487 -6890242 -4659763 -2588720 202783 4603437 6428635 3294509
34606 3294509 207358 1245556 2081962 -1678365 -5403414 -3494704 -256130 -2509301
34598 -2509301 -6599036 -4099502 3262047 6275397 3568086 2215155 4035629 3501443
34590 3501443 -163906 -784490 2969743 4861754 2857247 2731564 6441595 7618725
34582 7618725 3350272 315673 3328641 6944371 5156058 1268182 763726 1468112
34574 1468112 -1197472 -4928465 -4751414 -2299026 -2965841 -6713895 -8894038 -8207751 -7471635
34565 -7471635 -7799567 -7400602 -5221536 -1827832 1838341 3694530 1451581 -2712830
34557 -2712830 -2617521 2906168 6430891 2657941 -2349641 307092 8703150 13183648
34549 13183648 10526352 6365079 4662660 3560471 2051585 2364858 4028336 3109916
34541 3109916 -298891 -856271 2856268 4713968 677779 -4015537 -2677810 2380212
34533 2380212 3449129 -1092144 -5138834 -4177501 -799335 205618 -1727468 -3405397
34525 -3405397 -2456725 486630 3124264 3653183 2124943 432049 375707 1136221 -360785
34516 -360785 -5291162 -10000497 -9447086 -3667337 1820909 3151846 2771803 4652504 7664195
34507 7664195 7666285 4454052 1715502 510636 -1896174 -5888874 -7551543 -4947412 -1532988
34498 -1532988 -533908 -272842 1660571 3663417 3334784 1856745 1169088 144938 -2127513
34489 -2127513 -2648662 826170 4355955 2822058 -1760882 -3057938 -151590 1946164
34481 1946164 976579 -4198 722774 864868 -213263 813041 5077333 8089435 5856656
34472 5856656 669665 -2516973 -2477993 -1373937 -586893 -182235 -753909 -2623006 -4084025
34463 -4084025 -3117482 -533732 691198 -726936 -2814256 -3144228 -2177175 -2633999 -5312010
34454 -5312010 -6808665 -3284196 3816446 8595110 8129184 5850599 5497588 5293677 1875744
34445 1875744 -2999420 -4821276 -3711049 -3796006 -5739922 -5772732 -2778122 -486821 -776302
34436 -776302 -223047 3664700 7282217 5903926 912690 -1822050 576241 5077842
34428 5077842 6783634 4134011 352857 107089 4054696 7484193 6141615 2030379
34420 2030379 187680 919712 -95811 -4240038 -7914289 -8911022 -9167494 -9404248 -6875303
34411 -6875303 -1365239 2144356 593489 -2384591 -2910344 -2967148 -5041413 -5666831 -950253
34402 -950253 5057518 4858137 -1515038 -6977719 -7847924 -7048367 -7073624 -6437550 -4107172
34393 -4107172 -1707913 52536 2178909 3510168 1146140 -3763289 -5729184 -2580272
34385 -2580272 1216005 1445012 57196 994487 3691086 4492358 2293765 -644409 -2225575
34376 -2225575 -2300290 -1864712 -2199984 -3785374 -5053728 -3757847 -314251 2234425 2183108
34367 2183108 483824 -2373560 -7018697 -11369509 -10686939 -4442288 1025890 772715
34359 772715 -1469956 697282 5991072 7320549 2688380 -2262920 -2878643 -650003
34351 -650003 1560928 3835122 6282412 6521895 3299984 -726796 -2744957 -3483402 -4519540
34342 -4519540 -4804886 -2987541 -771868 -645517 -2079813 -3063525 -3643367 -4746621 -5212708
34333 -5212708 -3632018 -1851131 -2777670 -5483847 -6437372 -5194949 -4732027 -5976417 -6322544
34324 -6322544 -4554193 -3195346 -4242753 -5946360 -5841091 -4237381 -2784229 -1946422
34316 -1946422 -1635244 -2098444 -2666196 -1928988 -450952 -541663 -1969898 -1379041 1993331
34307 1993331 3992846 2111571 358872 3012259 6913125 5885484 679224 -2256525
34299 -2256525 -1303299 -1679589 -5555535 -7298024 -2276610 5200510 7787579 5178650
34291 5178650 2786251 2546507 948974 -3904577 -8677302 -9889731 -8565476 -7258947
34283 -7258947 -5448717 -1310390 3478609 4626305 1198811 -2683944 -3522555 -2842959
34275 -2842959 -3443972 -3791049 -309588 5547079 7334126 1988871 -5867511 -10158801
34267 -10158801 -10286226 -8957915 -6617638 -2455363 1263402 1098658 -1831106 -2850681
34259 -2850681 -912196 -259718 -3648939 -8109383 -9712389 -9069792 -8991066 -9061455 -6308369
34250 -6308369 -704065 3332665 2115450 -2367798 -4515861 -2039339 964187 -598564
34242 -598564 -5505832 -7407726 -3732806 437119 -326182 -4317031 -6412655 -6100890 -6240544
34233 -6240544 -5716804 -365786 8243471 11952770 6799268 -858508 -2781832 814427
34225 814427 3532823 2118150 -1150573 -3506607 -4495871 -3996117 -1120222 3940987 8757244
34216 8757244 10099716 6390566 -593723 -6334863 -7344265 -4770864 -2741555 -3039694
34208 -3039694 -3660119 -2842277 -1569445 -1157427 -1353505 -2088021 -4141900 -6617431 -6735185
34199 -6735185 -3763915 -261974 1940437 3618007 4701441 3280489 212581 -26367
34191 -26367 3690496 6009137 2995629 -1381746 -1654663 523233 249005 -1600594 -283882
34182 -283882 3887874 5797305 4056468 2589619 3524797 4577141 4068033 3071716 2021150
34173 2021150 295320 -598368 1279038 3426438 1588273 -2563110 -3078416 223481
34165 223481 866565 -3168597 -5428747 -1794623 2435028 1829192 473433 5079377 13193308
34156 13193308 16308792 12338320 7402713 5886467 5458837 2679960 -1868734 -5525529
34148 -5525529 -6931715 -6414022 -5557488 -6479230 -9121102 -10003613 -6621002 -2124091 -1967667
34139 -1967667 -6398479 -10217895 -9997647 -7474374 -5338173 -3903372 -3189252 -4215997
34131 -4215997 -6147381 -5558595 -1044338 4112843 6303825 6231345 6617792 7475850 6795738
34122 6795738 4595119 3114479 3425423 4392400 4759170 4157248 2459961 253154 -531583
34113 -531583 1237120 3493867 3208886 666977 -1381291 -2585995 -5146116 -8356805
34105 -8356805 -7573057 -1252125 4885911 4712445 -21357 -2752350 -1498630 94157
34097 94157 225577 1337167 3925370 3872728 -925788 -5804942 -5262300 -622661 2357019
34088 2357019 1425165 -860306 -2516921 -4494692 -7645965 -10886616 -12963650 -13534098
34080 -13534098 -12300285 -9439355 -6864512 -6509855 -7241698 -6093539 -2869528 -763760
34072 -763760 -1696590 -3738291 -4330605 -3605173 -2925448 -2227731 -819542 563484 599135
34063 599135 -293989 -221866 1553461 3414004 3193209 713862 -1878625 -2472419 -1426631
34054 -1426631 -905990 -1691630 -1995032 -325090 1880337 2098186 131015 -2253061 -4269264
34045 -4269264 -6461450 -8546880 -9332752 -8858497 -8469034 -8546972 -8138157 -7039514 -6389812
34036 -6389812 -6941590 -8287693 -9605985 -9627839 -6779091 -1625962 1981385 1426358 27970
34027 27970 3012577 9040186 10865012 5620555 -756122 -1981646 274572 261779 -3134393
34018 -3134393 -5845264 -4893263 -1459680 1364720 1257411 -1818654 -4808176 -3928853 334582
34009 334582 2917006 1006222 -1709889 -658116 2748358 3975988 2672200 2074794
34001 2074794 2495713 892678 -2985347 -5186891 -3551165 -927862 -707431 -2463801
33993 -2463801 -3815518 -3880865 -3096887 -1844313 -1004596 -2109050 -5268343 -8233911 -8893543
33984 -8893543 -7699980 -6496571 -5823587 -4639057 -2451955 -683703 -1199886 -3440805
33976 -3440805 -4104896 -1160919 2582811 2678001 -193138 -693630 2430941 3021350 -3303863
33967 -3303863 -11193228 -12638185 -8630269 -6448872 -7251647 -5020252 1856569 7098173
33959 7098173 7285451 7382992 10780825 11741512 4746887 -4665822 -6790693 -1885518 1095531
33950 1095531 -1779343 -5317338 -4882885 -2306665 -340259 1989344 5462305 7485778
33942 7485778 6386002 4777878 5052765 4855634 945330 -4933670 -8183678 -7894142 -7085525
33933 -7085525 -6880930 -4713636 493195 4892269 4138516 -446238 -3056929 -580630
33925 -580630 3985029 6069425 5068214 3380359 1810570 -803010 -3943273 -5177052
33917 -5177052 -4322988 -4155162 -5346632 -4618406 -690246 1885051 -793811 -4891453 -4013741
33908 -4013741 499851 1335656 -2933960 -5151539 -753016 5219175 6135615 3163957
33900 3163957 1591099 1981491 795412 -2614071 -5231314 -5529160 -4597779 -2768505 440081
33891 440081 3214951 2488242 -1518790 -5209172 -6301924 -5508521 -3689650 -920301 1345582
33882 1345582 814464 -2129761 -4556224 -5230059 -5559299 -5873391 -4552433 -1953552 -1215468
33873 -1215468 -3154084 -3957752 -633993 4151317 5610254 3043510 -264796 -1615897
33865 -1615897 -753154 1330228 2888695 1956195 -1248207 -3496577 -2268152 793919
33857 793919 2176026 1026049 -787349 -1921744 -2379825 -1945812 -330271 1489986 2094166
33848 2094166 1335228 -323083 -3008517 -5960725 -6337884 -2406082 2997984 5336882
33840 5336882 4209707 3051569 3262934 2491650 -479774 -3011899 -2783358 -1647746 -2574931
33831 -2574931 -4718045 -4663994 -1919972 -117308 -2010410 -5467062 -6181433 -3457742 -1109494
33822 -1109494 -2140208 -4666712 -4992701 -3161061 -2340430 -3167423 -2637475 376828 2587298
33813 2587298 1630480 177959 1214832 2500095 413242 -2983066 -2321766 2360483
33805 2360483 4858601 1366830 -5013727 -9475904 -10846899 -10198983 -8141775 -5546795
33797 -5546795 -3743921 -2118620 1588736 6964520 9920372 7836020 2901217 -1448566
33789 -1448566 -4579373 -7228595 -8910039 -9055783 -8395088 -7213175 -4616805 -1187407
33781 -1187407 637439 812666 2779193 7499236 10101801 6535240 545170 -905694
33773 -905694 2724549 5658252 4579613 2008404 696545 -239818 -2036244 -3209401
33765 -3209401 -2107313 50739 713417 -1089015 -4620037 -8464214 -10519617 -8857242
33757 -8857242 -4234064 -381507 -12444 -1368789 -506808 3348754 6602853 5852392 1984095
33748 1984095 -1554744 -3400686 -4970889 -6636963 -6109653 -2321141 1443906 1224440
33740 1224440 -2056019 -3936385 -2753042 -1185052 -1539233 -3176889 -5062438 -6943401
33732 -6943401 -7091866 -3203597 2710317 4719753 834919 -3657466 -3751464 -1399201 -777353
33723 -777353 -1074415 792899 3458484 3043547 -48765 -2021217 -2146528 -2709357 -3353207
33714 -3353207 -1377878 2455804 4198686 3103662 2077861 1403425 -1581657 -5337425
33706 -5337425 -3858507 3272301 7298219 1807190 -7381282 -9900447 -4834749 -461871
33698 -461871 -1808871 -5160275 -5281946 -2305371 535615 1776978 1653561 -65275 -3226212
33689 -3226212 -5648077 -5108688 -2811320 -2548995 -5641006 -8473901 -6758409 -1376826
33681 -1376826 2250021 910945 -2574081 -3622373 -1979218 -1159736 -2895350 -5007148
33673 -5007148 -4937126 -2949890 -1046131 -474607 -1234577 -2799734 -4466835 -5653119 -6253995
33664 -6253995 -6291269 -5456499 -3738699 -2066645 -1357773 -1354497 -1331518 -1330471 -1724692 -2415972
33654 -2415972 -3465837 -5309488 -7236726 -7460026 -6263959 -6706879 -9684652 -10911174
33646 -10911174 -6616307 -187178 1628063 -1950717 -5302934 -4990770 -3409372 -3241283
33638 -3241283 -3570765 -3079135 -2400223 -1469608 1083766 4017475 3408912 -1238799 -5207068
33629 -5207068 -5457544 -4929095 -6876650 -9269506 -8715150 -6258403 -5035066 -5163069 -5096660
33620 -5096660 -5284988 -6316589 -6144297 -3620951 -2172394 -4878032 -8036816 -5341021
33612 -5341021 2631052 8780210 9085500 6402619 4376464 3030344 1727543 1529689
33604 1529689 2353708 1737218 -1015399 -2485355 499504 6236559 9943602 8604638
33596 8604638 2741854 -4613726 -9255140 -8276565 -3265462 551387 299656 -922504
33588 -922504 1261239 5518792 5905163 221729 -6100625 -6651209 -2468468 -501387 -3976469
33579 -3976469 -7995651 -6394999 158126 6162349 9238911 11522692 13585931 12273554
33571 12273554 6445258 470830 -1167002 292992 759480 -482284 -1118813 -670902
33563 -670902 -976388 -2322829 -2613130 -674806 2100216 3638189 2935232 267559 -2678428
33554 -2678428 -3560588 -1938891 -146922 19938 18320 1885782 4536033 5355859 4003861
33545 4003861 1785542 -1170189 -4815337 -6783480 -4987518 -1642008 -698274 -2009789
33537 -2009789 -2204221 -650554 214743 290393 2198831 5519424 6028423 2513928 -518231
33528 -518231 616413 3737498 4900740 3782768 2316500 1459514 1994460 5031351 8770734
33519 8770734 8307378 2192646 -3946210 -4195691 26548 3262158 4221964 5650268 7725691
33510 7725691 7295967 3660152 -5868 -2004157 -4569726 -9311825 -13712191 -14422111
33502 -14422111 -11820559 -9265584 -9107043 -10768273 -11716295 -9518165 -4171962 873360
33494 873360 1436835 -2617555 -6550678 -6014309 -2294882 -703618 -3903137 -8516460 -9300772
33485 -9300772 -5676211 -2299431 -2816342 -4980442 -3910859 761914 3876828 1495560
33477 1495560 -3892551 -6590278 -4317852 368424 3951510 4903527 3407856 590859
33469 590859 -1661745 -1856029 -374241 1175487 2032272 2546640 2576522 1227584 -1390695
33460 -1390695 -3446011 -3152057 -595442 2564286 4556151 4382837 2079220 -1102400
33452 -1102400 -2926003 -1421103 3246326 7938083 8539893 4063912 -1524640 -3144389
33444 -3144389 -396121 2283669 1713855 -159285 85039 2130829 2835966 836340 -2473854
33435 -2473854 -5508498 -7140849 -5630819 -441410 4845109 5209339 955749 -1571514
33427 -1571514 1989176 7978125 9234161 3851517 -3232562 -6412199 -4657218 -833134
33419 -833134 2044247 3245821 4002132 5292406 6166646 4880827 1511678 -1928091 -4085069
33410 -4085069 -5138936 -4854921 -2549099 -145381 -1843943 -7987611 -12270588 -9066407
33402 -9066407 -1401242 3134361 3001083 3436543 6625758 7780796 3364775 -2660344
33394 -2660344 -4831549 -3976733 -4313240 -6066594 -6115924 -3878974 -1483434 575350 3031508
33385 3031508 4166563 1799105 -1487432 -745560 3267752 4278384 248054 -2968587
33377 -2968587 -581971 3917434 4634637 1997131 626854 1575803 2084475 1420446 1713096
33368 1713096 3371011 4170957 3112002 1399202 -644614 -3975458 -7544955 -8199497
33360 -8199497 -5226400 -2170364 -2400844 -4795077 -5465260 -2697369 1014081 1504304 -2639611
33351 -2639611 -7830439 -8474697 -3209034 3115647 5304616 4013999 3398771 4182775 3311806
33342 3311806 386252 -331697 3768326 8974346 9741470 5733501 1681590 1315741 3751076
33333 3751076 5674914 5492519 4762961 5768553 8078437 8663078 6080402 2858011 1912340
33324 1912340 2332654 1555223 214790 958539 3285861 4179438 3833678 5616713 9430383
33315 9430383 10577213 7214846 3472275 2261529 576153 -3890368 -6867024 -4136488
33307 -4136488 131153 -1320454 -7641894 -11205372 -9080732 -5953241 -5232648 -4270053
33299 -4270053 -404476 4172304 6494190 7155860 7586818 6798540 3925376 924726 -273703
33290 -273703 -800754 -2243796 -3377517 -2501327 -1098244 -1924606 -4651668 -6432109 -6059395
33281 -6059395 -4747837 -3253857 -1129822 1007102 1254611 -548535 -1762251 -476253
33273 -476253 1290126 -81958 -4560980 -7576236 -5469762 -608696 990382 -2744078
33265 -2744078 -6943924 -5894829 -451814 3196088 1641571 -1815085 -2184858 774250
33257 774250 3037612 1883616 -1107059 -2438594 -607262 2713026 4605763 3599265
33249 3599265 652478 -2160034 -3614273 -3994422 -4342427 -5365141 -6516611 -5897532 -2163451
33240 -2163451 2743480 4299494 549129 -4630735 -5704731 -2165290 1616367 2768049
33232 2768049 2758734 3345766 3353716 1464335 -596660 -306705 1872905 3315401 2679760
33223 2679760 582143 -2008234 -4029053 -4020815 -1666287 1106343 2431380 3035815 4475963
33214 4475963 5906205 5222186 2854853 1502636 1969720 2132842 734575 -497295 189893
33205 189893 1752750 2213931 1713914 1849483 3015664 4184682 4731501 4881116 4679403
33196 4679403 4036959 3720391 4765186 6489062 6446272 3384499 -539253 -1940801 -660417
33187 -660417 -424485 -3830272 -7834113 -6729806 91459 6232583 6135739 2509612 2458650
33178 2458650 7285207 10662744 7895498 2594942 1288869 4580398 7498983 6821516
33170 6821516 3988414 1531602 656151 2367874 6959893 11597741 12237430 9184584
33162 9184584 6915861 6769786 4331960 -2840826 -9432720 -9362379 -5321490 -4996959 -9329009
33153 -9329009 -11592388 -8524047 -5076723 -5553230 -6617280 -3581955 1479895 3426456
33145 3426456 2269468 1774982 2176248 605858 -2134231 -1670196 2468545 5358682 4328117
33136 4328117 2774482 3836031 5119752 3391344 638937 920603 3595120 4457445
33128 4457445 2586014 1520122 3394608 5815662 5817364 4047718 3258857 4313080 5342362
33119 5342362 4232244 1002133 -2021853 -2271441 269241 2572149 1941821 -334020
33111 -334020 -424582 2557309 4622601 2109599 -2761273 -4316634 -1209330 1461590 -587440
33102 -587440 -4208581 -2918826 3475484 7692851 4487761 -2583885 -6464084 -5395605
33094 -5395605 -2703570 -299068 2508444 4598072 3087438 -1206763 -3441477 -1855447
33086 -1855447 -520139 -2288913 -3697439 -1004858 2676689 1768282 -2700412 -4402225
33078 -4402225 -1328083 1695555 711579 -2269963 -3487299 -2583613 -1435409 -936101 -1055961
33069 -1055961 -1901904 -3069692 -3621614 -3574959 -3588325 -2912735 -193348 3346826 4558704
33060 4558704 2824960 563549 -1381392 -4706994 -8627190 -8807179 -4321334 -1019450
33052 -1019450 -3511448 -7582874 -6116501 15331 3282303 808428 -2024989 -211112
33044 -211112 4156102 6039467 4349672 2026351 1663509 3163519 4293011 2504781
33036 2504781 -2364064 -6843237 -7076296 -3444699 92949 1090195 438903 -657334 -2150378
33027 -2150378 -3224654 -2547520 -1291922 -2154098 -4254732 -3327083 1106269 3419891 -83643
33018 -83643 -5212401 -6250229 -4446169 -4637063 -6169570 -3894467 2449466 6501939 4311859
33009 4311859 -308331 -1818473 -129917 1162099 736711 553429 2290025 5155694
33001 5155694 6807916 5431856 1612095 -1600288 -1725435 118887 1040055 891795 2095601
32992 2095601 4678995 5173354 2001142 -1639165 -2800406 -3347938 -5897607 -7989874
32984 -7989874 -5242175 912997 4057213 1866268 -813746 35300 1324363 -1553030
$$ [...]
##END NTUPLES=NMR SPECTRUM
##END=
