##TITLE=31Pdec_4AEDB0606
 CDCl3
 24 sc
 7.6.2024
##JCAMPDX= 6.0         $$ Bruker NMR JCAMP-DX V2.0
##DATA TYPE= NMR SPECTRUM
##DATA CLASS= NTUPLES
##ORIGIN= UXNMR, Bruker Analytische Messtechnik GmbH
##OWNER= root
$$ XWIN-NMR		Version 3.5
$$ Fri Jun  7 15:50:30 2024 Russian Standard Time (UT+4h)  she@DPX200
##.OBSERVE FREQUENCY= 81.013821
##.OBSERVE NUCLEUS= ^31P
##.ACQUISITION MODE= SIMULTANEOUS
##.ACQUISITION SCHEME= undefined
##.AVERAGES= 24
##.DIGITISER RES= 16
##SPECTROMETER/DATA SYSTEM= spect
##.PULSE SEQUENCE= zgpg30
##.SOLVENT NAME= CDCl3
##.SHIFT REFERENCE= (INTERNAL, CDCl3, 0, 248.564)
##AUDIT TRAIL= $$ (NUMBER, WHEN, WHO, WHERE, WHAT)
$$ ##TITLE= Audit trail, XWIN-NMR		Version 3.5
$$ ##JCAMPDX= 5.01
$$ ##ORIGIN= Bruker BioSpin GmbH
$$ ##OWNER= she
$$ F:/spectra/data/she/nmr/P31/1/pdata/1/auditp.txt
$$ ##AUDIT TRAIL=  $$ (NUMBER, WHEN, WHO, WHERE, WHAT)
(   1,<2024-06-07 15:49:25.59 +0400>,<she>,<DPX200>,
      <created by zg, POWCHK disabled, PULCHK disabled
       configuration hash MD5:
       00 E9 B6 7A A2 85 ED C7 34 08 36 98 17 FE 4E 26
       data hash MD5: 32K
       F8 AF 72 C1 C4 BB 83 E4 46 06 C9 97 4A A3 23 1A>)
(   2,<2024-06-07 15:49:42.79 +0400>,<she>,<DPX200>,
      <Start of raw data processing
       efp BC_mod = 2 LB = 10 FT_mod = 6 PKNL = 1 PHC0 = -240.815 PHC1 = 59.4 SI = 64K 
       data hash MD5: 64K
       2C 3A A5 D7 F5 0E 54 28 A5 60 3B EC A7 BF C7 23>)
(   3,<2024-06-07 15:49:57.95 +0400>,<she>,<DPX200>,
      <pk PHC0 = 31.25793 PHC1 = 0 
       data hash MD5: 64K
       49 8D F2 8B F2 3D 9F 1C 9B 8F D0 63 88 8C 62 C9>)
$$ ##END=
$$ 
$$ hash MD5
$$ 01 37 41 C8 8B 30 2A 37 4A 45 AD 4E 94 0D 1D 2F
##$RELAX= 
##$RELAX= 
##$RELAX= 
##$RELAX= 
##$RELAX= 
##$RELAX= 
##$RELAX= 
##$RELAX= 
##$RELAX= 
$$ Bruker specific parameters
$$ --------------------------
##$DU= <F:/spectra>
##$EXPNO= 1
##$NAME= <P31>
##$PROCNO= 1
##$TYPE= <nmr>
##$USER= <she>
##$AMP= (0..31)
100 100 100 100 100 100 100 100 100 100 100 100 100 100 100 100 100 100 
100 100 100 100 100 100 100 100 100 100 100 100 100 100 
##$AQSEQ= 0
##$AQ_mod= 1
##$AUNM= <au_zg>
##$AUTOPOS= <>
##$BF1= 81.014009
##$BF2= 200.13
##$BF3= 200.13
##$BF4= 200.13
##$BF5= 200.13
##$BF6= 200.13
##$BF7= 200.13
##$BF8= 200.13
##$BYTORDA= 1
##$CFDGTYP= 0
##$CFRGTYP= 5
##$CHEMSTR= <none>
##$CNST= (0..31)
1 1 145 1 1 1 1 1 1 1 1 1 1 1 1 1 1 1 1 1 1 1 1 1 1 1 1 1 1 1 1 1 
##$CPDPRG= <waltz16>
##$CPDPRG1= <>
##$CPDPRG2= <waltz16>
##$CPDPRG3= <>
##$CPDPRG4= <mlev>
##$CPDPRG5= <mlev>
##$CPDPRG6= <mlev>
##$CPDPRG7= <mlev>
##$CPDPRG8= <mlev>
##$CPDPRGB= <>
##$CPDPRGT= <>
##$D= (0..31)
0 1 0 0 0 0 0 0 0 0 0 0.03 2e-05 3e-06 0 0 0 0 0 0 0 0 0 0 0 0 0 0 0 0 
0 0 
##$DATE= 1717760964
##$DBL= (0..7)
120 120 120 11 120 120 24 19 
##$DBP= (0..7)
150 150 150 150 150 150 150 150 
##$DBP07= 0
##$DBPNAM0= <>
##$DBPNAM1= <>
##$DBPNAM2= <>
##$DBPNAM3= <>
##$DBPNAM4= <>
##$DBPNAM5= <>
##$DBPNAM6= <>
##$DBPNAM7= <>
##$DBPOAL= (0..7)
0.5 0.5 0.5 0.5 0.5 0.5 0.5 0.5 
##$DBPOFFS= (0..7)
$$ [...]
##$SUBNAM2= <"">
##$SUBNAM3= <"">
##$SUBNAM4= <"">
##$SUBNAM5= <"">
##$SUBNAM6= <"">
##$SUBNAM7= <"">
##$SUBNAM8= <"">
##$SUBNAM9= <"">
##$SW= 501.771253377433
##$SWIBOX= (0..15)
0 1 3 0 0 0 0 0 0 0 0 0 0 0 0 0 
##$SW_h= 40650.406504065
##$TD= 32768
##$TD0= 1
##$TE= 0
##$TE2= 300
##$TE3= 300
##$TEG= 300
##$TL= (0..7)
0 120 53 12 22 120 120 120 
##$TP= (0..7)
150 150 150 150 150 150 150 150 
##$TP07= 0
##$TPNAME0= <>
##$TPNAME1= <>
##$TPNAME2= <>
##$TPNAME3= <>
##$TPNAME4= <>
##$TPNAME5= <>
##$TPNAME6= <>
##$TPNAME7= <>
##$TPOAL= (0..7)
0.5 0.5 0.5 0.5 0.5 0.5 0.5 0.5 
##$TPOFFS= (0..7)
0 0 0 0 0 0 0 0 
##$TUNHIN= 0
##$TUNHOUT= 0
##$TUNXOUT= 0
##$USERA1= <user>
##$USERA2= <user>
##$USERA3= <user>
##$USERA4= <user>
##$USERA5= <user>
##$V9= 5
##$VALIST= <valist>
##$VCLIST= <CCCCCCCCCCCCCCC>
##$VD= 0
##$VDLIST= <DDDDDDDDDDDDDDD>
##$VPLIST= <PPPPPPPPPPPPPPP>
##$VTLIST= <TTTTTTTTTTTTTTT>
##$WBST= 1024
##$WBSW= 4
##$XGAIN= (0..3)
0 0 0 0 
##$XL= 0
##$YL= 0
##$YMAX_a= 5210
##$YMIN_a= -4733
##$ZGOPTNS= <>
##$ZL1= 120
##$ZL2= 120
##$ZL3= 120
##$ZL4= 120
##$ABSF1= 0
##$ABSF2= 0
##$ABSG= 0
##$ABSL= 0
##$ALPHA= 0
##$AQORDER= 0
##$ASSFAC= 0
##$ASSFACI= 0
##$ASSFACX= 0
##$ASSWID= 0
##$AUNMP= <proc_1d>
##$AZFE= 0.1
##$AZFW= 0.5
##$BCFW= 0
##$BC_mod= 2
##$BYTORDP= 0
##$COROFFS= 0
##$CY= -3
##$DATMOD= 1
##$DC= 0
##$DFILT= <>
##$DTYPP= 0
##$F1P= 0
##$F2P= 0
##$FCOR= 1
##$FTSIZE= 65536
##$FT_mod= 6
##$GAMMA= 0
##$GB= 0
##$INTBC= 1
##$INTSCL= 6.047779e-11
##$ISEN= 30
##$LB= 10
##$LEV0= 0
##$LPBIN= 0
##$MAXI= 10000
##$MC2= 0
##$MEAN= 0
##$ME_mod= 0
##$MI= 50
##$NCOEF= 0
##$NC_proc= -7
##$NLEV= 6
##$NOISF1= 182.463
##$NOISF2= 159.3651
##$NSP= 0
##$NTH_PI= 0
##$NZP= 0
##$OFFSET= 248.5645
##$PC= 4
##$PHC0= -209.5571
##$PHC1= 59.4
##$PH_mod= 1
##$PKNL= yes
##$PPARMOD= 0
##$PSCAL= 0
##$PSIGN= 0
##$REVERSE= no
##$SF= 81.0140089999694
##$SI= 65536
##$SIGF1= 159.3651
##$SIGF2= -187.1042
##$SINO= 113.3802
##$SIOLD= 16384
##$SREGLST= <1H.CDCl3>
##$SSB= 0
##$STSI= 65536
##$STSR= 0
##$SW_p= 40650.406504065
##$SYMM= 0
##$S_DEV= 0
##$TDeff= 32768
##$TDoff= 0
##$TI= <>
##$TILT= no
##$TM1= 0
##$TM2= 0
##$TOPLEV= 0
##$USERP1= <user>
##$USERP2= <user>
##$USERP3= <user>
##$USERP4= <user>
##$USERP5= <user>
##$WDW= 1
##$XDIM= 65536
##$YMAX_p= 477321783
##$YMIN_p= -14871227
$$ End of Bruker specific parameters
$$ ---------------------------------
##NTUPLES= NMR SPECTRUM
##VAR_NAME=  FREQUENCY,     SPECTRUM/REAL,   SPECTRUM/IMAG
##SYMBOL=    X,             R,               I
##VAR_TYPE=  INDEPENDENT,   DEPENDENT,       DEPENDENT
##VAR_FORM=  AFFN,          ASDF,            ASDF
##VAR_DIM=   65536,         65536,           65536
##UNITS=     HZ,            ARBITRARY UNITS, ARBITRARY UNITS
##FACTOR=    0.620285442955139, 1,           1
##FIRST=     20137.2065510682, 0,            0
##LAST=      -20513.1999529968, 0,           0
##MIN=       -20513.1999529968, -14871227,   0
##MAX=       20137.2065510682, 477321783,    0
$$ Real data points
##PAGE= N=1
##DATA TABLE= (X++(R..R)), XYDATA
$$ [...]
41278 500862 409346 312102 211066 109550 12040 -76581 -152253 -213018 -259678 -295202 -323065
41267 -323065 -345599 -363493 -376643 -385538 -392042 -398984 -408812 -422243 -437773 -452292 -462348 -465396
41255 -465396 -460595 -449055 -433590 -418171 -407333 -405580 -416475 -441350 -478155 -521413 -563564 -596910
41243 -596910 -614968 -612932 -587818 -538934 -468522 -381841 -286225 -189373 -97704 -15526 54742 111708
41231 111708 154208 181176 192089 187516 169222 139651 100923 53603 -4237 -77034 -170379 -288715
41219 -288715 -433249 -601158 -786269 -980635 -1176286 -1366688 -1547555 -1716762 -1873609 -2018137
41209 -2018137 -2151080 -2274207 -2390361 -2502721 -2613631 -2723664 -2831275 -2932951 -3023563 -3096863
41199 -3096863 -3146146 -3165151 -3149054 -3095367 -3004506 -2879994 -2728276 -2558092 -2379314 -2201283
41189 -2201283 -2031097 -1872494 -1725797 -1588846 -1458466 -1331846 -1207404 -1084935 -965076
41180 -965076 -848465 -735036 -623890 -513896 -404883 -298751 -199489 -111547 -37291 24640
41170 24640 78639 129529 180107 230556 279808 327408 374413 422945 474998 531391 591349 652655
41158 652655 712139 766238 811512 845069 864855 869843 860160 837197 803660 763477 721439 682564
41146 682564 651436 631804 626467 637078 663577 703429 751290 799606 840078 865534 871538 857197
41134 857197 824899 779042 724262 663793 598548 527176 447029 355664 252354 139096 20683
41123 20683 -96269 -205056 -300639 -380680 -445510 -497205 -538330 -570906 -596044 -614380 -626959
41112 -626959 -635965 -644815 -657615 -678341 -710265 -755823 -816637 -893062 -982983 -1080591 -1176512 -1260065
41100 -1260065 -1322862 -1361753 -1379385 -1382146 -1376836 -1367956 -1356873 -1342887 -1325235 -1304863 -1285051 -1270664
41088 -1270664 -1266518 -1275914 -1300205 -1339334 -1392565 -1458678 -1535661 -1620230 -1707371 -1790087 -1859710 -1907175
41076 -1907175 -1925040 -1909481 -1861430 -1786362 -1692771 -1589919 -1485845 -1386515 -1296200 -1218511 -1157275
41065 -1157275 -1116538 -1099360 -1105865 -1131882 -1169440 -1209036 -1242145 -1262489 -1265917 -1249950 -1213927 -1159729
41053 -1159729 -1092303 -1019169 -948812 -888789 -844568 -819442 -814868 -830446 -863541 -909191 -960782
41042 -960782 -1011324 -1054742 -1086651 -1104381 -1106491 -1092338 -1062065 -1016841 -958857 -890853 -815477 -734799
41030 -734799 -650147 -562310 -472127 -381321 -293185 -212589 -145185 -96108 -68724 -63867 -79616 -111441
41018 -111441 -152512 -194257 -227311 -242901 -234458 -199121 -138571 -58633 32593 127345 220152 307997
41006 307997 388820 459647 515761 551484 561939 544626 499931 430660 341449 238732 131105
40995 131105 29198 -55439 -112172 -133063 -114153 -56193 35332 151191 280409 412503 538863
40984 538863 652826 748923 822182 867951 882289 862765 809321 724661 613795 482914 338420
40973 338420 186658 34117 -112617 -247650 -367095 -470220 -559787 -641229 -720844 -803699
40963 -803699 -892232 -986125 -1083188 -1180268 -1273580 -1358686 -1431011 -1487218 -1526740 -1552272 -1568538
40952 -1568538 -1579874 -1587832 -1590114 -1581443 -1556015 -1510266 -1444538 -1362919 -1271769 -1178147 -1089021 -1011189
40940 -1011189 -951075 -913646 -900577 -908733 -930342 -955300 -974640 -983326 -981017 -970921 -957825 -946398
40928 -946398 -940192 -941385 -951247 -971075 -1002819 -1048492 -1108343 -1178987 -1253007 -1320591 -1372408 -1402358
40916 -1402358 -1409193 -1396671 -1372276 -1344844 -1321785 -1306953 -1299996 -1297194 -1293071 -1281889 -1258686 -1220014
40904 -1220014 -1164530 -1093299 -1009585 -918272 -825286 -737250 -661139 -603436 -568773 -558715 -571634
40893 -571634 -603989 -652264 -714333 -789505 -877420 -976571 -1083272 -1191695 -1295123 -1387729 -1465702
40882 -1465702 -1526959 -1570033 -1593462 -1596379 -1579689 -1546580 -1501851 -1450491 -1396448 -1342237 -1289454
40871 -1289454 -1239767 -1195812 -1161453 -1141116 -1138340 -1154177 -1186373 -1229978 -1279136 -1329024 -1376981
40860 -1376981 -1422447 -1466134 -1508922 -1550878 -1590535 -1624535 -1647881 -1655038 -1641754 -1606854 -1552961
40849 -1552961 -1485608 -1411143 -1334524 -1258064 -1181689 -1104489 -1026695 -950787 -881059 -822098 -777484
40838 -777484 -749670 -740802 -753322 -789479 -849891 -932234 -1031046 -1138683 -1246622 -1346365 -1429833
40827 -1429833 -1489679 -1519619 -1514702 -1471483 -1388515 -1267272 -1112963 -934385 -742439 -547885
40817 -547885 -359285 -181768 -16754 137464 284380 427451 568345 705914 836278 953915
40807 953915 1053244 1130014 1181845 1207586 1205961 1174563 1110164 1010275 875009 708212 517456
40796 517456 312982 105870 -94220 -280959 -452053 -608445 -752552 -886449 -1010637 -1123543
40786 -1123543 -1221803 -1301273 -1358477 -1391794 -1401831 -1390959 -1362564 -1320513 -1268931 -1212039 -1153814
40775 -1153814 -1097509 -1045356 -998707 -958530 -925798 -901387 -885523 -877250 -874334 -873749 -872614 -869266
40763 -869266 -863909 -858251 -854032 -851228 -847161 -837319 -817570 -786493 -746351 -702101 -659104 -620957 -588587
40750 -588587 -560661 -534615 -507605 -477054 -440842 -397346 -345609 -285647 -218706 -147241 -74811
40739 -74811 -6083 53156 96393 117277 110669 73461 5146 -91965 -213135 -352313 -503434
40728 -503434 -661073 -820115 -974849 -1118311 -1242490 -1339691 -1404804 -1437514 -1443212 -1431796 -1414876
40717 -1414876 -1402772 -1402673 -1418414 -1451347 -1501435 -1567914 -1649334 -1743200 -1845595 -1951255 -2054221
40706 -2054221 -2148901 -2230950 -2297511 -2346801 -2377470 -2388189 -2377537 -2343880 -2285022 -2197891 -2078876
40695 -2078876 -1925156 -1736602 -1517278 -1275717 -1023742 -774237 -538604 -324675 -135663
40686 -135663 29647 175556 307325 428804 540625 639701 720258 775931 802032 797244 764282
40675 764282 709422 641068 567998 497994 437309 390678 361303 350428 356861 377195 407103 443127
40663 443127 483753 529122 579740 635056 692442 746699 790330 814893 813302 782034 722213 639126
40651 639126 540685 435629 332068 236427 152539 80806 17998 -41477 -102911 -168694 -237489
40640 -237489 -305428 -367972 -420936 -460515 -483204 -486320 -468965 -432802 -382070 -322708 -260843 -201305
40628 -201305 -146965 -99072 -58105 -24256 2858 25010 45948 71117 106245 155244 218432
40617 218432 292080 369565 443460 507405 556905 589125 602433 596593 573734 539245 501409 469385
40605 469385 450463 448093 461533 486772 517851 548120 571468 583520 582414 568780 544949 513911
40593 513911 478447 440627 401564 361360 319147 273246 221523 162051 93848 17177 -66964
40582 -66964 -157878 -255830 -361668 -475434 -594878 -714967 -828882 -930081 -1014302 -1080614
40572 -1080614 -1131178 -1170054 -1201537 -1228655 -1252409 -1272069 -1286213 -1293837 -1294979 -1290748 -1282964 -1273645
40560 -1273645 -1264657 -1257749 -1254857 -1258125 -1269276 -1288545 -1313856 -1340779 -1363398 -1375938 -1374607 -1358917
40548 -1358917 -1331789 -1298372 -1264147 -1233093 -1206502 -1182834 -1158756 -1130978 -1097913 -1060186 -1019879
40537 -1019879 -979295 -940309 -904654 -874621 -853212 -843407 -847083 -864567 -895304 -939056 -996508 -1068546
40525 -1068546 -1154519 -1250672 -1349906 -1443160 -1521655 -1578808 -1611029 -1617411 -1598862 -1557289 -1495194
40514 -1495194 -1415825 -1323689 -1225024 -1127636 -1039792 -968385 -917325 -887106 -875912 -881576 -903290
40503 -903290 -942224 -1001052 -1082797 -1189498 -1320958 -1473935 -1642108 -1817022 -1989678 -2152025
40493 -2152025 -2297674 -2421699 -2520092 -2589622 -2628504 -2637565 -2621016 -2586022 -2540963 -2493231 -2447748
40482 -2447748 -2406832 -2371137 -2340888 -2316723 -2299830 -2291357 -2291489 -2298797 -2310322 -2322340 -2331392 -2335083
40470 -2335083 -2332379 -2323403 -2308963 -2290176 -2268299 -2244574 -2219883 -2194368 -2167235 -2136614 -2099342 -2051046
40458 -2051046 -1987195 -1905044 -1805420 -1693189 -1576259 -1463765 -1364161 -1283676 -1225596 -1190686 -1178457
40447 -1178457 -1188305 -1219622 -1270929 -1338969 -1418789 -1504740 -1591485 -1674179 -1748013 -1808026 -1849595
40436 -1849595 -1869239 -1865057 -1836735 -1785246 -1712295 -1619523 -1507936 -1378129 -1231310 -1070511 -901352
40425 -901352 -732085 -572844 -434070 -324496 -249418 -209894 -202870 -222054 -259429 -307376 -360862
40414 -360862 -418647 -482753 -556407 -641685 -738224 -843555 -954453 -1068230 -1183284 -1298994
40404 -1298994 -1415282 -1531990 -1648081 -1760820 -1865363 -1955181 -2023353 -2064245 -2074819 -2054953
40394 -2054953 -2006734 -1933340 -1838353 -1725942 -1601552 -1472072 -1344695 -1224762 -1113920 -1009989
40384 -1009989 -908704 -806366 -702087 -598917 -503685 -425745 -374975 -359621 -384497 -449803
40374 -449803 -550621 -677321 -817150 -956851 -1085452 -1196079 -1286302 -1357431 -1413550 -1460594
40364 -1460594 -1505192 -1553038 -1607304 -1667933 -1732068 -1795085 -1851533 -1895804 -1922900 -1929437 -1914589
40353 -1914589 -1880452 -1831508 -1773366 -1711227 -1648585 -1586528 -1523885 -1458282 -1387986 -1313931 -1240980
40342 -1240980 -1177553 -1133414 -1116384 -1129343 -1168788 -1225457 -1286449 -1337826 -1366871 -1363799 -1323034
40331 -1323034 -1244257 -1133179 -1001583 -865887 -743770 -649548 -590175 -563802 -561496 -570985 -580517
40320 -580517 -581342 -568468 -540377 -498517 -446904 -391524 -339306 -296891 -269520 -260041 -267978 -289073
40308 -289073 -316022 -340563 -356001 -358951 -349576 -330478 -304847 -274606 -239339 -196575 -143467 -79053
40296 -79053 -6025 68793 135311 181969 198055 176037 113292 12630 -118507 -269486 -427887
40285 -427887 -580819 -716561 -826557 -907083 -959785 -990905 -1009503 -1025233 -1046149 -1077092 -1119173
40274 -1119173 -1170507 -1227833 -1288112 -1349148 -1408869 -1463959 -1509194 -1538292 -1545872 -1529356 -1489798
40263 -1489798 -1431472 -1360475 -1282832 -1202647 -1120957 -1035758 -943188 -839275 -721447 -589376 -445298
40252 -445298 -294086 -143045 -999 123465 224105 298594 348903 380233 398788 409229
40242 409229 413107 409117 394795 368363 329666 280227 223037 162449 104031 54018 18266 831
40230 831 2720 21417 51524 86189 118532 142526 153412 148070 125552 87404 37252 -20451
40218 -20451 -81925 -144943 -208728 -273147 -337847 -401788 -463251 -520244 -571161 -615451 -653993 -688985
40206 -688985 -723385 -760170 -801589 -848485 -899753 -952352 -1002181 -1045676 -1081113 -1108563 -1128436
40195 -1128436 -1139723 -1139316 -1122994 -1087526 -1032702 -962215 -882968 -803249 -730750 -671202 -627749 -600784
40183 -600784 -588020 -584890 -585400 -583410 -574219 -555985 -530293 -501281 -473502 -449498 -428299 -405558
40171 -405558 -375267 -332257 -274254 -202407 -120105 -31043 62146 157941 254940 350638 440809
40160 440809 519921 582536 624991 646370 648209 633168 603553 560419 503542 432090 345639 244938
40148 244938 131928 9009 -121709 -258396 -398628 -538642 -673657 -799410 -914037 -1019158
40138 -1019158 -1119451 -1220732 -1327250 -1439417 -1553136 -1661085 -1755211 -1829073 -1878984 -1903848
40128 -1903848 -1904265 -1881594 -1837272 -1772409 -1687739 -1584122 -1463550 -1330029 -1189499 -1048567 -912826
40117 -912826 -785825 -669209 -563634 -469744 -388655 -321845 -270584 -235364 -215788 -211008 -220175
40106 -220175 -242389 -276170 -319179 -368710 -422566 -479399 -538078 -596624 -651641 -698603 -732768
40095 -732768 -750331 -749635 -732195 -702967 -669348 -639068 -617852 -607870 -607441 -611819 -614522 -608799 -589112
40082 -589112 -552514 -499666 -435124 -366652 -303641 -254927 -226565 -220271 -233159 -258821 -289176 -316403
40070 -316403 -334611 -341083 -336729 -325404 -312265 -302014 -297843 -301253 -312318 -329919 -351805 -374773
40058 -374773 -395375 -411165 -421961 -430366 -441256 -460511 -493490 -543545 -610975 -692911 -784368 -879926
40046 -879926 -975111 -1066952 -1153911 -1235508 -1311787 -1382641 -1447250 -1503944 -1550561 -1585168 -1606801
40035 -1606801 -1615796 -1613372 -1600415 -1576117 -1537431 -1479943 -1399947 -1296747 -1174151 -1040468 -907065
40024 -907065 -786088 -688099 -620235 -585050 -580091 -598289 -629329 -661913 -686227 -695574 -686509 -657811
40012 -657811 -609382 -541933 -457341 -359025 -251922 -142216 -36967 56667 132848 188582 224184
40001 224184 241948 243784 229474 196662 142311 64310 -37671 -162131 -305989 -464868 -633392
39990 -633392 -805565 -975305 -1137270 -1287962 -1426690 -1555698 -1679272 -1802304 -1929040 -2062218
39980 -2062218 -2202457 -2347894 -2494345 -2636035 -2766488 -2879055 -2967066 -3024018 -3044297 -3024554
39970 -3024554 -2965227 -2871321 -2751718 -2617096 -2477507 -2340689 -2211587 -2092734 -1984921 -1887851
39960 -1887851 -1800686 -1722497 -1652549 -1590431 -1535993 -1489133 -1449610 -1417074 -1391323 -1372548 -1361238
39949 -1361238 -1357692 -1361334 -1370311 -1381758 -1392711 -1401130 -1406304 -1408470 -1408216 -1406450 -1404953 -1406649 -1414773 -1431134
39935 -1431134 -1454758 -1482041 -1508268 -1529378 -1543007 -1548753 -1548053 -1543700 -1538756 -1535029 -1531916 -1526440 -1514358
39922 -1514358 -1491566 -1454977 -1402739 -1334295 -1250655 -1154706 -1051042 -945205 -842911 -749745 -671031
39911 -671031 -611085 -571782 -551464 -545162 -546092 -547358 -543146 -529470 -504769 -470299 -429780 -387999
39899 -387999 -348757 -313184 -279537 -244740 -206686 -165677 -124029 -84246 -47104 -10914 27533
39888 27533 70847 118779 166975 207378 230214 226969 193425 131770 50977 -34769 -109041 -156558
39876 -156558 -166151 -132934 -59431 44728 164834 284480 389145 468652 517867 536038 525625
39865 525625 491337 439609 378334 316427 262878 225357 208935 215465 243576 288949 344790 403008
39853 403008 456303 500448 535425 564619 592481 621995 653130 682768 705872 717254 713192 692291
39841 692291 655427 604988 543911 474863 399786 319875 236025 149562 62893 -20374 -96136
39830 -96136 -161247 -215204 -261162 -305494 -355926 -419192 -499382 -597543 -712216 -840239 -977320
39819 -977320 -1118292 -1257214 -1387650 -1503350 -1599360 -1673126 -1725102 -1758402 -1777604 -1787278 -1791122
39808 -1791122 -1792142 -1793418 -1798404 -1810119 -1829531 -1854251 -1878489 -1894412 -1894250 -1872071 -1824641 -1751451
39796 -1751451 -1654445 -1537741 -1407132 -1269183 -1130184 -995441 -869102 -754198 -652579 -564762
39786 -564762 -489949 -426399 -371988 -324719 -283042 -246022 -213467 -185942 -164490 -149999 -142303 -139323
39774 -139323 -136626 -127866 -106434 -67853 -11700 58189 135368 213187 286539 352239 408440 454086
39762 454086 489175 515687 538189 563008 595813 638723 688535 737124 773873 789106 777301
39751 777301 739060 681175 614734 551851 502323 471520 460073 464937 480999 502595 524749 543970
39739 543970 558653 569305 578789 592178 615511 653413 706892 772965 846520 923000 999939 1076248
39727 1076248 1149957 1216052 1266047 1289781 1278601 1228301 1140466 1021779 881813 730436 575914
39716 575914 424392 280595 148939 34141 -59138 -127472 -170235 -190843 -196836 -198214 -204348
39705 -204348 -220840 -247915 -281083 -313552 -339129 -354439 -359660 -357745 -352786 -348585 -348081 -353374 -365669
39692 -365669 -384877 -409313 -436049 -461938 -484779 -504017 -520728 -536995 -555083 -576759 -603003
39681 -603003 -634133 -670213 -711466 -758221 -810120 -865006 -918572 -965415 -1000950 -1022830 -1031169 -1028083
39669 -1028083 -1017469 -1005097 -998267 -1004422 -1029065 -1074071 -1137304 -1213723 -1297203 -1381973 -1463034 -1535810
39657 -1535810 -1595865 -1639347 -1664136 -1671101 -1664640 -1651892 -1640649 -1636773 -1642356 -1655487 -1671522 -1685011
39645 -1685011 -1691478 -1688612 -1676780 -1658775 -1638906 -1621746 -1611072 -1609261 -1617099 -1633897 -1657959 -1687320
39633 -1687320 -1720249 -1754954 -1788676 -1817052 -1834657 -1836637 -1820528 -1787356 -1741498 -1689320 -1637092
39622 -1637092 -1589316 -1548440 -1515860 -1492778 -1479718 -1474944 -1473276 -1466558 -1445651 -1402904 -1333915 -1238074
39610 -1238074 -1118074 -979051 -827807 -672176 -520234 -379206 -254375 -148498 -62189 4689
39600 4689 51188 74087 68350 29228 -45030 -151275 -281264 -423387 -565705 -699137 -819481
39589 -819481 -927501 -1027239 -1123335 -1218339 -1310940 -1395846 -1465389 -1512164 -1531555 -1523379 -1492249
39578 -1492249 -1446584 -1396465 -1350975 -1316041 -1293499 -1281396 -1275128 -1268873 -1256892 -1234327 -1197490 -1143964
39566 -1143964 -1072960 -985942 -886994 -782305 -678802 -582614 -498173 -427992 -372718 -331169 -300699
39555 -300699 -278116 -260715 -246654 -234623 -223602 -213405 -205593 -203602 -211469 -231741 -263874 -304091
39543 -304091 -346685 -386020 -418267 -442304 -459603 -473447 -487882 -506837 -533489 -569810 -616275
39532 -616275 -671983 -735342 -805072 -880895 -963431 -1053336 -1150022 -1250406 -1348109 -1433614 -1495672
39521 -1495672 -1523867 -1511647 -1458737 -1371933 -1263755 -1149352 -1042871 -954776 -891071 -854236 -844729
39510 -844729 -861579 -901495 -957299 -1017465 -1068018 -1096371 -1095281 -1064908 -1012126 -947692 -882745 -826070
39498 -826070 -782767 -754230 -738857 -733009 -731950 -730793 -725574 -714567 -699514 -686063 -682664 -697927
39486 -697927 -737468 -801921 -887209 -986741 -1093954 -1203685 -1312116 -1416148 -1513098 -1600774 -1677504
39475 -1677504 -1742059 -1793793 -1833194 -1862513 -1885953 -1909174 -1938104 -1977314 -2028449 -2089406 -2154854
39464 -2154854 -2217960 -2272515 -2314329 -2341266 -2352251 -2346289 -2322472 -2280979 -2224192 -2156893 -2085205
39453 -2085205 -2014675 -1948254 -1885130 -1821347 -1752416 -1676708 -1597520 -1522459 -1460814 -1420875 -1408539
39442 -1408539 -1427009 -1476766 -1555588 -1659134 -1782297 -1920626 -2070817 -2229993 -2394507 -2559203
39432 -2559203 -2717482 -2861905 -2984963 -3079970 -3142037 -3168774 -3160331 -3118693 -3046773 -2947891 -2825826
39421 -2825826 -2685185 -2531599 -2371554 -2211992 -2059990 -1922530 -1805978 -1714899 -1650574 -1610281
39411 -1610281 -1588065 -1576703 -1569754 -1562733 -1553243 -1540393 -1524063 -1504527 -1482676 -1460592 -1441914 -1431591
39399 -1431591 -1435013 -1456745 -1499112 -1560978 -1637294 -1719867 -1799400 -1868219 -1922713 -1964419 -1999148
39388 -1999148 -2034452 -2076616 -2128459 -2188692 -2252766 -2314687 -2368991 -2412097 -2442536 -2460129 -2464699
39377 -2464699 -2455071 -2428989 -2384183 -2320107 -2239360 -2147864 -2053639 -1964797 -1887769 -1826428 -1782252
39366 -1782252 -1755042 -1743546 -1745738 -1758960 -1780333 -1807348 -1838197 -1871395 -1904683 -1933759 -1951756
39355 -1951756 -1950243 -1921598 -1861517 -1770368 -1653116 -1518457 -1377553 -1242074 -1121506 -1020721
39345 -1020721 -939265 -872837 -815986 -764661 -717689 -676939 -646250 -629528 -628833 -643455 -670540 -706868
39333 -706868 -750706 -802524 -864118 -936693 -1019209 -1108167 -1198952 -1287736 -1372625 -1453401 -1530234
39322 -1530234 -1602285 -1666937 -1720002 -1756743 -1773163 -1766925 -1737658 -1686832 -1617407 -1532997 -1436551
39311 -1436551 -1329212 -1210382 -1079186 -936368 -785550 -633500 -489569 -364353 -267628 -206213
39301 -206213 -182694 -195567 -240458 -311694 -403525 -510602 -627717 -749382 -869939 -984274
39291 -984274 -1088320 -1178624 -1251176 -1300644 -1320960 -1307234 -1257989 -1176494 -1070393 -949811 -824902
39280 -824902 -704043 -593207 -496107 -414433 -347978 -295165 -254241 -224739 -208324 -208690 -230765
39269 -230765 -279555 -358653 -468577 -605677 -762383 -928758 -1094563 -1250938 -1391333 -1511526
39259 -1511526 -1608820 -1680760 -1724220 -1735442 -1710994 -1648999 -1550036 -1417371 -1256444 -1073861 -876394
39248 -876394 -670469 -462291 -258379 -65998 107062 253810 370244 457294 521097 571030
39238 571030 616408 663441 713722 764572 810846 847490 872000 885836 894091 903497 919756 945469
39226 945469 979498 1017748 1054828 1085960 1108454 1122208 1129092 1131758 1132623 1133264 1134002 1133524 1128877 1116138
39212 1116138 1091516 1052157 996254 922730 831045 721404 595135 454880 304313 147530
39202 147530 -11678 -170386 -326664 -479116 -625934 -764089 -889377 -997426 -1084847 -1149602
39192 -1149602 -1190527 -1206870 -1198449 -1166170 -1112163 -1039281 -950385 -847972 -734431 -612856 -488061
39181 -488061 -367090 -258467 -170110 -106827 -68844 -52282 -51343 -60877 -77876 -101226 -130313 -163841
39169 -163841 -199897 -237097 -275740 -318024 -367208 -426223 -496357 -576378 -662471 -749203 -831293
39158 -831293 -905351 -970727 -1029077 -1083029 -1134597 -1184053 -1229786 -1269337 -1301073 -1325460 -1344991
39147 -1344991 -1362817 -1380971 -1399228 -1415064 -1424632 -1424420 -1413064 -1392629 -1368672 -1348912 -1341001 -1350238
39135 -1350238 -1378098 -1422112 -1477064 -1536857 -1596144 -1651161 -1699874 -1741682 -1776798 -1805184 -1825279
39124 -1825279 -1833079 -1822191 -1785072 -1715265 -1610054 -1472512 -1311961 -1142373 -979393 -837269
39114 -837269 -726730 -654022 -620659 -623508 -655226 -705418 -762745 -817613 -864479 -902803 -936392
39103 -936392 -971666 -1015606 -1073820 -1148957 -1239788 -1341395 -1446569 -1547852 -1639283 -1717098 -1779219
39092 -1779219 -1824041 -1849489 -1853133 -1833395 -1791040 -1730006 -1657234 -1581857 -1514031 -1463237 -1435932
39081 -1435932 -1433192 -1449695 -1474974 -1496510 -1503265 -1488343 -1450448 -1394203 -1329241 -1267741 -1220693 -1194331
39069 -1194331 -1188479 -1197559 -1213259 -1227108 -1231979 -1222812 -1197335 -1156667 -1104983 -1047696 -988899 -929671
39057 -929671 -868331 -802447 -731189 -656617 -583270 -516499 -460496 -416784 -383594 -356282 -328844
39046 -328844 -296276 -256955 -213905 -174162 -146257 -136780 -147471 -174183 -208206 -239224 -258343 -259783
39034 -259783 -240992 -202099 -145764 -77519 -5740 59565 108888 135133 134511 106565 54001 -17647
39022 -17647 -101072 -189213 -277354 -363859 -448915 -532294 -612019 -684981 -748962 -804305 -853944 -901827
39010 -901827 -950919 -1001885 -1052957 -1100757 -1141556 -1172443 -1192018 -1200523 -1199491 -1191038 -1176971 -1158272
38998 -1158272 -1135404 -1109317 -1082404 -1058659 -1042957 -1039781 -1051766 -1078448 -1115770 -1156906 -1194208
38987 -1194208 -1221459 -1235589 -1237519 -1232169 -1227623 -1233509 -1258831 -1309753 -1387915 -1489761 -1607133 -1728900
38975 -1728900 -1843094 -1938847 -2007720 -2044352 -2046730 -2016392 -1958611 -1882148 -1798010 -1717146 -1647783
38964 -1647783 -1593621 -1553829 -1524882 -1503132 -1486470 -1474256 -1466117 -1461056 -1457549 -1454053 -1449078 -1440903
38952 -1440903 -1427592 -1407646 -1380913 -1349294 -1317006 -1290106 -1275056 -1276567 -1295721 -1329416 -1371441
38941 -1371441 -1414632 -1453075 -1483414 -1504638 -1516668 -1518874 -1509718 -1487775 -1453225 -1408636 -1358561 -1308296
38929 -1308296 -1262509 -1224250 -1194462 -1171832 -1152977 -1133223 -1108193 -1075912 -1038383 -1001729 -974701
38918 -974701 -966162 -982366 -1024644 -1088010 -1161287 -1229062 -1275151 -1286592 -1257006 -1188428 -1091079 -981094
38906 -981094 -876706 -793960 -743184 -727266 -742151 -779152 -828070 -879991 -928912 -971821 -1007385
38895 -1007385 -1034131 -1049485 -1050605 -1036557 -1010173 -978063 -948669 -929518 -924992 -935260 -956468 -982088
38883 -982088 -1005079 -1020178 -1025331 -1021538 -1011271 -996476 -977335 -952314 -919037 -875324 -820051 -753840
38871 -753840 -679474 -601801 -527099 -462085 -412675 -382592 -372132 -377748 -392835 -409473 -420533 -421514
38859 -421514 -411599 -393503 -372217 -353403 -342225 -342770 -357618 -387418 -430802 -484962 -546559 -612348
38847 -612348 -679175 -743598 -801636 -849007 -881957 -898339 -898410 -884865 -862069 -834781 -806855 -780290
38835 -780290 -754874 -728609 -698971 -664766 -627875 -593816 -570519 -565826 -585199 -630904 -702704 -798995
38823 -798995 -917286 -1053804 -1202897 -1357073 -1508021 -1648244 -1772630 -1879417 -1970281 -2049317
38813 -2049317 -2121013 -2187892 -2249141 -2301045 -2338862 -2358773 -2358851 -2338964 -2300086 -2243481 -2169953 -2079366
38801 -2079366 -1970617 -1842082 -1692371 -1521133 -1329588 -1120541 -897966 -666605 -431888
38792 -431888 -199875 23277 232308 423527 594633 743979 870306 973325 1054455 1116658
38782 1116658 1163243 1196632 1218095 1228301 1227673 1215959 1191495 1151181 1091612 1010953 910729
38771 910729 796741 678570 567756 475423 410426 378476 381915 419675 487335 577495 680543
38760 680543 785762 882703 962563 1019161 1049206 1052020 1029180 984253 922414 849818 772884
38749 772884 697855 630612 576402 539163 520569 519431 532021 553337 578615 604397 628963 652257
38737 652257 675374 699532 724813 749372 769662 781688 782764 773025 756042 738066 726153 726027
38725 726027 740518 768766 805982 843912 872431 882216 867528 827762 767181 693237 614376 538025
38713 538025 469081 409064 356131 305991 253436 193838 123979 42006 -53067 -161589 -282782
38702 -282782 -413946 -550217 -685445 -813671 -930148 -1031329 -1114367 -1177050 -1218382 -1239224
38692 -1239224 -1242368 -1231928 -1212368 -1187527 -1160004 -1131135 -1101537 -1071671 -1042012 -1012824 -984117
38681 -984117 -956109 -929800 -906915 -888886 -875479 -864140 -850694 -831017 -802675 -765789 -723101
38670 -723101 -679613 -641911 -616946 -610118 -623180 -652859 -691006 -726382 -747480 -745434 -715934 -659495
38658 -659495 -580116 -483252 -374261 -257973 -139130 -22944 84756 177968 251435 301842
38648 301842 328748 334658 323977 301252 269619 230306 183328 128730 67431 1268 -67305 -135184
38636 -135184 -198301 -251917 -292031 -317318 -330271 -336730 -344157 -359639 -388432 -433379 -495067 -572332
38624 -572332 -662631 -762080 -865470 -966765 -1060216 -1141636 -1209033 -1262138 -1301043 -1324753 -1330518
38613 -1330518 -1314322 -1272287 -1202314 -1105274 -985371 -849652 -706942 -566497 -436669 -323706
38603 -323706 -230896 -158374 -103783 -63655 -34917 -15823 -5982 -5641 -14773 -32542 -57342 -87086
38591 -87086 -119164 -149822 -173558 -183701 -174649 -144819 -98354 -44199 7147 47403 72914 84848
38579 84848 87651 86934 87888 94586 109805 134624 167572 203800 235203 251934 244890 208096 140048
38566 140048 43738 -74319 -205533 -340637 -470653 -587215 -682533 -749602 -783107 -780703 -743913
38555 -743913 -678016 -590924 -491577 -388444 -288502 -196860 -116962 -51145 -1159 31701 47026
38544 47026 46000 31839 9475 -15414 -37452 -52161 -56213 -47886 -28014 -1027 24797 38502
38532 38502 28882 -12678 -90121 -202133 -343069 -504584 -677072 -850620 -1015921 -1165620
38522 -1165620 -1295827 -1406869 -1502594 -1588428 -1669007 -1746260 -1818434 -1880287 -1924449 -1943577 -1932714
38511 -1932714 -1891286 -1824193 -1741434 -1655986 -1580342 -1523072 -1486870 -1468917 -1463144 -1463163 -1464437 -1464773 -1463279
38498 -1463279 -1458777 -1448907 -1430534 -1401191 -1360547 -1310787 -1255378 -1196795 -1134677 -1065739 -985585 -891381
38486 -891381 -783903 -668036 -551594 -443067 -349266 -273771 -216541 -174560 -143186 -117913 -96025
38475 -96025 -77383 -63938 -58448 -63337 -80344 -110649 -154911 -213002 -283562 -363627 -448428 -531571
38463 -531571 -605933 -665381 -706776 -731293 -744257 -753489 -766838 -789888 -824533 -868783 -917786 -965623
38451 -965623 -1007083 -1038657 -1058534 -1066141 -1061852 -1047080 -1024365 -997000 -968054 -939099 -909330 -875667
38439 -875667 -833973 -780867 -715314 -639440 -558449 -479812 -411948 -362835 -338890 -344364 -381031 -447916
38427 -447916 -541020 -653228 -774843 -895020 -1004049 -1095684 -1168459 -1225341 -1272038 -1314928 -1359441
38416 -1359441 -1409235 -1466194 -1531016 -1603855 -1684527 -1772203 -1865123 -1960892 -2057308 -2153150 -2248390
38405 -2248390 -2343830 -2440423 -2538524 -2637012 -2732299 -2817613 -2883205 -2917935 -2911974 -2859792 -2762348
38394 -2762348 -2627577 -2468751 -2301139 -2138271 -1989308 -1858249 -1744736 -1645731 -1557505 -1477486
38384 -1477486 -1405433 -1343490 -1295103 -1263245 -1248545 -1247961 -1254535 -1258440 -1248921 -1216449 -1154543 -1061069
38372 -1061069 -938900 -795721 -642963 -494070 -362350 -258656 -189243 -154532 -149287 -164132
38362 -164132 -187707 -208895 -218766 -212007 -187429 -147426 -96860 -42135 9357 49812 72088 71167
38350 71167 45368 -3195 -69031 -144421 -221119 -292267 -354088 -406828 -454589 -504072 -562663 -636500
38338 -636500 -729061 -840380 -966887 -1101938 -1237139 -1364259 -1477101 -1572684 -1651422 -1716315
38328 -1716315 -1771490 -1820588 -1865566 -1906049 -1938973 -1958552 -1957018 -1926562 -1861918 -1762347 -1632249
38317 -1632249 -1480506 -1319018 -1160633 -1016661 -894633 -797125 -722037 -664191 -617810 -579057
38307 -579057 -547341 -524318 -511138 -506104 -504782 -502477 -496990 -489599 -483917 -483948 -492684 -511678 -541090
38294 -541090 -579790 -625560 -675715 -728238 -782880 -841409 -906536 -979847 -1059698 -1140106 -1211206
38283 -1211206 -1261192 -1279034 -1257073 -1192769 -1089334 -955190 -802258 -643280 -488987 -346191
38273 -346191 -217444 -101968 2915 100383 192991 282175 368567 452841 536249 620272 705644
38262 705644 791478 875158 953189 1022830 1083782 1138880 1193042 1250925 1314697 1383186 1452509
38251 1452509 1517314 1571865 1610808 1629880 1626593 1600603 1553553 1488502 1409178 1319192 1221279
38240 1221279 1116681 1004930 884096 751392 604097 440707 262019 71541 -125163
38231 -125163 -321809 -512508 -692137 -856268 -1001434 -1126089 -1231683 -1322817 -1405824 -1486272
38221 -1486272 -1566686 -1645698 -1718812 -1780062 -1823760 -1845884 -1845066 -1823016 -1784255 -1735123 -1682436 -1632206
38209 -1632206 -1588730 -1554146 -1528376 -1509412 -1493824 -1477279 -1455029 -1422524 -1376302 -1314938 -1239415
38198 -1239415 -1152457 -1057143 -955684 -849071 -737662 -622372 -506048 -394398 -295728 -219020
38188 -219020 -170822 -152234 -157382 -174268 -188034 -185623 -159927 -111514 -47305 22723 88873 143698
38176 143698 182391 202191 201616 179979 137162 73366 -11239 -116606 -242249 -386193 -544081
38165 -544081 -708971 -871846 -1022543 -1150884 -1248042 -1308099 -1329514 -1316035 -1276579 -1223856 -1172031
38154 -1172031 -1134048 -1119317 -1132190 -1171504 -1231392 -1303294 -1378491 -1450084 -1513697 -1567017 -1608881
38143 -1608881 -1638597 -1655803 -1660858 -1655503 -1643229 -1628946 -1617978 -1614929 -1622832 -1642603 -1672633 -1708772
38131 -1708772 -1745173 -1775970 -1796936 -1806094 -1803092 -1788065 -1760897 -1721097 -1667949 -1600654 -1518605 -1422062
38119 -1422062 -1313076 -1196049 -1077353 -963993 -861839 -774268 -701849 -643222 -596751 -561955
38109 -561955 -539847 -532023 -539257 -560594 -593406 -634102 -679051 -725438 -771872 -818392 -865631 -913496
38097 -913496 -960070 -1001401 -1032206 -1047286 -1043281 -1020177 -981702 -934068 -883586 -834587 -788747 -745674
38085 -745674 -703733 -660391 -612296 -555645 -487019 -404343 -307621 -199268 -84001 31792 141118
38074 141118 237597 316497 375372 414184 434883 440527 434302 418821 395999 367581 335997 304892
38062 304892 278705 261441 255519 261498 278515 304618 336775 371078 403594 431394 452922 467560
38050 467560 475032 475302 468862 456924 441167 423179 403984 384069 363947 344909 329229 319451
38038 319451 316963 320768 327314 331651 329362 318232 298925 274525 249394 227830 212897 205647 205078
38025 205078 208915 214804 221082 226543 229508 227162 215838 191969 152853 96794 22966 -68507 -176423
38012 -176423 -298843 -434010 -581110 -740120 -910641 -1090387 -1274206 -1454122 -1620473 -1763734
38002 -1763734 -1876389 -1954225 -1996785 -2007072 -1990800 -1955433 -1909163 -1859907 -1814328 -1777040 -1750284
37991 -1750284 -1734320 -1728320 -1731113 -1741276 -1756680 -1774178 -1789974 -1800652 -1804259 -1800895 -1792625 -1782865
37979 -1782865 -1775515 -1773980 -1780213 -1794092 -1813510 -1835287 -1856456 -1875290 -1891638 -1906596 -1921802 -1938585
37967 -1938585 -1957305 -1977153 -1996518 -2013531 -2026348 -2033051 -2031612 -2020427 -1999414 -1970988 -1939990 -1912167
37955 -1912167 -1891806 -1879850 -1873631 -1868281 -1858823 -1841706 -1815090 -1778153 -1730200 -1670361 -1598075 -1513840
37943 -1513840 -1419573 -1318433 -1214463 -1112296 -1016782 -932304 -862000 -807219 -767306 -739478 -718896
37932 -718896 -699422 -675353 -643626 -605379 -566009 -533612 -516436 -520351 -547359 -595656 -660887 -737644
37920 -737644 -820388 -903755 -982801 -1053571 -1113790 -1163275 -1203903 -1239173 -1273262 -1309464 -1348455
37909 -1348455 -1387398 -1420665 -1441934 -1446522 -1432791 -1402210 -1358295 -1305126 -1246107 -1183427 -1118173
37898 -1118173 -1050768 -981409 -910476 -838878 -768084 -699469 -632917 -565452 -491162 -403273 -297639
37887 -297639 -175576 -44091 86632 206673 308674 388238 443116 472273 475435 453017 406159
37876 406159 336710 247183 140791 21543 -105647 -234921 -359545 -472308 -566486 -637252
37866 -637252 -682884 -705070 -708061 -697136 -677136 -651709 -623505 -595039 -569599 -551689 -546813 -560656
37854 -560656 -597742 -659743 -744107 -843821 -948575 -1046788 -1127658 -1182866 -1207831 -1202281 -1169757
37843 -1169757 -1116092 -1047466 -968837 -883247 -792215 -697021 -600274 -506742 -422720 -354155 -304538
37832 -304538 -273592 -257299 -249225 -242632 -232526 -216772 -195871 -171791 -146677 -122147 -99312 -79162
37820 -79162 -62868 -51718 -46829 -48925 -58358 -75211 -99212 -129425 -163950 -199822 -233031 -258509
37808 -258509 -270165 -261507 -227226 -165331 -78595 25829 138686 251604 359394 460869 558157
37797 558157 654927 754122 856002 957146 1050696 1127573 1178261 1194730 1172065 1109473 1010384
37786 1010384 881556 731317 567521 396208 221805 48675 -117247 -268108 -395424
37777 -395424 -492250 -555102 -584860 -586456 -567505 -536385 -500427 -464955 -433397 -408079 -390991 -383920
37765 -383920 -388003 -403216 -428233 -460637 -497125 -533455 -564280 -583383 -584614 -563390 -518047 -450339
37753 -450339 -364819 -267618 -165413 -65109 26033 100640 152395 177696 176592 152288 109690
37742 109690 54251 -8276 -71633 -129259 -175158 -205019 -217074 -212390 -194594 -169145 -142329 -120006
37730 -120006 -106081 -101154 -102258 -104409 -103465 -98622 -92857 -91049 -97054 -111713 -132995 -157974 -185146
37717 -185146 -215581 -252531 -300166 -362361 -441805 -539306 -653260 -779586 -912446 -1045487 -1172973
37706 -1172973 -1290249 -1393652 -1480442 -1549205 -1600500 -1637133 -1663526 -1684203 -1701912 -1716315 -1724092
37695 -1724092 -1720598 -1702163 -1667668 -1618596 -1557936 -1488896 -1414212 -1336218 -1257421 -1181010 -1110809
37684 -1110809 -1050583 -1003258 -970669 -953949 -954060 -971864 -1007689 -1060771 -1128892 -1208349 -1294113 -1380172
37672 -1380172 -1460050 -1527639 -1578287 -1609898 -1623475 -1622614 -1612067 -1596137 -1577759 -1558533 -1539239 -1520312
37660 -1520312 -1502167 -1485507 -1471549 -1461901 -1457991 -1460328 -1467929 -1478037 -1486104 -1486063 -1471019 -1434350 -1370997
37647 -1370997 -1278676 -1158655 -1015700 -856860 -689249 -517757 -343965 -166938 14690 200725
37637 200725 388476 572936 747494 904911 1038538 1143468 1216956 1257752 1264976 1237667
37627 1237667 1175632 1081095 959968 821864 678722 542669 423863 328898 260009 215118
37617 215118 188625 172751 158983 139330 107275 58480 -8793 -93707 -193219 -302515 -415231
37606 -415231 -523747 -620093 -697604 -752593 -784994 -797548 -794104 -778062 -751629 -715912 -671575
37595 -671575 -619720 -562565 -503485 -446308 -394293 -349522 -313138 -286092 -269585 -264747 -271820 -289689
37583 -289689 -316244 -349329 -387578 -430663 -478889 -532442 -590628 -651598 -712928 -772851 -831357
37572 -831357 -890329 -952548 -1020204 -1093839 -1172285 -1253516 -1335653 -1417193 -1496075 -1568297 -1627474
37561 -1627474 -1666184 -1678686 -1663504 -1624455 -1569666 -1509102 -1451766 -1403650 -1366977 -1340484 -1320086
37550 -1320086 -1299514 -1271199 -1227885 -1164856 -1081828 -983374 -877555 -773483 -679105 -600116 -540110
37539 -540110 -501360 -485361 -492688 -522327 -571159 -634252 -706065 -782061 -859889 -939542 -1022451 -1110012
37527 -1110012 -1202268 -1297352 -1391986 -1482661 -1566730 -1642623 -1709241 -1765234 -1808915 -1838774 -1854126
37516 -1854126 -1855667 -1846046 -1830299 -1815590 -1809897 -1820088 -1850363 -1901730 -1972412 -2058630 -2155295 -2256439
37504 -2256439 -2355444 -2445224 -2518432 -2567831 -2587019 -2571554 -2520046 -2434423 -2318991 -2178757 -2018114
37493 -2018114 -1840576 -1649409 -1448488 -1242685 -1037592 -838720 -650680 -476768 -319089
37484 -319089 -178998 -57449 44980 128347 193643 242889 279002 305590 326650 345879 365485
37473 365485 385162 402253 413470 417193 414792 410235 408511 414125 430394 459424 502174 558344
37461 558344 626231 702760 783541 862701 932861 986028 1015678 1019000 997718 956819 902120 838271
37449 838271 768128 693231 614746 534500 455944 384616 327454 290891 278728 291132 325260
37438 325260 376736 440753 512303 585984 655938 716080 760366 782989 778701 743486 675553 576357
37426 576357 451270 309583 163516 26053 -92063 -184968 -252437 -298187 -326837 -341502
37416 -341502 -343305 -332446 -309478 -275756 -233066 -183106 -127447 -67975 -7314 51297 104734 151036
37404 151036 190400 225793 262784 308218 367931 444408 535479 634605 732463 819109 885907
37393 885907 926728 938314 920238 874856 807177 724217 633643 542245 454947 374655 302654
37382 302654 239066 183151 133429 87767 43558 -1938 -51126 -105519 -165425 -230147 -298786
37371 -298786 -371256 -448722 -532990 -625040 -723513 -824059 -920029 -1004303 -1071490 -1119533 -1150133
37360 -1150133 -1167906 -1178681 -1187482 -1197067 -1207745 -1218720 -1230092 -1244094 -1264611 -1295225 -1337007 -1387351
37348 -1387351 -1440384 -1488609 -1524917 -1544205 -1544267 -1526006 -1493239 -1452273 -1411229 -1378847 -1362598 -1366508
37336 -1366508 -1389721 -1426796 -1469747 -1510827 -1544714 -1569325 -1585318 -1594851 -1600211 -1602713 -1602032 -1596065
37324 -1596065 -1581501 -1555053 -1514986 -1462333 -1401354 -1339098 -1284095 -1244377 -1225338 -1228343 -1250856
37313 -1250856 -1288118 -1335515 -1390324 -1451848 -1519988 -1593347 -1668251 -1739337 -1801219 -1850132 -1884683
37302 -1884683 -1905668 -1915522 -1917948 -1917693 -1919966 -1929223 -1947903 -1976039 -2011960 -2053383 -2097993 -2143329
37290 -2143329 -2186373 -2223351 -2249980 -2262132 -2256548 -2231088 -2184346 -2115232 -2023176 -1908914 -1775098
37279 -1775098 -1626180 -1467746 -1305952 -1147242 -998064 -864160 -749525 -655657 -581769 -525906
37269 -525906 -486096 -460712 -448109 -446308 -453135 -466421 -483738 -501794 -516269 -522443 -516271 -495166
37257 -495166 -458207 -406019 -340837 -266920 -190948 -121792 -69374 -42918 -49239 -91528 -168598 -274544
37245 -274544 -399073 -529121 -651846 -757957 -843672 -910292 -961876 -1002536 -1034659 -1058518 -1073071
37234 -1073071 -1077496 -1072736 -1062227 -1051306 -1045429 -1048075 -1059259 -1075237 -1089312 -1093279 -1079195 -1041383
37222 -1041383 -978356 -893703 -795036 -691245 -589594 -494327 -407208 -329207 -262238 -210191 -178865
37211 -178865 -174687 -202343 -262106 -348155 -449107 -551027 -641682 -714030 -767445 -806481 -838153
37200 -838153 -868894 -902271 -938148 -973368 -1003340 -1023695 -1031471 -1025681 -1007208 -978119 -940864 -897984
37188 -897984 -852480 -808363 -770676 -744680 -734421 -741313 -763495 -796423 -834358 -871762 -903849 -926534
37176 -926534 -936520 -931810 -912110 -878581 -833151 -778082 -716090 -650617 -585728 -525604 -474047 -434170
37164 -434170 -408150 -396906 -399876 -415011 -438891 -466798 -493008 -511632 -518015 -510044 -488623 -457017
37152 -457017 -419462 -379921 -341738 -308183 -283007 -270142 -272629 -291749 -326958 -376304 -436763 -504574
37140 -504574 -575994 -648294 -720253 -791784 -863238 -934954 -1006860 -1077546 -1142909 -1195487 -1225496
37129 -1225496 -1223500 -1183453 -1104624 -991680 -853181 -699321 -539839 -382771 -234354 -99816
37119 -99816 15698 106928 169350 200651 201967 178173 136989 87105 36123 -10550 -49103 -75561
37107 -75561 -84620 -70465 -29265 38443 127059 227006 326764 414984 482399 523282 536152 523609
37095 523609 491380 446573 395098 338789 273771 191518 82506 -59434 -234311 -435678 -652225
37084 -652225 -870182 -1075746 -1257191 -1406322 -1519063 -1595324 -1638507 -1654815 -1652122 -1638288 -1619302
37073 -1619302 -1598141 -1574963 -1548475 -1517651 -1482861 -1445950 -1409542 -1376270 -1348509 -1328462 -1317873
37062 -1317873 -1316884 -1322608 -1328727 -1326967 -1309936 -1273815 -1219635 -1152824 -1081546 -1014496 -958747 -918166
37050 -918166 -892782 -879264 -872333 -866651 -858472 -846331 -830417 -811084 -787649 -758545 -722953 -682841
37038 -682841 -643882 -614470 -603371 -617382 -659937 -730744 -825985 -938981 -1061559 -1186136 -1307767
37027 -1307767 -1425089 -1539556 -1653366 -1767241 -1879179 -1984590 -2077416 -2151542 -2202116 -2226694
37017 -2226694 -2226082 -2204490 -2168736 -2126574 -2084671 -2046854 -2013229 -1980597 -1944172 -1900038 -1847323 -1789108
37005 -1789108 -1731519 -1681267 -1642621 -1615236 -1593856 -1570007 -1534638 -1480377 -1402456 -1298332 -1166764
36994 -1166764 -1007246 -820199 -607670 -373829 -124673 133068 393139 650187 899078
36985 899078 1133673 1346200 1527853 1670359 1767635 1816842 1818714 1777327 1699501 1593808 1469215
36974 1469215 1333645 1192966 1050718 908406 765935 622060 475168 324502 171209
36965 171209 18529 -128980 -266439 -389338 -494009 -578166 -641371 -684847 -710583 -720363 -715532
36954 -715532 -697604 -668961 -632852 -592679 -551299 -511056 -474463 -444841 -426371 -423596 -440583 -479808
36942 -479808 -540881 -619638 -708376 -797482 -877805 -942749 -989365 -1018321 -1032913 -1037391 -1035104 -1027241
36930 -1027241 -1012782 -989560 -955690 -910573 -855210 -791964 -724016 -654865 -588266 -528792 -482581
36919 -482581 -457507 -462238 -504451 -589004 -716824 -884892 -1087099 -1315396 -1560572 -1812492
36909 -1812492 -2060110 -2291650 -2495162 -2659516 -2775861 -2839270 -2849708 -2811516 -2731442 -2616256
36899 -2616256 -2471313 -2300675 -2108527 -1900954 -1687040 -1478523 -1287883 -1125436 -996555
36890 -996555 -900131 -828947 -771905 -717274 -655735 -582176 -495889 -399597 -298157 -197475 -103763
36879 -103763 -22816 40804 84550 108288 114124 105685 87188 62763 36349 11991 -6068 -13869
36867 -13869 -8589 10763 43094 85361 132998 180609 222914 255725 276816 286499 287567 284279
36855 284279 280647 279092 280360 284495 291699 302141 314953 327382 334884 332139 314433 278681 223679
36842 223679 149710 57989 -49546 -170249 -300936 -438325 -579283 -720467 -857709 -986003
36832 -986003 -1100563 -1198484 -1279911 -1348076 -1408432 -1467567 -1532267 -1608617 -1700798 -1809730 -1932142
36821 -1932142 -2060791 -2185913 -2297259 -2385767 -2444317 -2467855 -2453482 -2400893 -2312873 -2195270
36811 -2195270 -2056188 -1904684 -1749458 -1597948 -1455986 -1328134 -1218582 -1132118 -1074370 -1050836
36801 -1050836 -1064880 -1115571 -1196239 -1294422 -1393396 -1475070 -1523480 -1527889 -1484541 -1396573 -1272255
36790 -1272255 -1122218 -956693 -783713 -608706 -435284 -266519 -105831 43122 177600
36781 177600 297290 405086 506471 607666 713397 825135 940326 1052863 1154720 1238254
36771 1238254 1298148 1332143 1340424 1324333 1285287 1224188 1141180 1035665 906876 755299 584568
36760 584568 402544 220372 49457 -102126 -231736 -341765 -437433 -524546 -608421 -693847
36750 -693847 -784876 -883616 -988292 -1091901 -1182755 -1247152 -1273152 -1253814 -1188738 -1083865 -950321
36739 -950321 -802929 -658484 -533648 -442605 -394958 -394217 -437158 -514268 -611522 -713161 -804530
36728 -804530 -874234 -915557 -927521 -915420 -890084 -865421 -854832 -867952 -908894 -976245 -1064171
36717 -1064171 -1163880 -1265074 -1357593 -1433405 -1488556 -1524170 -1545822 -1561417 -1578636 -1603091 -1637902
36706 -1637902 -1684532 -1743861 -1816246 -1900003 -1989201 -2072706 -2135914 -2164793 -2150285 -2090912 -1992713
36695 -1992713 -1866990 -1727240 -1586526 -1455914 -1343827 -1255805 -1194390 -1159241 -1147604 -1155026
36685 -1155026 -1176074 -1205029 -1236662 -1266859 -1292810 -1312830 -1326464 -1335207 -1343298 -1357496 -1385328 -1432388
36673 -1432388 -1499879 -1583363 -1673171 -1756370 -1819614 -1852002 -1847237 -1804732 -1729670 -1632052 -1524968
36662 -1524968 -1422464 -1337319 -1278926 -1251624 -1254115 -1280470 -1322405 -1371726 -1421826 -1467808 -1505607
36651 -1505607 -1531002 -1539402 -1526804 -1491287 -1433772 -1357295 -1265397 -1161114 -1047305 -927586 -806526
36640 -806526 -688693 -577486 -474743 -381056 -295936 -217366 -141315 -62092 26121 127021 240044
36629 240044 359434 475326 576750 655221 707127 734011 741201 735853 725210 715478 711407 716392
36617 716392 732771 762047 805090 862276 933467 1017689 1112678 1214532 1317676 1415362 1500808
36606 1500808 1568596 1615459 1639940 1641513 1620309 1577988 1519074 1451550 1385841 1332193 1297334
36595 1297334 1281959 1280392 1282595 1277461 1255950 1213121 1148776 1066690 972776 873030 772282 674320
36583 674320 583074 503948 444190 411641 412131 446887 511575 597731 695687 797200 896535 990132
36571 990132 1075943 1153244 1222702 1286026 1345087 1401030 1453914 1502795 1545804 1580197 1602692
36560 1602692 1610355 1601780 1578083 1543274 1503730 1466712 1438254 1421224 1414466 1413466 1412147 1404822
36548 1404822 1387443 1357794 1315002 1259052 1190759 1112178 1026810 939077 853102 771523 695073
36537 695073 623081 554446 488558 425910 368285 318309 278348 249158 229033 214089 199749
36526 199749 182837 163199 143904 129906 126129 136279 162836 207630 272058 356626 460212
36515 460212 579567 709247 842019 969777 1084881 1181526 1256461 1308743 1338829 1347858 1337742
36504 1337742 1311936 1276144 1238082 1206007 1186417 1182047 1191290 1209438 1230949 1251345 1267828 1278767
36492 1278767 1282924 1279232 1267254 1247939 1224085 1200194 1181868 1175083 1185607 1218603 1278290 1367528
36480 1367528 1487078 1634532 1803432 1983445 2161884 2325954 2464635 2569769 2636709 2664870
36470 2664870 2658042 2623961 2573065 2516728 2465464 2427439 2407654 2407955 2427719 2464713 2515704 2576664
36458 2576664 2642784 2708571 2768284 2816780 2850484 2867974 2869761 2857360 2832214 2794993 2745562
36447 2745562 2683464 2608684 2522403 2427437 2328253 2230614 2141050 2066361 2013102 1986895 1991484
36436 1991484 2027824 2093791 2184847 2295199 2418455 2547341 2673225 2786736 2879711 2947282
36426 2947282 2988676 3006423 3004972 2989777 2966962 2942948 2923430 2911865 2908305 2909362 2909377 2902032 2881660
36413 2881660 2844119 2787618 2713613 2627274 2537053 2453382 2387011 2347351 2340864 2369785 2431835
36402 2431835 2521425 2631838 2757205 2893310 3037406 3187807 3343830 3506019 3676317 3857816
36392 3857816 4053784 4266005 4493179 4730591 4971638 5210448 5444019 5672658 5898553
36383 5898553 6123231 6345171 6558785 6755303 6925077 7060267 7156946 7216008 7242479 7243395
36373 7243395 7225238 7192243 7146157 7087001 7014284 6928541 6832974 6734317 6641970 6565618 6512587
36362 6512587 6486181 6485319 6505205 6538867 6579316 6621793 6665300 6712790 6770069 6843759 6939005 7057504
36350 7057504 7196526 7349278 7506537 7658983 7799551 7925239 8037959 8144058 8252457
36341 8252457 8371995 8509109 8666733 8844458 9039285 9246414 9459877 9673163 9879910
36332 9879910 10074681 10253709 10415520 10561286 10694789 10822039 10950699 11089496 11247634
36323 11247634 11433899 11655275 11915325 12213182 12543790 12899361 13271166 13650792 14030564
36314 14030564 14403706 14764983 15112101 15447341 15778449 16118149 16482240 16886854 17345726
36305 17345726 17868375 18459674 19120547 19849125 20642001 21495593 22407486 23377144 24405503
36296 24405503 25493697 26641718 27847817 29109008 30422712 31788943 33212156 34702020
36288 34702020 36273002 37943136 39732393 41661218 43749957 46019548 48493056 51197148
36280 51197148 54162973 57426589 61029258 65017840 69445392 74371981 79865465 86001909
36272 86001909 92865744 100550026 109157228 118800570 129605301 141708474 155255576 170393502
36264 170393502 187260706 205975332 226620236 249222293 273723281 299940796 327519575
36257 327519575 355877463 384156594 411199040 435574953 455693977 470014429 477321783
36250 477321783 476994859 469155388 454634537 434772157 411135470 385258633 358466596
36243 358466596 331794686 305982155 281509189 258651447 237534831 218181703 200546332
36236 200546332 184540775 170053371 156961965 145143206 134478256 124855250 116169706
36229 116169706 108324612 101230946 94808264 88984777 83696981 78889192 74513203 70528120
36221 70528120 66900092 63601351 60608134 57897915 55447165 53230510 51221265 49392721
36213 49392721 47719560 46179080 44752191 43424225 42185476 41031092 39959957 38972785
36205 38972785 38070179 37251350 36513777 35853639 35266650 34748876 34297133 33908861 33581672
36196 33581672 33312887 33099345 32937660 32824816 32758721 32738368 32763529 32834198 32949955 33109405
36186 33109405 33309998 33548436 33821481 34126513 34461251 34822721 35206158 35604496 36008618
36177 36008618 36407935 36790834 37144955 37457625 37716693 37911495 38033504 38076320 38034967 37904749
36167 37904749 37680336 37355982 36927131 36392594 35755816 35024413 34208371 33318080 32363268
36158 32363268 31353173 30297458 29206955 28093656 26970159 25849166 24743199 23664068
36150 23664068 22621721 21622758 20669369 19759302 18887041 18045829 17229855 16435794 15663360
36141 15663360 14915035 14195436 13510479 12866331 12268160 11719015 11219336 10767415 10360619
36132 10360619 9996449 9672447 9384829 9126925 8888862 8658879 8425507 8179500 7915074
36123 7915074 7630462 7327776 7011997 6689293 6365447 6045139 5732145 5429821 5141310
36114 5141310 4869430 4616494 4384170 4173305 3983804 3814733 3664577 3531416 3412886
36105 3412886 3306257 3208809 3118279 3032836 2950519 2868758 2784654 2695984 2602202 2504708 2406350
36094 2406350 2310537 2220380 2137867 2063230 1994756 1929266 1863113 1793157 1717224 1633969 1542501
36083 1542501 1442340 1334058 1220251 1105944 997783 902224 823726 763828 721279 692796
36073 692796 673940 659814 645512 626400 598393 558338 504471 436685 356302 265419 166355
36062 166355 61741 -44833 -148406 -243061 -323025 -383796 -422938 -440545 -439320 -423999 -400176
36051 -400176 -372925 -345666 -319490 -293212 -264269 -230207 -189723 -142670 -89396 -30448 33007
36040 33007 98712 163608 224819 280443 329319 369906 399274 413345 408709 385150 347407 305124
36028 305124 270921 257196 272697 319950 394580 486947 585421 679830 763644 834289 891897
36017 891897 937354 970583 989825 992176 974977 937287 880895 810823 735293 664983 611386 584676
36005 584676 591895 635932 715245 824027 952832 1089798 1222338 1338819 1429894 1489423 1515078
35994 1515078 1508494 1474646 1420392 1352734 1277671 1200150 1124667 1055665 997393 953493 926561
35983 926561 917584 925255 945716 973234 1001622 1025618 1041655 1048045 1044831 1033286 1015164 991978
35971 991978 964786 934693 903772 875662 855063 845965 849446 862509 878893 891520 895258 888714
35959 888714 874508 858307 847076 847027 861822 891667 933832 984427 1040523 1101403 1168280 1242597
35947 1242597 1323848 1408099 1488217 1555819 1603914 1628677 1629434 1607041 1561800 1492309 1396234 1272819
35935 1272819 1125642 963702 799942 648018 519060 419763 352024 313494 298256 297362 299681
35924 299681 293775 270741 226873 164677 91777 18463 -45019 -90782 -114987 -118650 -107158 -88514
35912 -88514 -70967 -61039 -62665 -77495 -105967 -148575 -206792 -283122 -380004 -497896 -633548 -779482
35900 -779482 -925029 -1058529 -1169946 -1253104 -1306838 -1334655 -1343147 -1339878 -1331526 -1322670 -1315355 -1309344
35888 -1309344 -1302638 -1291742 -1271638 -1236148 -1179260 -1097067 -989267 -859540 -715011 -565252 -420819
35877 -420819 -291237 -182830 -97387 -32362 17509 58046 93901 127860 161152 194226 227495
35866 227495 261799 298581 339753 387232 442295 505140 574910 649998 728402 808036 887178
35855 887178 965069 1042396 1121235 1204251 1293299 1387876 1483937 1573487 1645162 1685960 1683974 1631390
35843 1631390 1526523 1373865 1182249 962314 724697 479458 236378 5271 -204279
35834 -204279 -384093 -529262 -639923 -721707 -784079 -837102 -888269 -940954 -994732 -1046684 -1092674
35823 -1092674 -1128323 -1149857 -1154848 -1142611 -1114122 -1071735 -1019096 -961326 -905109 -858135 -827445
35812 -827445 -816912 -824726 -842409 -856361 -851740 -816976 -747052 -644521 -518448 -381910 -248646
35801 -248646 -129713 -31276 45573 103204 145226 174804 193877 203105 202354 191510 171242 143148
35789 143148 109114 70336 26795 -22300 -77315 -137160 -199343 -261216 -321395 -380171 -438604
35778 -438604 -497085 -554456 -608118 -654830 -691662 -716784 -730093 -733652 -731762 -730404 -736104 -754661
35766 -754661 -790338 -845660 -921558 -1017381 -1130589 -1256255 -1386778 -1512145 -1620769 -1700642
35756 -1700642 -1740626 -1732065 -1670795 -1558946 -1405333 -1223677 -1029287 -835790 -653339 -488611
35746 -488611 -345833 -227708 -135475 -68213 -22233 8529 30842 49956 68071 84371 96529
35735 96529 102607 102230 96724 88634 81106 77192 79073 87677 103118 125681 156365 196339 245685
35722 245685 302416 362424 420382 471207 511707 541844 565069 587402 615488 654313 705306
35711 705306 765374 827171 880664 915611 924202 903031 853855 783071 700107 615145 536838 470800
35699 470800 419398 382534 358647 345252 339037 335981 331840 322890 306573 281833 249188 210641
35687 210641 169339 128936 92694 62629 38973 20073 2756 -16869 -42345 -75821 -117366
35676 -117366 -164802 -214232 -261279 -302930 -339292 -374281 -414585 -467130 -536103 -620871 -715550
35665 -715550 -810181 -892839 -952087 -979402 -971172 -929562 -861591 -776546 -682778 -585356 -485604 -382733
35653 -382733 -276790 -171257 -73579 6874 62264 89057 88778 66731 29632 -16738 -68850
35642 -68850 -125034 -183728 -241846 -295135 -340838 -380794 -422266 -475411 -548953 -646917 -768149
35631 -768149 -908082 -1060929 -1220870 -1381977 -1537539 -1679628 -1799410 -1888352 -1939995 -1951646
35621 -1951646 -1925168 -1866318 -1782910 -1682908 -1573651 -1462373 -1356842 -1264864 -1192521 -1142307
35611 -1142307 -1112448 -1097828 -1092085 -1090071 -1089766 -1092768 -1103021 -1124414 -1158528 -1203625 -1255027 -1306326
35599 -1306326 -1350742 -1382349 -1397218 -1394453 -1376793 -1350333 -1323132 -1302986 -1295016 -1299984 -1314137 -1330835
35587 -1330835 -1343194 -1346270 -1337636 -1316454 -1282267 -1234685 -1174096 -1102583 -1024003 -942928 -863052 -786197
35575 -786197 -712576 -641868 -574060 -509432 -448045 -389458 -333048 -278659 -227339 -181916 -147080
35564 -147080 -128416 -130347 -153878 -195541 -248246 -303487 -353577 -392918 -418268 -428611 -425103 -411145
35552 -411145 -392218 -375228 -367294 -374134 -398436 -438675 -488817 -539075 -577632 -593034 -576740 -525197
35540 -525197 -440772 -331245 -207998 -83441 31627 129993 208780 268927 313861 348080 376109
35529 376109 401760 427450 453568 478289 498116 509041 507799 492717 464004 423565 374610 321239
35517 321239 268123 220237 182468 158894 151712 160090 179500 202083 218180 218560 196470 148920
35505 148920 77057 -14131 -116793 -221872 -321139 -408775 -481771 -539076 -580213 -604252 -609677
35494 -609677 -595131 -560541 -507996 -441859 -368024 -292687 -221152 -157013 -101787 -55026 -15077
35483 -15077 19485 48211 67894 73203 58731 21466 -37524 -112883 -196252 -278446 -351601 -410398
35471 -410398 -452114 -475983 -482584 -473574 -451502 -419442 -380587 -338112 -295276 -255304 -220746 -192631
35459 -192631 -170087 -150831 -132297 -112785 -92181 -72016 -54880 -43408 -39284 -42787 -52972 -68203
35447 -68203 -86757 -107535 -130920 -159339 -196894 -247855 -314661 -396416 -488570 -583906 -674414 -753258
35435 -753258 -815876 -859782 -883624 -886612 -868989 -833011 -783276 -725749 -665932 -607329 -551027 -496335
35423 -496335 -441871 -386514 -329988 -273086 -217492 -165308 -118462 -78350 -45627 -19952 492
35412 492 19404 42193 74988 123134 189780 275101 376246 487794 602362 711261 805258
35401 805258 875558 914949 919014 887197 823262 734526 629726 516383 399190 280374 161598
35390 161598 45917 -61433 -153678 -224049 -267590 -282735 -272337 -243805 -208060 -177378 -162701
35379 -162701 -171319 -205695 -263534 -338744 -422975 -507621 -586066 -655468 -717115 -774914 -832536 -890537
35367 -890537 -944740 -986557 -1005191 -991051 -939261 -851998 -738672 -613794 -493363 -391140 -316007
35356 -316007 -270987 -253859 -258863 -278819 -306854 -337200 -365007 -385749 -395049 -389351 -367065 -329367
35344 -329367 -280088 -224782 -169509 -119701 -79355 -50656 -34066 -28669 -32542 -43257 -58674 -77833
35332 -77833 -101172 -129674 -163530 -201388 -240804 -279457 -316272 -351863 -388132 -427240 -470341 -516642
35320 -516642 -563174 -605338 -637976 -656506 -657710 -639925 -602697 -546152 -470397 -375179 -260074
35309 -260074 -125382 26550 190385 358152 521045 671723 805686 920877 1015925 1088594
35299 1088594 1135842 1155538 1148337 1118031 1070059 1009504 940139 864928 787065 710440 639159
35288 639159 576599 524714 483912 453299 430875 413459 396643 375402 345606 305918 259007
35277 259007 211132 169950 141267 126112 119705 113117 96891 64514 13759 -54398 -137834 -234561
35265 -234561 -342610 -459099 -579454 -697483 -806465 -900871 -977846 -1037670 -1083043 -1117678
35255 -1117678 -1144776 -1165794 -1179836 -1184019 -1174751 -1149251 -1106536 -1047651 -975443 -894078 -808208 -721838
35243 -721838 -637521 -556483 -479517 -407669 -342011 -282909 -229795 -181980 -139906 -105772 -82987
35232 -82987 -74813 -83012 -107209 -145211 -194025 -250917 -313909 -381450 -451623 -521482 -587022 -643932
35220 -643932 -688866 -720663 -740866 -753302 -762979 -774807 -792505 -817825 -850110 -886253 -921115 -948513
35208 -948513 -962748 -960383 -941384 -908792 -866976 -819686 -769229 -716965 -664215 -612593 -563597 -517973
35196 -517973 -475350 -434400 -393612 -352498 -312607 -277697 -252885 -243453 -254040 -288392 -349085 -436723
35184 -436723 -548731 -678400 -814965 -945075 -1055435 -1135797 -1181064 -1191611 -1171876 -1128415
35174 -1128415 -1068634 -1000569 -932954 -874728 -833769 -815425 -821423 -849363 -892903 -942824 -989043
35163 -989043 -1023046 -1039677 -1037515 -1017971 -984048 -939688 -889864 -840800 -799560 -772743 -764834 -777175
35151 -777175 -808199 -854700 -913184 -980421 -1053048 -1126911 -1197012 -1258342 -1307090 -1341428 -1361541
35140 -1361541 -1369279 -1367837 -1361379 -1354155 -1349165 -1347121 -1346468 -1344339 -1337656 -1323716 -1300358 -1266036 -1220013
35127 -1220013 -1162642 -1095770 -1023126 -950222 -883251 -827167 -783942 -752117 -728065 -708293 -691577
35116 -691577 -679725 -676398 -684581 -704202 -731443 -760107 -783942 -798430 -801342 -792519 -773489 -747138
35104 -747138 -717120 -686955 -659188 -635008 -614376 -596262 -578729 -559059 -534396 -502934 -464996
35093 -464996 -423109 -380947 -341872 -307937 -279496 -255227 -232595 -209019 -183360 -156588 -130795
35082 -130795 -107162 -84624 -60504 -32633 -1192 31211 61172 86454 106995 124735 142869
35071 142869 164905 193335 227892 264252 294433 309047 300290 264113 200862 114606 11844
35060 11844 -99780 -212342 -318062 -409832 -482298 -533304 -564694 -581690 -591057 -599088 -610329
35049 -610329 -627182 -650062 -677983 -709624 -744567 -783901 -829546 -882689 -942576 -1006567 -1071172
35038 -1071172 -1133047 -1189296 -1237341 -1275004 -1300966 -1315281 -1319557 -1316767 -1310712 -1305136 -1302563 -1303251 -1304762
35025 -1304762 -1302224 -1289000 -1257569 -1200947 -1114804 -999658 -861798 -712111 -563186 -426021
35015 -426021 -307631 -210263 -132329 -70542 -22132 14146 38775 53154 60641 65857 72701 82589
35003 82589 94131 104173 109123 105753 91514 64821 25360 -25832 -86494 -153111 -220777 -283554
34991 -283554 -335784 -373835 -397245 -408772 -413651 -418531 -430255 -454561 -495074 -552990 -627438 -716228
34979 -716228 -816625 -926073 -1042697 -1165490 -1294237 -1429288 -1571062 -1719124 -1871045 -2021779
34969 -2021779 -2164159 -2290373 -2393639 -2469406 -2515875 -2533968 -2526928 -2499660 -2458047 -2408390 -2357047
34958 -2357047 -2310065 -2272592 -2247999 -2237145 -2238375 -2248545 -2264581 -2284543 -2307616 -2333233 -2360132
34947 -2360132 -2385968 -2407413 -2420452 -2420664 -2403661 -2365859 -2305457 -2223106 -2121866 -2006432 -1882018
34936 -1882018 -1753338 -1623949 -1496037 -1370687 -1248535 -1130473 -1018064 -913423 -818689 -735417
34926 -735417 -664308 -605432 -558678 -523992 -501194 -489624 -487995 -494699 -508414 -528646 -555762 -590297
34914 -590297 -631851 -678358 -726447 -772843 -815958 -856566 -897019 -939366 -983581 -1027057 -1065759
34903 -1065759 -1096223 -1117114 -1129553 -1136364 -1140978 -1146588 -1155832 -1170853 -1193402 -1224680 -1264967 -1313413
34891 -1313413 -1368210 -1427069 -1487768 -1548578 -1608421 -1666540 -1721767 -1771962 -1814124 -1845090 -1862244
34880 -1862244 -1863918 -1849638 -1820253 -1777762 -1724698 -1663515 -1596368 -1525155 -1451274 -1374864 -1294076
34869 -1294076 -1205071 -1103048 -983949 -846168 -691624 -525831 -357055 -194822 -48172 75990
34859 75990 174005 245707 293807 322758 337582 343010 343141 341523 341324 345197 354910 371106 393585
34846 393585 421967 456340 497538 546863 605250 672114 744448 816780 882032 932856 962900
34835 962900 967905 946700 901925 839869 768904 696720 627574 561103 493483 420172 338663 249977
34823 249977 158806 72739 799 -48718 -70727 -65158 -37116 4734 50782 92943 126135 148470
34811 148470 160315 162772 156184 139300 109523 64204 2344 -74326 -161578 -253909 -345769 -432080
34799 -432080 -508260 -570473 -616432 -646322 -663051 -671488 -676887 -683131 -691461 -700153 -705258 -702212 -687771
34786 -687771 -661565 -626580 -588359 -553478 -528232 -517847 -525689 -551897 -592008 -636920 -675063 -695975
34774 -695975 -693392 -666275 -617603 -552084 -474442 -389180 -301377 -217148 -142881 -83651 -42109 -18737
34762 -18737 -13160 -25413 -56166 -105734 -172621 -252789 -340303 -428924 -513457 -590015 -655513 -707414
34750 -707414 -744352 -767106 -778842 -783982 -786295 -787485 -787228 -784479 -778995 -772088 -766334 -764708 -769822 -783560
34736 -783560 -807007 -840389 -882956 -932987 -988132 -1046048 -1105069 -1164677 -1225519 -1288788 -1355038
34725 -1355038 -1423105 -1490062 -1552498 -1608318 -1657730 -1702611 -1744518 -1782433 -1811560 -1824138 -1812159
34714 -1812159 -1770723 -1700196 -1606131 -1497263 -1382755 -1269823 -1162461 -1061559 -966203 -875319
34704 -875319 -788697 -706998 -631275 -562648 -502281 -451294 -410387 -379412 -357215 -341742 -330181
34693 -330181 -319050 -304381 -282195 -249209 -203514 -144975 -75284 2226 82763 160206 227456
34682 227456 277525 305429 310089 294898 266231 230620 192269 152159 108737 59258 948 -68149
34670 -68149 -148555 -238957 -336215 -435746 -532021 -619119 -691452 -744737 -776944 -788745 -783374 -766139
34658 -766139 -743793 -723583 -711867 -712601 -726538 -751627 -784359 -821180 -859248 -896411 -930810 -960535
34646 -960535 -983607 -998289 -1003614 -999811 -988208 -970455 -947443 -918625 -882173 -835795 -777762 -707795
34634 -707795 -627646 -541199 -453963 -372271 -302732 -252147 -227278 -233749 -274114 -346192 -442872 -553711
34622 -553711 -667482 -774383 -867137 -941116 -994132 -1026415 -1040647 -1041532 -1034500 -1023763 -1010561 -992575
34610 -992575 -964952 -922452 -861779 -783211 -691344 -594892 -505372 -434549 -391232 -378789 -394596
34599 -394596 -431637 -481214 -535420 -588500 -636996 -679215 -714801 -745009 -773508 -806799 -853141
34588 -853141 -919633 -1008472 -1114225 -1223813 -1319618 -1384582 -1407275 -1385017 -1324084 -1237206 -1139457
34577 -1139457 -1044159 -960209 -891576 -838743 -801072 -778883 -774361 -791081 -832497 -900103 -992075
34566 -992075 -1102906 -1224321 -1347234 -1464052 -1570194 -1664010 -1745199 -1812892 -1864717 -1897365
34556 -1897365 -1908128 -1896378 -1864210 -1815881 -1756313 -1689465 -1617478 -1540878 -1459249 -1371604 -1276411
34545 -1276411 -1171830 -1056508 -930519 -795756 -655540 -513917 -375311 -244678 -127658
34536 -127658 -30010 43810 92082 116203 119721 106704 80386 42461 -7040 -69277 -145418 -235044
34524 -235044 -334811 -438121 -536084 -619646 -682295 -722283 -743191 -752376 -758127 -767078 -782919 -806295
34512 -806295 -835158 -865152 -890156 -903165 -897424 -867606 -810913 -727947 -622963 -503142 -377059
34501 -377059 -253115 -138520 -38744 43082 107003 156678 198651 240136 286059 336637 386612
34490 386612 426446 444985 432684 384374 300753 188128 56659 -82063 -217213 -340255
34480 -340255 -445806 -531720 -598369 -647361 -680287 -697995 -700376 -686356 -654063 -601427 -527415
34469 -527415 -433508 -324614 -208749 -95489 6170 89701 152025 193389 216301 224005 219050
34458 219050 202396 173200 129282 68176 -11625 -109787 -224009 -350547 -484880 -622266 -758240
34447 -758240 -889194 -1012774 -1127819 -1233649 -1328972 -1410920 -1474962 -1516181 -1531599 -1522361 -1494399
34436 -1494399 -1457071 -1420520 -1393159 -1380219 -1383463 -1401539 -1430593 -1465081 -1498741 -1525383 -1539180
34425 -1539180 -1534595 -1506483 -1450615 -1364325 -1246882 -1099549 -925581 -730268 -520902 -306576
34415 -306576 -97741 94604 260239 391483 484949 542706 572249 584967 593280 607477 633581
34404 633581 672966 723484 781151 841679 901530 958462 1011585 1060953 1106807 1148782 1185483
34393 1185483 1214735 1234315 1242648 1238970 1222978 1194434 1153104 1099076 1033204 957459 875028 789997
34381 789997 706525 627598 553930 483639 412936 337392 253078 157202 48384 -73188 -205778
34370 -205778 -346491 -492038 -639461 -786341 -930245 -1067733 -1193682 -1301762 -1386225 -1444195
34360 -1444195 -1477165 -1490958 -1494247 -1496309 -1504663 -1523280 -1552138 -1588542 -1629552 -1673995 -1722867 -1778197
34348 -1778197 -1841406 -1912181 -1988107 -2064950 -2137356 -2199853 -2247862 -2278407 -2290283 -2283678 -2259382
34337 -2259382 -2218052 -2160015 -2085756 -1996616 -1895040 -1784174 -1667231 -1547179 -1426963 -1309891
34327 -1309891 -1199827 -1100982 -1017378 -952112 -906540 -879642 -867988 -866558 -870120 -874405 -876508 -874615
34315 -874615 -867700 -855541 -838895 -819382 -798810 -778153 -756774 -732520 -702890 -666682 -624997 -580751
34303 -580751 -536904 -494537 -452030 -405800 -352063 -288513 -215009 -133111 -45079 46806 140204
34292 140204 232188 318885 395720 458110 502155 524879 524135 498667 448769 377424 291045 198958
34280 198958 111444 37125 -19060 -56602 -78892 -91904 -102548 -117086 -139970 -173286 -216806
34269 -216806 -268420 -324834 -382499 -438569 -491604 -541910 -591546 -644104 -704067 -775632 -861189
34258 -861189 -960101 -1068415 -1179630 -1286031 -1379970 -1454815 -1505712 -1530198 -1528475 -1502998 -1457466
34247 -1457466 -1395580 -1319968 -1231591 -1129845 -1013417 -881452 -734391 -574121 -403686 -226973
34237 -226973 -48410 127411 296029 452955 593061 710202 797816 850678 867053 850043
34227 850043 807246 748726 684233 620923 562517 509953 463023 422132 389435 368880 364962 380428
34215 380428 413662 456914 496482 515219 496535 428374 305835 131853 -83894 -327416 -583513
34204 -583513 -838786 -1083651 -1312771 -1523930 -1716170 -1888198 -2037806 -2162325 -2259617 -2329021
34194 -2329021 -2371795 -2390901 -2390322 -2374274 -2346613 -2310482 -2268132 -2220958 -2169785 -2115297 -2058408 -2000498
34182 -2000498 -1943596 -1890582 -1845245 -1811958 -1794760 -1795818 -1813597 -1841571 -1868399 -1879927 -1862355
34171 -1862355 -1805377 -1704270 -1560618 -1381903 -1180246 -970529 -767946 -585294 -430617 -306014
34161 -306014 -208038 -129471 -61717 2836 68966 137643 206255 269928 323283 361838 382680
34150 382680 384578 367910 334607 287988 232287 171889 110553 51078 -4470 -54294 -96690 -130427
34138 -130427 -155318 -172414 -183454 -189710 -190736 -183775 -164505 -129332 -78339 -17082 44268 94254
34126 94254 123939 128994 109385 67811 8585 -62382 -137271 -206858 -262303 -297470 -310532 -304071
34114 -304071 -283824 -256874 -230019 -208608 -195752 -191934 -195188 -202120 -209576 -216325 -223944 -236536 -259431
34101 -259431 -297375 -352801 -424669 -508329 -596453 -680664 -753182 -808059 -841951 -854557 -848744 -830262
34089 -830262 -806961 -787566 -780208 -790916 -822378 -873290 -938720 -1011614 -1084971 -1153656 -1214844 -1267055
34077 -1267055 -1308629 -1336913 -1348706 -1341733 -1316249 -1275896 -1227366 -1178962 -1138635 -1112141 -1101976
34066 -1101976 -1107431 -1125559 -1152356 -1183358 -1213528 -1237090 -1248029 -1241183 -1213182 -1162556 -1089066 -992998
34054 -992998 -875161 -737805 -585938 -428136 -276159 -143359 -42519 16028 25499 -16969
34044 -16969 -110081 -247863 -419187 -608460 -798178 -972616 -1120746 -1237085 -1320814 -1374472
34034 -1374472 -1403006 -1412935 -1411312 -1404530 -1397241 -1391518 -1386456 -1378624 -1363440 -1336754 -1295719 -1238784 -1165525
34021 -1165525 -1076900 -975790 -867369 -759064 -660084 -580298 -528300 -509092 -522363 -562222 -618499
34010 -618499 -679034 -732174 -768879 -784083 -777121 -751126 -711552 -664254 -614019 -564141 -517054 -475238
33998 -475238 -441638 -419224 -409853 -412928 -424568 -438064 -445879 -442502 -426719 -401915 -374029 -348135
33986 -348135 -325508 -302927 -274670 -236032 -186397 -130420 -77062 -37251 -21103 -35500 -82490
33975 -82490 -158691 -255705 -361332 -461458 -542515 -594264 -612271 -599036 -563075 -516124 -469675
33964 -469675 -432312 -408759 -400544 -407455 -428727 -463293 -509234 -563219 -620667 -676632 -726902 -768875
33952 -768875 -802194 -829077 -853973 -882356 -919009 -966696 -1025734 -1094351 -1169328 -1246703 -1322519
33941 -1322519 -1393611 -1458086 -1515191 -1564567 -1605357 -1635812 -1653759 -1657748 -1648169 -1627422 -1598896 -1565381
33929 -1565381 -1527989 -1486224 -1438947 -1385636 -1327487 -1268076 -1213196 -1169651 -1143398 -1137892 -1153272
33918 -1153272 -1186355 -1231059 -1279065 -1320735 -1346474 -1348474 -1322604 -1269860 -1196635 -1113388 -1031874
33907 -1031874 -961800 -908216 -870863 -845876 -828944 -818139 -814961 -823333 -847371 -889046 -946757 -1015367
33895 -1015367 -1087614 -1155988 -1214049 -1256793 -1280505 -1282666 -1262026 -1218670 -1153945 -1070239 -970636
33884 -970636 -858469 -736961 -609293 -479162 -351410 -231878 -126102 -37460 33945 90798
33874 90798 136749 174508 204938 227447 241044 245074 238965 221372 189753 141200 74167 -10037
33862 -10037 -106860 -209306 -309548 -400759 -478568 -541591 -590951 -629302 -659787 -685134 -706952
33851 -706952 -725482 -740021 -749675 -753738 -751357 -740931 -720231 -687810 -645165 -598087 -555721 -527374
33839 -527374 -518795 -530062 -555991 -588383 -618858 -641325 -653613 -658023 -660587 -669167 -691000 -730624
33827 -730624 -789018 -864105 -951933 -1047603 -1145569 -1239691 -1323641 -1391846 -1440666 -1469342 -1480234
33816 -1480234 -1478044 -1468157 -1454931 -1441013 -1428047 -1418000 -1413904 -1419412 -1437641 -1470158 -1516505 -1574114
33804 -1574114 -1638266 -1702079 -1756897 -1793512 -1804294 -1785529 -1738770 -1670199 -1588144 -1499981 -1409997
33793 -1409997 -1319087 -1226127 -1130079 -1031652 -933699 -840249 -754752 -678384 -609147 -542304 -472207
33782 -472207 -394849 -309830 -220572 -132652 -51302 20546 82844 137665 187663 234565 278298
33771 278298 317042 348044 368723 377460 373622 356722 325161 275477 202987 103981 -21440 -167596
33759 -167596 -323763 -476783 -613960 -724632 -800278 -834446 -823543 -768126 -673486 -548798
33749 -548798 -405223 -253853 -104153 36827 164369 275354 367430 438645 487661 514165
33739 514165 518979 503745 470432 421174 358756 287446 213208 142514 80149 27486 -17524 -58850
33727 -58850 -100687 -146566 -199208 -260494 -331320 -411467 -499591 -593117 -688031 -778888 -859462 -924065
33715 -924065 -969015 -993579 -999911 -992085 -974725 -951858 -926251 -899138 -870231 -838188 -801624 -760294
33703 -760294 -715623 -670261 -627123 -588841 -557814 -536283 -525907 -527189 -539461 -561574 -592599 -631912
33691 -631912 -678719 -731501 -787742 -844127 -897164 -944017 -983048 -1013684 -1035768 -1048993 -1052820 -1046784
33679 -1046784 -1030849 -1005608 -972316 -932688 -888320 -839763 -785741 -723288 -649180 -562158 -464752
33668 -464752 -363706 -268883 -191194 -140139 -121547 -136176 -179852 -245202 -324179 -410304 -499872
33657 -499872 -591848 -686490 -783111 -877947 -963420 -1029546 -1067110 -1071206 -1043500 -992178 -929553 -868409
33645 -868409 -818711 -786057 -772230 -776907 -798978 -836464 -885341 -938596 -986736 -1019976 -1031237 -1018547
33633 -1018547 -985649 -940414 -891737 -846566 -808601 -779106 -758809 -749378 -753610 -774506 -814002 -872092
33621 -872092 -946736 -1034494 -1131402 -1233413 -1336208 -1434930 -1524596 -1601338 -1663782 -1713591 -1754850
33610 -1754850 -1792739 -1832258 -1877354 -1930256 -1990884 -2056611 -2122860 -2184472 -2237005 -2277191 -2302525
33599 -2302525 -2310605 -2298734 -2263816 -2202731 -2113485 -1996927 -1857972 -1705253 -1549235 -1399941
33589 -1399941 -1265410 -1151266 -1061118 -997313 -961473 -954258 -974375 -1017708 -1077630 -1146690 -1218701
33578 -1218701 -1289851 -1358216 -1422074 -1478150 -1520883 -1543271 -1539088 -1505469 -1444705 -1364341 -1275569
33567 -1275569 -1190682 -1120644 -1073480 -1053495 -1060964 -1092143 -1139972 -1195730 -1251129 -1299683 -1336729
33556 -1336729 -1358602 -1362094 -1344640 -1304690 -1241598 -1155056 -1044614 -909787 -750867 -570267 -373709
33545 -373709 -170347 28631 212243 371433 499613 592338 647007 662854 640914 583556
33535 583556 493706 374287 228446 60496 -123162 -314083 -503033 -681883 -845169 -990708
33525 -990708 -1119221 -1233265 -1335847 -1429145 -1513734 -1588524 -1651346 -1699796 -1731949 -1746919 -1745442
33514 -1745442 -1730457 -1707224 -1682478 -1662661 -1652050 -1651821 -1660607 -1676282 -1697876 -1726386 -1763998 -1812376
33502 -1812376 -1871178 -1937511 -2006371 -2071793 -2128486 -2173404 -2206471 -2229970 -2246898 -2259161 -2266427
33491 -2266427 -2266169 -2254889 -2229914 -2190730 -2139136 -2078466 -2012701 -1946048 -1882943 -1828092 -1786293 -1762033
33479 -1762033 -1759095 -1780402 -1827967 -1902388 -2001686 -2120129 -2248146 -2373772 -2484873 -2570955 -2623991
33468 -2623991 -2638452 -2610986 -2540114 -2426143 -2271408 -2080773 -1862031 -1625740 -1384264 -1150205
33458 -1150205 -934773 -746593 -591177 -470979 -385820 -333426 -309714 -308650 -321964 -339620 -351586
33447 -351586 -350414 -333140 -301196 -258291 -207581 -149706 -82605 -2939 91668 200588 319088
33436 319088 438431 547007 632145 682407 690070 653201 576618 471375 352946 238472 143480
33425 143480 78807 48839 51813 81875 131639 193972 262599 331902 396598 451850 493942 521264
33413 521264 535100 539756 541798 548361 564983 593741 632648 676601 719335 755200 779933 790506
33401 790506 784816 761963 723015 671628 613946 557842 511735 483013 476121 490820 521578 558663
33389 558663 590633 607150 601078 569328 512563 434390 340546 238267 135604 40438 -40708
33378 -40708 -103655 -146704 -169680 -172432 -153932 -112726 -48263 38125 143088 261562 387004
33367 387004 511751 627891 728437 808173 863911 894354 899747 881304 840493 778574 696654
33356 696654 596152 479313 349560 211600 71157 -65655 -193247 -307481 -406439 -490751
33346 -490751 -563277 -628018 -688600 -746933 -802742 -854091 -898435 -933395 -956928 -967250 -963146 -944641
33334 -944641 -913382 -872130 -823544 -769125 -709120 -643460 -573106 -500878 -431243 -369147 -318612
33323 -318612 -281724 -258297 -246106 -241516 -240399 -239103 -235138 -227346 -215732 -201176 -185090 -168805
33311 -168805 -152894 -136921 -119965 -101439 -81329 -59551 -35105 -6003 29734 72720 121481
33300 121481 172884 223328 269879 310689 344791 371844 392116 406503 416260 422477 425652 425571 421427
33287 421427 412108 396651 374688 346576 313051 274783 232361 186912 140931 98588 65013 44704
33275 44704 39855 49575 70421 97863 127750 157059 183690 205670 220422 224599 214597 187352
33263 187352 140987 75122 -9089 -109116 -221470 -342305 -467788 -593769 -714811 -823500
33253 -823500 -911137 -970005 -995915 -989247 -953892 -895144 -818147 -727427 -626922 -519831 -408385
33242 -408385 -293986 -177780 -61257 53473 163731 266408 358098 435270 494699 534210
33232 534210 553347 553314 535825 501498 449032 375968 280646 164107 30782 -112360 -257765
33221 -257765 -399354 -533914 -661422 -784424 -906767 -1032000 -1161839 -1295138 -1427640 -1552467
33211 -1552467 -1661223 -1745629 -1799665 -1821731 -1816052 -1792481 -1764451 -1745640 -1746600 -1772621 -1823434 -1894346
33199 -1894346 -1977923 -2065474 -2148067 -2217132 -2265015 -2285844 -2276801 -2239273 -2179197 -2106288 -2032367
33188 -2032367 -1969234 -1926498 -1909872 -1920485 -1955361 -2008744 -2073741 -2143862 -2214026 -2280664 -2341114
33177 -2341114 -2393127 -2435217 -2467470 -2491730 -2510543 -2525370 -2535251 -2536635 -2524364 -2493334 -2440261 -2365093
33165 -2365093 -2271708 -2167692 -2063153 -1968760 -1893458 -1842464 -1816043 -1809341 -1813237 -1815962 -1805088
33154 -1805088 -1769455 -1700787 -1594792 -1451700 -1276079 -1075923 -861250 -642688 -430499 -234001
33144 -234001 -61051 82639 193997 272370 318702 334856 323710 289736 239225 179794 119470
33133 119470 65754 24723 88 -7429 143 19468 47971 85431 133973 196324 273428 362858
33121 362858 458802 553192 637154 702204 741025 747816 718436 650860 546331 410687 254639
33110 254639 92040 -63558 -202657 -322218 -425714 -520925 -616446 -718479 -829193 -947104
33100 -947104 -1068707 -1190039 -1307252 -1416290 -1512555 -1591298 -1648668 -1682669 -1693206 -1681142 -1647138
33089 -1647138 -1591325 -1514269 -1418589 -1309963 -1196667 -1087749 -990698 -909561 -844263 -791416 -746204
33078 -746204 -704337 -663255 -622594 -584365 -552886 -533920 -532703 -551594 -588703 -638245 -692365 -743318
33066 -743318 -785141 -814360 -829889 -832482 -824159 -807809 -787064 -766265 -750262 -743828 -750671 -772332
33054 -772332 -807440 -851792 -899414 -944319 -982247 -1011682 -1033807 -1051454 -1067360 -1082286 -1093844
33043 -1093844 -1096843 -1085194 -1054472 -1003955 -937417 -862549 -789117 -726218 -679481 -649360 -631327
33032 -631327 -617997 -602338 -580732 -554541 -529471 -513160 -512415 -531372 -570908 -628752 -699806 -776624
33020 -776624 -850209 -911291 -952068 -968217 -960426 -934483 -899420 -864358 -835610 -815335 -802024 -792175
33008 -792175 -782120 -769221 -752095 -730112 -702857 -670175 -632817 -593010 -554318 -520795 -495986
32997 -495986 -482181 -479895 -487507 -501422 -517174 -531258 -542673 -553143 -565842 -583467 -606806 -634351
32985 -634351 -662794 -687844 -705012 -710443 -701898 -679660 -646775 -608157 -568774 -531833 -497913 -465478
32973 -465478 -432383 -397492 -361554 -326861 -295907 -269973 -248697 -231005 -216735 -207736 -207589 -219944
32961 -219944 -246328 -284668 -329665 -375200 -417504 -457055 -497932 -545048 -600943 -663741 -727040
32950 -727040 -781630 -818269 -830425 -815932 -777252 -720651 -654892 -589825 -535189 -499845 -491459 -516246
32938 -516246 -578362 -678931 -815245 -980743 -1165875 -1359319 -1548867 -1721986 -1866743 -1973660
32928 -1973660 -2037894 -2060339 -2046653 -2004802 -1942595 -1866409 -1781187 -1691081 -1599968 -1511504 -1428824
32917 -1428824 -1354230 -1289062 -1233669 -1187278 -1147835 -1112109 -1076249 -1036633 -990624 -936982 -876000
32906 -876000 -809634 -741777 -678241 -625773 -589989 -573220 -573667 -586486 -605981 -627577 -648780 -669249
32894 -669249 -690397 -714659 -744452 -781096 -824062 -870780 -916793 -956167 -982267 -989089 -972877 -933408
32882 -933408 -874495 -803642 -730963 -667285 -621650 -599002 -599129 -617362 -646493 -679040 -709103 -733386
32870 -733386 -750970 -761753 -764202 -753882 -724095 -668596 -584797 -475414 -347775 -211787 -78165
32859 -78165 42485 140471 208422 243032 246028 223727 185330 140638 97829 61893 34239 13629
32847 13629 -2183 -15107 -26297 -36513 -46532 -57158 -68868 -81599 -95027 -109219 -125091 -144124
32835 -144124 -167382 -194549 -223851 -252942 -280017 -304240 -325303 -342636 -354885 -359812 -354620 -336616
32823 -336616 -304102 -257117 -197737 -130037 -60005 4547 54542 80925 76428 37112 -36798 -140928
32811 -140928 -267613 -407578 -551965 -693908 -829099 -955572 -1073472 -1185066 -1294530 -1406768
32801 -1406768 -1525207 -1649399 -1773719 -1888089 -1980666 -2041395 -2064864 -2051550 -2007574 -1943605
32791 -1943605 -1873059 -1809368 -1762603 -1736756 -1729271 -1733113 -1740037 -1743059 -1737135 -1718657 -1685080 -1635411
32779 -1635411 -1571134 -1496638 -1418556 -1344183 -1279635 -1228390 -1190580 -1163053 -1140074 -1114597 -1080034
32768 -1080034 -1032087 -969811 -895168 -811272 -720371 -622833 -517667 -404133 -283365 -159060
32758 -159060 -37002 76053 173572 250350 303631 333898 344649 341028 328216 310693 292496
32747 292496 277445 268334 265281 264559 259079 240611 202542 141819 59339 -40881 -152991 -270424
32735 -270424 -386604 -495410 -591722 -672280 -736603 -787392 -829932 -870667 -915524 -968589 -1031286
32724 -1031286 -1102086 -1176777 -1249358 -1313419 -1363568 -1396464 -1411094 -1408152 -1388740 -1352949 -1299200
32713 -1299200 -1224943 -1128441 -1010568 -875646 -731066 -586154 -450711 -333372 -239937 -172162
32703 -172162 -127566 -100479 -84041 -72402 -62205 -52645 -44204 -37047 -30229 -22149 -11693 834
32691 834 13553 23514 27321 21397 1900 -35278 -94022 -177051 -284889 -415103 -562023 -717264
32679 -717264 -871224 -1015189 -1143160 -1252497 -1343230 -1416635 -1473960 -1515879 -1542794 -1555668 -1556965
32668 -1556965 -1551218 -1544843 -1545019 -1557890 -1586832 -1631595 -1688748 -1753164 -1819797 -1884815 -1945524 -1999336
32656 -1999336 -2042843 -2072030 -2083720 -2077328 -2055760 -2024893 -1991821 -1962532 -1939976 -1923387 -1909189
32645 -1909189 -1892949 -1871217 -1842161 -1804747 -1757184 -1695985 -1616511 -1514777 -1389329 -1242090 -1077911
32634 -1077911 -903360 -725286 -549481 -379647 -217059 -61115 89364 234844 374421
32625 374421 506043 627181 735414 828704 905465 964588 1005407 1027512 1030355 1012711 972123
32614 972123 904677 805407 669444 493769 279363 33154 -231215 -494872 -737318 -940666
32604 -940666 -1092682 -1187927 -1227484 -1217978 -1170100 -1096548 -1009589 -918688 -828877 -740576 -651210
32593 -651210 -558059 -460939 -363377 -271937 -194233 -136656 -102822 -93497 -107949 -145615 -206720 -291376
32581 -291376 -397988 -522117 -656486 -792006 -919455 -1031300 -1122908 -1192476 -1239704 -1264209
32571 -1264209 -1264974 -1241312 -1194551 -1129127 -1052319 -972928 -899682 -839963 -799048 -779764 -782468 -805233
32559 -805233 -844186 -894077 -949165 -1004238 -1055238 -1099064 -1132594 -1151632 -1150665 -1123795 -1066491 -977341
32547 -977341 -859163 -719167 -568160 -418847 -283533 -171826 -88863 -34370 -2700 15747
32537 15747 31706 53582 85021 124646 167816 209122 244427 271901 291997 306706 318662 330582
32525 330582 345095 364503 390148 421648 456563 490835 519931 540314 550668 552294 548502 543435
32513 543435 541023 544348 555087 572759 594048 612886 621614 612891 581585 526036 448453 354539
32501 354539 252474 151318 59077 -19077 -81629 -130054 -166982 -194334 -212658 -221899 -222695 -216921
32489 -216921 -207098 -195370 -183015 -170756 -159426 -150525 -146573 -151241 -169063 -204502 -260660 -338200
32477 -338200 -434956 -546359 -666444 -789052 -908822 -1021591 -1124185 -1213855 -1287686 -1342186
32467 -1342186 -1373261 -1376825 -1350019 -1292503 -1207041 -1099071 -975689 -844806 -714628 -593019
32457 -593019 -486328 -397937 -327493 -271567 -225612 -186120 -151693 -122535 -99092 -81090 -67763
32446 -67763 -58774 -54730 -56643 -64784 -77885 -93094 -106457 -113664 -111162 -97611 -74936 -48038 -23061
32433 -23061 -5310 1833 -3363 -21855 -54289 -100720 -159986 -229396 -305053 -382648 -458285 -529016
32421 -529016 -593059 -649733 -699046 -741022 -775125 -800248 -815124 -818555 -809170 -785236 -745286 -689599
32409 -689599 -621608 -548227 -478735 -422677 -387657 -377856 -393613 -431783 -486353 -549227 -611633 -666279
32397 -666279 -709442 -741712 -766897 -789814 -814300 -842341 -874331 -909900 -948708 -990877 -1037091
32386 -1037091 -1088434 -1146038 -1210655 -1282405 -1360853 -1445145 -1533863 -1624681 -1714302 -1798900 -1874572
32375 -1874572 -1937276 -1982521 -2005630 -2002934 -1973192 -1918266 -1842661 -1752317 -1653268 -1550554 -1447569
32364 -1447569 -1346001 -1246443 -1149534 -1057081 -972422 -899507 -840911 -795768 -758828 -721318 -673319
32353 -673319 -606639 -517091 -405487 -277224 -140688 -4917 122800 238467 341356 432543
32343 432543 513032 582735 640811 686779 721309 746102 763120 773889 779281 779558 774211 761620
32331 761620 738984 702873 650305 579877 492478 391219 280431 164154 44979 -76143
32321 -76143 -199357 -325185 -453886 -584590 -714426 -838377 -950306 -1044580 -1117214 -1166145
32311 -1166145 -1191072 -1193337 -1175767 -1142112 -1096005 -1039872 -974515 -899856 -816531 -727382 -637778
32300 -637778 -554611 -484722 -433579 -404368 -397061 -407422 -426686 -442913 -444097 -421846 -373809 -303744
32288 -303744 -219449 -129785 -42146 38839 111259 175052 231148 281084 326886 370761 414456
32277 414456 458757 503473 547846 591068 632678 672609 710574 744917 771857 786231 783713 763033
32265 763033 726573 678893 624203 564118 496711 417336 321090 205897 74513 -65829 -205820
32254 -205820 -337023 -453776 -553521 -636003 -702168 -753445 -791687 -819542 -840599 -858749 -876735
32243 -876735 -894580 -908882 -913653 -902528 -871378 -820167 -753373 -678877 -605629 -540684 -486676 -440968
32231 -440968 -397068 -347611 -287328 -214647 -131657 -42956 45681 128261 199027 252700 284855
32220 284855 292619 275614 236906 183439 125417 74493 41413 34055 56386 108176 185086 279119
32208 279119 379663 475160 555023 611226 639131 637527 608195 555330 485036 404905 323631
32197 323631 250449 194073 161113 154522 172966 211498 263205 321109 379716 435830 488567 538794
32185 538794 588407 639484 693171 748559 802467 850861 891186 923811 951338 976347 999332
32174 999332 1018238 1029602 1030270 1018620 994954 961297 920952 877870 835721 796822 761436 727926
32162 727926 693690 656319 614328 567157 514624 456267 390995 317343 234357 142916 46990
32151 46990 -45887 -125458 -180869 -203418 -188860 -138429 -58361 41710 150878 259079 358726
32140 358726 445382 517334 574583 618189 650348 674653 695649 717507 742588 770821 800150
32129 800150 827556 849895 864130 867094 855375 825753 776098 706108 617426 513203 397491
32118 397491 274742 149338 25186 -94470 -206943 -309947 -401661 -480899 -547007 -599436
32108 -599436 -637502 -660766 -669751 -666177 -652246 -629543 -598557 -559364 -513154 -463558 -416826 -380548
32096 -380548 -361537 -363937 -388322 -431865 -489381 -554946 -623742 -693319 -763608 -835739 -910565 -987807
32084 -987807 -1066045 -1143207 -1217093 -1285716 -1347530 -1401696 -1448375 -1488793 -1524775 -1557864 -1588553
32073 -1588553 -1616111 -1639061 -1655944 -1666024 -1669685 -1668411 -1664363 -1659827 -1656831 -1657011 -1661592 -1671295 -1686233
32060 -1686233 -1705916 -1729454 -1755745 -1783418 -1810452 -1833743 -1849019 -1851361 -1836261 -1801091 -1746572
32049 -1746572 -1677602 -1602599 -1531161 -1471048 -1426211 -1396942 -1381684 -1378900 -1387617 -1406433 -1431970 -1458107
32037 -1458107 -1476801 -1480292 -1463742 -1427050 -1375040 -1315993 -1259233 -1212816 -1182094 -1169284 -1173629 -1191655
32025 -1191655 -1217571 -1244176 -1264480 -1273584 -1269977 -1255555 -1234470 -1211477 -1190667 -1174912 -1165671 -1162511
32013 -1162511 -1162266 -1158776 -1144135 -1111253 -1056222 -979085 -882852 -771746 -649701 -519614 -383522
32002 -383522 -243562 -103112 32770 158008 266707 354122 417003 453619 463756 448729
31992 448729 411247 355062 284410 203332 115035 21581 -75888 -176503 -279006 -381650 -482767
31981 -482767 -581452 -677544 -770479 -857633 -933359 -989700 -1018770 -1015655 -980347 -917775 -836193 -745094
31969 -745094 -653773 -570855 -504331 -461395 -447775 -466687 -517808 -596721 -695159 -802246 -906530
31958 -906530 -998269 -1071093 -1122533 -1153448 -1166875 -1166628 -1155839 -1135781 -1105558 -1062933 -1005807 -933403
31946 -933403 -846695 -748222 -641764 -531990 -424013 -322825 -232730 -156974 -97582 -55346 -29862
31935 -29862 -19646 -22476 -35989 -58305 -88331 -125555 -169454 -218858 -271653 -325016 -376078 -422583
31923 -422583 -463199 -497392 -525123 -546568 -561932 -571443 -575600 -575580 -573524 -572420 -575521 -585370 -602776
31910 -602776 -626246 -652381 -677178 -697447 -711495 -718913 -720060 -715840 -707740 -697758 -687966 -679979 -674845
31897 -674845 -673575 -677951 -690898 -715955 -756063 -812237 -882556 -961689 -1041194 -1110881 -1161167 -1185646
31885 -1185646 -1182824 -1156281 -1113357 -1063102 -1014471 -975330 -952044 -948982 -967680 -1006175 -1059229 -1119386
31873 -1119386 -1178154 -1226839 -1257354 -1263432 -1242047 -1194191 -1124408 -1039376 -946292 -851743 -761175
31862 -761175 -678642 -606513 -545020 -492000 -443355 -394475 -342141 -285847 -227688 -170947 -118360
31851 -118360 -71152 -29168 8141 40418 65456 79399 78377 60626 27423 -17987 -72441 -134017
31839 -134017 -201395 -272180 -341602 -402478 -446513 -466443 -458212 -422352 -364145 -292657 -219017 -154277
31827 -154277 -107327 -83443 -83929 -106798 -148119 -203473 -269030 -341851 -419465 -499282 -578449 -654230
31815 -654230 -724503 -788014 -844247 -893029 -934021 -966343 -988588 -999270 -997471 -983401 -958730 -926546
31803 -926546 -890967 -856603 -828286 -811255 -811430 -835202 -888451 -975089 -1095818 -1247612 -1424029
31792 -1424029 -1616065 -1813237 -2004702 -2180360 -2331780 -2452797 -2539617 -2590388 -2604313 -2580649
31782 -2580649 -2518175 -2415584 -2272672 -2091550 -1877168 -1636857 -1379205 -1112769 -845187 -583109
31772 -583109 -332831 -101055 105033 278507 413851 507911 560343 573552 552299 503161
31762 503161 434111 354256 273432 201182 145026 108634 90966 87245 91572 99776 110694 125133
31750 125133 143490 164054 183265 197516 205020 206604 205362 205724 212254 228166 253683 284858 313628
31737 313628 329367 321347 281177 204450 91465 -52911 -220104 -399298 -579313 -750475
31727 -750475 -906109 -1043383 -1163461 -1271076 -1373533 -1478903 -1593187 -1717147 -1844481 -1962877
31717 -1962877 -2057832 -2117250 -2134511 -2109013 -2044667 -1947484 -1823339 -1676875 -1512056 -1333958
31707 -1333958 -1150420 -972134 -810902 -677144 -578163 -517793 -496970 -514400 -566990 -650148
31697 -650148 -757985 -883251 -1017116 -1149478 -1270273 -1371581 -1449570 -1505367 -1544393 -1574337
31687 -1574337 -1602478 -1633509 -1668679 -1706202 -1742292 -1772355 -1792399 -1800584 -1798242 -1789635 -1780386 -1775423
31675 -1775423 -1777524 -1787023 -1802369 -1820705 -1837822 -1847820 -1843442 -1817771 -1766737 -1691083 -1596693 -1493155
31663 -1493155 -1391306 -1300771 -1228320 -1177333 -1148040 -1137956 -1142330 -1154933 -1169540 -1181765 -1190349
31652 -1190349 -1197129 -1205800 -1220274 -1243444 -1276687 -1320006 -1372620 -1433810 -1503593 -1582773 -1672271 -1772157
31640 -1772157 -1881042 -1996107 -2113589 -2229319 -2339126 -2439066 -2525668 -2596214 -2648965 -2683070
31630 -2683070 -2698146 -2693824 -2669695 -2625703 -2562623 -2482185 -2386738 -2278530 -2158773 -2026876 -1880472
31619 -1880472 -1716832 -1535307 -1339430 -1137157 -939000 -755254 -593960 -460281 -356827
31610 -356827 -284065 -240440 -222326 -224177 -239263 -261020 -284606 -307792 -330563 -353631 -376825 -398329
31598 -398329 -415034 -423560 -421267 -406826 -380361 -343351 -298510 -249626 -201299 -158485 -125962 -107766
31586 -107766 -106668 -123719 -158058 -207108 -267179 -334165 -404086 -473312 -538609 -597114 -646339 -684125
31574 -684125 -708512 -717550 -709189 -681459 -633072 -564211 -476978 -375152 -263432 -146741 -29868
31563 -29868 82758 187439 281608 364012 434585 494257 544752 588185 626276 659461 686345
31552 686345 703719 707132 691898 654443 593725 512285 416532 316130 222455 146167 94295
31541 94295 67842 61175 63810 63981 52547 25762 -13873 -58793 -99044 -125530 -132863 -121040 -95571
31528 -95571 -65989 -43230 -36919 -53733 -97323 -169109 -268791 -393954 -539186 -695645 -851770
31517 -851770 -995019 -1114080 -1200874 -1251861 -1268322 -1255501 -1220791 -1171595 -1113489 -1049092 -977846
31506 -977846 -896907 -803031 -694691 -573208 -442163 -305664 -166753 -27010 112560 250099
31496 250099 382032 503657 611114 703553 783770 856494 925176 989288 1043858 1081519 1095777
31485 1095777 1083582 1045983 987010 911936 826115 734872 644032 560225 490234 439446 410333
31474 410333 402115 411882 436356 472953 519429 572428 626072 671726 699361 699950 667824 601972
31462 601972 505888 386203 250824 107361 -37750 -179537 -314462 -440089 -554344 -654784
31452 -654784 -738613 -803665 -849524 -877794 -891434 -893894 -888605 -878609 -865986 -851308 -833545 -810539
31440 -810539 -779642 -738260 -684427 -617475 -538475 -449972 -355105 -256801 -157735 -60997 29359
31429 29359 108618 172615 219150 248709 264098 269243 267811 262155 253015 240104 223377 204221
31417 204221 185757 172089 167183 174088 194461 227919 271387 319192 364426 400997 425274 436604
31405 436604 436640 427884 412035 389000 357115 314414 260063 195217 123113 48482 -23558 -88981
31393 -88981 -146117 -196024 -241669 -286471 -333184 -383780 -439993 -503529 -575336 -654270 -736270 -814823
31381 -814823 -882688 -934099 -966447 -980688 -980285 -969232 -950090 -922929 -885450 -834049 -765310 -677437
31369 -677437 -571341 -451204 -324353 -200105 -87618 6571 79999 133862 170898 192753
31359 192753 198262 183535 143803 76010 -19168 -136638 -267396 -399742 -520974 -619600 -687764
31348 -687764 -723097 -729185 -714447 -689893 -666538 -653146 -654730 -671983 -701680 -737823 -772943 -799108
31336 -799108 -808697 -795645 -757339 -696212 -619536 -537074 -457846 -387723 -328573 -278679 -234008 -190072
31324 -190072 -143824 -94518 -42852 11001 68804 133749 208137 290661 374991 450446 504566
31313 504566 526533 510190 455555 368354 258017 135110 9150 -112763 -226492 -330696
31303 -330696 -426162 -514930 -599453 -681881 -763492 -844462 -924174 -1001954 -1077719 -1152004 -1225336
31292 -1225336 -1297442 -1366903 -1431425 -1488400 -1535447 -1571011 -1595130 -1610052 -1620042 -1630157 -1644696
31281 -1644696 -1666179 -1695122 -1730253 -1769005 -1808321 -1845519 -1878573 -1905535 -1923748 -1929746 -1920111 -1892704
31269 -1892704 -1847651 -1787769 -1718301 -1645877 -1576845 -1515638 -1463945 -1421189 -1386049 -1358139 -1338691
31258 -1338691 -1329641 -1331641 -1342449 -1356905 -1368598 -1372248 -1365671 -1350697 -1332762 -1319257 -1317034 -1330145
31246 -1330145 -1358908 -1400605 -1451010 -1505495 -1559278 -1607281 -1644374 -1666130 -1669594 -1653606 -1618602
31235 -1618602 -1566196 -1498625 -1418167 -1326684 -1225755 -1117591 -1006375 -899082 -804883 -732871
31225 -732871 -688917 -673155 -679385 -696677 -712307 -714759 -696006 -652840 -587196 -505276 -415655 -327116
31213 -327116 -247132 -181312 -133352 -104991 -95929 -104132 -126707 -161015 -205347 -258670 -319566 -385209
31201 -385209 -451282 -513120 -567352 -613010 -651486 -685593 -718335 -751722 -785761 -817867 -843288
$$ [...]
##END NTUPLES=NMR SPECTRUM
##END=
