##TITLE=31Pdec_475
 D2O
  24 sc
 29.11.2023
##JCAMPDX= 6.0         $$ Bruker NMR JCAMP-DX V2.0
##DATA TYPE= NMR SPECTRUM
##DATA CLASS= NTUPLES
##ORIGIN= UXNMR, Bruker Analytische Messtechnik GmbH
##OWNER= root
$$ XWIN-NMR		Version 3.5
$$ Wed Nov 29 13:52:07 2023 Russian Standard Time (UT+4h)  she@DPX200
##.OBSERVE FREQUENCY= 81.013821
##.OBSERVE NUCLEUS= ^31P
##.ACQUISITION MODE= SIMULTANEOUS
##.ACQUISITION SCHEME= undefined
##.AVERAGES= 24
##.DIGITISER RES= 16
##SPECTROMETER/DATA SYSTEM= spect
##.PULSE SEQUENCE= zgpg30
##.SOLVENT NAME= CDCl3
##.SHIFT REFERENCE= (INTERNAL, CDCl3, 0, 248.564)
##AUDIT TRAIL= $$ (NUMBER, WHEN, WHO, WHERE, WHAT)
$$ ##TITLE= Audit trail, XWIN-NMR		Version 3.5
$$ ##JCAMPDX= 5.01
$$ ##ORIGIN= Bruker BioSpin GmbH
$$ ##OWNER= she
$$ F:/spectra/data/she/nmr/P31/1/pdata/1/auditp.txt
$$ ##AUDIT TRAIL=  $$ (NUMBER, WHEN, WHO, WHERE, WHAT)
(   1,<2023-11-29 13:51:14.75 +0400>,<she>,<DPX200>,
      <created by zg, POWCHK disabled, PULCHK disabled
       configuration hash MD5:
       00 E9 B6 7A A2 85 ED C7 34 08 36 98 17 FE 4E 26
       data hash MD5: 32K
       F3 23 E8 69 58 56 35 C1 7B E4 63 00 2E E9 10 C7>)
(   2,<2023-11-29 13:51:18.75 +0400>,<she>,<DPX200>,
      <Start of raw data processing
       efp BC_mod = 2 LB = 10 FT_mod = 6 PKNL = 1 PHC0 = -11498.3 PHC1 = -455.3055 SI = 64K 
       data hash MD5: 64K
       95 5D 7C 53 4B 7F 9E 10 CF 28 A7 C9 40 BA E9 B7>)
(   3,<2023-11-29 13:51:33.21 +0400>,<she>,<DPX200>,
      <pk PHC0 = -87.72171 PHC1 = 126.8 
       data hash MD5: 64K
       60 24 82 4E 3A 21 58 2D AD C0 DE B7 D4 83 BF 6B>)
(   4,<2023-11-29 13:51:36.76 +0400>,<she>,<DPX200>,
      <abs ABSG = 5 
       data hash MD5: 64K
       DC F8 C2 97 38 5C 58 B4 5C 96 4B EB 56 05 A7 EE>)
$$ ##END=
$$ 
$$ hash MD5
$$ CB DC 5F DD 25 D8 A4 CE 92 48 C2 E2 E4 C7 70 4D
##$RELAX= 
##$RELAX= 
##$RELAX= 
##$RELAX= 
##$RELAX= 
##$RELAX= 
##$RELAX= 
##$RELAX= 
##$RELAX= 
$$ Bruker specific parameters
$$ --------------------------
##$DU= <F:/spectra>
##$EXPNO= 1
##$NAME= <P31>
##$PROCNO= 1
##$TYPE= <nmr>
##$USER= <she>
##$AMP= (0..31)
100 100 100 100 100 100 100 100 100 100 100 100 100 100 100 100 100 100 
100 100 100 100 100 100 100 100 100 100 100 100 100 100 
##$AQSEQ= 0
##$AQ_mod= 1
##$AUNM= <au_zg>
##$AUTOPOS= <>
##$BF1= 81.014009
##$BF2= 200.13
##$BF3= 200.13
##$BF4= 200.13
##$BF5= 200.13
##$BF6= 200.13
##$BF7= 200.13
##$BF8= 200.13
##$BYTORDA= 1
##$CFDGTYP= 0
##$CFRGTYP= 5
##$CHEMSTR= <none>
##$CNST= (0..31)
1 1 145 1 1 1 1 1 1 1 1 1 1 1 1 1 1 1 1 1 1 1 1 1 1 1 1 1 1 1 1 1 
##$CPDPRG= <waltz16>
##$CPDPRG1= <>
##$CPDPRG2= <waltz16>
##$CPDPRG3= <>
##$CPDPRG4= <mlev>
##$CPDPRG5= <mlev>
##$CPDPRG6= <mlev>
##$CPDPRG7= <mlev>
##$CPDPRG8= <mlev>
##$CPDPRGB= <>
##$CPDPRGT= <>
##$D= (0..31)
0 1 0 0 0 0 0 0 0 0 0 0.03 2e-05 3e-06 0 0 0 0 0 0 0 0 0 0 0 0 0 0 0 0 
0 0 
##$DATE= 1701251474
##$DBL= (0..7)
120 120 120 11 120 120 24 19 
##$DBP= (0..7)
150 150 150 150 150 150 150 150 
##$DBP07= 0
##$DBPNAM0= <>
##$DBPNAM1= <>
$$ [...]
##$SUBNAM3= <"">
##$SUBNAM4= <"">
##$SUBNAM5= <"">
##$SUBNAM6= <"">
##$SUBNAM7= <"">
##$SUBNAM8= <"">
##$SUBNAM9= <"">
##$SW= 501.771253377433
##$SWIBOX= (0..15)
0 1 3 0 0 0 0 0 0 0 0 0 0 0 0 0 
##$SW_h= 40650.406504065
##$TD= 32768
##$TD0= 1
##$TE= 0
##$TE2= 300
##$TE3= 300
##$TEG= 300
##$TL= (0..7)
0 120 53 12 22 120 120 120 
##$TP= (0..7)
150 150 150 150 150 150 150 150 
##$TP07= 0
##$TPNAME0= <>
##$TPNAME1= <>
##$TPNAME2= <>
##$TPNAME3= <>
##$TPNAME4= <>
##$TPNAME5= <>
##$TPNAME6= <>
##$TPNAME7= <>
##$TPOAL= (0..7)
0.5 0.5 0.5 0.5 0.5 0.5 0.5 0.5 
##$TPOFFS= (0..7)
0 0 0 0 0 0 0 0 
##$TUNHIN= 0
##$TUNHOUT= 0
##$TUNXOUT= 0
##$USERA1= <user>
##$USERA2= <user>
##$USERA3= <user>
##$USERA4= <user>
##$USERA5= <user>
##$V9= 5
##$VALIST= <valist>
##$VCLIST= <CCCCCCCCCCCCCCC>
##$VD= 0
##$VDLIST= <DDDDDDDDDDDDDDD>
##$VPLIST= <PPPPPPPPPPPPPPP>
##$VTLIST= <TTTTTTTTTTTTTTT>
##$WBST= 1024
##$WBSW= 4
##$XGAIN= (0..3)
0 0 0 0 
##$XL= 0
##$YL= 0
##$YMAX_a= 3197
##$YMIN_a= -3685
##$ZGOPTNS= <>
##$ZL1= 120
##$ZL2= 120
##$ZL3= 120
##$ZL4= 120
##$ABSF1= 248.5645
##$ABSF2= -253.2056
##$ABSG= 5
##$ABSL= 3
##$ALPHA= 0
##$AQORDER= 0
##$ASSFAC= 0
##$ASSFACI= 0
##$ASSFACX= 0
##$ASSWID= 0
##$AUNMP= <proc_1d>
##$AZFE= 0.1
##$AZFW= 0.5
##$BCFW= 0
##$BC_mod= 2
##$BYTORDP= 0
##$COROFFS= 0
##$CY= -3
##$DATMOD= 1
##$DC= 0
##$DFILT= <>
##$DTYPP= 0
##$F1P= 0
##$F2P= 0
##$FCOR= 1
##$FTSIZE= 65536
##$FT_mod= 6
##$GAMMA= 0
##$GB= 0
##$INTBC= 1
##$INTSCL= 6.047779e-11
##$ISEN= 30
##$LB= 10
##$LEV0= 0
##$LPBIN= 0
##$MAXI= 10000
##$MC2= 0
##$MEAN= 0
##$ME_mod= 0
##$MI= 50
##$NCOEF= 0
##$NC_proc= -10
##$NLEV= 6
##$NOISF1= 182.463
##$NOISF2= 159.3651
##$NSP= 0
##$NTH_PI= 0
##$NZP= 0
##$OFFSET= 248.5645
##$PC= 4
##$PHC0= -11586.02
##$PHC1= -328.5055
##$PH_mod= 1
##$PKNL= yes
##$PPARMOD= 0
##$PSCAL= 0
##$PSIGN= 0
##$REVERSE= no
##$SF= 81.0140089999694
##$SI= 65536
##$SIGF1= 159.3651
##$SIGF2= -187.1042
##$SINO= 113.3802
##$SIOLD= 16384
##$SREGLST= <1H.CDCl3>
##$SSB= 0
##$STSI= 65536
##$STSR= 0
##$SW_p= 40650.406504065
##$SYMM= 0
##$S_DEV= 0
##$TDeff= 32768
##$TDoff= 0
##$TI= <>
##$TILT= no
##$TM1= 0
##$TM2= 0
##$TOPLEV= 0
##$USERP1= <user>
##$USERP2= <user>
##$USERP3= <user>
##$USERP4= <user>
##$USERP5= <user>
##$WDW= 1
##$XDIM= 65536
##$YMAX_p= 419904457
##$YMIN_p= -90537739
$$ End of Bruker specific parameters
$$ ---------------------------------
##NTUPLES= NMR SPECTRUM
##VAR_NAME=  FREQUENCY,     SPECTRUM/REAL,   SPECTRUM/IMAG
##SYMBOL=    X,             R,               I
##VAR_TYPE=  INDEPENDENT,   DEPENDENT,       DEPENDENT
##VAR_FORM=  AFFN,          ASDF,            ASDF
##VAR_DIM=   65536,         65536,           65536
##UNITS=     HZ,            ARBITRARY UNITS, ARBITRARY UNITS
##FACTOR=    0.620285442955139, 1,           1
##FIRST=     20137.2065510682, 0,            0
##LAST=      -20513.1999529968, 0,           0
##MIN=       -20513.1999529968, -90537739,   0
##MAX=       20137.2065510682, 419904457,    0
$$ Real data points
##PAGE= N=1
##DATA TABLE= (X++(R..R)), XYDATA
$$ [...]
40993A691361o02872n63707n06266m47678l98776l60267l22913k72494j98104
40984a981716r9285J2653J19893K06206K63368K94083L11343L33815L77692M48615
40974B86667N38907O31894P09311P56279P62144P20077O28528M94281L34080J72195
40964F034363L3854o3108j14663j31818j35762j48989j86403k50037l28843m03503
40954D305091m54799m72451m59670m29943l97773l70097l44386l13314k70306
40945G92352k11805j37123m9120M4750J34401K12826K80619L44071M08433M73618
40935B293022N36400N95352O51713P05273P50213P75117P66189P10984O02512
40926H386775M44246K53141N5661j23589k73398l98477n10773o16352p07605p65258
$$ plain form
40993 1691361 1088489 524782 18516 -429162 -827938 -1188205 -1511118 -1783612 -1981716
40984 -1981716 -2081001 -2068348 -1948455 -1742249 -1478881 -1184798 -873455 -539640 -161948 286667
40974 286667 825574 1457468 2166779 2923058 3685202 4405279 5033807 5528088 5862168 6034363
40964 6034363 6068217 6005109 5890446 5758628 5622866 5473877 5287474 5037437 4708594 4305091
40954 4305091 3850292 3377841 2918171 2488228 2090455 1720358 1375972 1062658 792352
40945 792352 580547 443424 394304 439054 573455 786281 1066900 1410971 1819404 2293022
40935 2293022 2829422 3424774 4076487 4781760 5531973 6307090 7073279 7784263 8386775
40926 8386775 8831021 9084162 9139823 9016234 8742836 8344359 7833586 7217234 6509629 5744371
40916E744371p67147o96907n48087l24348l9796K78202N86652Q31431R61378R46372
40906F972121P88440N19471J88793j50709m52370o81671q19988q65372q28979
40897D669736p28503n82538m08937k27127o1379N9306J07844P0879m1304j94781
40887B663196l43827m47998m84519m50324l55383k13287l4891J72598M02193O42538
40877A550296Q75440J077225J223428J294576J280878J185210J025203Q33635
40869A0345891O53546N25594M71667M85034N34699N81847N98400N77893N34323
40860A5308894M89937M58086M31773L87274L01056J66042o615j99783m03412o16789
40850A6316463q40479j066795j276194j441179j534972j540664j456899j298653
$$ plain form
40916 5744371 4977224 4280317 3732230 3407882 3368086 3646288 4232940 5064371 6025749 6972121
40906 6972121 7760561 8280032 8468825 8318116 7865746 7184075 6364087 5498715 4669736
40897 4669736 3941233 3358695 2949758 2722631 2661252 2720558 2828402 2899281 2857977 2663196
40887 2663196 2319369 1871371 1386852 936528 581145 367858 332967 505565 907758 1550296
40877 1550296 2425736 3502961 4726389 6020965 7301843 8487053 9512256 10345891
40869 10345891 10999437 11525031 11996698 12481732 13016431 13598278 14196678 14774571 15308894
40860 15308894 15798831 16256917 16688690 17075964 17377020 17543062 17536447 17336664 16933252 16316463
40850 16316463 15475984 14409189 13132995 11691816 10156844 8616180 7159281 5860628
40842E860628j094331q80321o92445n55263m74635m39586m33211m44745m74084
40833C72007n26626o03374o93913p77392q30489q36464p89684o95774n71241m42814
40823f395764l41599k89639k85918l03056k98987k36663j00911R4938L14223N11406
40813g331970O49196P09897O95703O20127M97961L39795J52228n8624k83050n04914
40803d513651p01548q47325r20440r10225q21264o72338m91237l07808j46924
40794a0332760k2594O4747J25880J76582K31297K98944L79908M63926N32308N67392
40784g514370N64780N37899N09208M94466M93316M93367M82567M58591M29108
40775c051068M06148M01193M23291M77539N62237O66971P74387Q64478R18320
$$ plain form
40842 5860628 4766297 3885976 3193531 2638268 2163633 1724047 1290836 846091 372007
40833 372007 -154619 -757993 -1451906 -2229298 -3059787 -3896251 -4685935 -5381709 -5952950 -6395764
40823 -6395764 -6737363 -7027002 -7312920 -7615976 -7914963 -8151626 -8252537 -8157599 -7843376 -7331970
40813 -7331970 -6682774 -5972877 -5277174 -4657047 -4159086 -3819291 -3667063 -3725687 -4008737 -4513651
40803 -4513651 -5215199 -6062524 -6982964 -7893189 -8714453 -9386791 -9878028 -10185836 -10332760
40794 -10332760 -10355354 -10290607 -10164727 -9988145 -9756848 -9457904 -9077996 -8614070 -8081762 -7514370
40784 -7514370 -6949590 -6411691 -5902483 -5408017 -4914701 -4421334 -3938767 -3480176 -3051068
40775 -3051068 -2644920 -2243727 -1820436 -1342897 -780660 -113689 660698 1525176 2443496
40766B443496R21092Q66484P61688O28201M95401L90335L29589L15474L34879
40757G486639L60327L55942K90066J50642m5161k54572m26501n23975n39086m92285
40747F362036m18183l47951k98531k72407k64758k71254k91324l26478l77446
40738C493704m43176n20541o02373o74980p19335p17032o56538n35206l57942
40729a733419j36409J10153L55476N70750P32016Q27202Q59756Q46861Q12278
40720C244664P76559P48873P23516O81689N98322M53279K43291j2126k75795n06355
40710F675917o71316p52887p47601o64973n27047l65710k15479j04943n2245o5267
40700B508449j42414k71368m28845n85607p15490q02103q38918q25274p64212
$$ plain form
40766 2443496 3364588 4231072 4992760 5620961 6116362 6506697 6836286 7151760 7486639
40757 7486639 7846966 8202908 8492974 8643616 8598455 8343883 7917382 7393407 6854321 6362036
40747 6362036 5943853 5595902 5297371 5024964 4760206 4488952 4197628 3871150 3493704
40738 3493704 3050528 2529987 1927614 1252634 533299 -183733 -840271 -1375477 -1733419
40729 -1733419 -1869828 -1759675 -1404199 -833449 -101433 725769 1585525 2432386 3244664
40720 3244664 4021223 4770096 5493612 6175301 6773623 7226902 7470193 7458067 7182272 6675917
40710 6675917 6004601 5251714 4504113 3839140 3312093 2946383 2730904 2625961 2573716 2508449
40700 2508449 2366035 2094667 1665822 1080215 364725 -437378 -1276296 -2101570 -2865782
40691b865782o64491n42828m20443l13388k23484j38389m2430O9586J86031K83721
40681d671897L40391L46309L08787K47740J85413J36900J06807R1190P9780N6784
40671b771796M555q7000k10955l43137m52665n14536n15361m52054l29148j58095
40661e830192M2818K49890M36962N79829O62143O80813O46825N79377M96552M08700
40651a046283L18386K25492J32727M7247k2326p0310r5602r9518q2483m2791K1875
40640g13586J11686K22120L43139M61953N69216O64116P52548Q38342R15169R67131
40630E131834R77811R39355Q54093P29064N70652L85152J83884j4143j86599l15918
40620I255185l93547m17592l89180l13932k07426r7342j7475L384m8881j69907
$$ plain form
40691 -2865782 -3530273 -4073101 -4493544 -4806932 -5030416 -5168805 -5211235 -5141649 -4955618 -4671897
40681 -4671897 -4331506 -3985197 -3676410 -3428670 -3243257 -3106357 -2999550 -2908360 -2828580 -2771796
40671 -2771796 -2767241 -2854241 -3065196 -3408333 -3860998 -4375534 -4890895 -5342949 -5672097 -5830192
40661 -5830192 -5787374 -5537484 -5100522 -4520693 -3858550 -3177737 -2530912 -1951535 -1454983 -1046283
40651 -1046283 -727897 -502405 -369678 -322431 -344757 -415067 -510669 -610187 -692670 -735461 -713586
40640 -713586 -601900 -379780 -36641 425312 994528 1658644 2411192 3249534 4164703 5131834
40630 5131834 6109645 7049000 7903093 8632157 9202809 9587961 9771845 9757702 9571103 9255185
40620 9255185 8861638 8444046 8054866 7740934 7533508 7436166 7418691 7422075 7373194 7203287
40610G203287l39384n28817p12008q73714j011428j128896j225882j291879j308664
40601a217385j260036j141725r64996p52550n30700l23006j47845j9042N3668
40592f303617O7082K9576l5831r5874j19687r3127k5585N5561J19710J48519J43729
40581f109544J23737J11929J24503J64980K27201L02627L85635M73071N59256
40572c636605O31498O70797O58177N82305M43603K54280L7037j76654l51388m57808
40562a344758m83841m39145l48549k38656j26667j7648R0628K01009L13448M25365
40552a968814N32756O29310P04648P45503P41430O91342O04810M96242L76445
40543C553672K48384J09934l8937j89733l23969m18105m53119m23993l43440k37061
$$ plain form
40610 7203287 6863903 6335086 5623078 4749364 3737936 2609040 1383158 91279 -1217385
40601 -1217385 -2477421 -3619146 -4584142 -5336692 -5867392 -6190398 -6338243 -6357285 -6303617
40592 -6303617 -6236535 -6206959 -6242790 -6338664 -6458351 -6551478 -6577063 -6521502 -6401792 -6253273 -6109544
40581 -6109544 -5985807 -5873878 -5749375 -5584395 -5357194 -5054567 -4668932 -4195861 -3636605
40572 -3636605 -3005107 -2334310 -1676133 -1093828 -650225 -395945 -358908 -535562 -886950 -1344758
40562 -1344758 -1828599 -2267744 -2616293 -2854949 -2981616 -2999264 -2908636 -2707627 -2394179 -1968814
40552 -1968814 -1436058 -806748 -102100 643403 1384833 2076175 2680985 3177227 3553672
40543 3553672 3802056 3911990 3873053 3683320 3359351 2941246 2488127 2064134 1720694 1483633
40533A483633j32561m9742K940K4839J7449j8182q0023j62756k57681l54884m45568
40522B7464n22945n81534o15730o19028n84991n09840l95062k48857q6395P1488
40512d065430K02568K90421L30359L28931K96901K41876J66776P4029k9803j33521
40502b296893k25042k95821l42404l64502l62419l37005k91845k34208j73006
40493d923145j16455p2753n2222o5928j19159k04587l00912l77831m04101l55956
40483f993049k24836k2223K22343M70463O85798Q40058R13739Q97656P98716O45075
40473a766260M81662L53765K87266K78223K97878L08671K81154K03876Q4177n7896
40463G52516j98764l19163m06553m51335m41929l65815k17440n935K44782N02883
$$ plain form
40533 1483633 1351072 1301330 1304270 1329109 1346558 1328376 1248353 1085597 827916 473032 27464
40522 27464 -495481 -1077015 -1692745 -2311773 -2896764 -3406604 -3801666 -4050523 -4136918 -4065430
40512 -4065430 -3862862 -3572441 -3242082 -2913151 -2616250 -2374374 -2207598 -2133569 -2163372 -2296893
40502 -2296893 -2521935 -2817756 -3160160 -3524662 -3887081 -4224086 -4515931 -4750139 -4923145
40493 -4923145 -5039600 -5112353 -5164575 -5230503 -5349662 -5554249 -5855161 -6232992 -6637093 -6993049
40483 -6993049 -7217885 -7240108 -7017765 -6547302 -5861504 -5021446 -4107707 -3210051 -2411335 -1766260
40473 -1766260 -1284598 -930833 -643567 -365344 -67466 241205 522359 726235 810412 752516
40463 752516 553752 234589 -171964 -623299 -1065228 -1431043 -1648483 -1654418 -1409636 -906753
40453i06753P36167R16642J023677J046984R87779Q57195O74367M65841K63571
40444F065470R8537q031n0245l7016J3591Q2411J56242K29796L00707L62452M03226
40433G617140M12938L91482L50287L06519K75473K65620K76340K97285L09982
40424A0503066K92720K27703J07563o1808k63545m76526o83267q74123j044792
40415G726991j189612j297300j353700j349175j283851j166997j012796q36607
40407a763047o52755m73043l05766j55679k3794R3751K05596L20700M41020N57697
40397a755320O55207P20470P49123P43860P06728O32050N06156L14867N3664k65914
40387C060891o16445r59566j253030j458822j550875j519870j373532j134185
$$ plain form
40453 -906753 -170586 746056 1769733 2816717 3804496 4661691 5336058 5801899 6065470
40444 6065470 6164007 6155976 6105731 6068715 6082306 6164717 6320959 6550755 6851462 7213914 7617140
40433 7617140 8030078 8421560 8771847 9078366 9353839 9619459 9895799 10193084 10503066
40424 10503066 10795786 11023489 11131052 11069244 10805699 10329173 9645906 8771783 7726991
40415 7726991 6537379 5240079 3886379 2537204 1253353 86356 -926440 -1763047
40407 -1763047 -2415802 -2888845 -3194611 -3350290 -3374084 -3280333 -3074737 -2754037 -2313017 -1755320
40397 -1755320 -1100113 -379643 369480 1113340 1820068 2452118 2958274 3273141 3326805 3060891
40387 3060891 2444446 1484880 231850 -1226972 -2777847 -4297717 -5671249 -6805434
40379f805434q35898n20827k32658p410J34974J94831J91849J59588J36590J55957
40369g428438K36324L76978N58107P45864R01284R91653J001436R38099Q28731
40360h49962P07777O02335N23744M69227M29296L93466L51400K92868K10807J07088
40350C238046l663r6618j45620j34105o2482N1227J76942K81365L36903L28515
40340C970510K56999J38114k234j35413k37990k97305l12464k91041k45010j88932
40330B655234j39395j12043j15707j48288j99328k57822l18470l81684m48935
40321E33562n18549n84543o37571o66643o61778o18204n40842m46055l57496k96054
40311d794173k68569k62961k54157k17354j40024k6356J05844K32726L33788L99853
$$ plain form
40379 -6805434 -7641332 -8162159 -8394817 -8402227 -8267253 -8072422 -7880573 -7720985 -7584395 -7428438
40369 -7428438 -7192114 -6815136 -6257029 -5511165 -4609881 -3618228 -2616792 -1678693 -849962
40360 -849962 -142185 460150 983894 1453121 1882417 2275883 2627283 2920151 3130958 3238046
40350 3238046 3234383 3137765 2992145 2858040 2795558 2846785 3023727 3305092 3641995 3970510
40340 3970510 4227509 4365623 4363389 4227976 3989986 3692681 3380217 3089176 2844166 2655234
40330 2655234 2515839 2403796 2288089 2139801 1940473 1682651 1364181 982497 533562
40321 533562 15013 -569530 -1207101 -1873744 -2535522 -3153726 -3694568 -4140623 -4498119 -4794173
40311 -4794173 -5062742 -5325703 -5579860 -5797214 -5937238 -5963594 -5857750 -5625024 -5291236 -4891383
40301d891383M34738M48107M44648M19308L63276K75217J67844O4453j1711m7458
40291b332961m2444m039N9847J42964K37087L28715M01884M45258M56239M37840
40281A30390L91903L16191K09098P7966n7553j72228k48026k82652k87026k74909
40271a96846k54201k26316j92072j57300j32732j27895j44208j73574k04156k28090
40261b037390k44087k53458k54823k43436k15663j74186j29122r4016p9347q7591
40251c813119j12302j40813j58704j54605j24549p4703k0842J6126J7402k6360
40241d592469j11233k21986l38527m42160n17825n53543n41168m79658l77952
40232h176521k54695j35155m6798j3454m8282j48048k92219m47479n75910o44747
$$ plain form
40301 -4891383 -4456645 -4008538 -3563890 -3144582 -2781306 -2506089 -2338245 -2273792 -2285503 -2332961
40291 -2332961 -2375405 -2379444 -2319597 -2176633 -1939546 -1610831 -1208947 -763689 -307450 130390
40281 130390 522293 838484 1047582 1125548 1067995 895767 647741 365089 78063 -196846
40271 -196846 -451047 -677363 -869435 -1026735 -1159467 -1287362 -1431570 -1605144 -1809300 -2037390
40261 -2037390 -2281477 -2534935 -2789758 -3033194 -3248857 -3423043 -3552165 -3646181 -3725528 -3813119
40251 -3813119 -3925421 -4066234 -4224938 -4379543 -4504092 -4578795 -4599637 -4583511 -4566109 -4592469
40241 -4592469 -4703702 -4925688 -5264215 -5706375 -6224200 -6777743 -7318911 -7798569 -8176521
40232 -8176521 -8431216 -8566371 -8613169 -8626623 -8674905 -8822953 -9115172 -9562651 -10138561 -10783308
40222a0783308o35728n50279m06568k28964l6660J61000L61099N61182P56528
40213a0801698R40904J106850J243329J333328J355273J288874J122783Q60779
40205a549578N23950J46975k30645n73412q53014j046012j132474j100638r54950
40196f769798p19804m34562j42219J22159L38047M99161O08014O69684O88460
40187e140858O67511O09218N15321L88561K36677P5608p2991j90782k72548l28568
40177c512851l76873m31256m94053n57336o08624o35933o31164n93547n32325
40168h373962m65074m10454l79494l71592l77441l85303l84731l65654l16350
40159a1830055k25326q7221R2892L00892N18341P25205Q99973J021773J077124
$$ plain form
40222 -10783308 -11419036 -11969315 -12375883 -12604847 -12641507 -12480507 -12119408 -11558226 -10801698
40213 -10801698 -9860794 -8753944 -7510615 -6177287 -4822014 -3533140 -2410357 -1549578
40205 -1549578 -1025628 -878653 -1109298 -1682710 -2535724 -3581736 -4714210 -5814848 -6769798
40196 -6769798 -7489602 -7924164 -8066383 -7944224 -7606177 -7107016 -6499002 -5829318 -5140858
40187 -5140858 -4473347 -3864129 -3348808 -2960247 -2723570 -2647962 -2720953 -2911735 -3184283 -3512851
40177 -3512851 -3889724 -4320980 -4815033 -5372369 -5980993 -6616926 -7248090 -7841637 -8373962
40168 -8373962 -8839036 -9249490 -9628984 -10000576 -10378017 -10763320 -11148051 -11513705 -11830055
40159 -11830055 -12055381 -12142602 -12049710 -11748818 -11230477 -10505272 -9605299 -8583526 -7506402
40150g506402J067501J011756R41084Q88856Q78848R15929R83342J049402J081305
40141A311621J059036R81501Q61818P15724N52042L71914J75978k7725k21640
40132E780269l82872m90513n33278n15028m54636l77688l03101k32958j52321
40123B337874l8880J23867L36907N83095Q31051J042690J181762J222440J157137
40114H777943J000865P88480N63927L66054K18399J27597Q8487Q9686J15555J46871
40104A2283864J64747J57296J22718O5171j1150j01775j96074k74865l17166l11053
40094A1581713k59298j76626q2259P624Q4688J48416K01066K41597K63990K60358
40084A2271269K24203J50832L7253j15100k95884m83786o49292p61731p98448
$$ plain form
40150 -7506402 -6438901 -5427145 -4486061 -3597205 -2718357 -1802428 -819086 230316 1311621
40141 1311621 2370657 3352158 4213976 4929700 5481742 5853656 6029634 6001909 5780269
40132 5780269 5397397 4906884 4373606 3858578 3403942 3026254 2723153 2490195 2337874
40123 2337874 2298994 2422861 2759768 3342863 4173914 5216604 6398366 7620806 8777943
40114 8777943 9778808 10567288 11131215 11497269 11715668 11843265 11931752 12021438 12136993 12283864
40104 12283864 12448611 12605907 12728625 12793796 12782646 12680871 12484797 12209932 11892766 11581713
40094 11581713 11322415 11145789 11063530 11071154 11155842 11304258 11505324 11746921 12010911 12271269
40084 12271269 12495472 12646304 12683557 12568457 12272573 11788787 11139495 10377764 9579316
40075I579316p52949o38119m82144l19220j79962q4605l9246l4940n0708o0923
40065F936500m4429Q489R3681J94995K89320L53691L73014L45745K84003K06847
40055I041856J29766N7537j4021q8803j62034k20872k54006k62049k59627k66989
40045G700758k97528l50238m11588m63946m93611m93742m62879m03414l22579
40036D001233k34115j56903j09658j04820j45435k25501l32084m47802n53742
40027A691173o32178o67832o48222n66063m24822k43122n1461J19290K49603L33919
40017h39715L73218L66365L09495K03963O4298q2239k04458k77103k85623k25966
40007e97765j03026P1204K80954N10949P48334R80610J192402J364890J478228
$$ plain form
40075 9579316 8826367 8188248 7706104 7386884 7206922 7122317 7083071 7048131 6997423 6936500
40065 6936500 6892071 6900560 6994241 7189236 7478556 7832247 8205261 8551006 8835009 9041856
40055 9041856 9171622 9229159 9215138 9126335 8964301 8743429 8489423 8227374 7967747 7700758
40045 7700758 7403230 7052992 6641404 6177458 5683847 5190105 4727226 4323812 4001233
40036 4001233 3767118 3610215 3500557 3395737 3250302 3024801 2692717 2244915 1691173
40027 1691173 1058995 391163 -257059 -823122 -1247944 -1491066 -1542527 -1423237 -1173634 -839715
40017 -839715 -466497 -100132 209363 413326 477624 395385 190927 -86176 -371799 -597765
40007 -597765 -700791 -629587 -348633 162316 910650 1891260 3083662 4448552 5926780
39998E926780J514533J460103J307911J061459P39040L75727J9757k78675m83452
39989A1643183n84559n97255n48656m62480l52670k26666r0635M8953J86327L16807
39979I332349M36573N42962O33972P04681P42315P25588O31627M47395J78955
39970A4376417j46468m86459p95082j035904j191292j264239j272308j236571
39962F948094j169913j069751r19661p01017m09227o4325K91986O11491Q57633
39953D375310J016816J098981J129796J138998J148805J165491J177039J158449
39945A3409685J083522R38659P32386M94810K65543P5616o5153j66238k41659
39936A6527171k95126l17871l00340k46811j80239j33426j33133j87715k85203
$$ plain form
39998 5926780 7441313 8901416 10209327 11270786 12009826 12385553 12405310 12126635 11643183
39989 11643183 11058624 10461369 9912713 9450233 9097563 8870897 8780262 8829215 9015542 9332349
39979 9332349 9768922 10311884 10945856 11650537 12392852 13118440 13750067 14197462 14376417
39970 14376417 14229949 13743490 12948408 11912504 10721212 9456973 8184665 6948094
39962 6948094 5778181 4708430 3788769 3087752 2678525 2614200 2906186 3517677 4375310
39953 4375310 5392126 6491107 7620903 8759901 9908706 11074197 12251236 13409685
39945 13409685 14493207 15431866 16164252 16659062 16924605 17000221 16935068 16768830 16527171
39936 16527171 16232045 15914174 15613834 15367023 15186784 15053358 14920225 14732510 14447307
39927A4447307m01268n10676n95611o48325o69761o66216o44807o08918n56373
39918I145352m82453l86285k76474j71946r6475o8616r2525j56437k41345l34095
39908F838701m34733n52676o95086q55928j012391j130443j176856j131750r95612
39899a146774p88087n40883k88816o1543J22753K60103L58496M31572M91348N42738
39889f19093N81774N98404N82998N32381M50786L45389K21237Q0018p7838k51100
39879B444956m36888o28956q14059r69080j063688j070551r79710q08786o00841
39870d927603m08583k73345k11520k15231k63412l33733m08914m77616n33336
39861h053293n73657n99981o17103o32225o53034o84434p24254p60019p70128
$$ plain form
39927 14447307 14046039 13535363 12939752 12291427 11621666 10955450 10310643 9701725 9145352
39918 9145352 8662899 8276614 8000140 7828194 7731719 7663103 7570578 7414141 7172796 6838701
39908 6838701 6403968 5851292 5156206 4300278 3287887 2157444 980588 -151162 -1146774
39899 -1146774 -1934861 -2475744 -2764560 -2826103 -2703350 -2443247 -2084751 -1653179 -1161831 -619093
39889 -619093 -37319 561085 1144083 1676464 2127250 2472639 2693876 2773894 2696056 2444956
39879 2444956 2008068 1379112 565053 -404027 -1467715 -2538266 -3517976 -4326762 -4927603
39870 -4927603 -5336186 -5609531 -5821051 -6036282 -6299694 -6633427 -7042341 -7519957 -8053293
39861 -8053293 -8626950 -9226931 -9844034 -10476259 -11129293 -11813727 -12537981 -13298000 -14068128
39852a4068128p31171o28631m64381k55794k7640J96793L99780N68456O93311
39843a4317405P68988P96832P86620P55209P21628O99848O92296O87738O65492
39834g742754O04490M93052L34917J49034l6869j96008l10566l73346l82974l38245
39824g799269k38253q8589R3573K82783M55501N97892P04768P73279Q00405P87478
39814c630432P45586O93826O49958O20963O01260N79743N50168N17153M93296
39805A821521M88681N00098N08580M88875M25240L22127K01618Q9783K908n6923
39795D792508r6485j23544j42622j54303j55606j41570j09896o6610k7429j2153
39785C762290l6033j04038k09786l36880m61104n54265n90258n51694m34397k48183
$$ plain form
39852 -14068128 -14799299 -15427930 -15892311 -16148105 -16175745 -15978952 -15579172 -15010716 -14317405
39843 -14317405 -13548417 -12751585 -11964965 -11209756 -10488128 -9788280 -9095984 -8408246 -7742754
39834 -7742754 -7138264 -6645212 -6310295 -6161261 -6198130 -6394138 -6704704 -7078050 -7461024 -7799269
39824 -7799269 -8037522 -8126111 -8032538 -7749755 -7294254 -6696362 -5991594 -5218315 -4417910 -3630432
39814 -3630432 -2884846 -2191020 -1541062 -920099 -318839 260904 811072 1328225 1821521
39805 1821521 2310202 2810300 3318880 3807755 4232995 4555122 4756740 4846523 4849431 4792508
39795 4792508 4696023 4572479 4429857 4275554 4119948 3978378 3868482 3801872 3774443 3762290
39785 3762290 3726257 3622219 3412433 3075553 2614449 2060184 1469926 918232 483835 235652
39775B35652j4033K40913M88284P02282Q62885R58792R87986R54248Q62451P18342
39765F997802N34103L33342J48581J1229n9298o1876j3983N3145J03656J08398
39755H155099N3935n4685j98276l52226m94894o11606o93527p34901p32982o90998
39745C644939o20798n42295m79824m56392m86438n69149o86683q09973r09095
39736a915708r61994r57793q95883p83933o36219m71451l08610j61312l3899P6987
39726g049815J75278K57686L11035L16954K61850J47834q44j40996k24410k16486
39716f161914j09957P2700K87855M85843O27076O93728O92806O50450O01000N75270
39706a585143N90738O45870P21176P87711Q19557Q04165P45584O60009N67095
$$ plain form
39775 235652 221619 462532 950816 1653098 2515983 3474775 4462761 5417009 6279460 6997802
39765 6997802 7531905 7865247 8013828 8025057 7965759 7903883 7889900 7943045 8046701 8155099
39755 8155099 8209034 8154349 7956073 7603847 7108953 6497347 5803820 5068919 4335937 3644939
39745 3644939 3024141 2481846 2002022 1545630 1059192 490043 -196640 -1006613 -1915708
39736 -1915708 -2877702 -3835495 -4731378 -5515311 -6151530 -6622981 -6931591 -7092903 -7126802 -7049815
39726 -7049815 -6874537 -6616851 -6305816 -5988862 -5727012 -5579178 -5580022 -5721018 -5945428 -6161914
39716 -6161914 -6271871 -6199171 -5911316 -5425473 -4798397 -4104669 -3411863 -2761413 -2160413 -1585143
39706 -1585143 -994405 -348535 372641 1160352 1979909 2784074 3529658 4189667 4756762
39697D756762M82464M14460L64365L27045K91877K46386J83420J07844L7498l040
39687G209081P425P7413J98021L44065M79682N65853N68920M70869K79577L2461
39677A0233367k12047l93171m67821m23791k82299q9375J01485K48304L32042
39668I046694L56240L38098K96952K44100J77265Q3272n1326k28589m34907o45705
39658I182094q34035r77422j061339j079781j033598r27666p68586n64167l25032
39649A610468o8030J80912L88980N25658N74050N35542M24804K61300O5188j41406
39639D357466l33225m85430n80723o14773n94767n31314m30008k91100j18396
39630C77730P1442K49602L86825M66932M92522M80430M51239M18796L84716L40319
$$ plain form
39697 4756762 5239226 5653686 6018051 6345096 6636973 6883359 7066779 7174623 7212121 7209081
39687 7209081 7216506 7293919 7491940 7836005 8315687 8881540 9450460 9921329 10200906 10233367
39677 10233367 10021320 9628149 9160328 8736537 8454238 8364863 8466348 8714652 9046694
39668 9046694 9402934 9741032 10037984 10282084 10459349 10542621 10491295 10262706 9827799 9182094
39658 9182094 8348059 7370637 6309298 5229517 4195919 3268253 2499667 1935500 1610468
39649 1610468 1542438 1723350 2112330 2637988 3212038 3747580 4172384 4433684 4498872 4357466
39639 4357466 4024241 3538811 2958088 2343315 1748548 1217234 787226 496126 377730
39630 377730 449172 698774 1085599 1552531 2045053 2525483 2976722 3395518 3780234 4120553
39620D120553K74300J80828O3258o7318j96073l07895l88964m27283m14283l48928
39610B488195k42039j15923L218R5918J55199J83318J83210J52358Q3999k5764
39600B961689j70498l30560m76334n75973o04909n53882m31997k62924p6157J01850
39590d19695K53103L69582M51834N04971N33452N38228N18913M78685M26207L72090
39580D027370L23602K82839K49380K23798K08547K06127K17221K40512K73433
39571F252829L11624L46857L66269L55714L05988K17236R8544l5526j67856k80692
39561G770987l59241l98212m07699m12753m44330n25655o61355q35215j017537
39552B708990j178598j301674j388731j454941j514908j569819j604477j595899
$$ plain form
39620 4120553 4394853 4575681 4638939 4571621 4375548 4067653 3678689 3251406 2837123 2488195
39610 2488195 2246156 2130233 2133451 2229369 2384568 2567886 2751096 2903454 2987453 2961689
39600 2961689 2791191 2460631 1984297 1408324 803415 249533 -182464 -445388 -521545 -419695
39590 -419695 -166592 202990 654824 1159795 1693247 2231475 2750388 3229073 3655280 4027370
39580 4027370 4350972 4633811 4883191 5106989 5315536 5521663 5738884 5979396 6252829
39571 6252829 6564453 6911310 7277579 7633293 7939281 8156517 8255061 8219535 8051679 7770987
39561 7770987 7411746 7013534 6605835 6193082 5748752 5223097 4561742 3726527 2708990
39552 2708990 1530392 228718 -1160013 -2614954 -4129862 -5699681 -7304158 -8900057
39544h900057j526820j394896j212601r98996p69421n30098k80913k2889K36372
39535a5400319M83042P00804Q74128R90492J043122J033883R73717Q79376P68285
39526g653470O54526N48031M57371L93566L69984L95401M64593N55833O39877
39517c174288O94401P13167P04601O83040O58874O31882N90025N14761L91053
39508B407516K16747N839k15768m18924n79843o85393p33749p30925o85989o08389
39498b028878n08591l99727k96811k12785j54242j20405j05835j04103j09448
39489d040825j16458j19937j16260j05021q9097p3219o2390o0312o6641p3319
39479d923479o3327j5585Q4314K33110M05682N61738O61433O82257O27635N21862
$$ plain form
39544 -8900057 -10426877 -11821773 -13034374 -14033370 -14802791 -15332889 -15613802 -15636691 -15400319
39535 -15400319 -14917277 -14216473 -13342345 -12351853 -11308731 -10274848 -9301131 -8421755 -7653470
39526 -7653470 -6998944 -6450913 -5993542 -5599976 -5229992 -4834591 -4369998 -3814165 -3174288
39517 -3174288 -2479887 -1766720 -1062119 -379079 279795 911677 1501702 2016463 2407516
39508 2407516 2624263 2630102 2414334 1995410 1415567 730174 -3575 -734500 -1420489 -2028878
39498 -2028878 -2537469 -2937196 -3234007 -3446792 -3601034 -3721439 -3827274 -3931377 -4040825
39489 -4040825 -4157283 -4277220 -4393480 -4498501 -4587598 -4660817 -4723207 -4783519 -4850160 -4923479
39479 -4923479 -4986806 -5002391 -4918077 -4684967 -4279285 -3717547 -3056114 -2373857 -1746222 -1224360
39469a224360L94606K65085J35785j682j54272l18082m77899o14552p13714p70167
39459c479252p86571p69729p27130o64693n86052m93820l92107k88021j90335
39450h377710j05985l6330K4936R0620J74883K86054M21851N69716P10149Q19641
39440e422175Q74041Q56008P65599O25897M75949L53333K78269K49950K55601
39431f87528K83355L29799L99597N00371O36234Q01419R75522J123969J206572
39422E569310J191659J068306Q49400N64022K44474q3420m01053o91110r33779
39413G377809j111818j221243j277247j308319j342030j392413j456797j522511
39405c254569j577355j615195j632427j619678j558780j429929j223220r44251
$$ plain form
39469 -1224360 -829754 -564669 -428884 -430566 -584838 -902920 -1380819 -1995371 -2709085 -3479252
39459 -3479252 -4265823 -5035552 -5762682 -6427375 -7013427 -7507247 -7899354 -8187375 -8377710
39450 -8377710 -8483695 -8520025 -8495089 -8404469 -8229586 -7943532 -7521681 -6951965 -6241816 -5422175
39440 -5422175 -4548134 -3692126 -2926527 -2300630 -1824681 -1471348 -1193079 -943129 -687528
39431 -687528 -404173 -74374 325223 825594 1461828 2263247 3238769 4362738 5569310
39422 5569310 6760969 7829275 8678675 9242697 9487171 9403751 9002698 8311588 7377809
39413 7377809 6265991 5044748 3767501 2459182 1117152 -275261 -1732058 -3254569
39405 -3254569 -4831924 -6447119 -8079546 -9699224 -11258004 -12687933 -13911153 -14855404
39397a4855404o10708k45639J26212M78887P86027J023916J175894J236693J215045
39388i669077J132558J018316R01944Q08954P59352P66980Q37509R65896J135701
39379a341867J321243J492100J618956J679702J664024J575165J429012J251271
39371A0689606J071832R15404P91298O89631N88434M67537L19269J49773k7038
39362A5655746j97099l51222m86148o01580o95567p62604p96198p92353p49518
39353A0223457o66194n41343l78879j90950M778J91872L59751N03138O18636P02037
39343A0826303P47873P50455P05601O12651M76773L10897J35374k6658j57384
39334A4381885k51354l16105l65436m09930m51426m84935n05555n13845n14475
$$ plain form
39397 -14855404 -15466112 -15711751 -15585539 -15106652 -14320625 -13296709 -12120815 -10884122 -9669077
39388 -9669077 -8536519 -7518203 -6616259 -5807305 -5047953 -4280973 -3443464 -2477568 -1341867
39379 -1341867 -20624 1471476 3090432 4770134 6434158 8009323 9438335 10689606
39371 10689606 11761438 12676842 13468140 14157771 14746205 15213742 15533011 15682784 15655746
39362 15655746 15458647 15107425 14621277 14019697 13324130 12561526 11765328 10972975 10223457
39353 10223457 9557263 9015920 8637041 8446091 8450869 8642741 9002492 9505630 10124266 10826303
39343 10826303 11574176 12324631 13030232 13642883 14119656 14430553 14565927 14539269 14381885
39334 14381885 14130531 13814426 13448990 13039060 12587634 12102699 11597144 11083299 10568824
39325A0568824n09336m91983m49916l74078k68364j51440m9047J8430M5515M2762
39315H381367K9398K2499K9095M4697N7331N3394K2046m3117j43940k77208m32874
39304G742688n92756p32132q25612q55665q19680p30705o09721m73438l26506
39295A776473j64552J5080K05127L89745N52511O82770P76264Q33371Q59303Q65682
39285F791774Q68882Q82907R10463R39196R46978R13205Q28657O98086N35934
39276A4316082L60198J88290L4276r5031k04354l09978m32122n82737p56796r33165
39266A1584663j084059j187057j233665j231754j201938j169281j153012j157668
39258B166229j169261j159010j094709r55365p41125m72007j77025J17538L92543
$$ plain form
39325 10568824 10059488 9567505 9117589 8743511 8475147 8323707 8274660 8293090 8338605 8381367
39315 8381367 8410765 8433264 8462359 8507056 8564387 8617781 8639827 8596710 8452770 8175562 7742688
39304 7742688 7149932 6417800 5592188 4736523 3916843 3186138 2576417 2102979 1776473
39295 1776473 1611921 1627001 1832128 2221873 2774384 3457154 4233418 5066789 5926092 6791774
39285 6791774 7660656 8543563 9454026 10393222 11340200 12253405 13082062 13780148 14316082
39276 14316082 14676280 14864570 14898846 14803815 14599461 14289483 13857361 13274624 12517828 11584663
39266 11584663 10500604 9313547 8079882 6848128 5646190 4476909 3323897 2166229
39258 2166229 996968 -162042 -1256751 -2212116 -2953241 -3425248 -3602273 -3484735 -3092192
39249c092192O32984Q23570R48237R94003R56331Q42788O72928M73579K71027
39240C523255Q3436q2714k30133l63100m78870n63913n98219n65048m59397k90285
39230b4988p7233J55461L84088N89996P62758R00409J005637J079307J115445
39221E890880J101884J027471Q91474P08260N03195L02529J25004j9046j22577
39212A0409074j77999j79960j32070m9534M6289J36064K05091K39242K21818J38249
39202A0856264j3898k18598m45022o58971q34332r57864j026480j042095j009984
39193D649020r41144q53588p68377p02518o63911o50239o50178o47038o26536
39184a854509n86315n38931n03345m90523m94872m97737m78723m26455l43534
$$ plain form
39249 -3092192 -2459208 -1635638 -687401 306602 1262933 2105721 2778649 3252228 3523255
39240 3523255 3606691 3523977 3293844 2930744 2451874 1887961 1289742 724694 265297 -24988
39230 -24988 -102221 53240 437328 1027324 1790082 2690491 3696128 4775435 5890880
39221 5890880 6992764 8020235 8911709 9619969 10123164 10425693 10550697 10531651 10409074
39212 10409074 10231075 10051115 9919045 9869511 9915800 10051864 10256955 10496197 10718015 10856264
39202 10856264 10842366 10623768 10178746 9519775 8685443 7727579 6701099 5659004 4649020
39193 4649020 3707876 2854288 2085911 1383393 719482 69243 -580935 -1227973 -1854509
39184 -1854509 -2440824 -2979755 -3483100 -3973623 -4468495 -4966232 -5444955 -5871410 -6214944
39175f214944k45402j55118r6577q8042j36923k36275l64275m88413n74212n95188
39165i195369n39399m10011k20607J1307K68893N36691P98648J036570J231324
39156f481953J366577J432888J430092J366865J257434J116862R57387P88029
39148C234181O16926M53312L06370J81200P5462j9998j16341k20739l32325m41767
39138C736281n34429n96367o21198o13853n87756n56041n22934m82339m24686
39129a203322l45975k51279j51026n5208K8954R6070J42884J71510J91792K18338
39119a157262K63445L31866M20841N22515O24514P09025P55110P46325O79260
39110C895639N65992M27889K84651J45298O103j43196l07595m76175o20879p08203
$$ plain form
39175 -6214944 -6460346 -6615464 -6712041 -6800083 -6937006 -7173281 -7537556 -8025969 -8600181 -9195369
39165 -9195369 -9734768 -10144779 -10365386 -10354079 -10085186 -9548495 -8749847 -7713277 -6481953
39156 -6481953 -5115376 -3682488 -2252396 -885531 371903 1488765 2446152 3234181
39148 3234181 3851107 4304419 4610789 4791989 4867451 4847453 4731112 4510373 4178048 3736281
39138 3736281 3201852 2605485 1984287 1370434 782678 226637 -296297 -778636 -1203322
39129 -1203322 -1549297 -1800576 -1951602 -2006810 -1977856 -1881786 -1738902 -1567392 -1375600 -1157262
39119 -1157262 -893817 -561951 -141110 381405 1005919 1714944 2470054 3216379 3895639
39110 3895639 4461631 4889520 5174171 5319469 5325572 5182376 4874781 4398606 3777727 3069524
39100C069524p17709o54696n47854m33812l39360k71959k21746j70722j02650
39091c90984r348J07809K40934L81973N28728O85250Q54572J029166J188140J304367
39081E920607J355132J328086J221212J041537Q05335N37392K66838K0715j81734
39072A2315120l32788m37514n11485n74427o42099p20236q03094q76599r24644
39063F492234r35818r07797q47943p70601o91996o23259n64330n03629m25853
39054B21008l22906j99339o8603N5539J65717K62995L55451M54980N73190P17026
39044B215058Q84806J063400J228005J346451J388089J333872J182817R52324
39036A1594822O72878L79110R9558j51119l73110n73906p56547r11943j020811
$$ plain form
39100 3069524 2351815 1697119 1149265 715453 376093 104134 -117612 -288334 -390984
39091 -390984 -400332 -292523 -51589 330384 859112 1544362 2398934 3428100 4616240 5920607
39081 5920607 7275739 8603825 9825037 10866574 11671909 12209301 12476139 12496854 12315120
39072 12315120 11982332 11544818 11033333 10458906 9816807 9096571 8293477 7416878 6492234
39063 6492234 5556416 4648619 3800676 3030075 2338079 1714820 1150490 646861 221008
39054 221008 -101898 -301237 -369840 -314301 -148584 114411 469862 924842 1498032 2215058
39044 2215058 3099864 4163264 5391269 6737720 8125809 9459681 10642498 11594822
39036 11594822 12267700 12646810 12746368 12595249 12222139 11648233 10891686 9979743 8958932
39027H958932j062999j026168r08058p13945m54996j50141J71785M74014P18423
39018F006847Q73565R21106Q59238P02116M75103K07065p6838l58614o26065q67920
39008H115603j068797j207873j263614j223179j091616q95042o74470m71572l12590
38999i3150j99544j14910l7033M4785J26148J95180K43180K69408K78605K76487
38989I89156K67611K56147K47468K48898K68511L11736L77545M57516N39238O11474
38979D575300O67048P02300P15001P02612O61577N88544M84517L59728K34078
38970I690705J30526O5274M1625N0570P5900J00562J12609J09200R6843Q7559
38960A0561373R3755J24541J83931K69702L72768M78363N69618O32554O60143
$$ plain form
39027 8958932 7895933 6869765 5961707 5247762 4792766 4642625 4814410 5288424 6006847
39018 6006847 6880412 7801518 8660756 9362872 9837975 10045040 9968202 9609588 8983523 8115603
39008 8115603 7046806 5838933 4575319 3352140 2260524 1365482 691012 219440 -93150
38999 -93150 -292694 -407604 -444637 -399852 -273704 -78524 164656 434064 712669 989156
38989 989156 1256767 1512914 1760382 2009280 2277791 2589527 2967072 3424588 3963826 4575300
38979 4575300 5242348 5944648 6659649 7362261 8023838 8612382 9096899 9456627 9690705
38970 9690705 9821231 9886505 9928130 9978700 10054600 10155162 10267771 10376971 10473814 10561373
38960 10561373 10655128 10779669 10963600 11233302 11606070 12084433 12654051 13286605 13946748
38951A3946748O53022O16295N54809M71008L67377K50942J35437L8945k1829l8205
38941A6974549j4876K8467O1440N3036j6287j46386l17639m99968o66073q01585
38931A4654678r06953r91418j063868j125857j169863j183223j155270j083045
38923E975181r71944q32405o77127n20562l77865k60528j71212j02481m0478K9701
38913B050280J19896K36005L75900N28855O77272Q00198Q78508R01196Q69970
38904G438080P97266O97183N76470M34446K72398J02824n1449j68817k42121k83443
38894I572837l17220l66294m39243n25728o01918o42581o32560n70628m63878
38885E012787l18378j35129Q4573L29720N75797P91173R48550J032618J040108
$$ plain form
38951 13946748 14599770 15216065 15770874 16241882 16609259 16860201 16995638 17034583 17012754 16974549
38941 16974549 16959673 16988140 17049580 17102616 17086329 16939943 16622304 16122336 15456263 14654678
38931 14654678 13747725 12756307 11692439 10566582 9396719 8213496 7058226 5975181
38923 5975181 5003237 4170832 3493705 2973143 2595278 2334750 2163538 2061057 2020579 2050280
38913 2050280 2170176 2406181 2782081 3310936 3988208 4788406 5666914 6568110 7438080
38904 7438080 8235346 8932529 9508999 9943445 10215843 10318667 10267218 10098401 9856280 9572837
38894 9572837 9255617 8889323 8450080 7924352 7322434 6679853 6047293 5476665 5012787
38885 5012787 4694409 4559280 4643853 4973573 5549370 6340543 7289093 8321711 9361819
38876I361819R76123Q52508O88822N10727L41656J91148M9201j06786k95722n18388
38866A2051108p54539r71878j138607j230663j232305j136219r48335o93923m15611
38857C529028j59893L9491J69316K33376K45900K28795K09960K16290K62216L42486
38847E316965M35487N14375N57624N53707N00512M02874K70417J16321m3062j88283
38837H436937k98078l53193l41591k61571j20353O9912K94331N33866P63194R51836
38827I675290J070040J097689J032452Q92209P08835N16317L41442K02283J10898
38818A5647455P2891Q2800J21530J60580J70663J29604K7694j29260l20549n16248
38808A5447160o85804q04973q59196q44781p68585o45039m90910l21141j48323
$$ plain form
38876 9361819 10337942 11190450 11879272 12389999 12731655 12922803 12972004 12865218 12569496 12051108
38866 12051108 11296569 10324691 9186084 7955421 6723116 5586897 4638562 3944639 3529028
38857 3529028 3369135 3408626 3577942 3811318 4057218 4286013 4495973 4712263 4974479 5316965
38847 5316965 5752452 6266827 6824451 7378158 7878670 8281544 8551961 8668282 8625220 8436937
38837 8436937 8138859 7785666 7444075 7182504 7062151 7132063 7426394 7960260 8723454 9675290
38827 9675290 10745330 11843019 12875471 13767680 14476515 14992832 15334274 15536557 15647455
38818 15647455 15720346 15803146 15924676 16085256 16255919 16385523 16413217 16283957 15963408 15447160
38808 15447160 14761356 13956383 13097187 12252406 11483821 10838782 10347872 10026731 9878408
38799I878408J5888J60726K78280L65189M22321M53305M63204M57183M38359M05811
38789A3338674L55195K83222J93357R7852J3942m3204o6008n5966k1712K5227
38779A4120579P5815J27377J82677K44327L09298L67843M06040M08671L62584
38770A6605211K63304J23601k3422j32942j65712j03979M2672K43344M59868O62462
38760A7974407Q39789R98616J154109J317484J488041J651829J785176J861058
38752B9070509J857200J764169J590334J360642J108283Q61685O32823M14363
38744C8660008J88835n5473l13109n62066p74317r27853j013768j037494j015999
38735C3148764r72375r29215r03460r04705r36061r94764j071471j150688j215028
$$ plain form
38799 9878408 9894296 10055022 10333302 10698491 11120812 11574117 12037321 12494504 12932863 13338674
38789 13338674 13693869 13977091 14170448 14268300 14282242 14239038 14173030 14117064 14095352 14120579
38779 14120579 14196394 14323771 14506448 14750775 15060073 15427916 15833956 16242627 16605211
38770 16605211 16868515 16992116 16968694 16835752 16670040 16566061 16608733 16852077 17311945 17974407
38760 17974407 18814196 19812812 20966921 22284405 23772446 25424275 27209451 29070509
38752 29070509 30927709 32691878 34282212 35642854 36751137 37612822 38245645 38660008
38744 38660008 38848843 38793370 38480261 37918195 37143878 36216025 35202257 34164763 33148764
38735 33148764 32176389 31247174 30343714 29439009 28502948 27508184 26436713 25286025 24070997
38726B4070997j252295j259882j241549j197814j118380r85224p85925n26375
38718A5703553k31463O6239L38603N64858P27336Q09513Q01075P04714N37092
38709B0021520L23356R0920j33082l22048m52417n10040m96413m28677l31323
38700A7761796k25653j25603m2041J2057K4087r284p6488j55718k26611k79601
38690A6656941l17126l48462l83761m31087m95323n75260o57847p14859p09003
38681A2024213o09867m10458j32857J80689M85110P48610R60502J128764J270013
38672A5644719J397819J515158J612874J672376J670570J586877J412166J156409
38664B7668968Q49947N35783K56038L9961j00632j68622j76337j41664q4953k4990
$$ plain form
38726 24070997 22818702 21558820 20317271 19119457 18001077 17015853 16229928 15703553
38718 15703553 15472090 15538329 15876932 16441790 17169126 17978639 18779714 19484428 20021520
38709 20021520 20344876 20435796 20302714 19980666 19528249 19018209 18521796 18093119 17761796
38700 17761796 17536143 17410540 17368499 17380556 17404643 17395359 17318871 17163153 16936542 16656941
38690 16656941 16339815 15991353 15607592 15176505 14681182 14105922 13448075 12733216 12024213
38681 12024213 11414346 11003888 10871031 11051720 11536830 12285440 13245942 14374706 15644719
38672 15644719 17042538 18557696 20170570 21842946 23513516 25100393 26512559 27668968
38664 27668968 28518915 29054698 29310736 29350697 29250065 29081443 28905106 28763442 28678489 28653499
38654B8653499K4654N5441N9619K6796n3711j85680l59747n52980p34129q71081
38644B6062681r37888r20620q20946o54776m44713k10318L6352K86581N27210
38635B2923563P37881Q96673R89241J014033R80324R01566P89330O51823M97241
38626C0381675L37863J90291P0981r217m7665m9355k4963J1500M5956O8072P3711
38615C1048849O4230M3034J1741l1202q8226j57887k30735k88903l10513k77275
38605B9783113j81449k8446J65435L77219N80793P50695Q68038R26755R35045
38596C4177198R10037Q69806Q28037P92622P66239P48180P37282P33991P39202
38587D1302594P50829P62176P63903P47446P07051O40463N49665M41813L28993
$$ plain form
38654 28653499 28678153 28733594 28793213 28820009 28766298 28580618 28220871 27667891 26933762 26062681
38644 26062681 25124793 24204173 23383227 22728451 22283738 22073420 22109772 22396353 22923563
38635 22923563 23661444 24558117 25547358 26561391 27541715 28443281 29232611 29884434 30381675
38626 30381675 30719538 30909829 30980810 30971593 30923928 30874573 30849610 30861110 30907066 30975138 31048849
38615 31048849 31113079 31156113 31167854 31136652 31048426 30890539 30659804 30370901 30060388 29783113
38605 29783113 29601664 29573218 29738653 30115872 30696665 31447360 32315398 33242153 34177198
38596 34177198 35087235 35957041 36785078 37577700 38343939 39092119 39829401 40563392 41302594
38587 41302594 42053423 42815599 43579502 44326948 45033999 45674462 46224127 46665940 46994933
38578D6994933K25628J43839Q8989N8332M3828L6229K6532M737m0132j16106k23038
38567D7243771l50382m79644n90011o65266o99801p00107o79094o46263o01587
38558D1831616n38589m53159l49191k35623j18776J616J28598K60507L86926M90921
38548D1404846N54978N66805N23763M35556L23766K16403J38559J03368J07475
38539D4375519J32899J54317J49507J09042M0240l8139j08341j64946k16551k76895
38529D4156652l53444m42878n35734o24487p08137p90631q75115r58122j027921
38520C7840183j069040j070289j030309r56513q59380p47284o24860m93870l54540
38511C0634098k06582m9920J15051K87488M65667O45662Q20082R78296J108741
$$ plain form
38578 46994933 47220561 47364400 47453389 47511721 47555549 47591778 47618310 47623047 47582915 47466809 47243771
38567 47243771 46893389 46413745 45823734 45158468 44458667 43758560 43079466 42433203 41831616
38558 41831616 41293027 40839868 40490677 40255054 40136278 40137894 40266492 40526999 40913925 41404846
38548 41404846 41959824 42526629 43050392 43485948 43809714 44026117 44164676 44268044 44375519
38539 44375519 44508418 44662735 44812242 44921284 44961524 44923385 44815044 44650098 44433547 44156652
38529 44156652 43803208 43360330 42824596 42200109 41491972 40701341 39826226 38868104 37840183
38520 37840183 36771143 35700854 34670545 33714032 32854652 32107368 31482508 30988638 30634098
38511 30634098 30427516 30377596 30492647 30780135 31245802 31891464 32711546 33689842 34798583
38502C4798583J202497J256413J273735J260915J221529J151298J039225Q76438
38494D4080633O67483M35336K15405M2832n8343p9545k7376P8742K11388L42713
38484D5909268M51344N24494N55771N42918M87959L98705K90079J84611J10591
38475D9455740R5689J57323K95712M94523P27816R67205J184840J352728J442582
38466E6174158J429972J302878J069935P61874M23709J01930j66445l59224m69174
38457F0269613n00958m66398l79908k55915j08587M7558J97959L30485M39586
38448E9573435N29334O11029O94267P76763Q41065Q61497Q17130P03832N40607
38439F5948959L67779K35819J87572K41912L87925N92251Q14225J019997J189272
$$ plain form
38502 34798583 36001080 37257493 38531228 39792143 41013672 42164970 43204195 44080633
38494 44080633 44748116 45183452 45398857 45441689 45383346 45303801 45276425 45355167 45566555 45909268
38484 45909268 46360612 46885106 47440877 47983795 48471754 48870459 49160538 49345149 49455740
38475 49455740 49551429 49708752 50004464 50498987 51226803 52194008 53378848 54731576 56174158
38466 56174158 57604130 58907008 59976943 60738817 61162526 61264456 61098011 60738787 60269613
38457 60269613 59768655 59302257 58922349 58666434 58557847 58605405 58803364 59133849 59573435
38448 59573435 60102769 60713798 61408065 62184828 63025893 63887390 64704520 65408352 65948959
38439 65948959 66316738 66552557 66740129 66982041 67369966 67962217 68776442 69796439 70985711
38430G0985711J312875J384551J394036J327637J176265R44277O52393L33612
38422G9511357K5743k35872m24278n24919n36736m69745l39753j61859N4688L07027
38412G7205653N93110R03054J214319J495505J716820J860588J926329J929306
38404H8844684J894541J849157J815990J810478J840465J906338K000014K104129
38396A04065796K194136K243572K230279K141540J977795J754328J498728J242963
38388A19349137J013499Q26048O88443O07962N95836O65015Q23360J066793J375328
38379A27011421J713387K035676K298549K473040K553339K556686K515579K466580
38371A45624257K440292K455830K521145K637093K800623L003898L231564L461732
$$ plain form
38430 70985711 72298586 73683137 75077173 76404810 77581075 78525352 79177745 79511357
38422 79511357 79537100 79301228 78876950 78352031 77815295 77345550 77005797 76843938 76898626 77205653
38412 77205653 77798763 78701817 79916136 81411641 83128461 84989049 86915378 88844684
38404 88844684 90739225 92588382 94404372 96214850 98055315 99961653 101961667 104065796
38396 104065796 106259932 108503504 110733783 112875323 114853118 116607446 118106174 119349137
38388 119349137 120362636 121188684 121877127 122485089 123080925 123745940 124569300 125636093 127011421
38379 127011421 128724808 130760484 133059033 135532073 138085412 140642098 143157677 145624257
38371 145624257 148064549 150520379 153041524 155678617 158479240 161483138 164714702 168176434
38363A68176434L672821L851974L998793M122889M239015M363080M508271M679658
38355B01612935M869584N058973N226314N359383N462297N554240N661515N806647
38347B44611888N998294O225378O458468O659073O793617O846222O824844O758181
38339B97175965O684909O639844O642736O693664O776070O865210O937258O974252
38331C51389908O963547O894960O759569O550536O263796N898476N459005M958236
38323D01138033M416677L854903L283716K700520K095300J461667Q05681J47960
38315D19904457m81966j056849j562653k002300k389713k739363l059429l352696
38307D03259488l622567l878341m135069m407530m702385n014782n332300n642860
$$ plain form
38363 168176434 171849255 175701229 179700022 183822911 188061926 192425006 196933277 201612935
38355 201612935 206482519 211541492 216767806 222127189 227589486 233143726 238805241 244611888
38347 244611888 250610182 256835560 263294028 269953101 276746718 283592940 290417784 297175965
38339 297175965 303860874 310500718 317143454 323837118 330613188 337478398 344415656 351389908
38331 351389908 358353455 365248415 372007984 378558520 384822316 390720792 396179797 401138033
38323 401138033 405554710 409409613 412693329 415393849 417489149 418950816 419756497 419904457
38315 419904457 419422491 418365642 416802989 414800689 412410976 409671613 406612184 403259488
38307 403259488 399636921 395758580 391623511 387215981 382513596 377498814 372166514 366523654
38299C66523654n940011o222200o488419o734685o953550p135969p274065p363464
38291C12411291p404280p400608p359549p290488p203854p108464p008671o903962
38283B54731415o791598o669353o535128o384012o206941n994348n743838n467040
38275B04939157n189919m944074m752064m614882m509465m398064m244095m026437
38267A68260157l746586l426995l101900k804621k557364k368212k235259k153060
38259A45866160k116392k119781k155023k210220k271905k328616k372332k396510
38251A27895381k393323k353908k271957k147674j989606j814013j642034j494499
38243A11788367j386121j323111j306100j334797j408663j522632j662935j808439
$$ plain form
38299 366523654 360583643 354361443 347873024 341138339 334184789 327048820 319774755 312411291
38291 312411291 305007011 297606403 290246854 282956366 275752512 268644048 261635377 254731415
38283 254731415 247939817 241270464 234735336 228351324 222144383 216150035 210406197 204939157
38275 204939157 199749238 194805164 190053100 185438218 180928753 176530689 172286594 168260157
38267 168260157 164513571 161086576 157984676 155180055 152622691 150254479 148019220 145866160
38259 145866160 143749768 141629987 139474964 137264744 134992839 132664223 130291891 127895381
38251 127895381 125502058 123148150 120876193 118728519 116738913 114924900 113282866 111788367
38243 111788367 110402246 109079135 107773035 106438238 105029575 103506943 101844008 100035569
38235A00035569j937602k036189k100764k136767k153765k161663k169368k184210
38227H3155241k209946k243675k274574k286271k261310k184823k046803j844767
38219F5803072j587663j298100j008985p54483n60506m40237l95276m18535m95931
38210E8843356o07426p29403q38352r14602r45717r29440q74561p97617p16297
38201E1489941o43486n85204n41722n09050m79792m45165l99637l46269k98028
38192D7241588k72014k79022l15616l64533m03088m13497l88774l32134k52420
38183D4220490j59960o5741J6632O9785P5701K2973q5941k31977l83274n04683
38173D2974005n70009n72137n25729m60380m07943l90928m16788m78226n57335
$$ plain form
38235 100035569 98097967 96061778 93961014 91824247 89670482 87508819 85339451 83155241
38227 83155241 80945295 78701620 76427046 74140775 71879465 69694642 67647839 65803072
38219 65803072 64215409 62917309 61908324 61153841 60593335 60153098 59757822 59339287 58843356
38210 58843356 58235930 57506527 56668175 55753573 54807856 53878416 53003855 52206238 51489941
38201 51489941 50846455 50261251 49719529 49210479 48730687 48285522 47885885 47539616 47241588
38192 47241588 46969574 46690552 46374936 46010403 45607315 45193818 44805044 44472910 44220490
38183 44220490 44060530 43994789 44011421 44081206 44156907 44179880 44093939 43861962 43478688 42974005
38173 42974005 42403996 41831859 41306130 40845750 40437807 40046879 39630091 39151865 38594530
38164C8594530o32086o83922p03859o94078o64239o25086n82941n37273m82151
38155C2988895m11355l24915k32092j46962p9220k8356J3280N2086Q8260J18180
38145C2037801J39610J53130J58865J52740J26148O8896k6976j64347l39018n38014
38135C1768835p38894r12487j030331j074006j040233r38488p84278n94543l87233
38126B4268342j81769L304J54113K62999L26736L44619L19387K60172J83626J10477
38116B6052006N8613L6591M0979N8350P0592O1528K2995m1745j19172j91066k41359
38105B5808312k60146k43411j90677j03678J3013J50821K97050M36383N53731
38096B6461398O37417O80893O82072O42091N66433M67652L64610K75291K08035
$$ plain form
38164 38594530 37962444 37278522 36574663 35880585 35216346 34591260 34008319 33471046 32988895
38155 32988895 32577540 32252625 32020533 31873571 31794351 31765995 31779275 31831361 31919621 32037801
38145 32037801 32177411 32330541 32489406 32642146 32768294 32837190 32810214 32645867 32306849 31768835
38135 31768835 31029941 30117454 29087123 28013117 26972884 26034396 25250118 24655575 24268342
38126 24268342 24086573 24089877 24243990 24506989 24833725 25178344 25497731 25757903 25941529 26052006
38116 26052006 26110619 26147210 26188189 26246539 26317131 26378659 26401654 26359909 26240737 26049671 25808312
38105 25808312 25548166 25304755 25114078 25010400 25023413 25174234 25471284 25907667 26461398
38096 26461398 27098815 27779708 28461780 29103871 29670304 30137956 30502566 30777857 30985892
38087C0985892J59552J21283Q6892N3967K1022j4323n4081r8156j44189j87918
38077C0929941k23521k45487k52184k47978k40966k37987k41492k50157k60950
38068B8729219k69773k71067k59117k32335j97622j70275j67934k02460k75373
38059B6683263l78733m98724o19040p24008q01927q46941q57787q35375p82936
38050B0337792p08495o24743n43518m69388l99283l28685k57486j89406j26666
38041A6690122o6399k604O8400J43579K12756K62496K82152K68321K24917J59875
38031A8243615Q2523L512o5446j15280j44684j60826j73313j86224j95253j91675
38021A7096949j68585j24161o1067J4892R4433J63936K07185K10570J68616Q5828
$$ plain form
38087 30985892 31145444 31266727 31353619 31407586 31428608 31414285 31360204 31262048 31117859 30929941
38077 30929941 30706420 30460933 30208749 29960771 29719805 29481818 29240326 28990169 28729219
38068 28729219 28459446 28188379 27929262 27696927 27499305 27329030 27161096 26958636 26683263
38059 26683263 26304530 25805806 25186766 24462758 23660831 22813890 21956103 21120728 20337792
38050 20337792 19629297 19004554 18461036 17991648 17592365 17263680 17006194 16816788 16690122
38041 16690122 16623723 16621119 16689519 16833098 17045854 17308350 17590502 17858823 18083740 18243615
38031 18243615 18326138 18329650 18264204 18148924 18004240 17843414 17670101 17483877 17288624 17096949
38021 17096949 16928364 16804203 16743136 16758028 16852461 17016397 17223582 17434152 17602768 17688596
38011A7688596k6008j52407k79570l95686m90581n54594n77869n51628m71739
38002A4188514l42239j75996P853J86890L36581M30840M46096L70554K14362J2260
37992A5675715j86275l35345m08628m04495l39992k40586j32631m0115J8141L4541
37982A3640330J9776K848J8568Q7736K03787L35738M44293M99113M88003M17025
37972A6157217L05218J76976N3997n0530j32652j92629k27480k26515j73800n6685
37962A5633117J24534L51085N86812P85522R02567R06987P89558N64022K62739
37953B0906943p0493l89259o54476q42369r46254r72012r32112q42204p19593
37944A4538171n81239m41772l13506k07928j35740j04530j16205j66171k43680
$$ plain form
38011 17688596 17662588 17510181 17230611 16834925 16344344 15789750 15211881 14660253 14188514
38002 14188514 13846275 13670279 13678132 13865022 14201603 14632443 15078539 15449093 15663455 15675715
37992 15675715 15489440 15154095 14745467 14340972 14000980 13760394 13627763 13587648 13605789 13640330
37982 13640330 13660106 13662954 13681522 13769258 13973045 14308783 14753076 15252189 15740192 16157217
37972 16157217 16462435 16639411 16693408 16642878 16510226 16317597 16090117 15863602 15689802 15633117
37962 15633117 15757651 16108736 16695548 17481070 18383637 19290624 20080182 20644204 20906943
37953 20906943 20836450 20447191 19792715 18950346 18004092 17032080 16099968 15257764 14538171
37944 14538171 13956932 13515160 13201654 12993726 12857986 12753456 12637251 12471080 12227400
37935A2227400l32049m09386m51952m40709l68707k45266r4582N0624J57732K02933
37925A0296038J78409R5331k0668j41404k48532l36868m05659m45958m36655l54308
37915H179726j89234M4940L14671N78335P98574R51179J030648J050770J036981
37906A3796590J012124R84680R47774Q87919P94580O64301N00524L13224J19154
37897B0020870o0022k03413k98851l48930l71337l92566m38204n24712o55287
37888A6727548q19037r92464j144208j243901j272352j227588j123302r81302
37880G923394q22724o61935n04134l45939j78284Q796K20666M54301O97756R32209
37870G724106J134558J279992J345846J317103J191125R78217O97874L74078L3243
$$ plain form
37935 12227400 11895351 11485965 11034013 10593304 10224597 9979331 9884749 9935373 10093105 10296038
37925 10296038 10474447 10569778 10549110 10407706 10159174 9822306 9416647 8970689 8534034 8179726
37915 8179726 7990492 8035432 8350103 8928438 9727012 10678191 11708839 12759609 13796590
37906 13796590 14808714 15793394 16741168 17629087 18423667 19087968 19588492 19901716 20020870
37897 20020870 19960848 19757435 19458584 19109654 18738317 18345751 17907547 17382835 16727548
37888 16727548 15908511 14916047 13771839 12527938 11255586 10027998 8904696 7923394
37880 7923394 7100670 6438735 5934601 5588662 5410378 5419174 5639840 6094141 6791897 7724106
37870 7724106 8858664 10138656 11484502 12801605 13992730 14970947 15668821 16042899 16076142
37861A6076142k95217n78528p83441q82505q61395p24044m93276k06717R0384
37852A1341403L52864N42628O35254O26160N33572L94002K49651J33587O1208
37843A4870329L1869L7187O9374J25225K05620L12581M45948O00547P63892R15335
37833A8377907J029112J082888J068480R96970Q92701P79199O66942N51240M20410
37824B5865849K67566R8265o9694k13312l13866l64062l70165l49477l25686l24172
37814B3901246l67008m66225o16299p90803r48572j048954j068419j009312q96763
37805A6688891p66449o49789n63706n09812m82602m79752n06346n70270o73534
37796A1486631q06350r47479j070047j149816j171594j130332j026916q63493
$$ plain form
37861 16076142 15780925 15202397 14418956 13536451 12675056 11951012 11457736 11251019 11341403
37852 11341403 11694267 12236895 12872149 13498309 14031881 14425883 14675534 14809121 14870329
37843 14870329 14902198 14939385 15008759 15133984 15339604 15652185 16098133 16698680 17462572 18377907
37833 18377907 19407019 20489907 21558387 22555357 23448058 24227257 24894199 25445439 25865849
37824 25865849 26133415 26231680 26161986 25948674 25634808 25270746 24900581 24551104 24225418 23901246
37814 23901246 23534238 23068013 22451714 21660911 20712339 19663385 18594966 17585654 16688891
37805 16688891 15922442 15272653 14708947 14199135 13716533 13236781 12730435 12160165 11486631
37796 11486631 10680281 9732802 8662755 7512939 6341345 5211013 4184097 3320604
37788C320604o43394l75747p9565K17617M86819P06167Q65541R64594J005923
37779F468559R89673R15024P87662O25591M56784L10473K09876J70516K00407
37770A1134565K96963M42282O03945P44242Q32109Q49617P91270O61006M71166
37761A6827165K42612L413k14055l76033m51220m18289k76561n3150K00737M24543
37751A5909162N65685N90439M86763K63665m9660m07075p54469j042708j238556
37742A4323246j328836j317836j221291j060400q58691o42485m42491k91473k15315
37733F944428k21417k92557l91541m74109n02402m53092l19969j13733J40049
37724D315657M06341O49426Q41257R64767J012057R82150Q82557P33449N68539
$$ plain form
37788 3320604 2677210 2301463 2221898 2439515 2926334 3632501 4498042 5462636 6468559
37779 6468559 7458232 8373256 9160918 9786509 10243293 10553766 10763642 10934158 11134565
37770 11134565 11431528 11873810 12477755 13221997 14054106 14903723 15694993 16355999 16827165
37761 16827165 17069777 17073190 16859135 16483102 16031882 15613593 15337032 15283882 15484619 15909162
37751 15909162 16474847 17065286 17552049 17815714 17766054 17358979 16604510 15561802 14323246
37742 14323246 12994410 11676574 10455283 9394883 8536192 7893707 7451216 7159743 6944428
37733 6944428 6723011 6430454 6038913 5564804 5062402 4609310 4289341 4175608 4315657
37724 4315657 4721998 5371424 6212681 7177448 8189505 9171655 10054212 10787661 11356200
37715A1356200M27481L40831L15681L32547L57403L61130L32353K75842K01953
37706A4301421J19242L5923l5013p5481o9009r558R3495K16109L25028L86401
37696A5288558L75858K87132J35462m6147k16534l38438l89008l65418k83427
37687A4448038j69431m9900N6569J41581K04067K44829K61562K47317J94344J01467
37677A5680443k0524j50655k65874l48825l89735l83805l30328k36563j21532
37668A3432602j2741O4690R8666R2403N8081Q670m6243j00753j52584k04346k63758
37657A2974687l39964m36161n43648o43008p13380p43597p37296p09407o77815
37648G430411o55158o43245o31323n99509n26669l98598k12332K3687K91448N66166
$$ plain form
37715 11356200 11783681 12124512 12440193 12772740 13130143 13491273 13823626 14099468 14301421
37706 14301421 14420663 14456586 14421573 14346092 14277083 14267525 14361020 14577129 14902157 15288558
37696 15288558 15664416 15951548 16087010 16040863 15824329 15485891 15096883 14731465 14448038
37687 14448038 14278607 14228707 14285276 14426857 14630924 14875753 15137315 15384632 15578976 15680443
37677 15680443 15659919 15509264 15243390 14894565 14504830 14121025 13790697 13554134 13432602
37668 13432602 13419861 13484551 13583217 13675620 13733701 13742371 13696128 13595375 13442791 13238445 12974687
37657 12974687 12634723 12198562 11654914 11011906 10298526 9554929 8817633 8108226 7430411
37648 7430411 6775253 6132008 5500685 4901176 4374507 3975909 3763577 3787264 4078712 4644878
37638D644878Q20794J031445J181177J260468J265607J197826J064871Q83789
37630A3350855O80878M85252L17697J82122O5963n1370j87875l50874n33167p15226
37620A3244255q74674r98046j085024j140577j162959j140081j057983r13144
37612D871767p18256m98741k84540j02867K5799Q9480Q6092K5229p1014j70659
37602C252290k39153k49590j91483p3670P9893K38938L76241M74820N31598N56086
37592D755970N63209N63594N57959N39903N03815M50336L85176L14002K39036
37583H873000J60441Q1400J3138k4405q629P4740K21771M07952N95352P45540
37573A1140300Q31292Q42050P82765O69842N27166L81759K56867J63819R8389
$$ plain form
37638 4644878 5465672 6497117 7678294 8938762 10204369 11402195 12467066 13350855
37630 13350855 14031733 14516985 14834682 15016804 15082767 15031397 14843522 14492648 13959481 13244255
37620 13244255 12369581 11371535 10286511 9145934 7982975 6842894 5784911 4871767
37612 4871767 4153511 3654770 3370230 3267363 3293162 3382642 3468734 3493963 3422949 3252290
37602 3252290 3013137 2763547 2572064 2498394 2578287 2817225 3193466 3668286 4199884 4755970
37592 4755970 5319179 5882773 6440732 6980635 7484450 7934786 8319962 8633964 8873000
37583 8873000 9033441 9114841 9127979 9103574 9094945 9169685 9391456 9799408 10394760 11140300
37573 11140300 11971592 12813642 13596407 14266249 14793415 15175174 15432041 15595860 15694249
37564A5694249M6052p190o7577j35636k13767l10294m35325n91638p67645r37357
37554A2273872j068576j136890j138501j092720j030737r78116r43887r22293
37546C962152r01702q71579q23913p51918o49512n13101l45260j58208K6486J84366
37536h42189K98334L66485M02376M27546M61234N13919N88086O83593Q00916R38427
37526D638727J086777J226515J331807J378238J351531J254203J106364R38321
37518A4312483P78371O44098N42298M73873M36471M22977M20562M14526L94758
37509A8840417L59153L11723K59104K10042J76777J72851K05255K67202L40384
37500B1142908M06517M57838M96636N25675N40285N29890M86098M08781L04994
$$ plain form
37564 15694249 15740301 15733111 15665534 15529898 15316131 15005837 14570512 13978874 13211229 12273872
37554 12273872 11205296 10068406 8929905 7837185 6806448 5828332 4884445 3962152
37546 3962152 3060450 2188871 1364958 613040 -36472 -549573 -894833 -1053041 -1026555 -842189
37536 -842189 -543855 -177370 225006 652552 1113786 1627705 2215791 2899384 3700300 4638727
37526 4638727 5725504 6952019 8283826 9662064 11013595 12267798 13374162 14312483
37518 14312483 15090854 15734952 16277250 16751123 17187594 17610571 18031133 18445659 18840417
37509 18840417 19199570 19511293 19770397 19980439 20157216 20330067 20535322 20802524 21142908
37500 21142908 21549425 22007263 22503899 23029574 23569859 24099749 24585847 24994628 25299622
37491B5299622J83022M7645r9553k56166m15737n68485p04925q18588r05565r62503
37481B0798767r86557r78430r45433r00408q55588q15143p71660p09260o12211
37472A3224077m75165l09966j44920j6411M2692J2068j11673l14354n66960q32774
37462A0506614j077473j276480j415116j484119j477772j398037j259863j090031
37454B7723r17086p58282o12605m65017k99143j10082R0462K79177M32433N36823
37444a795597N92883O10609O00894N69138N14581M33909L25426J91714M0719j14440
37434A969836k57249l71240m44325m72893m63898m33316m00431l80506l79941
37425a633963l96554m23646m54185m82181n01435n04223m81844m26711l34634
$$ plain form
37491 25299622 25482644 25530289 25430736 25174570 24758833 24190348 23485423 22666835 21761270 20798767
37481 20798767 19812210 18833780 17888347 16987939 16132351 15317208 14545548 13836288 13224077
37472 13224077 12748912 12438946 12294026 12277615 12320307 12332375 12220702 11906348 11339388 10506614
37462 10506614 9429141 8152661 6737545 5253426 3775654 2377617 1117754 27723
37454 27723 -889363 -1647645 -2260250 -2725267 -3024410 -3134492 -3044030 -2764853 -2332420 -1795597
37444 -1795597 -1202714 -592105 8789 577927 1092508 1526417 1851843 2043557 2084276 1969836
37434 1969836 1712587 1341347 897022 424129 -39769 -473085 -873516 -1254022 -1633963
37425 -1633963 -2030517 -2454163 -2908348 -3390529 -3891964 -4396187 -4878031 -5304742 -5639376
37416e639376k07044n3734J05828K46221L45303L93110L93546L58679L02477K39390
37406c515600J85948J59570J72773K27336L14310M20502N35666O53512P65382
37397h0601Q52827Q87207Q38917O91272M50778J48090j71034m60336o86202q33536
37387A637382r03679r08394q64094p87783o94595n97090n06248m32078l81227
37378d437806l51828l29174k86672j94014k9842K07441M97403Q05172J093190
37369c026130J329466J490049J559455J533181J421081J247376J045426Q49732
37361G449636O88552N78456N21176N04267N07415N12442N10889N03861M95186
37352A2271880M84829M68182M40826M04120L67681L47573L60644M16150N07896
$$ plain form
37416 -5639376 -5846420 -5900154 -5794326 -5548105 -5202802 -4809692 -4416146 -4057467 -3754990 -3515600
37406 -3515600 -3329652 -3170082 -2997309 -2769973 -2455663 -2035161 -1499495 -845983 -80601
37397 -80601 772226 1659433 2498350 3189622 3640400 3788490 3617456 3157120 2470918 1637382
37387 1637382 733703 -174691 -1038785 -1826568 -2521163 -3118253 -3624501 -4056579 -4437806
37378 -4437806 -4789634 -5118808 -5405480 -5599494 -5629336 -5421895 -4924492 -4119320 -3026130
37369 -3026130 -1696664 -206615 1352840 2886021 4307102 5554478 6599904 7449636
37361 7449636 8138188 8716644 9237820 9742087 10249502 10761944 11272833 11776694 12271880
37352 12271880 12756709 13224891 13665717 14069837 14437518 14785091 15145735 15561885 16069781
37343A6069781O11423O89610P05533O36978M85048K72200L1615k04497m11214
37334A8886477n72159o80748p43149p78523q12014q62659r33494j008918j059553
37325A1435260j052417r63894p91104n55740k97348n9173J26308K46430L09322
37316H397644L37030L53149L70235L83585L75105L25167K25558Q5965o9229k10955
37306A0573254l15838l72223l81202l54473l10167k67233k39841k33937k46928
37297G851412k69901k91662l02992k98294k72684k17732j22437J8172J93505L76609
37287F663996N34801O44600P00977P15818P07373O87148O52190N87617M77060
37278A2371580L12519R6704j60483m43779p28986r79190j149042j198948j112031
$$ plain form
37343 16069781 16681204 17370814 18076347 18713325 19198373 19470573 19502188 19297691 18886477
37334 18886477 18314318 17633570 16890421 16111898 15299884 14437225 13503731 12494813 11435260
37325 11435260 10382843 9418949 8627845 8072105 7774757 7715584 7841892 8088322 8397644
37316 8397644 8734674 9087823 9458058 9841643 10216748 10541915 10767473 10853438 10784209 10573254
37306 10573254 10257416 9885193 9503991 9149518 8839351 8572118 8332277 8098340 7851412
37297 7851412 7581511 7289849 6986857 6688563 6415879 6198147 6075710 6093882 6287387 6663996
37287 6663996 7198797 7843397 8544374 9260192 9967565 10654713 11306903 11894520 12371580
37278 12371580 12684099 12780803 12620320 12176541 11447555 10468365 9319323 8120375 7008344
37269G008344r04259o22996l34841j06790J3658J2257r0527k50396m16196n45223
37259C763031o13203o18397n79117n23723m76275m46131m28820m17277m13734
37250g53646m32009m88260n87901p18569q52636r55512r94889r49342q15672o11497
37240h159933l69139j22775J03000K96807M57569N90430P03515Q03092Q86737
37231d810697R39585R38897Q65841P16726N06854K66433L2360j60534k87267l38142
37221a329944l19562k49623j51266m6707M5708J13768J53255J67200J60888J35215
37211a321068Q4434J981j08722k27184l19661l52980l09545j94374l2105J41541
37201b637683K89164L80668M01001L53565K56453J33380M989j15320k20798l07855
$$ plain form
37269 7008344 6104085 5481089 5146248 5039458 5053116 5065373 4974846 4724450 4308254 3763031
37259 3763031 3149828 2531431 1952314 1428591 952316 506185 77365 -339912 -753646
37250 -753646 -1185655 -1673915 -2261816 -2980385 -3833021 -4788533 -5783422 -6732764 -7548436 -8159933
37240 -8159933 -8529072 -8651847 -8548847 -8252040 -7794471 -7204041 -6500526 -5697434 -4810697
37231 -4810697 -3871112 -2932215 -2066374 -1349648 -842794 -576361 -544001 -704535 -991802 -1329944
37221 -1329944 -1649506 -1899129 -2050395 -2097102 -2051394 -1937626 -1784371 -1617171 -1456283 -1321068
37211 -1321068 -1236634 -1234653 -1343375 -1570559 -1890220 -2243200 -2552745 -2747119 -2779224 -2637683
37201 -2637683 -2348519 -1967851 -1566850 -1213285 -956832 -823452 -818463 -933783 -1154581 -1462436
37191a462436l71811m05199m01487l62607l03066k44829k06000j92849k01500
37182d151784k25827k63271l14059l76219m41606m96085n23447n10465m50576
37173g753339l45597k06495n3145Q9361J99529K69814L10945L45767L96143M71275
37163f275742N63668O53344P17069P37865P10440O40811N41807M27574L08484
37154i74680J86982N6814r1031k57073m24576n61371o32679o16862n14574l47275
37144d176325j47971M9661K18537L40837M08776M26086M08921L82068L69082L81637
37134a338691M16247M60883N04891N43111N72205N85751N74365N30572M53926
37125C303260L54040K51195J72587J42422J70207K46588L50392M59853N58196
$$ plain form
37191 -1462436 -1834247 -2239446 -2640933 -3003540 -3306606 -3551435 -3757435 -3950284 -4151784
37182 -4151784 -4377611 -4640882 -4954941 -5331160 -5772766 -6268851 -6792298 -7302763 -7753339
37173 -7753339 -8098936 -8305431 -8358576 -8269215 -8069686 -7799872 -7488927 -7143160 -6747017 -6275742
37163 -6275742 -5712074 -5058730 -4341661 -3603796 -2893356 -2252545 -1710738 -1283164 -974680
37154 -974680 -787698 -730884 -821915 -1078988 -1503564 -2064935 -2697614 -3314476 -3829050 -4176325
37144 -4176325 -4324296 -4274635 -4056098 -3715261 -3306485 -2880399 -2471478 -2089410 -1720328 -1338691
37134 -1338691 -922444 -461561 43330 586441 1158646 1744397 2318762 2849334 3303260
37125 3303260 3657300 3908495 4081082 4223504 4393711 4640299 4990691 5450544 6008740
37116F008740O32656O73391O75518O40479N72957M76302L51709K01586L2377j45815
37106A0119900l20440m75411n89557o39966o11504n06375l45704j62031J1306
37097F480218J48487K37158K82598L06507L36985L93861M79269N78773O69392
37088I913248P28610P42088P09317O44268N69248N05707M67847M60561M79151
37079A5220045N10371N36810N43456N21278M65746L75282K54785J21295L818o5633
37069A8487253o4665J0008J39334K85904M06031M67142M61603M07419L35139K70586
37059B1205754K24731J94644J71169J46504J17688Q6341N7207L7514L6329O2042
37049B2339923J17647J96569K82229L52395L86680L74078L16998K29397J29721
$$ plain form
37116 6008740 6641396 7314787 7990305 8630784 9203741 9680043 10031752 10233338 10265715 10119900
37106 10119900 9799460 9324049 8734492 8094526 7483022 6976647 6630943 6468912 6480218
37097 6480218 6628705 6865863 7148461 7454968 7791953 8185814 8665083 9243856 9913248
37088 9913248 10641858 11383946 12093263 12737531 13306779 13812486 14280333 14740894 15220045
37079 15220045 15730416 16267226 16810682 17331960 17797706 18172988 18427773 18549068 18552886 18487253
37069 18487253 18422588 18432596 18571930 18857834 19263865 19731007 20192610 20600029 20935168 21205754
37059 21205754 21430485 21625129 21796298 21942802 22060490 22146831 22204038 22241552 22277881 22339923
37049 22339923 22457570 22654139 22936368 23288763 23675443 24049521 24366519 24595916 24725637
37040B4725637L2631n6092j39550k25408l19304m18850n11415n77426n97561n60572
37030B1352090m68855l40008k03242r1158l0309l4336j01103k13240l42423m57817
37020A9069599n35894n66054n49181m91722m00295k79864j36022J9784J66455
37011A6296806K76237L25299L04586K22510R9034m1419j72994k70216l14289l03498
37001A6422056k59921k24534k40512l33760n02432p21369r56395j177311j362079
36992A0643743j494323j561388j556593j482435j349844j173630r69044p52914
36984C03572n46424l73443k52524j88100j68514j72920j81608j82752j73358j56972
36974b093043j40943j32764j34272j35669j14578m3221R9379L16817N91037Q84904
$$ plain form
37040 24725637 24758268 24702176 24562626 24337218 24017914 23599064 23087649 22510223 21912662 21352090
37030 21352090 20883235 20543227 20339985 20248827 20218518 20184182 20083079 19869839 19527416 19069599
37020 19069599 18533705 17967651 17418470 16926748 16526453 16246589 16110567 16130351 16296806
37011 16296806 16573043 16898342 17202928 17425438 17524472 17483053 17310059 17039843 16725554 16422056
37001 16422056 16162135 15937601 15697089 15363329 14860897 14139528 13183133 12005822 10643743
36992 10643743 9149420 7588032 6031439 4549004 3199160 2025530 1056486 303572
36984 303572 -242852 -616295 -868819 -1056919 -1225433 -1398353 -1579961 -1762713 -1936071 -2093043
36974 -2093043 -2233986 -2366750 -2501022 -2636691 -2751269 -2794490 -2695111 -2378294 -1787257 -902353
36964i02353J150729J343523J434807J419709J312866J137342R16199O71931M30076
36955H914829K19587O7442q971o395O5080J86783L37303M97002O50205P85281
36945A1708146Q93109R64830R90293R58989Q63971P06689M99530K63522K1926
36936A7871005k07005m13944n97205p57889q94858j002203j069772j086368j044899
36927A0796862r47800q09554o53524n03518l74361k67377j73904q4496K427P8264
36917G063019J28832J41817J12086M2973n5142j67145k75966l66107m26952m53598
36907E743817m44457l98828l18833k15265j10245l0281P435M643k0435m4866n2617
36896D120068l9177r203K9454P2093J21278J86315K77422L97092N33461O60150
$$ plain form
36964 -902353 248376 1591899 3026706 4446415 5759281 6896623 7812822 8484753 8914829
36955 8914829 9134416 9201858 9192887 9186492 9251572 9438355 9775658 10272660 10922865 11708146
36945 11708146 12601255 13566085 14556378 15515367 16379338 17086027 17585557 17849079 17871005
36936 17871005 17664000 17250056 16652851 15894962 15000104 13997901 12928129 11841761 10796862
36927 10796862 9849062 9039508 8385984 7882466 7508105 7240728 7066824 6982328 6984755 7063019
36917 7063019 7191851 7333668 7445754 7488727 7433585 7266440 6990474 6624367 6197415 5743817
36907 5743817 5299360 4900532 4581699 4366434 4256189 4225908 4233343 4237986 4217551 4172685 4120068
36896 4120068 4080891 4071688 4101142 4173235 4294513 4480828 4758250 5155342 5688803 6348953
36886F348953P44415P60551P01267N79838M22054K54526R7471l5526j34831j94059
36876I544659k11983j94010j51260r8102m9868k0571j9410m6892r4011j46684
36866H511868j93071k28224k53157k70914k83985k94236l02873l08930l08239
36857F068239k95355k67244k24831j70493j03864k0135Q7457K22432L80225N46316
36847F222747O98851Q15345Q80738Q93272Q65749Q21955P89546P91459Q38693
36838A3618355R27116J039399J150770J236464J278658J271270J220757J142207
36830B2884996J052129R61644Q73647P84953O90907N88550M76583L53614K17158
36821B8884181O3894j10083l08783n33598p78081j024207j244863j412361j507490
$$ plain form
36886 6348953 7093368 7853919 8555186 9135024 9557078 9811604 9909075 9873549 9738718 9544659
36876 9544659 9332676 9138666 8987406 8889304 8839436 8818865 8799455 8752563 8658552 8511868
36866 8511868 8318797 8090573 7837416 7566502 7282517 6988281 6685408 6376478 6068239
36857 6068239 5772884 5505640 5280809 5110316 5006452 4986317 5073774 5296206 5676431 6222747
36847 6222747 6921598 7736943 8617681 9510953 10376702 11198657 11988203 12779662 13618355
36838 13618355 14545471 15584870 16735640 17972104 19250762 20522032 21742789 22884996
36830 22884996 23937125 24898769 25772416 26557369 27248276 27836826 28313409 28667023 28884181
36821 28884181 28948075 28837992 28529209 27995611 27217530 26193323 24948460 23536099 22028609
36812B2028609j523948j467824j355096j208621j054002r13837q02395p23217
36804A2979669o70605o33810o02048n68436n31256m92474m55202m22244l95571
36795H208023l75330l58361l38730l11373k76021k37478k02149j74634j56786
36786E777161j48178j46137j45687j40310j23117q8012l1660M3699J29352K13588
36776E340699K87646L49020L99422M39468M64364M63939M28249L55969K58619
36767H787395J54975N8680l0177j21795k24849l35967m37356n02938n09359m46682
36757F391927l23151j61390J0570J67129K88779L63068L84892L56474K87430J95571
36747G961299J06472M7933L9323Q2209J59550K44236L11212L46940L53215L45221
$$ plain form
36812 22028609 20504661 19036837 17681741 16473120 15419118 14505281 13702886 12979669
36804 12979669 12309064 11675254 11073206 10504770 9973514 9481040 9025838 8603594 8208023
36795 8208023 7832693 7474332 7135602 6824229 6548208 6310730 6108581 5933947 5777161
36786 5777161 5628983 5482846 5337159 5196849 5073732 4985720 4954060 4997759 5127111 5340699
36776 5340699 5628345 5977365 6376787 6816255 7280619 7744558 8172807 8528776 8787395
36767 8787395 8942370 9001050 8970873 8849078 8624229 8288262 7850906 7347968 6838609 6391927
36757 6391927 6068776 5907386 5917956 6085085 6373864 6736932 7121824 7478298 7765728 7961299
36747 7961299 8067771 8115704 8155027 8237236 8396786 8641022 8952234 9299174 9652389 9997610
36737I997610L44868L71621M33993N25153O24819P06787P47531P31061O49368
36728A5132811N02676L02020P0893j58693l54751m93067n61282n60796n07159
36719A3372652m26031l43816k78131k34767k11702k04416k07764k15201k19130
36710A1031694k13874j99202j80820j66636j61139j62187j62809j56591j42807
36701I485629j27885j22152j33521j62150j99909k35069k58217k64634k52316
36692G729776k18695j59422p0282M8322J86096L20304M19966M57224M20159L18449
36682I451897J77456K4332j24694k68405m15216n73573p44222r17811j078051
36673E531713j208677j300254j352213j368642j352113j301507j215104j094015
$$ plain form
36737 9997610 10342478 10714099 11148092 11673245 12298064 13004851 13752382 14483443 15132811
36728 15132811 15635487 15937507 16008400 15849707 15494956 15001889 14440607 13879811 13372652
36719 13372652 12946621 12602805 12324674 12089907 11878205 11673789 11466025 11250824 11031694
36710 11031694 10817820 10618618 10437798 10271162 10110023 9947836 9785027 9628436 9485629
36701 9485629 9357744 9235592 9102071 8939921 8740012 8504943 8246726 7982092 7729776
36692 7729776 7511081 7351659 7281377 7329699 7515795 7836099 8256065 8713289 9133448 9451897
36682 9451897 9629353 9653685 9528991 9260586 8845370 8271797 7527575 6609764 5531713
36673 5531713 4323036 3022782 1670569 301927 -1050186 -2351693 -3566797 -4660812
36665d660812r41077p56243n34148k68095M0855L75981P04861R88677J195150
36656c854851J306515J319223J240024J084641Q79246O59572M64030L23315K52311
36647C674026K48970L01046L96664N31097P03345R04609J109297J278448J374329
36638A0521831J375241J281096J109944Q91677O61987M54633K91228J73824Q7187
36629A6848648J0786o7892j47966k19221k69923k92316k84579k50881k00412j44881
36619A4981363r5051n8646m1058m6823p8421j32185j95654k50775k81884k82417
36609A3518449k55963k13117j68112j36315j30613j56609k09729k76633l39595
36600A1631763l81694l92671l75331l48487l41389l79941m72569o04431p42862
$$ plain form
36665 -4660812 -5601889 -6358132 -6892280 -7160375 -7119520 -6743539 -6038678 -5050001 -3854851
36656 -3854851 -2548336 -1229113 10911 1095552 1974798 2634370 3098400 3421715 3674026
36647 3674026 3922996 4224042 4620706 5151803 5855148 6759757 7869054 9147502 10521831
36638 10521831 11897072 13178168 14288112 15179789 15841776 16296409 16587637 16761461 16848648
36629 16848648 16859434 16791542 16643576 16424355 16154432 15862116 15577537 15326656 15126244 14981363
36619 14981363 14886312 14827666 14786608 14739785 14661364 14529179 14333525 14082750 13800866 13518449
36609 13518449 13262486 13049369 12881257 12744942 12614329 12457720 12247991 11971358 11631763
36600 11631763 11250069 10857398 10482067 10133580 9792191 9412250 8939681 8335250 7592388
36591G592388q50262q97843q74150p85452o49892m90879l33131j99450j04972
36582B406357n1069k4846o295K2494P2566J47948K46013L57160M66804N61122
36572D198254O32916O82962P16341P37047P44563P34115P00573O43891N72571
36563A0363233N02648M52965M39479M70301N41774O36901P28436P86763P88880
36554A5711380P23959N94231M12850K00390j9753k26535m05097n47701o52292
36545A5791432p20565p56691p66516p56708p33994p04738o74758o48916o30358
36536I398188o19558o13322o03969n79479n26053m33615l02233j45008J5875J58300
36526E749126K68377L42151L81785L91893L79844L57611L40111L39068L56955
$$ plain form
36591 7592388 6742126 5844283 4970133 4184681 3534789 3043910 2710779 2511329 2406357
36582 2406357 2355288 2330442 2324147 2346641 2419207 2567155 2813168 3170328 3637132 4198254
36572 4198254 4831170 5514132 6230473 6967520 7712083 8446198 9146771 9790662 10363233
36563 10363233 10865881 11318846 11758325 12228626 12770400 13407301 14135737 14922500 15711380
36554 15711380 16435339 17029570 17442420 17642810 17623057 17396522 16991425 16443724 15791432
36545 15791432 15070867 14314176 13547660 12790952 12056958 11352220 10677462 10028546 9398188
36536 9398188 8778630 8165308 7561339 6981860 6455807 6022192 5719959 5574951 5590826 5749126
36526 5749126 6017503 6359654 6741439 7133332 7513176 7870787 8210898 8549966 8906921
36517H906921L85782M11168M18959M01910L64685L24163L02265L13503L55585
36508A2184941M10806M56969M78096M66721M19172L32142K05133M4985j33851
36499A4865114l14093m80657o21974p28905p94267q13677p86367p15427o08071
36490I001676m75467l30915j86608n1491O8216J67512K42585K92124L17163L18499
36480I363294K94720K44418J71508Q8230J2013m1655o4467n5295j6612M8855J39194
36469A0184203K52331L84034N26152O66470P90801Q86208R43234R56551R25507
36460A6515491Q55784P61348O63997N88746N56163N75070O38986P27723Q13337
36451B2696645Q68657Q75765Q30924P43002O26373M93580L52973K11236P5691
$$ plain form
36517 8906921 9292703 9703871 10122830 10524740 10889425 11213588 11515853 11829356 12184941
36508 12184941 12595747 13052716 13530812 13997533 14416705 14748847 14953980 14998965 14865114
36499 14865114 14551021 14070364 13448390 12719485 11925218 11111541 10325174 9609747 9001676
36490 9001676 8526209 8195294 8008686 7957195 8025411 8192923 8435508 8727632 9044795 9363294
36480 9363294 9658014 9902432 10073940 10162170 10174183 10132528 10068061 10012766 9996154 10045009 10184203
36469 10184203 10436534 10820568 11346720 12013190 12803991 13690199 14633433 15589984 16515491
36460 16515491 17371275 18132623 18796620 19385366 19941529 20516599 21155585 21883308 22696645
36451 22696645 23565302 24441067 25271991 26014993 26641366 27134946 27487919 27699155 27774846
36442B7774846m7731j59625k69989l94394n44009p15353q88000j034192j134779
36433B2586774j189161j210567j210944j189260j133593j034365q96493p40327
36425A3982064n91438m67731l72790k98519k33197j68260r9621k4754N9568J55489
36415A1940811K59897L62954M52106N18762N61903N86089N96792N97784N91647
36406A6468745N80300N62615N30939M71213L68892K17171K1799k00054m24725
36397A8596895o27612p88152q93967r42613r39395q92505q09653o99059n72845
36388A1431094m47452l38101k50656j78279j07038k6358O4221J56356K38850L02598
36378A0845235L43185L62692L70230L78457L96905M27501M66264N08841N53991
$$ plain form
36442 27774846 27727115 27567490 27297501 26903107 26359098 25643745 24755745 23721553 22586774
36433 22586774 21397613 20187046 18976102 17786842 16653249 15618884 14722391 13982064
36425 13982064 13390626 12922895 12550105 12251586 12018389 11850129 11750508 11725754 11785322 11940811
36415 11940811 12200708 12563662 13015768 13534530 14096433 14682522 15279314 15877098 16468745
36406 16468745 17049045 17611660 18142599 18613812 18982704 19199875 19221674 19021620 18596895
36397 18596895 17969283 17181131 16287164 15344551 14405156 13512651 12702998 12003939 11431094
36388 11431094 10983642 10645541 10394885 10216606 10109568 10083210 10147431 10303787 10542637 10845235
36378 10845235 11188420 11551112 11921342 12299799 12696704 13124205 13590469 14099310 14653301
36369A4653301O02232O51707O95069P19775P11509O58299N52560L90838J73950
36360A9809240q9867l79959o60717q86219j013403j019525r14194p37049n41147
36351A3567160l72469k57061j99091j85996j96712k11047k16956k11537j95848
36342A1520443j68841j25516n9432L3056J48881K76151L95715M86866N34529N34368
36332A3576220M94046M30801L66334L20834L08465L34960L96623M80957N70750
36323A7279990O50563P10266P41961P34412O73299N49305L66848J45027q9962
36314B1761709l13965n08448o57846p46438p60740o97170n68415m02556k35429
36305A6870702j01045k3146q429m3311r8046j38434j39568r4308j3361Q1333J66518
$$ plain form
36369 14653301 15255533 15907240 16602309 17322084 18033593 18691892 19244452 19635290 19809240
36360 19809240 19719373 19339414 18678697 17792478 16779075 15759550 14845356 14108307 13567160
36351 13567160 13194691 12937630 12738539 12552543 12355831 12144784 11927828 11716291 11520443
36342 11520443 11351602 11226086 11166654 11199710 11348591 11624742 12020457 12507323 13041852 13576220
36332 13576220 14070266 14501067 14867401 15188235 15496700 15831660 16228283 16709240 17279990
36323 17279990 17930553 18640819 19382780 20117192 20790491 21339796 21706644 21851671 21761709
36314 21761709 21447744 20939296 20281450 19535012 18774272 18077102 17508687 17106131 16870702
36305 16870702 16769657 16746511 16738082 16694771 16596725 16458291 16318723 16224415 16211054 16292387 16458905
36294A6458905K26835K59658K73746K83409L01635L34832L80982M32282M81289
36285A9433573N26098N69333O10199O35319O16642N21088L28990N1042k68088
36276B3024196n64631p82319q95591r16296q81891q34527q03858q00506q18091
36267A5726486q38241q36098p87650o78867n12505l08322r7478Q4447K02936K29708
36257A2184416J49588l1957k84929n59502q00545r66363j041228j034503r69277
36248F645700q70064p56271o40477n28118m18466l08054j94583p7550M4374J74656
36238C071147L15407M61211N96165O98324P50200P48800P07284O45681N76793
36229H571012M98194L96186K57658Q0386j24044l33904n23753o71032p61522p92104
$$ plain form
36294 16458905 16685740 16945398 17219144 17502553 17804188 18139020 18520002 18952284 19433573
36285 19433573 19959671 20529004 21139203 21774522 22391164 22912252 23241242 23292284 23024196
36276 23024196 22459565 21677246 20781655 19865359 18983468 18148941 17345083 16544577 15726486
36267 15726486 14888245 14052147 13264497 12585630 12073125 11764803 11667325 11751772 11954708 12184416
36257 12184416 12334004 12302047 12017118 11457616 10657071 9690708 8649480 7614977 6645700
36248 6645700 5775636 5019365 4378888 3850770 3432304 3124250 2929667 2852117 2896491 3071147
36238 3071147 3386554 3847765 4443930 5142254 5892454 6641254 7348538 7994219 8571012
36229 8571012 9069206 9465392 9723050 9803436 9679392 9345488 8821735 8150703 7389181 6597077
36219F597077p69698p07266o19784n22240m28597l49258k87024k35398j83262
36210B494550j24125o2090p824L3056O8685J17767J95899L01576M12041M91481
36200C921016N06283M39400K97830J11665p3916k11455k66383k30340j25512N311
36190D373899J19910J96783K41464K76096L20992L80987M44186M91735N10386
36181G356438M98652M62989M09226L38107K48423J42394K6333r3253k11706l22956
36171H854647m15734m76333m97660m85659m55043m16248l64857k83625j56310
36162E303178J7498K17413M08906N55075O26651O08591N04080L34988J36111n6379
36152H656112k16675l34624m12236m54769m62484m28007l40742j95804k354K14019
$$ plain form
36219 6597077 5827379 5120113 4500329 3978089 3549492 3200234 2913210 2677812 2494550
36210 2494550 2370425 2308335 2300511 2333567 2402252 2520019 2715918 3017494 3429535 3921016
36200 3921016 4427299 4866699 5164529 5276194 5202278 4990823 4724440 4494100 4368588 4373899
36190 4373899 4493809 4690592 4932056 5208152 5529144 5910131 6354317 6846052 7356438
36181 7356438 7855090 8318079 8727305 9065412 9313835 9456229 9482562 9389309 9177603 8854647
36171 8854647 8438913 7962580 7464920 6979261 6524218 6107970 5743113 5459488 5303178
36162 5303178 5320676 5538089 5946995 6502070 7128721 7737312 8241392 8576380 8712491 8656112
36152 8656112 8439437 8104813 7692577 7237808 6775324 6347317 6006575 5810771 5808417 6022436
36142F022436M17450N74718O68805P05012P04645O88970O63444O12724N09247
36133A1567451L29392O7918k55646o00411r15729j156680j296956j333762j283523
36124E122054j172118j024858q60051o87822n13691l44140j89942o4149K4132
36115B89415P5210R8448J06068J06451J03357J01746J13945J58408K49642L86259
36105A788949N46696O96822Q04786Q53894Q46780Q00767P38540O78002O24132
36096H379368N66473M85640L66781K10771L4552j38448k88368m02225m71952m92824
36086H249768m64701l93886k93039j78215o3708M3082J43294K43128L47707M56759
36076H090189N63587O54908P09994P01436O01415L93997Q8281k75638o33722r16610
$$ plain form
36142 6022436 6439886 7014604 7683409 8388421 9093066 9782036 10445480 11058204 11567451
36133 11567451 11896843 11964761 11709115 11108704 10192975 9036295 7739339 6405577 5122054
36124 5122054 3949936 2925078 2065027 1377205 863514 519374 329432 265283 289415
36115 289415 364625 463073 569141 675592 778949 880695 994640 1153048 1402690 1788949
36105 1788949 2335645 3032467 3837253 4691147 5537927 6338694 7077234 7755236 8379368
36096 8379368 8945841 9431481 9798262 10009033 10043585 9905137 9616769 9214544 8742592 8249768
36086 8249768 7785067 7391181 7098142 6919927 6856219 6899301 7042595 7285723 7633430 8090189
36076 8090189 8653776 9308684 10018678 10720114 11321529 11715526 11803807 11528169 10894447 9977837
36066I977837j071352j076067r42381p07046m17958j20443J51250L75623N41741
36057F711204O47842P01639P18720P16629P07777O96155O79045O51061O08458
36048A2838530N53153M94591M46097M16170M01272L87546L61513L20997K77107
36039A6496976K45567K34571K38348K40687K25538J87160J32947P7041K9672r384
36029A8099123m8376r5415j52416k15464k79033l39192l94742m47998n05336n75193
36019A5045958o63008p66528q75297r74306j048866j088302j087716j047483r70053
36010F524399q55842p01947n06076k73527k1783K21293M25494N68474O43284O59693
36000F683462O39078O05869N79763N71077N79241N94391O02945N96329N77721
$$ plain form
36066 9977837 8906485 7830418 6888037 6180991 5763033 5642590 5793840 6169463 6711204
36057 6711204 7359046 8060685 8779405 9496034 10203811 10899966 11579011 12230072 12838530
36048 12838530 13391683 13886274 14332371 14748541 15149813 15537359 15898872 16219869 16496976
36039 16496976 16742543 16977114 17215462 17456149 17681687 17868847 18001794 18078835 18108507 18099123
36029 18099123 18050747 17955332 17802916 17587452 17308419 16969227 16574485 16126487 15621151 15045958
36019 15045958 14382950 13616422 12741125 11766819 10717953 9629651 8541935 7494452 6524399
36010 6524399 5668557 4966610 4460534 4187007 4165224 4386517 4812011 5380485 6023769 6683462
36000 6683462 7322540 7928409 8508172 9079249 9658490 10252881 10855826 11452155 12029876
35991A2029876N60535N58045N71935N89617N93148N72695N33874M93513M68002
35982A6971240M63473M74267M88436M94456M84953M57799M16529L70084L30097
35973B0951334L05225K95075K88336K68372K24437J61316R9534O4897P4278J26587
35963B2859391K03217K76149L19358L18527K74970K02307J18877M0517k3520p1234
35953B4518559j05383j28736j40252j35225j08576n7174K0126J21833K40780L62267
35943B4588219M67864N43599N86287O03593O08544O12096O17367O18517O05257
35934B9851343N70304N14508M46405L77639L18480K76239K56402K64073L03446
35925C3178839L75335M75436N95398P25277Q53930R67360J049359J087196J078799
$$ plain form
35991 12029876 12590411 13148456 13720391 14310008 14903156 15475851 16009725 16503238 16971240
35982 16971240 17434713 17908980 18397416 18891872 19376825 19834624 20251153 20621237 20951334
35973 20951334 21256559 21551634 21839970 22108342 22332779 22494095 22593629 22658526 22732804 22859391
35963 22859391 23062608 23338757 23658115 23976642 24251612 24453919 24572796 24613313 24589793 24518559
35953 24518559 24413176 24284440 24144188 24008963 23900387 23843213 23863339 23985172 24225952 24588219
35943 24588219 25056083 25599682 26185969 26789562 27398106 28010202 28627569 29246086 29851343
35934 29851343 30421647 30936155 31382560 31760199 32078679 32354918 32611320 32875393 33178839
35925 33178839 33554174 34029610 34625008 35350285 36204215 37171575 38220934 39308130 40386929
35916D0386929J034360R69769Q96284Q13572P10676N74674M02415K07332J5098
35907D6011109j49929k76614l66908m24584m44588m13396l19153j61398M7552
35898D3502091K88520N41766P88484J008073J176399J270406J279322J215472
35890E1070533J114800J023663R79236R95814J063469J156116J242337J295509
35882E9941477J302265J266728J206718J141783J080245J015055R32590Q27895
35874F8714756P13970O17088N61715N56862N93643O53884P21762P90367Q60790
35865G4784837R37086J022377J119150J231779J365935J521905J686499J832626
35857H5502194J930011J960040J923230J835027J715586J582024J446287J316078
$$ plain form
35916 40386929 41421289 42391058 43287342 44100914 44811590 45386264 45788679 45996011 46011109
35907 46011109 45861180 45584566 45217658 44793074 44348486 43935090 43615937 43454539 43502091
35898 43502091 43790611 44332377 45120861 46128934 47305333 48575739 49855061 51070533
35890 51070533 52185333 53208996 54188232 55184046 56247515 57403631 58645968 59941477
35882 59941477 61243742 62510470 63717188 64858971 65939216 66954271 67886861 68714756
35874 68714756 69428726 70045814 70607529 71164391 71758034 72411918 73133680 73924047 74784837
35865 74784837 75721923 76744300 77863450 79095229 80461164 81983069 83669568 85502194
35857 85502194 87432205 89392245 91315475 93150502 94866088 96448112 97894399 99210477
35849I9210477J195561J085052R81026Q77758P70700O59772N49781M46763L52418
35840A06129308K60705J59005L3043j27112l22314n42511p68567r77116j146395
35831A02698046j261024j314826j311610j263805j189454j108877j042034j005982
35823I3200434j011519j059977j142257j241146j335766j407331j446062j457143
35815H3099233j460636j482066j537584j622796j712035j767678j754698j655211
35807G0106529j477945j257690j042985q76962p80939p48986p55669p72834p86479
35798F1606040q03720q45330r29525j059287j221279j393987j556669j693723
35790E2102520j794762j853122j864517j826726j740512j611150j449654j273155
$$ plain form
35849 99210477 100406038 101491090 102472116 103349874 104120574 104780346 105330127 105776890 106129308
35840 106129308 106390013 106549018 106582061 106454949 106132635 105590124 104821557 103844441 102698046
35831 102698046 101437022 100122196 98810586 97546781 96357327 95248450 94206416 93200434
35823 93200434 92188915 91128938 89986681 88745535 87409769 86002438 84556376 83099233
35815 83099233 81638597 80156531 78618947 76996151 75284116 73516438 71761740 70106529
35807 70106529 68628584 67370894 66327909 65450947 64670008 63921022 63165353 62392519 61606040
35798 61606040 60802320 59956990 59027465 57968178 56746899 55352912 53796243 52102520
35790 52102520 50307758 48454636 46590119 44763393 43022881 41411731 39962077 38688922
35782C8688922j103913r65708q77929q51044q87067r83176j132534j320340j520745
35773B9046466j700810j830023j888364j868887j776684j626989j441846j244308
35765A5668555j051728q72033p05034n47611l99382k65381j54452p4435k6635
35756A1571864j637K0803O4307J41191K39036L21024L43878K82123J41631m5214
35746A3079006k36618l98946n16274n89014o24250o25543n90720n18993m19015
35737H559633l08527k05442j19470n2077l438K1991J7865j5377o4062j04836j17640
35726G608620r8409o1254k9032k1037m7168j09977k08238l36255m79576o12552
35716E605122p01781p14680o29315m42394j73689J34996M28594O54440P78707
$$ plain form
35782 38688922 37585009 36619301 35741372 34890328 34003261 33020085 31887551 30567211 29046466
35773 29046466 27345656 25515633 23627269 21758382 19981698 18354709 16912863 15668555
35765 15668555 14616827 13744794 13039760 12492149 12092767 11827386 11672934 11598499 11571864
35756 11571864 11570227 11591030 11655337 11796528 12035564 12356588 12700466 12982589 13124220 13079006
35746 13079006 12842388 12443442 11927168 11338154 10713904 10088361 9497641 8978648 8559633
35737 8559633 8251106 8045664 7926194 7874117 7870679 7892670 7910535 7895158 7831096 7726260 7608620
35726 7608620 7510211 7448957 7419925 7398888 7351720 7241743 7033505 6697250 6217674 5605122
35716 5605122 4903341 4188661 3559346 3116952 2943263 3078259 3506853 4161293 4940000
35707D940000P95241P22279N90146M27689K54501Q0776q8895k53094m14319n79441
35697F474883p55879r44776j136947j314778j456950j541319j546260j454364
35689c676390j259236r70493o12432k17991J76201N30985Q05989R66932R98729
35680c257706R15902P60246N84171M29784L16558K42432J92500J47665R0703J1394
35670D33649q9678k01326l06265l86190m24229m06476l26129j89650j9457J51215
$$ plain form
35707 4940000 5735241 6457520 7047666 7475355 7729856 7810632 7721737 7468643 7054324 6474883
35697 6474883 5719004 4774228 3637281 2322503 865553 -675766 -2222026 -3676390
35689 -3676390 -4935626 -5906119 -6518551 -6736542 -6560341 -6029356 -5223367 -4256435 -3257706
35680 -3257706 -2341804 -1581558 -997387 -567603 -251045 -8613 183887 331552 422255 433649
35670 433649 343971 142645 -163620 -549810 -974039 -1380515 -1706644 -1896294 -1915751 -1764536
$$ [...]
##END NTUPLES=NMR SPECTRUM
##END=
