##TITLE=31Pdec_45BnP0107
 CDCl3, 24 sc
 4.7.2022
##JCAMPDX= 6.0         $$ Bruker NMR JCAMP-DX V2.0
##DATA TYPE= NMR SPECTRUM
##DATA CLASS= NTUPLES
##ORIGIN= UXNMR, Bruker Analytische Messtechnik GmbH
##OWNER= root
$$ XWIN-NMR		Version 3.5
$$ Mon Jul  4 14:05:11 2022 Russian Standard Time (UT+4h)  she@DPX200
##.OBSERVE FREQUENCY= 81.013821
##.OBSERVE NUCLEUS= ^31P
##.ACQUISITION MODE= SIMULTANEOUS
##.ACQUISITION SCHEME= undefined
##.AVERAGES= 24
##.DIGITISER RES= 16
##SPECTROMETER/DATA SYSTEM= spect
##.PULSE SEQUENCE= zgpg30
##.SOLVENT NAME= DMSO
##.SHIFT REFERENCE= (INTERNAL, DMSO, 0, 248.564)
##AUDIT TRAIL= $$ (NUMBER, WHEN, WHO, WHERE, WHAT)
$$ ##TITLE= Audit trail, XWIN-NMR		Version 3.5
$$ ##JCAMPDX= 5.01
$$ ##ORIGIN= Bruker BioSpin GmbH
$$ ##OWNER= she
$$ F:/spectra/data/she/nmr/P31/1/pdata/1/auditp.txt
$$ ##AUDIT TRAIL=  $$ (NUMBER, WHEN, WHO, WHERE, WHAT)
(   1,<2022-07-04 14:02:49.56 +0400>,<she>,<DPX200>,
      <created by zg, POWCHK disabled, PULCHK disabled
       configuration hash MD5:
       00 E9 B6 7A A2 85 ED C7 34 08 36 98 17 FE 4E 26
       data hash MD5: 32K
       2A C0 DF FE 65 E3 92 7B 4E ED 7D 5C E4 26 52 9A>)
(   2,<2022-07-04 14:02:53.68 +0400>,<she>,<DPX200>,
      <Start of raw data processing
       efp BC_mod = 2 LB = 1 FT_mod = 6 PKNL = 1 PHC0 = -9703.67 PHC1 = -342.3441 SI = 64K 
       data hash MD5: 64K
       D2 18 B8 83 23 0D C7 43 23 E1 2C D6 44 34 E3 A8>)
(   3,<2022-07-04 14:03:13.85 +0400>,<she>,<DPX200>,
      <pk PHC0 = -178.7432 PHC1 = 359.4001 
       data hash MD5: 64K
       12 51 6F BC 8C 6A A7 4D 85 67 E9 56 3E 48 9D C8>)
$$ ##END=
$$ 
$$ hash MD5
$$ F5 24 A9 D1 53 88 7C 0E C6 9F 8E D6 43 E5 E2 AE
##$RELAX= 
##$RELAX= 
##$RELAX= 
##$RELAX= 
##$RELAX= 
##$RELAX= 
##$RELAX= 
##$RELAX= 
$$ Bruker specific parameters
$$ --------------------------
##$DU= <F:/spectra>
##$EXPNO= 1
##$NAME= <P31>
##$PROCNO= 1
##$TYPE= <nmr>
##$USER= <she>
##$AMP= (0..31)
100 100 100 100 100 100 100 100 100 100 100 100 100 100 100 100 100 100 
100 100 100 100 100 100 100 100 100 100 100 100 100 100 
##$AQSEQ= 0
##$AQ_mod= 1
##$AUNM= <au_zg>
##$AUTOPOS= <>
##$BF1= 81.014009
##$BF2= 200.13
##$BF3= 200.13
##$BF4= 200.13
##$BF5= 200.13
##$BF6= 200.13
##$BF7= 200.13
##$BF8= 200.13
##$BYTORDA= 1
##$CFDGTYP= 0
##$CFRGTYP= 5
##$CHEMSTR= <none>
##$CNST= (0..31)
1 1 145 1 1 1 1 1 1 1 1 1 1 1 1 1 1 1 1 1 1 1 1 1 1 1 1 1 1 1 1 1 
##$CPDPRG= <waltz16>
##$CPDPRG1= <>
##$CPDPRG2= <waltz16>
##$CPDPRG3= <>
##$CPDPRG4= <mlev>
##$CPDPRG5= <mlev>
##$CPDPRG6= <mlev>
##$CPDPRG7= <mlev>
##$CPDPRG8= <mlev>
##$CPDPRGB= <>
##$CPDPRGT= <>
##$D= (0..31)
0 1 0 0 0 0 0 0 0 0 0 0.03 2e-05 3e-06 0 0 0 0 0 0 0 0 0 0 0 0 0 0 0 0 
0 0 
##$DATE= 1656928968
##$DBL= (0..7)
120 120 120 11 120 120 24 19 
##$DBP= (0..7)
150 150 150 150 150 150 150 150 
##$DBP07= 0
##$DBPNAM0= <>
##$DBPNAM1= <>
##$DBPNAM2= <>
##$DBPNAM3= <>
##$DBPNAM4= <>
##$DBPNAM5= <>
##$DBPNAM6= <>
##$DBPNAM7= <>
##$DBPOAL= (0..7)
0.5 0.5 0.5 0.5 0.5 0.5 0.5 0.5 
##$DBPOFFS= (0..7)
$$ [...]
##$SUBNAM2= <"">
##$SUBNAM3= <"">
##$SUBNAM4= <"">
##$SUBNAM5= <"">
##$SUBNAM6= <"">
##$SUBNAM7= <"">
##$SUBNAM8= <"">
##$SUBNAM9= <"">
##$SW= 501.771253377433
##$SWIBOX= (0..15)
0 1 3 0 0 0 0 0 0 0 0 0 0 0 0 0 
##$SW_h= 40650.406504065
##$TD= 32768
##$TD0= 1
##$TE= 0
##$TE2= 300
##$TE3= 300
##$TEG= 300
##$TL= (0..7)
0 120 53 12 22 120 120 120 
##$TP= (0..7)
150 150 150 150 150 150 150 150 
##$TP07= 0
##$TPNAME0= <>
##$TPNAME1= <>
##$TPNAME2= <>
##$TPNAME3= <>
##$TPNAME4= <>
##$TPNAME5= <>
##$TPNAME6= <>
##$TPNAME7= <>
##$TPOAL= (0..7)
0.5 0.5 0.5 0.5 0.5 0.5 0.5 0.5 
##$TPOFFS= (0..7)
0 0 0 0 0 0 0 0 
##$TUNHIN= 0
##$TUNHOUT= 0
##$TUNXOUT= 0
##$USERA1= <user>
##$USERA2= <user>
##$USERA3= <user>
##$USERA4= <user>
##$USERA5= <user>
##$V9= 5
##$VALIST= <valist>
##$VCLIST= <CCCCCCCCCCCCCCC>
##$VD= 0
##$VDLIST= <DDDDDDDDDDDDDDD>
##$VPLIST= <PPPPPPPPPPPPPPP>
##$VTLIST= <TTTTTTTTTTTTTTT>
##$WBST= 1024
##$WBSW= 4
##$XGAIN= (0..3)
0 0 0 0 
##$XL= 0
##$YL= 0
##$YMAX_a= 9049
##$YMIN_a= -10523
##$ZGOPTNS= <>
##$ZL1= 120
##$ZL2= 120
##$ZL3= 120
##$ZL4= 120
##$ABSF1= 0
##$ABSF2= 0
##$ABSG= 0
##$ABSL= 0
##$ALPHA= 0
##$AQORDER= 0
##$ASSFAC= 0
##$ASSFACI= 0
##$ASSFACX= 0
##$ASSWID= 0
##$AUNMP= <proc_1d>
##$AZFE= 0.1
##$AZFW= 0.5
##$BCFW= 0
##$BC_mod= 2
##$BYTORDP= 0
##$COROFFS= 0
##$CY= -3
##$DATMOD= 1
##$DC= 0
##$DFILT= <>
##$DTYPP= 0
##$F1P= 0
##$F2P= 0
##$FCOR= 1
##$FTSIZE= 65536
##$FT_mod= 6
##$GAMMA= 0
##$GB= 0
##$INTBC= 1
##$INTSCL= 5.30512e-09
##$ISEN= 30
##$LB= 1
##$LEV0= 0
##$LPBIN= 0
##$MAXI= 10000
##$MC2= 0
##$MEAN= 0
##$ME_mod= 0
##$MI= 50
##$NCOEF= 0
##$NC_proc= -8
##$NLEV= 6
##$NOISF1= 182.463
##$NOISF2= 159.3651
##$NSP= 0
##$NTH_PI= 0
##$NZP= 0
##$OFFSET= 248.5645
##$PC= 4
##$PHC0= -9882.413
##$PHC1= 17.056
##$PH_mod= 1
##$PKNL= yes
##$PPARMOD= 0
##$PSCAL= 0
##$PSIGN= 0
##$REVERSE= no
##$SF= 81.014009
##$SI= 65536
##$SIGF1= 159.3651
##$SIGF2= -187.1042
##$SINO= 113.3802
##$SIOLD= 16384
##$SREGLST= <1H.CDCl3>
##$SSB= 0
##$STSI= 65536
##$STSR= 0
##$SW_p= 40650.406504065
##$SYMM= 0
##$S_DEV= 0
##$TDeff= 32768
##$TDoff= 0
##$TI= <>
##$TILT= no
##$TM1= 0
##$TM2= 0
##$TOPLEV= 0
##$USERP1= <user>
##$USERP2= <user>
##$USERP3= <user>
##$USERP4= <user>
##$USERP5= <user>
##$WDW= 1
##$XDIM= 65536
##$YMAX_p= 495912464
##$YMIN_p= -282079452
$$ End of Bruker specific parameters
$$ ---------------------------------
##NTUPLES= NMR SPECTRUM
##VAR_NAME=  FREQUENCY,     SPECTRUM/REAL,   SPECTRUM/IMAG
##SYMBOL=    X,             R,               I
##VAR_TYPE=  INDEPENDENT,   DEPENDENT,       DEPENDENT
##VAR_FORM=  AFFN,          ASDF,            ASDF
##VAR_DIM=   65536,         65536,           65536
##UNITS=     HZ,            ARBITRARY UNITS, ARBITRARY UNITS
##FACTOR=    0.620285442955139, 1,           1
##FIRST=     20137.2065510759, 0,            0
##LAST=      -20513.1999529892, 0,           0
##MIN=       -20513.1999529892, -282079452,  0
##MAX=       20137.2065510759, 495912464,    0
$$ Real data points
##PAGE= N=1
##DATA TABLE= (X++(R..R)), XYDATA
$$ [...]
40737E252881P47006o74936p82923k390126m361110l463437j26855K027865J758739
$$ 5252881 5999887 5324951 4542028 2151902 -2209208 -5672645 -5799500 -3771635 -2012896
40728b012896J383945K179887K267229L77177j430436j130164m19087j827011
$$ -2012896 -628951 1550936 3818165 4195342 2764906 1634742 1215655 -611356
40720f11356l618353j753607L072582N012549J403989k869106k447462R82692
$$ -611356 -4229709 -5983316 -2910734 2101815 3505804 636698 -1810764 -828072
40712h28072K430417J385406M78571p93583m285839o815727l306632L764082O161709
$$ -828072 1602345 2987751 3466322 2672739 -1613100 -8428827 -11735459 -7971377 -1809668
40703a809668K354702k16832K211828L736689j44891m169146k481719J358386
$$ -1809668 545034 328202 2540030 6276719 6131828 1962682 -519037 839349
40695H39349J266072q95499l03089R73992j213374l065396J355619P357666M904542
$$ 839349 2105421 1209922 906833 1880825 667451 -2397945 -1042326 6315340 11219882
40686A1219882m151338o976177K71098O067428J794144n220320m310122K185536
$$ 11219882 7068544 92367 363465 6430893 8225037 3004717 -1305405 880131
40678H80131M383891L62640l389490l469035k457234j726313O10783M239232N610799
$$ 880131 5264022 5626662 2237172 -1231863 -3689097 -5415410 -4804627 -565395 5045404
40669E045404L524716Q54531k79947q30003j375334m87125J842765K576773l14248
$$ 5045404 8570120 9424651 9144704 8314701 6939367 6452242 8295007 10871780 10557532
40660A0557532m347162n179506j693700K880308M259176J070229l562589m457065
$$ 10557532 6210370 1030864 -662836 2217472 6476648 7546877 3984288 -472777
40652d72777N3862N075579M072906k567667o937268l579187K855703L659706j954404
$$ -472777 -418915 4656664 8729570 6161903 -775365 -4354552 -1498849 2160857 206453
40643B06453n976103l046535K555068M011863J541107L87301K102197L195910
$$ 206453 -5769650 -8816185 -6261117 -2249254 -708147 -320846 1781351 4977261
40635D977261J518588j117143k787366l352360k220141J059912L466947J121357
$$ 4977261 6495849 5378706 2591340 -761020 -2981161 -1921249 1545698 2667055
40627B667055l609323l675124J701161M351000m44719n631712k852842M355641
$$ 2667055 -942268 -4617392 -2916231 1434769 990050 -4641662 -7494504 -3138863
40619c138863O095768J202341k449921j279261m8123j689304k174270J286463
$$ -3138863 2956905 4159246 1709325 430064 381941 -1307363 -3481633 -2195170
40611b195170M430030K844494q41758j450087R95398K551547J673079R6642r18979
$$ -2195170 2234860 5079354 4237596 2787509 3782907 6334454 8007533 8104175 7185196
40602G185196j739838k548611k858425k436270j466650m61080k99748j017671
$$ 7185196 5445358 2896747 38322 -2397948 -3864598 -4325678 -4625426 -5643097
40594e643097q17833J490204L557113K247444q99105j189300J729647K870377
$$ -5643097 -6460930 -4970726 -1413613 833831 -65274 -1254574 475073 3345450
40586C345450N1903k267248m11238K262225J085301j968244j687871J576979K677794
$$ 3345450 3397353 1130105 718867 2981092 4066393 2098149 410278 1987257 4665051
40577D665051L46568r58092J272570L396408J428053k848430m692326l024125
$$ 4665051 5011619 4053527 5326097 8722505 10150558 7302128 2609802 -414323
40569d14323r82670q00323j234281n38944N78671N98306J56578R80740K396433
$$ -414323 -1396993 -2197316 -3431597 -3970541 -3391870 -2793564 -2636986 -1656246 740187
40560G40187J741982j131050k743670j115092P92714l85240k686882j523201L006724
$$ 740187 2482169 1351119 -1392551 -2507643 -1714929 -2100169 -4787051 -6310252 -3303528
40551c303528N748792L592992q03288l142840k220913L27679K333707K315236
$$ -3303528 2445264 6038256 5234968 2092128 -128785 198894 2532601 4847837
40543D847837N47904p47836j79745M86016p39792k088913p00924J817610J260898
$$ 4847837 5395741 4647905 4468160 4954176 4214384 2125471 1424547 3242157 4503055
40534D503055k062311l341681q87632J616088J568087Q19517J077290J202021
$$ 4503055 2440744 -900937 -1788569 -172481 1395606 2215123 3292413 4494434
40526D494434Q13610J299938J572654j312494n394868m466478J610946M611889
$$ 4494434 5308044 6607982 8180636 6868142 1473274 -2993204 -1382258 3229631
40518C229631K56468m594362k777449K159140K885773M3014j142796q88456k496735
$$ 3229631 3486099 -1108263 -3885712 -1726572 1159201 1202215 59419 -829037 -3325772
40509c325772l838741o45741M249208M370701O21446n03485J477180J070212j868610
$$ -3325772 -7164513 -7810254 -3561046 809655 1431101 927616 2404796 3475008 1606398
40500A606398j422279K469181K152188m336823q154015l184255M049200M536490
$$ 1606398 184119 2653300 4805488 468665 -7685350 -10869605 -6820405 -2283915
40492b283915k85392l035427k233226j672927j640568R97518N246053N925708
$$ -2283915 -2569307 -5604734 -7837960 -9510887 -11151455 -10153937 -4907884 1017824
40484A017824J762186k232442j922990P34790J542583J4934q58902O69149K734042
$$ 1017824 2780010 547568 -1375422 -640632 901951 916885 57983 727132 3461174
40475C461174K309110r26197l911660l578686k80671K822445L235751J026240
$$ 3461174 5770284 4844087 932427 -2646259 -2926930 -104485 3131266 4157506
40467D157506k017486l653048k252661J472635M095362K850685o21170j936153
$$ 4157506 2140020 -1513028 -3765689 -2293054 1802308 4652993 4031823 2095670
40459B095670M28247L140181K173584k430923o434238n439027M70927N724034
$$ 2095670 2523917 5664098 7837682 5406759 -1027479 -6466506 -5995579 -271545
40451b71545M568918j645518n156071j740271L380793L139592j268797l180933
$$ -271545 4297373 2651855 -2504216 -4244487 -863694 2275898 1007101 -2173832
40443b173832r18440J093107O77028M09686J359983J144959l32301K76066L022293
$$ -2173832 -3092272 -1999165 -1322137 -912451 447532 1592491 1260190 1536256 4558549
40434D558549L056554j303585m804892l227712J68537L63054j814350k293166
$$ 4558549 7615103 6311518 1506626 -1721086 -1552549 -1189495 -3003845 -5297011
40426e297011l36604J843178L148736L522300K451833O22112J63354P73853o14634
$$ -5297011 -5633615 -3790437 -641701 2880599 5332432 5954544 6117898 6891751 6277117
40417F277117l795809l894799M95688L458466R70999j820847Q01533M551618J690147
$$ 6277117 2481308 -1413491 -917803 2540663 3511662 1690815 2492348 7043966 8734113
40408H734113n555330p864734l516654j46391j394070j741608K636346O772245
$$ 8734113 3178783 -4685951 -8202605 -8348996 -9743066 -11484674 -8848328 -2076083
40400b076083N238823O76616j244712k35898M62017L82668J028827J453289l57441
$$ -2076083 3162740 3839356 2594644 2358746 2820763 3203431 4232258 5685547 5328106
40391E328106l163756l782642j912723k00423r3274o09321p58873m81204N15181
$$ 5328106 2164350 -1618292 -3531015 -3731438 -3824712 -4434033 -5192906 -5674110 -5158929
40382e158929K344281L530412K387365q4692r34237O66952K143085J130715j396231
$$ -5158929 -2814648 715764 3103129 3018437 2084200 2751152 4894237 6024952 4628721
40373D628721k830404k398634j378375p04843j89154P8528n35893j586875j430454
$$ 4628721 1798317 -600317 -1978692 -2683535 -2872689 -2794161 -3330054 -4916929 -6347383
40364f347383K63138J486633Q53094O7522J351327L573347L621477J053536j512454
$$ -6347383 -6084245 -4597612 -3744518 -3676996 -2325669 1247678 4869155 5922691 4410237
40355D410237k465671k527868j896080L01753K831119K453114j067720l581538
$$ 4410237 1944566 -583302 -2479382 -2177629 653490 3106604 2038884 -1542654
40347a542654k334859K33526R46481O54094J377219J966225N31730j389196j225744
$$ -1542654 -3877513 -3643987 -2697506 -2043412 -666193 1300032 1831762 442566 -783178
40338g83178J55820L97489j2245M51139M49129j437574k200034J406198N601223
$$ -783178 -627358 -229869 -242114 209025 658154 -779420 -2979454 -1573256 4027967
40329D027967L402738m249569q262920l885039L067796N125470K484105j45626
$$ 4027967 7430705 3181136 -5081784 -8966823 -5899027 -773557 1710548 1564922
40321A564922j075458j613479j856280q25800J010147K437913L178029K890708
$$ 1564922 489464 -1124015 -2980295 -3806095 -2795948 -358035 2819994 5710702
40313E710702P39188k194645k833029o38304P62601q87112k450341l23864L351809
$$ 5710702 6449890 4255245 1422216 783912 1546513 659401 -1790940 -2114804 1237005
40304A237005L581190p4188l152052k636658j5986J753086J296749j021487l434612
$$ 1237005 4818195 4744007 1591955 -1044703 -1060689 692397 1989146 967659 -2466953
40295b466953l466950m89580K865752L792063K809376J964140J021799j321301
$$ -2466953 -5933903 -6423483 -3557731 234332 3043708 5007848 6029647 4708346
40287D708346l500852k417608J186553K686077M6744l082888k539272P87718K677393
$$ 4708346 1207494 -1210114 -23561 2662516 2709260 -373628 -2912900 -2125182 552211
40278E52211J034313k370448m378165l052198J065650M783217M413625j70746
$$ 552211 1586524 -783924 -5162089 -8214287 -7148637 -2365420 2048205 1877459
40270A877459m362457l505683J529630N226312M000659J46900j607500o9428J517187
$$ 1877459 -2484998 -5990681 -4461051 765261 4765920 4912820 3305320 3235892 4753079
40261D753079J91854k857584m094722k357942j68280j3763p73051O42707M362062
$$ 4753079 4944933 2087349 -2007373 -4365315 -4533595 -4547358 -5320409 -4677702 -315640
40252c15640O112196K025575n773719j0172013o461682K188900P816974N927135
$$ -315640 5796556 7822131 2048412 -8123601 -14585283 -12396383 -4579409 1347726
40244A347726m66345m985276m521022r35954K438879M071599M035618K403804
$$ 1347726 881381 -4103895 -8624917 -9560871 -7121992 -3050393 985225 3389029
40236C389029p33862l969656m752472j986782J908090L080215R75960o67642R42579
$$ 3389029 2655167 -1314489 -6066961 -8053743 -6145653 -3065438 -2089478 -2757120 -1814541
40227a814541L169968J612356k701290l879247L90906N170440N094442J147709
$$ -1814541 1355427 2967783 266493 -3612754 -3221848 1948592 7043034 8190743
40219H190743k229084l415243l341368j883223J005198K642660Q87295j400214
$$ 8190743 5961659 2546416 -794952 -2678175 -1672977 969683 1856978 456764
40211D56764j10120L036793K694670j261884l191471p37957J671565L36617k290376
$$ 456764 346644 3383437 6078107 4816223 1624752 886795 2558360 2894977 604601
40202F04601k519673r87651n9795L38777J034570J181943N70868J097929L034801
$$ 604601 -1915072 -2902723 -2962518 -2623741 -1589171 -407228 163640 1261569 4296370
40193D296370L205720k5058l344223l417508j858323j598153j656702J84224K450691
$$ 4296370 7502090 7477032 4132809 715301 -1143022 -2741175 -4397877 -4213653 -1762962
40184a762962K440892J260416J600682K478712J166704j205423j170077R19740
$$ -1762962 677930 1938346 3539028 6017740 7184444 5979021 4808944 5728684
40176E728684J437326j87123p60234P89395J598537j25263k329395k539023q81637
$$ 5728684 7166010 6978887 6218653 7008048 8606585 8481322 6151927 3612904 2731267
40167B731267J184519K476212J989845k75046k290827k138663p58932j88365j33572
$$ 2731267 3915786 6391998 8381843 8106797 5815970 3677307 2918375 2730010 2596438
40158B596438P41353J477598M31142j048691o79537K39196r20932k475196o14777
$$ 2596438 3337791 4815389 5246531 4197840 3518303 3757499 2836567 361371 -253406
40149b53406L274086L751285K59076j610093P33208K941003J423120j129407j173201
$$ -253406 3020680 6771965 7031041 5420948 6154156 9095159 10518279 9388872 8215671
40140H215671K20086R15871J644154K563666Q99609l645585n859793k290456K780506
$$ 8215671 8435757 9351628 10995782 13559448 14459057 10813472 4953679 2663223 5443729
40131E443729L883471K660007L537007M985290K530484j936884j970370K845073
$$ 5443729 9327200 11987207 15524214 20509504 23039988 21103104 19132734 21977807
40123B1977807N859959L787015J057129J808959L915355L933937K634980K030170
$$ 21977807 27837766 31624781 32681910 34490869 38406224 42340161 44975141 47005311
40115D7005311J177123j207600l178321k405675k98722J16526j362078k791998
$$ 47005311 48182434 46974834 43796513 41390838 41092116 41208642 39846564 37054566
40107C7054566l455024l544547k208983O86417K183480n21266n005162n781490
$$ 37054566 33599542 30054995 27846012 28532429 30715909 30194643 25189481 19407991
40099A9407991j820070J932219J512537j293633k848193k762802k449066j588325
$$ 19407991 17587921 19520140 21032677 19739044 16890851 14128049 11678983 10090658
40091A0090658M03197J471550m72437l148637k302603J713427L902389J684973
$$ 10090658 10493855 11965405 11492968 8344331 6041728 7755155 11657544 13342517
40083A3342517j941273l301260k299535m72761J361857J869097l82840l295268
$$ 13342517 11401244 8099984 5800449 5327688 6689545 8558642 8175802 4880534
40075D880534k446485J635772K634905j521864l833076P79888N608614J840868
$$ 4880534 2434049 4069821 6704726 5182862 1349786 2129674 7738288 9579156
40067I579156o294992o880871R20627N409991J004281l725695j149472L401157
$$ 9579156 3284164 -3596707 -2676080 2733911 3738192 12497 -1136975 2264182
40059B264182K051572k201591j803600J979507K123726j434932k236322R55525
$$ 2264182 4315754 2114163 310563 2290070 4413796 2978864 742542 1698067
40051A698067K300367o71651l114900j392634J425350J560079M16881Q07372J406005
$$ 1698067 3998434 3326783 211883 -1180751 244599 1804678 2221559 3028931 4434936
40042D434936p75633m515589n031770m94842M854269N504794J639986p69383K157183
$$ 4434936 3659303 -856286 -5888056 -6382898 -1528629 3976165 5616151 4846768 7003951
40033G003951O328377M842983k022593o790362n379296k058542j309340q00182
$$ 7003951 13332328 18175311 16152718 9362356 3983060 1924518 615178 -185004
40025a85004K679634N568924K688088l276576m894517j022246K440387K174357
$$ -185004 2494630 8063554 10751642 7475066 2580549 1558303 3998690 6173047
40017F173047P83833K95575q16409k900349l551249k302953j421728q34823J931572
$$ 6173047 6956880 7252455 6436046 3535697 -15552 -2318505 -3740233 -4575056 -2643484
40008b643484N419336M363502j373461m459518m08199N474737N932972J662133
$$ -2643484 2775852 7139354 5765893 1306375 898176 6372913 12305885 13968018
40000A3968018j656214k241548k594579l599614l654072k493148j501194q57861
$$ 13968018 12311804 10070256 7475677 3876063 221991 -2271157 -3772351 -4630212
39992d630212K71038J449909J635598J150143O74381l17643j851002k008429J55881
$$ -4630212 -4359174 -2909265 -1273667 -123524 550857 233214 -1617788 -3626217 -3470336
39983c470336K064729R44637j813012k666090j050428N60911P69704M39389L72545
$$ -3470336 -1405607 -460970 -2273982 -4940072 -5990500 -5429589 -4659885 -4220496 -3847951
39974c847951M73494Q44813J581197K034620J951539K145308K397279P24825k923095
$$ -3847951 -3374457 -2529644 -948447 1086173 3037712 5183020 7580299 8305124 5382029
39965E382029m729133k212618R41700j51376l417252k393127L152049N572073
$$ 5382029 652896 -1559722 -618022 -769398 -4186650 -6579777 -3427728 2144345
39957B144345M71186o227372o399349p86493L218552K504186J049215J888465
$$ 2144345 2615531 -3611841 -10011190 -10797683 -7579131 -5074945 -4025730 -2137265
39949b137265K171880j145981n045028m249769P44167M145878L054461N85565
$$ -2137265 34615 -1111366 -6156394 -10406163 -9661996 -5516118 -2461657 -1876092
39941a876092q8204j29422j053437p97834K163027M295452J857538k112472j728593
$$ -1876092 -1964296 -2093718 -3147155 -3944989 -1781962 2513490 4371028 2258556 529963
39932E29963K090191K702221j409265m104122j625577J922024K294380J662557
$$ 529963 2620154 5322375 3913110 -191012 -1816589 105435 2399815 4062372
39924D062372K990951L712674N62839l840249n005293l445266j933842M09208
$$ 4062372 7053323 10765997 11328836 7488587 2483294 -961972 -2895814 -2486606
39916b486606M946395P638771L662440l772297o403609k188918K855793L800179
$$ -2486606 2459789 10098560 13761000 9988703 3585094 1396176 4251969 8052148
39908H052148J592367j182549l170218k673046P75508L048024j55922n299935
$$ 8052148 9644515 8461966 5291748 2618702 3394210 6442234 6286312 986377
39900I86377m374883K800507P229413L946472j012450o10037L091554L856551
$$ 986377 -3388506 -587999 6641414 10587886 9575436 8965399 12056953 15913504
39892A5913504Q63495k099083l108729k762201j333826M58203M80127j541818
$$ 15913504 16776999 14677916 11569187 8806986 7473160 7931363 8411490 6869672
39884F869672k645287j489997r48645k658926l341181o37393J872732O08813j238028
$$ 6869672 4224385 2734388 1785743 -873183 -4214364 -4851757 -2979025 -2370212 -3608240
39875c608240R97439M771137L879636j393161m684045l133828N1754K201036L794520
$$ -3608240 -2610801 2160336 6039972 4646811 -37234 -3171062 -3119308 -918272 2876248
39866B876248M212513J335051l276799m525435j060791K323947J584740j345270
$$ 2876248 7088761 8423812 5147013 621578 -439213 1884734 3469474 2124204
39858B124204k204233P7645L238791M440372K211701j964859m035152k068554
$$ 2124204 -80029 -2384 3236407 7676779 9888480 7923621 3888469 1819915
39850A819915L77465o95649k831975o84297M468569N613778R26602l505127l629922
$$ 1819915 2197380 1501731 -1330244 -2014541 2454028 8067806 8994408 5489281 1859359
39841A859359k577183k934367j700285K408452M010566k56096m355175j586058
$$ 1859359 -717824 -3652191 -5352476 -2944024 1066542 810446 -3544729 -5130787
39833e130787M255893M630372m16940l343051j481821M34428l10965q07302O74530
$$ -5130787 -874894 3755478 3338538 -4513 -1486334 -1051906 -1362871 -2170173 -1495643
39824a495643J539663L37421p03994m40140p59988k112338k077645K7966J821834
$$ -1495643 44020 381441 -322553 -762693 -1522681 -3635019 -5712664 -5684698 -3862864
39815c862864K338120K990333L144022L53560l598146l132506K263369N820538
$$ -3862864 -1524744 1465589 4609611 4963171 1365025 -1767481 495888 6316426
39807F316426L354862o90703j045341M31076l97568k303336j677153Q76124K517336
$$ 6316426 9671288 8980585 7935244 8366320 7968752 5665416 3988263 4864387 7381723
39798G381723L159794L172809J47361o003929q903576m013399K512403J822575
$$ 7381723 10541517 13714326 13861687 7857758 -1045818 -5059217 -2546814 -724239
39790g24239l509359l353918L057591N447069m43733n528550k182923L632166
$$ -724239 -4233598 -7587516 -4529925 917144 473411 -5055139 -7238062 -3605896
39782c605896K758776k265819k258808L137127N307499J078286k273911J172665
$$ -3605896 -847120 -3112939 -5371747 -2234620 3072879 4151165 1877254 3049919
39774C049919O558531N402551j962092o667171l264736L361583M982732Q32642
$$ 3049919 9608450 15011001 13048909 6381738 3117002 6478585 11461317 12293959
39766A2293959k521925j410747M1816k249129m514580r26769N571310N986992
$$ 12293959 9772034 8361287 8403103 6153974 1639394 712625 6283935 12270927
39758A2270927r75009n994289k829316K638812K250197j934760k295302J416902
$$ 12270927 11295918 5301629 2472313 5111125 7361322 5426562 3131260 4548162
39750D548162K400470j322722l825762j271623K257642J932656l60307J73938
$$ 4548162 6948632 5625910 1800148 528525 2786167 4718823 4358516 4532454
39742D532454L476056N018695K502110j449195l243951k484220j411392j538410
$$ 4532454 8008510 13027205 15529315 14080120 10836169 8351949 6940557 5402147
39734E402147k086256j822238j293527j808900k571248j172982K200243L645285
$$ 5402147 3315891 1493653 200126 -1608774 -4180022 -5353004 -3152761 492524
39726D92524P34507l244436l135565J259664N222439N255145K241780j029284
$$ 492524 1227031 -2017405 -5152970 -3893306 1329133 6584278 8826058 7796774
39718G796774k507076j280533J671009L158549J084885k112833k486096p33099
$$ 7796774 5289698 4009165 5680174 8838723 9923608 7810775 5324679 4591580
39710D591580j229427m451946n215323n41953N182547O332263L811698K419760
$$ 4591580 3362153 -1089793 -6305116 -6847069 -1664522 4667741 8479439 10899199
39702A0899199K839311J387053k752876n128102k450055K225349L395316K14278
$$ 10899199 13738510 15125563 12372687 7244585 4794530 7019879 10415195 10629473
39694A0629473l053559k961786o28677Q42829M43887o32016j420874j701112q36903
$$ 10629473 7575914 4614128 3985451 4828280 5272167 4640151 3219277 1518165 681262
39685F81262J500588L469084K479090q34963k646455j147032R72627J068426O56800
$$ 681262 2181850 5650934 8130024 7295061 4648606 3501574 4474201 5542627 6199427
39676F199427K098319L754532K406085j089641k843860j856261o25074k66890
$$ 6199427 8297746 12052278 14458363 13368722 10524862 8668601 8043527 7776637
39668G776637L73744O14002j990187o208653o727786j542346M409866N768474
$$ 7776637 8150381 8764383 6774196 565543 -6162243 -7704589 -3294723 2473751
39660B473751L273427Q05867n82400j956555k619367j256148O08142L64858j215378
$$ 2473751 5747178 6553045 5970645 4014090 1394723 138575 746717 1111575 -103803
39651a03803r32446J655986L340700J968784o62960j457823K56299K410572K525641
$$ -103803 -1036249 619737 3960437 5929221 5266261 3808438 4064737 6475309 9000950
39642I000950K8343l042615l750787j309067J966082L316778K506222J416165
$$ 9000950 9029293 5986678 2235891 926824 2892906 6209684 8715906 10132071
39634A0132071J374100J772029J150560p19224j943080n16232K236064K130902
$$ 10132071 11506171 13278200 14428760 13709536 11766456 11250224 13486288 15617190
39626A5617190j945541m898525k146457K400980J096959n052145o402392O37532
$$ 15617190 13671649 8773124 6626667 9027647 10124606 5072461 -1329931 -692399
39618f92399O970889M059041l225486m502026N45225L532396J428070m58696Q78863
$$ -692399 6278490 10337531 7112045 2610019 3155244 6687640 8115710 7657014 8535877
39609H535877J878456M35432j47707J772040K420717k21224j850405Q30096L564158
$$ 8535877 10414333 10849765 10702058 12474098 14894815 14673591 12823186 13653282 17217440
39600A7217440R49542m460189n523199r18624L544248L520564J149144P58851
$$ 17217440 18166982 13706793 8183594 7264970 10809218 14329782 15478926 16237777
39592A6237777L095285N172845M024988k83703m568955n385397k436787J405233
$$ 16237777 19333062 24505907 28530895 28247192 23678237 18292840 15856053 17261286
39584A7261286L639457M258255L928510K322484k44543j540267J8530K739101
$$ 17261286 20900743 25158998 29087508 31409992 31165449 29625182 29643712 32382813
39576C2382813L614450K046997j05778j290162j303489l67035J065998K008948
$$ 32382813 35997263 38044260 37938482 36648320 35344831 34977796 36043794 38052742
39568C8052742J839094J071676L02893p32113k095029k897276k797986k800906
$$ 38052742 39891836 40963512 41266405 40534292 38439263 35541987 32744001 29943095
39560B9943095l184963k414816J1925J600536M29317j063294N54267L593368K904212
$$ 29943095 26758132 24343316 24355241 25955777 26385094 25321800 25876067 29469435 32373647
39551C2373647j993370m996823j722242L951523M951868M10839l838524l538154
$$ 32373647 30380277 25383454 23661212 27612735 32564603 32975442 29136918 25598764
39543B5598764r91732p13262l021065m390767k888589m53028N41685N66881J230024
$$ 25598764 24607032 23893770 20872705 16481938 13593349 13140321 13682006 14248887 15478911
39534A5478911J937791Q00406j499621j603326J669971M720748L587071m30931
$$ 15478911 17416702 18217108 16717487 15114161 16784132 21504880 25091951 24661020
39526B4661020k326323l57351J485984p00611m764797n101937o20630L142777
$$ 24661020 22334697 21977346 23463330 22762719 17997922 12895985 12275355 15418132
39518A5418132J372177l106540l531654J056512M088526Q61557m475376m881482
$$ 15418132 16790309 13683769 10152115 11208627 15297153 16158710 11683334 6801852
39510F801852m72007K386864R06030q27944P37546L173048K592186l73470k297396
$$ 6801852 6329845 8716709 9622739 8794795 9532341 12705389 15297575 14924105 12626709
39501A2626709j855703p7163J941207K863344J020711k704824m254823j617312
$$ 12626709 10771006 10693843 12635050 15498394 16519105 13814281 9559458 7942146
39493G942146J746932J908754J67437j99344m298j715047l127349Q3528O091189
$$ 7942146 9689078 11597832 11765269 11565925 11561627 9846580 6719231 6802759 12893948
39484A2893948P854774L204813k141365l290442k056661j772285j857652r54353
$$ 12893948 20748722 23953535 21812170 18521728 16465067 14692782 12835130 11880777
39476A1880777n78318j660649j554050J289029L306684J134495k202101j592435
$$ 11880777 11302459 9641810 8087760 9376789 12683473 13817968 11615867 10023432
39468A0023432J921278K781488l36630l010367k421630j037388j563179k394743
$$ 10023432 11944710 14726198 14389568 11379201 8957571 7920183 6357004 3962261
39460C962261m95910L513527N391870J967092m816120q649570m900395L367540
$$ 3962261 3466351 6979878 12371748 14338840 9522720 873150 -4027245 -659705
39452f59705P548194L433987l500839n470201k181937R12893J627658K317595
$$ -659705 6888489 10322476 6821637 1351436 -830501 82392 1710050 4027645
39444D027645L115679Q57091l862051n000479L46960O612972O804114J341865
$$ 4027645 7143324 8000415 4138364 -862115 -515155 6097817 12901931 14243796
39436A4243796l679547m198711r28511K979202L985878M68959m192088l829080
$$ 14243796 10564249 6365538 5437027 8416229 12402107 12871066 8678978 4849898
39428D849898K116071O048717K306797l958110l855641K140627N461523K679571
$$ 4849898 6965969 13014686 15321483 11363373 7507732 9648359 15109882 17789453
39420A7789453n68922M1890J085123j391336m676339m096406l58502K476845L069738
$$ 17789453 17220531 17262421 18347544 16956208 12279869 8183463 7824961 10301806 13371544
39411A3371544K656176J684887N30105Q16819K221135J066169l552918n770083
$$ 13371544 16027720 17712607 18242712 19059531 21280666 22346835 18793917 13023834
39403A3023834q06495O237113O619491J110572j365608K087214M671600K255453
$$ 13023834 12217339 18454452 25073943 26184515 24818907 26906121 31577721 33833174
39395C3833174O1086K679128N825493M327719J332045K056216M052936K207513
$$ 33833174 33894260 36573388 42398881 46726600 48058645 50114861 54167797 56375310
39387E6375310r22772P83695N358088N261364M37203j525748J279048K260802
$$ 56375310 55452538 56236233 61594321 66855685 67292888 65767140 67046188 69306990
39379F9306990r56407j884744K270541L759770l070072j1015101j0490842m053051
$$ 69306990 68350583 66465839 68736380 72496150 69426078 58410977 47920135 43867084
39371D3867084j049822k742726k867927j12672L04053k987482m812155k286363
$$ 43867084 42817262 40074536 37206609 37093937 37397990 34410508 29598353 27311990
39363B7311990J130920J908360O80110q81716k160326k156461q36161j168581
$$ 27311990 28442910 30351270 31031380 30149664 27989338 25832877 24996716 23828135
39355B3828135m445689n560109j70635N612310K409745o382714p449172J875613
$$ 23828135 19382446 13822337 13651702 19264012 21673757 15291043 7841871 9717484
39347I717484Q565250M030301l285968k924458J546377J590958r13422N92817
$$ 9717484 18282734 22313035 19027067 16102609 17648986 19239944 18326522 18919339
39339A8919339L520482J022671m196223m024822L91354J262222p86553J751681
$$ 18919339 22439821 23462492 19266269 15241447 15632801 16895023 16108470 17860151
39331A7860151P163056M912136n485666j0746973m179133L859774L246367o47799
$$ 17860151 25023207 29935343 24449677 13702704 9523571 13383345 16629712 15981913
39323A5981913J211000N103906K268203m439810m991683O73956L072547m68847
$$ 15981913 17192913 22296819 24565022 20125212 15133529 15807485 18880032 18411185
39315A8411185k326091J273888M090597J603614q24008K709741Q394359Q611576
$$ 18411185 16085094 17358982 21449579 23053193 22229185 24938926 33333285 41944861
39307D1944861L470493l71031O7806J440863R58040J81214R45933J985443J718449
$$ 41944861 45415354 45044323 45112129 46552992 47511032 47692246 48638179 50623622 52342071
39298E2342071J397334L033801N955523P744123P591711O632662N681524M902111
$$ 52342071 53739405 56773206 62728729 70472852 78064563 84697225 90378749 95280860
39290I5280860N258355P525683R654048Q340221M449213L393642P491834J1195807
$$ 95280860 100539215 108064898 117718946 126059167 130508380 133902022 141393856 152589663
39282A52589663Q266547J643221L79136O489438J0820566M950976p169268j3937214
$$ 152589663 160856210 162499431 162878567 169368005 180188571 185139547 177970279 164033065
39274A64033065j0464078l681565k882385q768562j3941015j2686299p541857
$$ 164033065 153568987 149887422 147005037 138236475 124295460 111609161 104067304
39267A04067304n158633p405131r481544p303989l465298l144591o278264p762543
$$ 104067304 98908671 91503540 82021996 74718007 71252709 68108118 61829854 54067311
39259E4067311m963797j135980n56815l241385n664072m818653j026131J850443
$$ 54067311 49103514 47967534 47410719 44169334 38505262 33686609 32660478 34510921
39251C4510921l04626o255314q737863l029407N380990O921600J049640l289151
$$ 34510921 34206295 27950981 19213118 16183711 21564701 28486301 29535941 26246790
39243B6246790j122106K044346K73821l382974k963554L55095J000181j430646
$$ 26246790 25124684 27169030 27442851 24059877 21096323 21451418 22451599 21020953
39235B1020953k130523O04986K938291J591276j973716m202090l544045j481653
$$ 21020953 18890430 19495416 22433707 24024983 22051267 17849177 14305132 12823479
39227A2823479p62819k076326k384035R82650M627236K318422m680857o894880
$$ 12823479 12060660 9984334 7600299 8582949 13210185 15528607 10847750 3952870
39219C952870o3810P241963N528322j878285m928426k159888l98123j765619j436041
$$ 3952870 3889060 11131023 16659345 14781060 9852634 7692746 7294623 5529004 4092963
39210D092963J804174K923253L83080p23918J687954K350870j909169n844708
$$ 4092963 5897137 8820390 9203470 8479552 10167506 12518376 10609207 4764499
39202D764499m087955L48348J576706N094P89J860255K138070P0916j659569j712697
$$ 4764499 676544 1024892 2601598 2606692 2607481 4467736 6605806 6676722 5017153 3304456
39192C304456j266556q42564L19138J728429J652357J08247o30892N86648J615510
$$ 3304456 2037900 1195336 1514474 3242903 4895260 5003507 4372615 4959263 6574773
39183F574773l43392m333782n514909q44959N874473P387052K063674l774734
$$ 6574773 6231381 1897599 -3617310 -4462269 1412204 8799256 10862930 7088196
39175G088196m529972k346739j840317j982059P86015M286210L055092j858146
$$ 7088196 2558224 211485 -1628832 -3610891 -2824876 1461334 4516426 2658280
39167B658280l411249M69649M049761L483064J823694J798650R42513k349665
$$ 2658280 -752969 -283320 3766441 7249505 9073199 10871849 11814362 9464697
39159I464697m515139k873606k93190L18252O73818K201369K279938r4421q10158
$$ 9464697 4949558 2075952 1782762 2101014 2774832 4976201 7256139 7161718 6351560
39150F351560K040596L308157p91887n206705l863790M23138J554148O84740K371490
$$ 6351560 8392156 11700313 10908426 5701721 1837931 2261069 3815217 4499957 6871447
39141F871447M310165J017676m587279l952593K916032O218760J061043n556964
$$ 6871447 11181612 12199288 7612009 3659416 6575448 12794208 13855251 8298287
39133H298287n461878K64428N027098N231797J865361k114654l571118j727970
$$ 8298287 2836409 3100837 8127935 13359732 15225093 13110439 9539321 7811351
39125G811351J34504j057941k795352p11760L213554K777091j950887l732766
$$ 7811351 7945855 6887914 4092562 3380802 6594356 9371447 7420560 3687794
39117C687794M98485M813109L817835J54545j494061j718044k907911l639683
$$ 3687794 4186279 8999388 12817223 12971768 11477707 9759663 6851752 3212069
39109C212069j829798L82657L9110j287491k67213K351000K995287P02995k283396
$$ 3212069 1382271 1764928 1804038 516547 249334 2600334 5595621 6298616 4015220
39100D015220l886545l309521n10460K876521L959434K177786L67374L40966K35471
$$ 4015220 128675 -3180846 -3691306 -814785 3144649 5322435 5689809 6030775 6266246
39091F266246j507356k814145j591409M39416Q48991N96081J517393K455967J670887
$$ 6266246 4758890 1944745 353336 792752 1641743 2237824 3755217 6211184 7882071
39082G882071N89304J137873J631384l61089k992292k577046K99019J705509N88906
$$ 7882071 8471375 9609248 11240632 10879543 7887251 5310205 5609224 7314733 7903639
39073G903639l85990Q8051K46989j079003k540441k458173m61893K750948N051801
$$ 7903639 7517649 7605700 7852689 6773686 4233245 1775072 1313179 4064127 9115928
39064I115928L529997j567437n024859k498879K933751M200259l70684n319988
$$ 9115928 12645925 11078488 6053629 3554750 6488501 10688760 10318076 4998088
39056D998088n651038k022367J909728L395679J415915k598837m407693j083734
$$ 4998088 -652950 -2675317 -765589 2630090 4046005 1447168 -2960525 -4044259
39048d044259M139217N199152J746968m73041J139843J991874j696168n958447
$$ -4044259 94958 5294110 7041078 6568037 7707880 9699754 8003586 2045139
39040B045139m769201P01091L718320J443048k052828k276432J84498J871037
$$ 2045139 -2724062 -2022971 1695349 3138397 1085569 -1190863 -1006365 864672
39032H64672J356718m154q73991j371862j644837q14161J238478K113480n08734
$$ 864672 2221390 2217236 1343245 -28617 -1673454 -2487615 -1249137 864343 355609
39023C55609m376915m055545J534855O307111M829465j6003j524592J054338K773660
$$ 355609 -4021306 -8076851 -6541996 -234885 4594580 4578577 3053985 4108323 6881983
39014F881983J701185Q69153J306762j7453l442858m334971p25900K551447J349487
$$ 6881983 8583168 9452321 10759083 10741630 7298772 2963801 2237901 4789348 6138835
39005F138835j282414o63140J938316K490913J277209J186792J754772N86676
$$ 6138835 4856421 4193281 6131597 8622510 9899719 11086511 12841283 13427959
38997A3427959j314408j169224J93948j39322j712096k046002j901885l408379
$$ 13427959 12113551 10944327 11138275 10998953 9286857 7240855 5338970 1930591
38989A930591m376738j173106L496252L240074j160812j784743L446387O305518
$$ 1930591 -2446147 -3619253 -123001 3117073 1956261 171518 3617905 9923423
38981I923423J126553n586138m887589J190051L740513P49895j603011M0576K078321
$$ 9923423 11049976 5463838 576249 1766300 5506813 6256708 4653697 4694273 6772594
38972F772594J544122O27229J228739R31736k057714m420388k462665J539302
$$ 6772594 8316716 8943945 10172684 11104420 9046706 4626318 2163653 3702955
38964C702955K281608o69879k417675k17774K714448K377136k93486j465164j99779
$$ 3702955 5984563 5314684 2897009 2679235 5393683 7770819 7477333 6012169 5812390
38955E812390Q95900J28341j238958j735317j712705j624784p65594P67802J158009
$$ 5812390 6708290 6836631 5597673 3862356 2149651 524867 -240727 527075 1685084
38946A685084p5062k62229K481311N295767L910603j095247m918951m895860k555633
$$ 1685084 1610022 1347793 3829104 9124871 13035474 11940227 7021276 2125416 -430217
38937d30217L67715L617124N565683L514274j243234l093895K36919L537725J271976
$$ -430217 -62502 3554622 9120305 12634579 11391345 8297450 8534369 12072094 13344070
38928A3344070m303783o539379l641822K56513K025925K501422K527590R12384
$$ 13344070 9040287 2500908 -1140914 -884401 1141524 3642946 6170536 7082920
38920G082920k258069m055145k492227O76951K650077K883548K108595K63463
$$ 7082920 4824851 769706 -1722521 -1045570 1604507 4488055 6596650 6860113
38912F860113k369265l585502j566639J729637K133392j204858m010811k141193
$$ 6860113 4490848 905346 -661293 1068344 3201736 1996878 -2013933 -4155126
38904d155126K702209M821368J987637j607356j316102J450880J779936r41744
$$ -4155126 -1452917 3368451 5356088 3748732 2432630 3883510 5663446 4721702
38896D721702k130235M34833K768378J118366j606757k65465L934131M624457
$$ 4721702 2591467 3026300 5794678 6913044 5306287 5040822 8974953 13599410
38888A3599410j70730m849403m164151j32614J720480P3005j692803j282461k45207
$$ 13599410 13428680 8579277 4415126 4282512 6002992 6075997 4383194 3100733 2855526
38879B855526o92245j983018k031841m53813J224585K001588K348770K404691
$$ 2855526 2163281 180263 -1851578 -2305391 -1080806 920782 3269552 5674243
38871E674243J068434j567900k381716J250887O279519O003940j075560p713498
$$ 5674243 6742677 5174777 2793061 4043948 10323467 16327407 15251847 7538349
38863G538349o364245R88681N340692K106269m036455o081498k689751K160107
$$ 7538349 1174104 2162785 7503477 9609746 5573291 -508207 -3197958 -1037851
38855a037851M515465L410498M17657j770622j344890P22711J692540P01036j33365
$$ -1037851 3477614 6888112 7305769 5535147 4190257 4912968 6605508 7306544 7173179
38846G173179O83742J208795r97851m297550m212369M52751N217297N157716J052339
$$ 7173179 7856921 9065716 8067865 3770315 -442054 10697 5227994 10385710 11438049
38837A1438049j801155n41785J843130J046676k579123m755748l141522Q5234
$$ 11438049 9636894 9095109 10938239 11984915 9405792 4650044 1508522 1593756
38829A593756J695159J127117o5161n46281N6721J230761J623041M62538q32464
$$ 1593756 3288915 4416032 4350871 3804590 3861311 5092072 6715113 7177651 6345187
38820F345187n43142q2697k200020n233946l766088K846514P470460M562489j744673
$$ 6345187 5802045 5719348 3519328 -1714618 -5480706 -2634192 4836268 9398757 7654084
38811G654084l828059j158109J145578J290822J459100J432594q46952l030690
$$ 7654084 3826025 2667916 3813494 5104316 6563416 7996010 7149058 4118368
38803D118368n34057M567026M822821p51555m175658q19910L598319K733566q49028
$$ 4118368 3584311 8151337 12974158 12222603 8046945 7227035 10825354 13558920 12709892
38794A2709892j616130n00815j552122l589599k491692Q60409J838385j54136
$$ 12709892 11093762 10592947 9040825 5451226 2959534 3819943 5658328 5504192
38786E504192j381368n63601k54604j422991j767118j47794J432710J245787J55849
$$ 5504192 4122824 3559223 3304619 1881628 114510 -33284 1399426 2645213 2801062
38777B801062j90113P26781K309645L078168J612467j118445j922603J87604J967864
$$ 2801062 2610949 3337730 5647375 8725543 10338010 9219565 7296962 7484566 9452430
38768I452430Q79013p29414Q7852J328594l60517k911056j662189K148383K280108
$$ 9452430 10331443 9602029 9689881 11018475 10657958 7746902 6084713 8233096 10513204
38759A0513204k658942o523320m549570M55125L258273K912020J547670L98702
$$ 10513204 7854262 1330942 -3218628 -2763503 494770 3406790 4954460 5353162
38751E353162K8942J271795K943582J511340l743197p694520n158702J829634
$$ 5353162 5382104 6653899 9597481 11108821 7365624 -328896 -5487598 -3657964
38743c657964O197503M678476R76771k70514N47986k1497k439045l014140N80311
$$ -3657964 2539539 7218015 8194786 7924272 8472258 8450761 6011716 2997576 3577887
38734C577887M914680M484245p25234m618843l147473K60004L33815j798132p15987
$$ 3577887 8492567 12976812 12251578 7632735 4485262 4745266 5079081 3280949 2564962
38725B564962M068211O480256K596824l656895n856695k740678J939470M495046
$$ 2564962 6633173 13113429 15710253 12053358 6196663 3455985 5395455 9890501
38717I890501L737038O66060j745591m81757L379451M611699O59140l926802l633175
$$ 9890501 13627539 14293599 12548008 12066251 15445702 20057401 20716541 16789739 13156564
38708A3156564l65929l84834l736237l410378L145044Q256564M513158l776302
$$ 13156564 12790635 12405801 8669564 5259186 8404230 16660794 21173952 17397650
38700A7397650o232152j106016L127956R33640l090818k691718J065630L636403
$$ 17397650 11165498 10059482 13187438 14121078 11030260 8338542 9404172 13040575
38692A3040575M339401M420213K279247k857692n962575k379452L312021K879166
$$ 13040575 17379976 21800189 24079436 21221744 15259169 12879717 16191738 19070904
38684A9070904k319729l039013K474018N194256L73526m539627k609619J484991
$$ 19070904 16751175 13712162 16186180 21380436 21753962 17214335 14604716 16089707
38676A6089707Q74230j107077K191199P369175N759457j400174l883997J598449
$$ 16089707 16963937 15856860 18048059 25417234 31176691 29776517 25892520 27490969
38668B7490969O545941L623641l724799p448068m621022J505114N725268M670858
$$ 27490969 34036910 37660551 33935752 26487684 21866662 23371776 29097044 33767902
38660C3767902l4917k417072M29957L251681M1522n854151o245327j127408J552130
$$ 33767902 33732985 31315913 31745870 34997551 35039073 29184922 22939595 21812187 23364317
38651B3364317q72946k315919N07247K633460N94334j290990N53430J904553j686885
$$ 23364317 22491371 20175452 20682699 23316159 23910493 22619503 23172933 25077486 23390601
38642B3390601o547561o515345k123080J732862L180587L010648Q72669k717926
$$ 23390601 16843040 10327695 8204615 9937477 13118064 16128712 17001381 14283455
38634A4283455m043555j142784J960021R19062k090461k131094P96516K835707
$$ 14283455 10239900 9097116 11057137 11976199 9885738 7754644 8551160 11386867
38626A1386867K560607J388875l1772j432582j242335N95943P98432k219076m671644
$$ 11386867 13947474 15336349 15304577 13871995 12629660 13225603 14024035 11804959 7133315
38617G133315l176324n11098m15283n49695K854581O651831M825252r45584k825009
$$ 7133315 3956991 3445893 3030610 2480915 5335496 11987327 16812579 15866995 13041986
38608A3041986J249606M707087K431612k858209n994422n574933k868276Q77206
$$ 13041986 14291592 18998679 21430291 18572082 12577660 7002727 4134451 5011657
38600E011657L972991M519143K578517j50967k733955m528781l641975M08655
$$ 5011657 8984648 13503791 16082308 15931341 13197386 8668605 5026630 5435285
38592E435285L786182K541814j230727k091168Q13737L391933L205135J213936
$$ 5435285 9221467 11763281 10532554 8441386 9255123 12647056 15852191 17066127
38584A7066127j918070n404034n475112J13611N560427L091168m383526n846247
$$ 17066127 15148057 9744023 4268911 4382522 9942949 13034117 8650591 2804344
38576B804344J114588O194321K540550l158843k798228K87227r88002m307308
$$ 2804344 3918932 10113253 12653803 9494960 6696732 6983959 5995957 1688649
38568A688649k519660L321947N701840L075924J052094J999906K288852K07278
$$ 1688649 -831011 2490936 8192776 11268700 12320794 14320700 16609552 16816830
38560A6816830j361262j233403j636378k254294L02734N010523N502935p8894
$$ 16816830 15455568 14222165 12585787 10331493 10634227 15644750 21147685 21068791
38552B1068791m787792k804147J928950K346393j018149k314521m18056L23025
$$ 21068791 16280999 13476852 15405802 17752195 16734046 14419525 14001469 14324494
38544A4324494j483121j910073J010068L378652J516000k159816k719606L07893
$$ 14324494 12841373 10931300 11941368 15320020 16836020 14676204 11956598 12264491
38536A2264491K867171K041014j003690l206075k574364O83164M138379M603003
$$ 12264491 15131662 17172676 16168986 12962911 10388547 11071711 15210090 19813093
38528A9813093J381733k275483k774068p53045J83522j026776j687861k08440
$$ 19813093 21194826 18919343 16145275 15392230 15575752 14548976 12861115 12652675
38520A2652675J115844k4535k099183k322575r62986j01907K71062J441046K216509
$$ 12652675 13768519 13743984 11644801 9322226 8359240 8257333 8528395 9969441 12185950
38511A2185950M6798l843835m451210K61276N738104O258169J914638k159861
$$ 12185950 12232748 8388913 3937703 4198979 9937083 16195252 18109890 15950029
38503A5950029k152671J114733M343126M951263K369662j800267m531478l737749
$$ 15950029 13797358 14912091 19255217 24206480 26576142 24775875 20244397 16506648
38495A6506648n39946J634911O69605k038652l253190j357155K104351M084390
$$ 16506648 15966702 17601613 18271218 16232566 12979376 11622221 13726572 17810962
38487A7810962L040836L23873j423069j106833m1919N7439p77953j190753m95169
$$ 17810962 20851798 21175671 19752602 18645769 18603850 18661289 17883336 16692583 16197414
38478A6197414O79814J562284J973022J710298M26032j126478q96443J849854
$$ 16197414 16877228 18439512 20412534 22122832 22548864 21422386 20525943 22375797
38470B2375797M285842K540044l022955p060820n265187K89139L747848K623797
$$ 22375797 26661639 29201683 26178728 19117908 13852721 14141860 17889708 20513505
38462B0513505N0251r8032K006314L227565J723635j278182l253994k811943n59989
$$ 20513505 20563756 20465724 22472038 25699603 27423238 26145056 22891062 20079119 19519130
38453A9519130J704388K529211J755774K44544q58669o55110O88583J360464l94075
$$ 19519130 21223518 23752729 25508503 25753047 24894378 24239268 24927851 26288315 25894240
38444B5894240l260678l535390l21708K281429P82085k152596j473394K608406
$$ 25894240 22633562 19098172 18776464 21057893 21839978 19687382 18213988 20822394
38436B0822394N344597M814264L270187J451620k216879n833366m318940J839314
$$ 20822394 26166991 30981255 34251442 35703062 33486183 27652817 23333877 25173191
38428B5173191M901706J061098l087259q35492L780336K823301k324867l494532
$$ 25173191 30074897 31135995 28048736 27213244 30993580 33816881 31492014 27997482
38420B7997482O92822L095038J23313l158320k110131Q62349K099677K713664
$$ 27997482 28690304 31785342 31908655 28750335 26640204 27502553 29602230 32315894
38412C2315894M477376M733670O31166m675054n317169r51818K832083K369615
$$ 32315894 36793270 41526940 42158106 37483052 32165883 31214065 34046148 36415763
38404C6415763L63695J057153L573774K923256k527193p492324o000068L94195
$$ 36415763 36779458 37836611 41410385 44333641 41806448 34314124 28314056 28708251
38396B8708251M453835L297152J660618L201432M133697K43743m463233l158179
$$ 28708251 33162086 36459238 38119856 41321288 45454985 45698728 41235495 38077316
38388C8077316K378320L750020j039388m693531k274496J946576K579893J346886
$$ 38077316 40455636 44205656 43166268 38472737 36198241 38144817 40724710 42071596
38380D2071596K422422M577993L569367m96195l274648k394247K75503J847982
$$ 42071596 44494018 49072011 52641378 52145183 48870535 46476288 46751791 48599773
38372D8599773J178866r40940k436346j531902J212317L537438M415447M332475
$$ 48599773 49778639 48837699 46401353 44869451 46081768 49619206 54034653 58367128
38364E8367128K847562o72844l568422j776609L236966M533625m39890n135843
$$ 58367128 61214690 60541846 56973424 55196815 58433781 62967406 62527516 57391673
38356E7391673l253828J942207L355586J312908J872072N655687O262497P67145
$$ 57391673 54137845 56080052 59435638 60748546 62620618 68276305 74538802 75305947
38348G5305947n084554n021695m81981K896312L359322L407600M017877K938744
$$ 75305947 70221393 65199698 64717717 67614029 70973351 74380951 78398828 81337572
38340H1337572q63468m259469l288853J726101O067366N674760J282229k818180
$$ 81337572 80474104 76214635 72925782 74651883 80719249 86394009 87676238 84858058
38332H4858058l207811Q0102M337924O271070M130465n00527l423221k105924
$$ 84858058 81650247 81730349 86068273 92339343 96469808 95969281 92546060 90440136
38324I0440136J074477J887217J54279j61571K939426O390235O346723L020336
$$ 90440136 91514613 93401830 93556109 93394538 96333964 102724199 109070922 112091258
38316A12091258m44917j912868j363584L62301K267826L566905M288940M754942
$$ 112091258 111646341 109733473 108369889 108732190 111000016 114566921 118855861 123610803
38308A23610803M536049L405891K728061L476372L628952J058397j550163M22228
$$ 123610803 128146852 131552743 134280804 137757176 141386128 142444525 140894362 141316590
38300A41316590N296563N729573k22562m802328j302318O269987R445399O760930
$$ 141316590 146613153 152342726 152120164 147317836 146015518 152285505 161730904 168491834
38292A68491834L090997J178311M92861J971213O680450J0892493R514504M297574
$$ 168491834 171582831 172761142 173254003 175225216 181905666 192798159 202312663 206610237
38284B06610237K023026M269227N812317M180949L499049O263343Q272468N969749
$$ 206610237 208633263 212902490 218714807 222895756 226394805 232658148 240930616 246900365
38276B46900365L049575M463303Q198659Q849085O401174N406121P003951P817737
$$ 246900365 249949940 254413243 262611902 271460987 277862161 283268282 290272233 298089970
38268B98089970O528763N803931O720289O571115M353677L742830P199873J0762685
$$ 298089970 304618733 310422664 317142953 323714068 328067745 331810575 339010448 349773133
38260C49773133R190686M205134K593428O507129J0578894R816617N956160L689543
$$ 349773133 358963819 363168953 365762381 372269510 382848404 392665021 398621181 402310724
38252D02310724M343837O482213R603504J3049980J3479115Q497181K001110O59945
$$ 402310724 406654561 413136774 422740278 435790258 449269373 457766554 459767664 460427609
38244D60427609M672795P185648M320737N92482J435870M877387N041054J121847
$$ 460427609 465100404 472286052 476606789 477199271 478635141 483512528 488553582 489675429
38236D89675429j958183q52971K395944L982996K669249q8403k206650k584222
$$ 489675429 487717246 486864275 489260219 493243215 495912464 495824061 493617411 491033189
38228D91033189j943001k272656m580684p457111q682713p774760o122840n155644
$$ 491033189 489090188 486817532 482236848 474779737 466097024 458322264 452199424 447043780
38220D47043780n175178n565960n588596n270836n484455o552881p368585p118839
$$ 447043780 441868602 436302642 430714046 425443210 419958755 413405874 406037289 398918450
38212C98918450p046977q526645j0162332r434802o785337n151698n760777p470576
$$ 398918450 391871473 383344828 373182496 363747694 356962357 351810659 346049882 338579306
38204C38579306r657530j1926440j1700081p085455j910059k015650o124657p189355
$$ 338579306 328921776 316995336 305295255 298209800 296299741 294284091 288159434 280970079
38196B80970079m025150l549438q510363j1697452p647991k000402k147030n702134
$$ 280970079 276944929 273395491 264885128 253187676 245539685 243539283 241392253 235690119
38188B35690119o578343o308357r582784j3250975j0546624l607530j065986m295698
$$ 235690119 229111776 222803419 213220635 199969660 189423036 185815506 184749520 180453822
38180A80453822o359466m421220k946218l742148l043881n79848j628384o663606
$$ 180453822 174094356 169673136 166726918 162984770 159940889 159361041 157732657 151069051
38172A51069051q225447k796929K345028j81844o946264r528815o194912j828802
$$ 151069051 142843604 140046675 142391703 142209859 135263595 125734780 119539868 117711066
38164A17711066M8662k98998j826125l442797l381442j237649P91950Q96089j08448
$$ 117711066 117759728 117460730 115634605 112191808 108810366 107572717 108364667 109260756 109152308
38155A09152308j106123k553817m335998m679485l061203j468479j219257j342775
$$ 109152308 108046185 105492368 101156370 96476885 93415682 91947203 90727946 89385171
38147H9385171j302847k070118l269554k802032o70662L77678p17375j959368
$$ 89385171 88082324 86012206 82742652 79940620 79269958 79647636 78930261 76970893
38139G6970893k338090l009167l434851j309696K120201K071844k125787m842636
$$ 76970893 74632803 71623636 68188785 66879089 68999290 71071134 68945347 64102711
38131F4102711k633931L60100p49859m112413m757657j918831J356734K885737
$$ 64102711 61468780 61828880 61079021 56966608 52208951 50290120 51646854 54532591
38123E4532591K287186J02260j540874o44381O41737j745056n953642m866379
$$ 54532591 56819777 56922037 55381163 54736782 55378519 53633463 47679821 42813442
38115D2813442K527768P442625L629113l396584n375829l132742k173803k192431
$$ 42813442 45341210 52783835 56412948 53016364 47640535 44507793 42333990 40141559
38107D0141559L86437L410113J692633l424806n655163l720523j964730j813900
$$ 40141559 40527996 43938109 45630742 42205936 36550773 32830250 30865520 29051620
38099B9051620k26007L278512M977413L074891j33924k486676l431253j923834
$$ 29051620 28825613 32104125 37081538 40156429 40022505 37535829 34104576 32180742
38091C2180742J980707M412818K006170k215043k900880p40400l88633j751561
$$ 32180742 34161449 38574267 40580437 38365394 35464514 34724114 34335481 32583920
38083C2583920q79701J477402N73622l058706l661552m89548P80700j435043j821857
$$ 32583920 31704219 33181621 33755243 30696537 27034985 26545437 27326137 25891094 24069237
38074B4069237J343946K271962j464085l313506R25970M573249O44256n976831
$$ 24069237 25413183 27685145 26221060 22907554 23833524 28406773 29051029 23074198
38066B3074198o101870r56541P36440k339435k645046K618841O357753L034731
$$ 23074198 16972328 16015787 16752227 14412792 11767746 14386587 20744340 23779071
38058B3779071k634414l330588l6520O18089k825458m637728r67375M073431M054749
$$ 23779071 21144657 17814069 17777549 18395638 15570180 10932452 9965077 14038508 18093257
38049A8093257q12327m097996k060611J684620K006208l34473m63520K814153
$$ 18093257 17280930 13182934 11122323 12806943 14813151 14478678 14015158 16829311
38041A6829311M979460K201544l259315n748172k839395K170905L994911R45909
$$ 16829311 21808771 24010315 20751000 15002828 12163433 14334338 18329249 19275158
38033A9275158l383710m446570k274948p73893j396471r84180K265178M621633
$$ 19275158 15891448 11444878 9169930 8396037 6999566 6015386 8280564 12902197
38025A2902197K405012j538358k039613M1000l32645l382405m005756n13968K578837
$$ 12902197 15307209 13768851 11729238 11770238 11437593 8055188 4049432 3535464 6114301
38016F114301J894995n15222k039277l088737l600991j449677K732675M216365
$$ 6114301 8009296 7494074 5454797 2366060 -1234931 -2684608 48067 4264432
38008D264432J104952j894577l56936L224472L716001Q81154j550981j804324
$$ 4264432 5369384 3474807 3117871 6342343 10058344 10939498 9388517 7584193
38000G584193j092775n39303l54850o99025r79061J19945K237330L112679K049687
$$ 7584193 6491418 5952115 5597265 4898240 3919179 4039124 6276454 9389133 11438820
37991A1438820Q49260K54477r18019k008959n33116K345360J816765k473004m286381
$$ 11438820 12288080 12542557 11624538 9615579 9082463 11427823 13244588 10771584 6485203
37982F485203m62833L470070K220398r48748r64488P09k134547m214113j102078
$$ 6485203 6022370 9492440 11712838 10764090 9799602 9800311 7665764 3451651 2349573
37973B349573L756951K920682k272892l774169n64263M01932k567150k772918
$$ 2349573 6106524 9027206 6754314 2980145 2415882 2817814 250664 -2522254
37965b522254K249711N510047K384259j646356p66246J706980L27303k653982
$$ -2522254 -272543 5237504 7621763 5975407 5209161 6916141 7243444 4589462
37957D589462k000103Q97948R60546j231668p75840K377901K856535j298753n217305
$$ 4589462 2589359 3487307 4447853 3216185 2440345 4818246 7674781 6376028 1158723
37948A158723m020363J126698N265779N190793J723548j683087k127518j75576
$$ 1158723 -2861640 -1734942 3530837 8721630 10445178 8762091 6634573 6458997
37940F458997Q13438q34451k794634k386642m98126N09705Q83013K293755L938516
$$ 6458997 7272435 6437984 3643350 1256708 758582 1268287 2151300 4445055 8383571
37931H383571L403450Q45524j172200j850913k668618l501458j959961K196737
$$ 8383571 11787021 12632545 11460345 9609432 6940814 3439356 1479395 3676132
37923C676132N263219M185515O30975j552252j171761K6971N17390K31737o02989
$$ 3676132 8939351 13124866 13755841 12203589 11031828 11058799 11576189 11807926 11204937
37914A1204937j746655k147935n97049K406271M483282L560373p9031l850955
$$ 11204937 9458282 7310347 6713298 9119569 13602851 17163224 17084193 13233238
37906A3233238m856702k510079M15381M52725k061298k747790Q35428M732025
$$ 13233238 8376536 5866457 6281838 6734563 4673265 1925475 2760903 7492928
37898G492928L328640k316078n272470k552953P93934o0771k237670o24453K935856
$$ 7492928 10821568 8505490 3233020 680067 1474001 1413230 -824440 -1448893 1486963
37889A486963K527776j459087k332127J839979M594281J421104k862375j943136
$$ 1486963 4014739 2555652 223525 2063504 6657785 8078889 5216514 3273378
37881C273378J844904J483913l402542n795065j599474M698910O068837J212308
$$ 3273378 5118282 6602195 3199653 -2595412 -4194886 504024 6572861 7785169
37873G785169m719926n948102j705290L318173M286580J817479N15044J853113
$$ 7785169 3065243 -2882859 -4588149 -1269976 3016604 4834083 5349127 7202240
37865G202240J967468j842961o229541o494841l027408N07183K600405L728296
$$ 7202240 9169708 7326747 1097206 -5397635 -8425043 -7917860 -5317455 -1589159
37857a589159L450952J814794J106170K007161R41297l940192p456097m173612
$$ -1589159 1861793 3676587 4782757 6789918 7731215 3791023 -3665074 -7838686
37849g838686K381369M353253J257958o29051R27705K304838K293959L250966
$$ -7838686 -5457317 -1104064 153894 -475157 452548 2757386 5051345 8302311
37841H302311L766765l75077o642075o898317m88375L696211J569140o6802L336608
$$ 8302311 12069076 11693999 5051924 -1846393 -2334768 1361443 2930583 2863781 6200389
37832F200389N413247N62918n194844m039429O31747P73959k727517l210044n47803
$$ 6200389 11613636 12176554 6981710 2942281 3574028 4347987 1620470 -1589574 -2137377
37823b137377j39798k392694k753668n85740M90831j78054k65903J4162m51977
$$ -2137377 -2277175 -4669869 -7423537 -8009277 -7518446 -7696500 -7962403 -7948241 -8400218
37814h400218R74102N896345Q425913K741562n345845n020444K457180M914141
$$ -8400218 -7426116 -1529771 6896142 9637704 4291859 -728585 1728595 6642736
37806F642736j677086p300957m257804J871770K960343L70196m05478N44724K95245
$$ 6642736 4965650 -2335307 -6593111 -4721341 -1760998 -1390802 -1796280 -1251556 -956311
37797i56311k87516N91153Q28245j257152j935343K174524O736576M870084k271536
$$ -956311 -1243827 -652674 175571 -1081581 -3016924 -842400 5894176 10764260 8492724
37788H492724o615732m303616J33908J408780L19907Q30671L458157M590245J879964
$$ 8492724 1876992 -2426624 -2292716 -883936 -564029 266642 3724799 8315044 10195008
37779A0195008k021160k688229j21822R63836j980291n296622m633023j532506
$$ 10195008 8173848 5485619 5363797 6327633 4347342 -949280 -5582303 -7114809
37771g114809l52845r56918J93254L063011M180720L260528L332989L991076J256370
$$ -7114809 -7467654 -8424572 -8231318 -5168307 -987587 2272941 5605930 9597006 10853376
37762A0853376m524809p368574m431286Q0458K083523K457834K232876k55348
$$ 10853376 6328567 -1040007 -5471293 -5390835 -3307312 -849478 1383398 1128050
37754A128050l965244l732176J390958M852368K520050o68551L10714J690898
$$ 1128050 -2837194 -6569370 -5178412 -326044 2194006 1525455 1836169 3527067
37746C527067j514167n046454j887941M683797M851963k125934o083627j103407
$$ 3527067 2012900 -3033554 -4921495 -237698 4614265 2488331 -3595296 -4698703
37738d698703O080759O160838n65902o249891n885647j699226J255241R56888
$$ -4698703 1382056 7542894 6976992 727101 -5158546 -6857772 -5602531 -4645643
37730d645643l42697K58149K394391L275580K036340P47573N24040k72592k464337
$$ -4645643 -4988340 -4730191 -2335800 939780 2976120 3723693 4247733 3975141 1510804
37721A510804l822829k458110L29397K445532L393312K865984N79390j147061
$$ 1510804 -2312025 -4770135 -4440738 -1995206 1398106 4264090 4843480 3696419
37713C696419P36385L922060K309362l918919o692175k338311K161701P37725
$$ 3696419 4432804 8354864 10664226 6745307 53132 -2285179 -123478 614247
37705F14247j938983J82413L029291J91408m183736j989159L900896M089418o24749
$$ 614247 -1324736 -1142323 1886968 2078376 -2105360 -4094519 -193623 3895795 3271046
37696C271046o31424M886390N831393j125410o227108k694570K766109J884006
$$ 3271046 2639622 7526012 13357405 12231995 6004887 3310317 6076426 7960432
37688G960432k642017l774836j483373r4137k21068q4605l15357j720416k221241
$$ 7960432 5318415 1543579 60206 -33931 -254999 -339604 -654961 -2375377 -4596618
37679d596618p18816N2746j340760j583556J436438L937627K286040o38804k69630
$$ -4596618 -5315434 -5262688 -6603448 -8187004 -6750566 -2812939 -526899 -1165703 -1435333
37670a435333K162032K202580o12840k927823k737945n24923K456012L839835
$$ -1435333 726699 2929279 2316439 -611384 -3349329 -3874252 -1418240 2421595
37662B421595J084966m033132n293163n5962N970768N955607P25242l797717m851533
$$ 2421595 3506561 -526571 -5819734 -5875696 95072 6050679 6775921 2978204 -1873329
37653a873329m020746k677149q52185Q56283J948476L227865M670814M190873
$$ -1873329 -5894075 -8571224 -9423409 -8567126 -6618650 -3390785 1280029 5470902
37645E470902J011711k297067l503762l401866k731282m70801K272637J610742
$$ 5470902 6482613 4185546 681784 -2720082 -5451364 -5922165 -3649528 -2038786
37637b038786k423685l873109R534L272772O16989l382226j706594L233197L830708
$$ -2038786 -4462471 -8335580 -8326046 -5053274 -4436285 -7818511 -9525105 -6291908 -2461200
37628b461200R7935j166690J498063K402601p08188l034074j364817J147154J155461
$$ -2461200 -2363265 -3529955 -2031892 370709 -337479 -3371553 -4736370 -3589216 -2433755
37619b433755j34896o35769n51580o6993J413229K442606O49235k430503k566421
$$ -2433755 -2568651 -3204420 -3756000 -3822993 -2409764 32842 682077 -1748426 -4314847
37610d314847L74770K154429J425454J336789K640080J745738j937165l223626
$$ -4314847 -3940077 -1785648 -360194 976595 3616675 5362413 3425248 201622
37602B01622O27043M619338L340820j181529l637670l439248l476781l844650
$$ 201622 828665 5448003 8788823 7607294 3969624 530376 -2946405 -6791055
37594f791055k121824J463840L602895K306514j092044l745904l335225K63768
$$ -6791055 -8912879 -7449039 -3846144 -1539630 -2631674 -6377578 -9712803 -9449035
37586i449035L846375L554394J97258j001035K087407M861950K867511j444623
$$ -9449035 -5602660 -2048266 -1851008 -2852043 -764636 4097314 6964825 5520202
37578E520202l024338j974576j705589j847253O17946M159514L576209j063984
$$ 5520202 2495864 521288 -1184301 -3031554 -2413608 1745906 5322115 4258131
37570D258131l078473N87873L807939M13770n748031n940276N77494N344826K670721
$$ 4258131 1179658 1767531 5575470 5989240 241209 -5699067 -5121573 223253 2893974
37561B893974l104711m678636j494098J448550J521166N35809m250r86686k502512
$$ 2893974 -210737 -4889373 -6383471 -4934921 -3413755 -2877946 -2882196 -3868882 -6371394
37552f371394k689977j145403Q1390N36033K555457N998976O123386Q72988l707286
$$ -6371394 -9061371 -10206774 -10125384 -9589351 -7033894 -1034918 5088468 5961456 2254170
37543B254170j413900L597600K082686n359152p873314j022615N587452K868522
$$ 2254170 840270 4437870 6520556 1161404 -6711910 -7734525 -2147073 721449
37535G21449l805180l702666K093132L385408j736807l930083J523859O809384
$$ 721449 -3083731 -6786397 -4693265 -1307857 -3044664 -6974747 -5450888 1358496
37527A358496M296021j792041l287518q83584p43835k780535j530289L032357
$$ 1358496 5654517 3862476 574958 -308626 -1052461 -3832996 -5363285 -2330928
37519b330928M610109J027420k546707k630205k167886l252285k252058L099631
$$ -2330928 2279181 3306601 759894 -1870311 -4038197 -7290482 -9542540 -6442909
37511f442909P669470N829637J29045k935786k440039k027643k117197j91915
$$ -6442909 1226561 7056198 7185243 4249457 1809418 -218225 -2335422 -2527337
37503b527337K486837J771702j698125k645345P2517J513269p86470k848842j616358
$$ -2527337 -40500 1731202 33077 -2612268 -2539751 -1026482 -1812952 -4661794 -6278152
37494f278152r8292j288318k309400N41745M914833N619898K104316j680131k898535
$$ -6278152 -6376444 -7664762 -9974162 -9432417 -4517584 1102314 3206630 1526499 -1372036
37485a372036j675861O72505K007553J85444l448817m061125j8863L674971K552652
$$ -1372036 -3047897 -2375392 -367839 -182395 -3631212 -7692337 -7711200 -4036229 -1483577
37476a483577l39121J52960K199625R7105n290964o740124j709172L695560L633502
$$ -1483577 -1822698 -1669738 529887 626992 -4663972 -11404096 -13113268 -9417708 -5784206
37467e784206k67612l009901k752964n00023K738101N344071M701838O49414k683192
$$ -5784206 -6051818 -9061719 -11814683 -12314706 -9576605 -4232534 469304 1118718 -1564474
37458a564474j517507K247291L138624o60302m578410l254596K321342N369647
$$ -1564474 -3081981 -834690 2303934 1643632 -2934778 -6189374 -3868032 1501615
37450A501615J823518l878236m423401K00914K936092N25779j860471K03870K764985
$$ 1501615 3325133 -553103 -4976504 -4775590 -1839498 -1313719 -3174190 -2970320 -205335
37441b05335M94546l651516k958676K107874N210320M343647K728789Q55839l498901
$$ -205335 289211 -3362305 -6320981 -4213107 997213 5340860 8069649 8925488 5426587
37432E426587p386326m412328L760918O949275R90542n776883n124690q2866K168759
$$ 5426587 -1959739 -6372067 -2611149 4338126 5328668 -448215 -5572905 -5655771 -3487012
37423c487012J359257J185202J109624j264959l621829k131944J401367K229986
$$ -3487012 -2127755 -942553 167071 -1097888 -4719717 -6851661 -5450294 -3220308
37415c220308M28084j18299J298585K030751J419146R21230L40474r74925r67556
$$ -3220308 -2792224 -2910523 -1611938 418813 1837959 2759189 3099663 2124738 1157182
37406A157182J729920L293740k14992n022053l993865J939295M382487J52646
$$ 1157182 2887102 6180842 5965850 943797 -3050068 -1110773 3271714 3424360
37398C424360m262462l062929R40371K082804r2940k313914k817323j607180J051559
$$ 3424360 -838102 -3901031 -2960660 -877856 -970796 -3284710 -6102033 -7709213 -6657654
37389f657654L400369K592221j131851l758703l026858j045073M85297K993756
$$ -6657654 -3257285 -665064 -1796915 -5555618 -8582476 -9627549 -9142252 -6148496
37381f148496O115370N271615j203090p009666n714487k07609J998058K70519
$$ -6148496 -33126 5238489 4035399 -2974267 -8688754 -8896363 -6898305 -6627786
37373f627786M14173M004119O022179L795543Q09601m71763k576339o410505p081038
$$ -6627786 -6213613 -2209494 3812685 7608228 8417829 7946066 5369727 -1040778 -8121816
37364h121816j323064N763745P099314L333475L81757j34807j508944m180088
$$ -8121816 -9444880 -3681135 3418179 6751654 7133411 6998604 5489660 1309572
37356A309572m202687l87392K939953K435417K41693n34212o64346j874918k504396
$$ 1309572 -2893115 -3280507 -340554 2094863 2336556 1802344 1137998 -736920 -3241316
37347c241316j93835L071292K918336q44434l412403j537034K015668K317725
$$ -3241316 -3435151 -363859 2554477 1710043 -1702360 -3239394 -1223726 1093999
37339A093999j017709l260659q20053L770536M783237O66977l841476l853983
$$ 1093999 76290 -3184369 -4004422 -233886 4549351 5216328 1374852 -2479131
37331b479131k87712K319950J980640K80843j352927k707858k706490l21145K305221
$$ -2479131 -2766843 -446893 1533747 1814590 461663 -2246195 -4952685 -5273830 -2968609
37322b968609J736590j239035k216732q0290J420764L34481m69835Q17327J453488
$$ -2968609 -1232019 -2471054 -4687786 -4768076 -3347312 -3012831 -3482666 -2665339 -1211851
37313a211851k38782j099095Q96627K072236m51046k593937J11611L934698K175835
$$ -1211851 -1450633 -2549728 -1653101 419135 -31911 -2625848 -2514237 1420461 3596296
37304C596296l798417o251087k357782L134358N599145M496857P08655l684185
$$ 3596296 -202121 -6453208 -8810990 -5676632 -77487 4419370 5128025 1443840
37296A443840m122881J239760O330600M307930j543704k382718J894862K861534
$$ 1443840 -2679041 -1439281 4891319 9199249 7655545 5272827 7167689 10029223
37288A0029223j655523m027083n96654J983116j135777m575455k618033J123696
$$ 10029223 8373700 4346617 3749963 5733079 4597302 21847 -2596186 -1472490
37280a472490Q57035j850074k649728k073667j836570K16297M513886N481960
$$ -1472490 -615455 -2465529 -5115257 -7188924 -9025494 -8809197 -4295311 1186649
37272A186649M55408l415285L10937N898407M191240k360157m342021j143517
$$ 1186649 1642057 -1773228 -1462291 4436116 8627356 6267199 1925178 781661
37264G81661j95532k623271k112088J961290K553254j925933l934125K41263M121335
$$ 781661 586129 -2037142 -4149230 -2187940 365314 -1560619 -5494744 -5253481 -1132146
37255a132146K267695j221101r34995R83621L51813j137035K5984K159678J709953
$$ -1132146 1135549 -85552 -1020547 -36926 314887 -822148 -796164 1363514 3073467
37246C073467j61770k9727J641003J904943O10908j89389j70406l20004m77439
$$ 3073467 2911697 2881970 4522973 6427916 7038824 6849435 6679029 6359025 5881586
37237E881586l58300q74353j882575j459322J64009k66493l053686l406466O47929
$$ 5881586 5523286 4648933 2766358 1307036 1471045 1204552 -1849134 -5255600 -4607671
37228d607671L405562L33514l253178k28115N473217L819912m925628r449793
$$ -4607671 -1202109 -868595 -4121773 -4349888 1123329 4943241 17613 -9432180
37220i432180m339598K551582L343037J138076J931269L805786K162707l84179
$$ -9432180 -13771778 -11220196 -7877159 -6739083 -4807814 -1002028 1160679 776500
37212G76500J519661N329202L854650k473344n801068l330412o71765j273387
$$ 776500 2296161 7625363 11480013 9006669 3205601 -124811 -796576 -2069963
37204b069963j292155J767864L522940Q19739j666084P26251L906564J552997
$$ -2069963 -3362118 -1594254 1928686 2748425 1082341 1808592 5715156 7268153
37196G268153l781379m277535O94505L989355J953179j574074l076886l664430
$$ 7268153 3486774 -790761 -96256 3893099 5846278 4272204 1195318 -2469112
37188b469112l912439j532429L009479M828390J991495r83006n90219J86292j794494
$$ -2469112 -6381551 -7913980 -4904501 -76111 1915384 932378 342159 528451 -1266043
37179a266043l398446q24653K730524J769313k054858k423870J096164K434225
$$ -1266043 -4664489 -5489142 -2758618 -989305 -3044163 -5468033 -4371869 -1937644
37171a937644p46727l353328j472569J574916J338172m89979M41146L453800L814773
$$ -1937644 -2684371 -6037699 -7510268 -5935352 -4597180 -5087159 -4646013 -1192213 2622560
37162B622560L89828k521410j797875N4042o79560k851235k299228J226268K975023
$$ 2622560 3012388 490978 -1306897 -1252855 -1932415 -4783650 -7082878 -5856610 -2881587
37153b881587J05607l761964l486530N20408L581508L641698K821305K469001
$$ -2881587 -2775980 -6537944 -10024474 -9504066 -5922558 -2280860 540445 3009446
37145C009446J069625j886822l836840k839748m30199R92001J070618L10576j260742
$$ 3009446 4079071 2192249 -1644591 -4484339 -4914538 -3922537 -2851919 -2541343 -3802085
37136c802085k647927j962130L14225J131666k20944m88063J860942L163337L39390
$$ -3802085 -6450012 -8412142 -8097917 -6966251 -7187195 -7675258 -5814316 -2650979 -2311589
37127b311589l361746k963513M74747J796666q5277j254191L23415J976112J249753
$$ -2311589 -5673335 -8636848 -8162101 -6365435 -6450712 -7704903 -7381488 -5405376 -4155623
37118d155623l66176j53964K037553M029367L784376J098205k087174l257535
$$ -4155623 -4521799 -4675763 -2638210 1391157 5175533 6273738 4186564 929029
37110I29029k094100o69081k5692J254400L322984K823300k211722p508672p114383
$$ 929029 -1165071 -1834152 -1859844 -605444 2717540 5540840 3329118 -4179554 -11293937
37101a1293937j809910J730740L23448j754454L70503N030086O376831K170548
$$ -11293937 -13103847 -11373107 -11049659 -12804113 -12433610 -7403524 -1026693 1143855
37093A143855l274381m176256k33859K901220R75386k692573j614173L847897
$$ 1143855 -2130526 -6306782 -6540641 -3639421 -2664035 -5356608 -6970781 -3122884
37085c122884O001120J166388m120702k609824K647270L069518k461742o528748
$$ -3122884 2878236 4044624 -76078 -2685902 -38632 3030886 569144 -5959604
37077e959604m509968j87517J219151k9002o72757J81018J051900J241357J562652
$$ -5959604 -10469572 -10657089 -9437938 -9466940 -10139697 -9958679 -8906779 -7665422 -6102770
37068f102770K493972K860950R53624k530272l677736o2575M312673L259847j843054
$$ -6102770 -3608798 -747848 205776 -2324496 -6002232 -6064807 -1752134 1507713 -335341
37059c35341k726023K893778O493501J917101m151704k864976K097872R93479
$$ -335341 -3061364 -167586 6325915 8243016 4091312 1226336 3324208 4317687
37051D317687n170149o354286m21950L963561K119252p44773p65565j363328m067510
$$ 4317687 -852462 -7206748 -7628698 -3665137 -1545885 -2290658 -3056223 -4419551 -8487061
37042h487061l830232J252290M666978J851280k109571j288270J725987J694806
$$ -8487061 -12317293 -11065003 -6398025 -4546745 -6656316 -7944586 -6218599 -4523793
37034d523793l38206n33967O68871J102119J582356K519287J054885k856004l380504
$$ -4523793 -4861999 -5395966 -4727095 -3624976 -2042620 476667 1531552 -1324452 -4704956
37025d704956J812764N265216N63018o221062n092792K288839N747721K495745
$$ -4704956 -2892192 2373024 2936042 -3285020 -8377812 -6088973 -341252 2154493
37017B154493p22537l75021l42633k356533k234451J438220L395238M54494k713698
$$ 2154493 1431956 1056935 714302 -1642231 -3876682 -2438462 956776 1411270 -1302428
37008a302428j095890K792656L265943j69076l271550l417285j739043l49040
$$ -1302428 -2398318 394338 3660281 3491205 219655 -3197630 -4936673 -5285713
37000e285713j57097o60125m85450R32040J954873Q40749r29895l38581J987020
$$ -5285713 -5442810 -6102935 -6588385 -5656345 -3701472 -2860723 -3790618 -4129199 -2142179
36991b142179K069597q66357k410441O7886K577758N33893l497532l231153J514695
$$ -2142179 -72582 -938939 -3349380 -3281494 -703736 -169843 -3667375 -6898528 -5383833
36982e383833M070995P70275l617738l016736J288991L260747J262361l27908
$$ -5383833 -1312838 -542563 -4160301 -7177037 -5888046 -2627299 -1364938 -1692846
36974a692846J290534K955645R42112k853688l628262o49050K222978K358289
$$ -1692846 -402312 2553333 3495445 641757 -2986505 -3635555 -1412577 945712
36966I45712J140648N75128L19717o41425j716042j713493p75004Q747J38035
$$ 945712 2086360 2661488 2981205 2339780 623738 -1089755 -1864759 -1856012 -1717977
36957a717977N5911M12858J201800J328200l48780k881665l407529q75656J851811
$$ -1717977 -1662066 -1249208 -47408 1280792 932012 -1949653 -5357182 -6232838 -4381027
36948d381027J724777j32487n16119P72480J353232P26102L21775k44867k421509
$$ -4381027 -2656250 -2788737 -3304856 -2532376 -1179144 -453042 -131267 -376134 -2797643
36939b797643m308353k099449L194337N642828K815464o08766j52728K116671
$$ -2797643 -7105996 -9205445 -6011108 -368280 2447184 1838418 1685690 3802361
36931C802361J826303r25344k692468j874690M15983K501090K674302m7942l578001
$$ 3802361 5628664 4703320 2010852 136162 552145 3053235 5727537 5679595 2101594
36922B101594l852097l48132K509908J586250p89113j329153o11554k73116O44945
$$ 2101594 -1750503 -2098635 411273 1997523 1208410 -120743 -732297 -1005413 -360468
36913c60468K615519K590538j282334m992746l817902K64645J613699m26353j427560
$$ -360468 2255051 4845589 3563255 -1429491 -5247393 -4982748 -3369049 -3795402 -5222962
36904e222962N38500K633070K465702P70743j339068l424055l762773p17298L266647
$$ -5222962 -4684462 -2051392 414310 1185053 -154015 -3578070 -7340843 -8058141 -4791494
36895d791494L296979r83656l888222j153869M136683N588431J530199l495784
$$ -4791494 -1494515 -2478171 -6366393 -7520262 -3383579 2204852 3735051 239267
36887B39267m565135j595907J657372K560259K152841K508136L111289J772524
$$ 239267 -4325868 -5921775 -4264403 -1704144 448697 2956833 6068122 7840646
36879G840646j476405l933407l911423k351942l34319K076560L651218K100311
$$ 7840646 6364241 2430834 -1480589 -3832531 -4166850 -2090290 1560928 3661239
36871C661239j906471m096240k231990O35930J062606K06958P50280J741174O01347
$$ 3661239 1754768 -2341472 -4573462 -3937532 -2874926 -2667968 -1917688 -176514 424833
36862D24833j647960j559718R83665K105821n49478m428917n086716j243540L717973
$$ 424833 -1223127 -2782845 -1799180 306641 -242837 -4671754 -9758470 -11002010 -7284037
36853g284037N138996K197353j041869q98352J051277J122955j00219Q38076L334408
$$ -7284037 -2145041 52312 -989557 -1887909 -836632 286323 186104 1024180 4358588
36844D358588L124778j9720j589397n92562j183815l754937k646511L231820O033859
$$ 4358588 7483366 7463646 5874249 5281687 4097872 342935 -2303576 928244 6962103
36835F962103J116773m583761l696347k48898j412466m399144k379509J965993
$$ 6962103 8078876 3495115 -201232 -450130 -1862596 -6261740 -8641249 -6675256
36827f675256R13273l747626l300485K277534M137198L42156r35082L647881O642991
$$ -6675256 -5761983 -9509609 -12810094 -10532560 -6395362 -6053206 -6988288 -3340407 3302584
36818C302584L133620q88894N77089L394485J048348m360441o059657k833910
$$ 3302584 6436204 5547310 6124399 9518884 10567232 6206791 147134 -2686776
36810b686776R96991K540796K137192P09989p17164r65462p13837j940674l726541
$$ -2686776 -1689785 851011 2988203 3698192 2981028 2015566 1301729 -638945 -4365486
36801d365486k457065J841094L899517P57202l417250l400875L5638K693508L122971
$$ -4365486 -6822551 -4981457 -1081940 -324738 -3741988 -7142863 -7107225 -4413717 -1290746
36792a290746K541931J466095O5553l81536M23322L36839j814547l565252k339241
$$ -1290746 1251185 2717280 2782833 2401297 2824619 3161458 1346911 -2218341 -4557582
36783d557582M91559J926614J759176J741243J958882J089564o84364j751758
$$ -4557582 -4066023 -2139409 -380233 1361010 3319892 4409456 3725092 1973334
36775A973334j665525j541107k007858k326179j598714R2099J887723L128828
$$ 1973334 307809 -1233298 -3241156 -5567335 -7166049 -7073950 -5186227 -2057399
36767b057399L858922L922235J962467k783793p226938o023459J282363P589958
$$ -2057399 1801523 5723758 7686225 4902432 -2324506 -8347965 -7065602 524356
36759E24356O270389l15969m412060l125703l15501N47265L0648o10615j353734
$$ 524356 6794745 6478776 2066716 -1058987 -1374488 -827223 -796575 -1407190 -2760924
36750b760924j466352l9637J263604K16290j433152k01925K566597J913225k497880
$$ -2760924 -4227276 -4266913 -3003309 -2787019 -4220171 -4422096 -1855499 57726 -2440154
36741b440154n106729k674101J656183M038549M397243L452781N32066l280392
$$ -2440154 -7546883 -10220984 -8564801 -4526252 -129009 3323772 3855838 575446
36733E75446m397239j610891J970804L481738L094861J475857j117515k493644
$$ 575446 -3821793 -5432684 -3461880 19858 3114719 4590576 3473061 979417
36725I79417l09348K982277K391119j565327l126761o47633J145495p8380p29391
$$ 979417 670069 3652346 6043465 4478138 1351377 703744 1849239 1770859 1041468
36716A041468Q29041P45357k193236k764581J371393M059819M46693m418779l716850
$$ 1041468 1870509 2615866 422630 -2341951 -970558 3089261 3535954 -882825 -4599675
36707d599675M10016J864776J120441K318458L853051R40936m559538n728663
$$ -4599675 -4189659 -2324883 -1204442 1114016 4967067 5908003 1348465 -4380198
36699d380198j482869J973464J021782j098077j122667n95952j607429k580150
$$ -4380198 -5863067 -3889603 -2867821 -3965898 -5088565 -5684517 -7291946 -9872096
36691i872096j178895J610248K849533J574443l44816p00127N04904J142409k01976
$$ -9872096 -11050991 -9440743 -6591210 -5016767 -5361583 -6061710 -5556806 -4414397 -4616373
36682d616373j992734j576995J188407L957913N004356L996270O79747l792279
$$ -4616373 -6609107 -8186102 -6997695 -3039782 1964574 5960844 6640591 2848312
36674B848312n227142q13988N111680N177975o93280m901735l091338Q20417K114931
$$ 2848312 -2378830 -3192818 1918862 7096837 6403557 1501822 -1589516 -769099 1345832
36665A345832J122780o65386l493054n449659k621879L481485N712195K216764
$$ 1345832 2468612 1803226 -1689828 -7139487 -9761366 -6279881 -567686 1649078
36657A649078L8866L327992O027545K239560l823388n241248k856046j011942
$$ 1649078 1687944 5015936 11043481 13283041 9459653 4218405 1362359 350417
36649C50417O78733L596088M287771M54766k966228j715656k01197l135011n681948
$$ 350417 1029150 4625238 8913009 9367775 6401547 4685891 4484694 1349683 -4332265
36640d332265j713240M248928M194663K56060m04471P81191j964146n254614j490743
$$ -4332265 -6045505 -1796577 2398086 2654146 2249675 3030866 1066720 -4187894 -5678637
36631e678637N399673M204867m347897p756540k095300K799530J103105p42901
$$ -5678637 -278964 3925903 -421994 -8178534 -10273834 -7474304 -6371199 -7114100
36623g114100J994459L886224R26012j648559P2690J123882k195427m468156r35611
$$ -7114100 -5119641 -1233417 -307405 -1955964 -1883274 -759392 -2954819 -7422975 -8358586
36614h358586L601956L228311N25675L88500J357063M17912j96975J668967K214947
$$ -8358586 -4756630 -1528319 -1002644 -614144 742919 1160831 963856 2632823 4847770
36605D847770j435525m336240j518897K575385Q07379m664608n638375m72461
$$ 4847770 3412245 -923995 -2442892 132493 939872 -3724736 -9363111 -9835572
36597i835572M525740M906363K399596J59446o48737M4227J217099P45741j433582
$$ -9835572 -5309832 -403469 1996127 2155573 1506836 1551063 2768162 3513903 2080321
36588B080321k178027j63652J084601j107072l375907j477134K525525L404415
$$ 2080321 -97706 -261358 823243 -283829 -3659736 -5136870 -2611345 793070
36580G93070P08563j586104j581310p59388j12151O60615J112799Q18993R11395
$$ 793070 1501633 -84471 -1665781 -2425169 -2537320 -1876705 -763906 55087 966482
36571I66482J855596J687138m97789j876767k33997J739544M28860k861481m077880
$$ 966482 2822078 4509216 4011427 2134660 1900663 3640207 4069067 1207586 -2870294
36562b870294k251347N59551K766225L174617M13725l750692m057507R11388M975265
$$ -2870294 -5121641 -4562090 -1795865 1378752 1792477 -1958215 -6015722 -5104334 -129069
36553a29069L091097n66588J95663K751794N52804m407344m208424J061212K843081
$$ -129069 2962028 2395440 2591103 5342897 5895701 1488357 -2720067 -1658855 1184226
36544A184226j288657l391374J026787N074301K111928l193041k949000J109580
$$ 1184226 -104431 -3495805 -2469018 2605283 4717211 1524170 -1424830 -315250
36536c15250J347301k898110m731449r42860L616313L784508N85742j693073r69202
$$ -315250 1032051 -1866059 -6597508 -7540368 -3924055 -139547 446195 -1246878 -2216080
36527b216080J734489M035655L513971m79292n177860o377170l102225J160815
$$ -2216080 -481591 3554064 7068035 6588743 1410883 -4966287 -8068512 -6907697
36519f907697K768067J961554J379109J743894J027028j941734m737277l772420
$$ -6907697 -4139630 -2178076 -798967 944927 1971955 30221 -4707056 -8479476
36511h479476P52942M131063K644098j353402k113259J799285N280787L596890
$$ -8479476 -7726534 -3595471 -951373 -2304775 -4418034 -2618749 2662038 6258928
36503F258928j079949k985585j075994L6688k310478m573278k571997K019490
$$ 6258928 5178979 2193394 1117400 1154088 -1156390 -5729668 -8301665 -6282175
36495f282175M230062K803568O98936l92174j642141l090307k582102j3510J581544
$$ -6282175 -2052113 751455 1450391 1058217 -583924 -3674231 -6256333 -6269843 -4688299
36486d688299J211853J989943N081851N890141Q13354n586995n911284m32701
$$ -4688299 -3476446 -1486503 3595348 9485489 10298843 4711848 -1199436 -1632137
36478a632137L811877L437722J616361M61412k183079o235504o664744j380935
$$ -1632137 2179740 5617462 7233823 7695235 5512156 -723348 -7388092 -8769027
36470h769027L796883L129253m72513m96257K936954M275345K026437K30019O06285
$$ -8769027 -4972144 -1842891 -2315404 -2811661 125293 4400638 6427075 6657094 7263379
36461G263379j37087l464341n219352j985384K810545L258472p08613l402952
$$ 7263379 7126292 3661951 -1557401 -3542785 -732240 2526232 1817619 -1585333
36453a585333j317835K520171L114666P1489k360699j187389J395665J071880
$$ -1585333 -2903168 -382997 2731669 2803158 442459 -744930 650735 1722615
36445A722615k478946m577087j524501M040787N958759K345925k039803k252747
$$ 1722615 -756331 -5333418 -6857919 -2817132 3141627 5487552 3447749 1195002
36437A195002M77705J364477m91638j205213Q95242J756073j941636o190917m516455
$$ 1195002 1672707 3037184 2545546 1340333 2235575 3991648 2050012 -4140905 -8657360
36428h657360J913628M924890J008787l477600j802764L443393M876379J131947
$$ -8657360 -6743732 -1818842 -810055 -4287655 -6090419 -2647026 2229353 3361300
36420C361300k409519k103938J61286J425058J257970M17317m74144n16937L14875
$$ 3361300 951781 -1152157 -990871 434187 1692157 2109474 1635330 1118393 1433268
36411A433268O463k554388m587064l015452L74543J829240K025125L855615N253042
$$ 1433268 1439731 -1114657 -5701721 -8717173 -8342630 -6513390 -4488265 -632650 4620392
36402D620392J661523m384545m767874J199820M213875o18876n581917k734247
$$ 4620392 6281915 1897370 -2870504 -1670684 2543191 1924315 -3657602 -6391849
36394f391849L311754L312153j729242l278965L56523K317943p08097l689053
$$ -6391849 -3080095 232058 -1497184 -4776149 -4419626 -2101683 -2809780 -6498833
36386f498833k078858J750123L398171K417412Q46772l56358j216715j698723
$$ -6498833 -8577691 -6827568 -3429397 -1011985 -165213 -521571 -1738286 -3437009
36378c437009k081372k481699j925217Q6244J897282K099788K186866L593540
$$ -3437009 -5518381 -8000080 -9925297 -9839053 -7941771 -5841983 -3655117 -61577
36370f1577L940845O22404l405966k844073J568571L684542J147545j983222k591451
$$ -61577 3879268 4501672 1095706 -1748367 -179796 3504746 4652291 2669069 77618
36361G7618k203029j678063J189764N741120O423813J075932m166096l432559
$$ 77618 -2125411 -3803474 -2613710 3127410 9551223 10627155 6461059 3028500
36353C028500K1287m55631m032638m340114l20959K318381N90296j649983o68406
$$ 3028500 3049787 2594156 -1438482 -5778596 -6099555 -3781174 -3190878 -4840861 -5509267
36344e509267J792612K654505K355032K458819J997815l78468l049977l462325
$$ -5509267 -3716655 -1062150 1292882 3751701 5749516 5371048 2321071 -1141254
36336a141254j839189r4819J356298K882080L254784J247749j402745k037188
$$ -1141254 -2980443 -3075262 -1718964 1163116 4417900 5665649 4262904 2225716
36328B225716j376951k039193l154099j142133L322858M356152m18040m920254
$$ 2225716 848765 -1190428 -4344527 -5486660 -2163802 2192350 1774310 -3145944
36320c145944k830414K740163L500763j786034n609689k724328K907431M453688
$$ -3145944 -5976358 -3236195 264568 -1521466 -7131155 -9855483 -6948052 -2494364
36312b494364J110210k491541k912394o75775K070758L804844L918037K567856
$$ -2494364 -1384154 -3875695 -6788089 -7463864 -5393106 -1588262 2329775 4897631
36304D897631L78373k059496l868786l549664o94926K229231K280308L57518J74527
$$ 4897631 5276004 3216508 -652278 -4201942 -4896868 -2667637 -387329 -29811 144716
36295A44716K319274K838419o49837m816871n105540j713134J594012K547515
$$ 144716 2463990 5302409 4652572 -164299 -5269839 -6982973 -5388961 -2841446
36287b841446J659518K46079l65280P52223K390297J698563j644966m094976l272609
$$ -2841446 -1181928 -935849 -1301129 -548906 1841391 3539954 1894988 -2199988 -5472597
36278e472597j485905j360456j159446J515839M231445L070137l62826q95418
$$ -5472597 -6958502 -8318958 -9478404 -7962565 -3731120 -660983 -1023809 -1919227
36270a919227K000657L580405J531141j194811k150404k648851l477516k349701
$$ -1919227 81430 3661835 5192976 3998165 1847761 -801090 -4278606 -6628307
36262f628307J532918M318240K279804k743687n587693l790964O96367M273377
$$ -6628307 -5095389 -777149 1502655 -1241032 -6828725 -10619689 -9923322 -5649945
36254e649945M502103J674380j162109j250337J95864m16867l300456m386403
$$ -5649945 -1147842 526538 -635571 -1885908 -1690044 -2106911 -5407367 -9793770
36246i793770j546814J924768K467118J413604J642389K109755J12601k977376
$$ -9793770 -11340584 -9415816 -6948698 -5535094 -3892705 -1782950 -1670349 -4647725
36238d647725l131888q6651K353425K407492K049776K064211L71061k901127l583248
$$ -4647725 -7779613 -7866264 -5512839 -3105347 -1055571 1008640 1379701 -1521426 -5104674
36229e104674M6851L144284J104066k746607j810847L280211N239567J234123
$$ -5104674 -5057823 -1913539 -809473 -3556080 -5366927 -2086716 3152851 4386974
36221D386974l086317k561451M64381J459312P95526R45702R16561r54328j955445
$$ 4386974 1300657 -1260794 -796413 662899 1458425 2404127 3320688 2366360 410915
36212D10915R24456M215945K317392k621288k970618K031345M525712N68295l944709
$$ 410915 1335371 5551316 7868708 5247420 2276802 4308147 8833859 9402154 5457445
36203E457445l635318j918053l292434m501655q99962L744217K496341k930582
$$ 5457445 1822127 -95926 -3388360 -7890015 -8789977 -5045760 -2549419 -5480001
36195e480001m467966l64544L037470K222664R16649K012873K574639r7197l328198
$$ -5480001 -9947967 -10312511 -7275041 -5052377 -4135728 -2122855 451784 354587 -2973611
36186b973611l467525j021942J599342L662299M703374L142130p41299l361075
$$ -2973611 -6441136 -7463078 -5863736 -2201437 2501937 5644067 4902768 1541693
36178A541693k181961P85419K136937J395028k1716j768011l909173n021785l534871
$$ 1541693 -640268 145151 2282088 3677116 3655400 1887389 -2021784 -7043569 -10578440
36169a0578440j74529K591668K963023J031424j270170j337852J187917K832973
$$ -10578440 -10752969 -8161301 -5198278 -4166854 -5437024 -6774876 -5586959 -2753986
36161b753986K76489m091808m261115Q88724N265571L760176j097733l533568
$$ -2753986 -2477497 -6569305 -10830420 -9941696 -4676125 -915949 -2013682 -5547250
36153e547250k181577K16820K063349L695902M463573L060049L39985j398682
$$ -5547250 -7728827 -7512007 -5448658 -1752756 2710817 5770866 6110851 4712169
36145D712169j705257j914331k228605j544455j7905P40890K10008m08766k74423
$$ 4712169 3006912 1092581 -1136024 -2680479 -2698384 -1957494 -1747486 -2156252 -2430675
36136b430675J62705L91282L90718J0504o49110m47521J445089L442700K672154
$$ -2430675 -2267970 -1876688 -1485970 -1475466 -2124576 -2572097 -1127008 2315692 4987846
36127D987846j328090n475626o261841l064947J777080N090007M876012J453201
$$ 4987846 3659756 -1815870 -8077711 -11142658 -9365578 -4275571 600441 2053642
36119B053642k682062m662844l488431n95936J514329J199944r54751k255212
$$ 2053642 -628420 -5291264 -8779695 -9375631 -7861302 -6661358 -7616109 -9871321
36111i871321m25034L208716M409420J379180j965991n76958M504041O747955
$$ -9871321 -10296355 -7087639 -2678219 -1299039 -3265030 -3841988 662053 7410008
36103G410008K706711l209056m639082j529430P23183p32446k793004j616428
$$ 7410008 10116719 6907663 2268581 739151 1462334 729888 -2063116 -3679544
36095c679544J928964L912413K476467p70203l358538m007426k786957j009797
$$ -3679544 -1750580 2161833 4638300 3868097 509559 -3497867 -6284824 -7294621
36087g294621m34400j104156q93908J130235K443314Q64024r76358Q26536M164068
$$ -7294621 -7729021 -8833177 -9727085 -8596850 -6153536 -5289512 -6265870 -5439334 -1275266
36078a275266K707000l898074p588818k961252M376647N419716o5484m655520
$$ -1275266 1431734 -2466340 -10055158 -13016410 -8639763 -3220047 -3285531 -7941051
36070g941051m037746o16883K324923L909896L252824k94425l643737k155674
$$ -7941051 -11978797 -12595680 -10270757 -6360861 -3108037 -3402462 -7046199 -9201873
36062i201873L215572N963294L093105o53554j75771K823876L444427Q84256j664079
$$ -9201873 -5986301 -23007 3070098 2416544 2240773 5064649 8509076 9393332 7729253
36053G729253k168150j289530q9702R09745J107173K48419j172369k912414m965230
$$ 7729253 5561103 4271573 4181871 5091616 6198789 6447208 5274839 2362425 -2602805
36044b602805n836965l209868K225293N980406M775980M27271l023318l996527
$$ -2602805 -8439770 -11649638 -9424345 -3443939 1332041 1759312 -1264006 -5260533
36036e260533l284777j461753J079714K960062L043768J958824Q73371L3664k86165
$$ -5260533 -8545310 -10007063 -8927349 -5967287 -2923519 -964695 -91324 -57660 -343825
36027c43825P08756K416813K599883P32766q09759p58782j211326l336705m060111
$$ -343825 364931 2781744 5381627 6114393 5304634 4545852 3334526 -2179 -4062290
36018d062290p86591L299927L326486K58963q79655N75359M6657m064610o791087
$$ -4062290 -4848881 -1548954 1777532 2036495 1156840 1732199 1778856 -2285754 -9076841
36009i076841l686619K545629N682615L840814P45815L11098K329547L435678
$$ -9076841 -12763460 -10217831 -4535216 -694402 51413 362511 2692058 6127736
36001F127736J188624k886290m496826j615452K340058K326668j510838l655170
$$ 6127736 7316360 4430070 -66756 -1682208 657850 2984518 1473680 -2181490
35993b181490q06245L259907K837568j652789m132725j168098L461503L957215
$$ -2181490 -2987735 272172 3109740 1456951 -2675774 -3843872 -382369 3574846
35985C574846N6095l167289k422822k14357n29243k798066k896191M73665L529137
$$ 3574846 3630941 463652 -1959170 -2173527 -2702770 -5500836 -8397027 -7923362 -4394225
35976d394225K579889r44115k578507n82969K458691L248864J186345j723131
$$ -4394225 -1814336 -2758451 -5336958 -5919927 -3461236 -212372 973973 -749158
35968g49158k911231j166741K205144L934102J650541l243202o302292m406673
$$ -749158 -3660389 -4827130 -2621986 1312116 2962657 -280545 -6582837 -10989510
35960a0989510O91624L812760J810244k730284m241183p56041L814932M954489
$$ -10989510 -10297886 -6485126 -4674882 -7405166 -11646349 -12402390 -8587458 -3632969
35952c632969L122986J806419J719540O65758j445143j975352p22228r72723l364228
$$ -3632969 -509983 1296436 3015976 3681734 2236591 261239 -460989 -1433712 -4797940
35943d797940l425946J268814N753663M394032k06075j034113K284494L064641
$$ -4797940 -8223886 -6955072 -1201409 3192623 2986548 1952435 4236929 7301570
35935G301570j404655n092686k266491L842607N606141J318261l364022l388286
$$ 7301570 5896915 804229 -1462262 2380345 7986486 9304747 5940725 2552439
35927B552439j58320J258884j211379m214190l292524J104704L637167J033236
$$ 2552439 2394119 3653003 2441624 -1772566 -5065090 -3960386 -323219 710017
35919G10017l054829k899029J069454L037413O66607j806308q92896P70395k74408
$$ 710017 -2344812 -5243841 -4174387 -1136974 -470367 -2276675 -3169571 -2399176 -2673584
35910b673584j995206p59601J554327K91997l570396m113744K09665M150729M059060
$$ -2673584 -4668790 -5428391 -3874064 -3582067 -7152463 -11266207 -11056542 -6905813 -2846753
35901b846753K692352K895042K369275q37935k878091k76698K394763j303455
$$ -2846753 -154401 2740641 5109916 4271981 1393890 1117192 3511955 2208500
35893B208500p896669p228881J944485Q569120M835337k944214m664233j082356
$$ 2208500 -5688169 -12917050 -10972565 -2403445 2431892 -512322 -5176555 -6258911
35885f258911l34222l763025m259967J635913Q013216Q172025L226268q28518
$$ -6258911 -6593133 -10356158 -14616125 -12980212 -4966996 3205029 6431297 5602779
35877E602779q79649J289791K438448J088769j523971k740579j577405j48028
$$ 5602779 4723130 6012921 8451369 9540138 8016167 5275588 3698183 3550155
35869C550155m90846j263754l20150Q23377q71580m040389l968586J2779L117864
$$ 3550155 3059309 1795555 1475405 2298782 1427202 -2613187 -6581773 -6568994 -3451130
35860c451130K337152K33701l87552q01757k575025l727163k049747J142372L669888
$$ -3451130 -1113978 -880277 -1267829 -2069586 -4644611 -8371774 -10421521 -9279149 -5609261
35851e609261N550079O346682L307753l723901q876197o712003k1040L696055
$$ -5609261 -59182 6287500 9595253 5871352 -3004845 -9716848 -9737888 -6041833
35843f041833K065632o31172q47297L01192P42991O80532Q75106Q14848n6010
$$ -6041833 -3976201 -4607373 -5454670 -5153478 -4410487 -3729955 -2854849 -2040001 -2096011
35834b096011j164861j625302j023972N63310K286852K880744K325297J976181
$$ -2096011 -3260872 -4886174 -5910146 -5346836 -3059984 -179240 2146057 4122238
35826D122238J982607N19776k775012m955865l783006j344163p34556j254950
$$ 4122238 6104845 6624621 3849609 -1106256 -4889262 -6233425 -6967981 -8222931
35818h222931m39158R60261K14180k082772k220636J051361M715820N607890L501956
$$ -8222931 -8662089 -7701828 -7487648 -9570420 -11791056 -10739695 -6023875 -415985 3085971
35809C085971j7245l135814m200686k810500m68854J424828L154956M541774L409624
$$ 3085971 3068726 -67088 -4267774 -7078274 -7547128 -6122300 -2967344 1574430 4984054
35800D984054q60719m407798l339486N19460K325635J095963m50982j299570k293215
$$ 4984054 4123335 -284463 -3623949 -3104489 -778854 317109 -133873 -1433443 -3726658
35791c726658k155497Q73802M008223K641077j862891l464987j015326M16539
$$ -3726658 -5882155 -5008353 -1000130 1640947 -221944 -3686931 -4702257 -4285718
35783d285718r89185p13565K857545L883876j369809p083843o066617j33295M129716
$$ -4285718 -5274903 -5988468 -3130923 752953 -616856 -7700699 -13767316 -13900611 -9770895
35774i770895N425146O330732N496364j91757p151218p569800j123968L603552
$$ -9770895 -4345749 1984983 7481347 7289590 138372 -7431428 -8555396 -4951844
35766d951844J561282k077386j163302J982450J777500p89542m52785K525486
$$ -4951844 -3390562 -5467948 -6631250 -4648800 -2871300 -3660842 -4113627 -1588141
35758a588141K309459k341613m928751j246359L270048J479715m022052m329074
$$ -1588141 721318 -1620295 -6549046 -7795405 -4525357 -3045642 -7067694 -11396768
35750a1396768K051036O522522L307457k125922k108042J552057J745322j726555
$$ -11396768 -9345732 -2823210 484247 -1641675 -3749717 -2197660 -452338 -2178893
35742b178893k460246Q66650J823679k699647o564072l859775J857170L497066
$$ -2178893 -4639139 -3772489 -1948810 -4648457 -11212529 -15072304 -13215134 -9718068
35734i718068J132385K33906J985054K463404P36886P29926L691738M952399J115007
$$ -9718068 -8585683 -8351777 -6366723 -3903319 -3166433 -2436507 1255231 6207630 7322637
35725G322637m202228n477655k778886k47322M25073P07254R01697k59642j877595
$$ 7322637 3120409 -2357246 -5136132 -5383454 -4958381 -4251127 -3349430 -3609072 -5486667
35716e486667j165134J702874L004333J187674n92111K42909J502038K84577j970831
$$ -5486667 -6651801 -4948927 -1944594 -756920 -1349031 -1106122 395916 680493 -1290338
35707a290338k216727r85994o60412p04102O69166J838591J75974k130142p74632
$$ -1290338 -3507065 -4493059 -5153471 -5857573 -5188407 -3349816 -3173842 -5303984 -6078616
35698f078616K665096K368538j590599k468570J783796M486051J332092k414918
$$ -6078616 -3413520 -1044982 -2635581 -5104151 -3320355 1165696 2497788 82870
35690H2870j358122P62505j491583m740662k473703L102707M313191N91637j561617
$$ 82870 -1275252 -512747 -2004330 -6744992 -9218695 -6115988 -1802797 -1211160 -2772777
35681b772777r6123L53137j937031k706349Q6449K644111K229242J125636J349629
$$ -2772777 -2868900 -2515763 -4452794 -7159143 -7072694 -4428583 -2199341 -1073705 275924
$$ [...]
##END NTUPLES=NMR SPECTRUM
##END=
