##TITLE=31Pdec_DE-43H_DEK
 D2O, 64 sc
 10.10.2024
##JCAMPDX= 6.0         $$ Bruker NMR JCAMP-DX V2.0
##DATA TYPE= NMR SPECTRUM
##DATA CLASS= NTUPLES
##ORIGIN= UXNMR, Bruker Analytische Messtechnik GmbH
##OWNER= root
$$ XWIN-NMR		Version 3.5
$$ Thu Oct 10 15:29:04 2024 Russian Standard Time (UT+4h)  she@DPX200
##.OBSERVE FREQUENCY= 81.013821
##.OBSERVE NUCLEUS= ^31P
##.ACQUISITION MODE= SIMULTANEOUS
##.ACQUISITION SCHEME= undefined
##.AVERAGES= 64
##.DIGITISER RES= 17
##SPECTROMETER/DATA SYSTEM= spect
##.PULSE SEQUENCE= zgpg30
##.SOLVENT NAME= CDCl3
##.SHIFT REFERENCE= (INTERNAL, CDCl3, 0, 198.062)
##AUDIT TRAIL= $$ (NUMBER, WHEN, WHO, WHERE, WHAT)
$$ ##TITLE= Audit trail, XWIN-NMR		Version 3.5
$$ ##JCAMPDX= 5.01
$$ ##ORIGIN= Bruker BioSpin GmbH
$$ ##OWNER= she
$$ F:/spectra/data/she/nmr/P31/2/pdata/1/auditp.txt
$$ ##AUDIT TRAIL=  $$ (NUMBER, WHEN, WHO, WHERE, WHAT)
(   1,<2024-10-10 15:05:35.42 +0400>,<she>,<DPX200>,
      <created by zg, POWCHK disabled, PULCHK disabled
       configuration hash MD5:
       00 E9 B6 7A A2 85 ED C7 34 08 36 98 17 FE 4E 26
       data hash MD5: 32K
       35 37 6D 03 55 80 4F 5D E2 9E B6 64 5F 76 78 F7>)
(   2,<2024-10-10 15:28:05.71 +0400>,<she>,<DPX200>,
      <Start of raw data processing
       efp BC_mod = 2 LB = 1.5 FT_mod = 6 PKNL = 1 PHC0 = 2768.644 PHC1 = 119.6875 SI = 64K 
       data hash MD5: 64K
       F3 81 D9 43 93 E0 BF 06 7E 6E 6E 76 C1 96 B6 CE>)
(   3,<2024-10-10 15:28:28.46 +0400>,<she>,<DPX200>,
      <pk PHC0 = -333.2 PHC1 = 388.0004 
       data hash MD5: 64K
       D0 23 6D F5 69 76 46 E9 1E 03 61 60 E8 7E FA C6>)
(   4,<2024-10-10 15:28:34.67 +0400>,<she>,<DPX200>,
      <abs ABSG = 5 
       data hash MD5: 64K
       22 36 23 2B 67 A5 0E CD 7B FD E5 AF 86 34 C9 0A>)
$$ ##END=
$$ 
$$ hash MD5
$$ AE 1D 6D A6 9B 78 95 27 6B B3 8E 5C 47 E0 EE B7
##$RELAX= 
##$RELAX= 
##$RELAX= 
##$RELAX= 
##$RELAX= 
##$RELAX= 
##$RELAX= 
##$RELAX= 
$$ Bruker specific parameters
$$ --------------------------
##$DU= <F:/spectra>
##$EXPNO= 2
##$NAME= <P31>
##$PROCNO= 1
##$TYPE= <nmr>
##$USER= <she>
##$AMP= (0..31)
100 100 100 100 100 100 100 100 100 100 100 100 100 100 100 100 100 100 
100 100 100 100 100 100 100 100 100 100 100 100 100 100 
##$AQSEQ= 0
##$AQ_mod= 1
##$AUNM= <au_zg>
##$AUTOPOS= <>
##$BF1= 81.014009
##$BF2= 200.13
##$BF3= 200.13
##$BF4= 200.13
##$BF5= 200.13
##$BF6= 200.13
##$BF7= 200.13
##$BF8= 200.13
##$BYTORDA= 1
##$CFDGTYP= 0
##$CFRGTYP= 5
##$CHEMSTR= <none>
##$CNST= (0..31)
1 1 145 1 1 1 1 1 1 1 1 1 1 1 1 1 1 1 1 1 1 1 1 1 1 1 1 1 1 1 1 1 
##$CPDPRG= <waltz16>
##$CPDPRG1= <>
##$CPDPRG2= <waltz16>
##$CPDPRG3= <>
##$CPDPRG4= <mlev>
##$CPDPRG5= <mlev>
##$CPDPRG6= <mlev>
##$CPDPRG7= <mlev>
##$CPDPRG8= <mlev>
##$CPDPRGB= <>
##$CPDPRGT= <>
##$D= (0..31)
0 1 0 0 0 0 0 0 0 0.06 0 0.03 2e-05 3e-06 0 0 0.0002 0 0 0 0 0 0 0 0 0 
0 0 0 0 0 0 
##$DATE= 1728558334
##$DBL= (0..7)
120 120 120 11 120 120 24 19 
##$DBP= (0..7)
150 150 150 150 150 150 150 150 
##$DBP07= 0
##$DBPNAM0= <>
##$DBPNAM1= <>
$$ [...]
##$SUBNAM3= <"">
##$SUBNAM4= <"">
##$SUBNAM5= <"">
##$SUBNAM6= <"">
##$SUBNAM7= <"">
##$SUBNAM8= <"">
##$SUBNAM9= <"">
##$SW= 400.765351723535
##$SWIBOX= (0..15)
0 1 3 0 0 0 0 0 0 0 0 0 0 0 0 0 
##$SW_h= 32467.5324675325
##$TD= 32768
##$TD0= 1
##$TE= 0
##$TE2= 300
##$TE3= 300
##$TEG= 300
##$TL= (0..7)
0 120 53 12 22 120 120 120 
##$TP= (0..7)
150 150 150 150 150 150 150 150 
##$TP07= 0
##$TPNAME0= <>
##$TPNAME1= <>
##$TPNAME2= <>
##$TPNAME3= <>
##$TPNAME4= <>
##$TPNAME5= <>
##$TPNAME6= <>
##$TPNAME7= <>
##$TPOAL= (0..7)
0.5 0.5 0.5 0.5 0.5 0.5 0.5 0.5 
##$TPOFFS= (0..7)
0 0 0 0 0 0 0 0 
##$TUNHIN= 0
##$TUNHOUT= 0
##$TUNXOUT= 0
##$USERA1= <user>
##$USERA2= <user>
##$USERA3= <user>
##$USERA4= <user>
##$USERA5= <user>
##$V9= 5
##$VALIST= <valist>
##$VCLIST= <CCCCCCCCCCCCCCC>
##$VD= 0
##$VDLIST= <DDDDDDDDDDDDDDD>
##$VPLIST= <PPPPPPPPPPPPPPP>
##$VTLIST= <TTTTTTTTTTTTTTT>
##$WBST= 1024
##$WBSW= 4
##$XGAIN= (0..3)
0 0 0 0 
##$XL= 0
##$YL= 0
##$YMAX_a= 5686
##$YMIN_a= -20345
##$ZGOPTNS= <>
##$ZL1= 120
##$ZL2= 120
##$ZL3= 120
##$ZL4= 120
##$ABSF1= 198.0616
##$ABSF2= -202.7028
##$ABSG= 5
##$ABSL= 3
##$ALPHA= 0
##$AQORDER= 0
##$ASSFAC= 0
##$ASSFACI= 0
##$ASSFACX= 0
##$ASSWID= 0
##$AUNMP= <proc_1d>
##$AZFE= 0.1
##$AZFW= 0.5
##$BCFW= 0
##$BC_mod= 2
##$BYTORDP= 0
##$COROFFS= 0
##$CY= -3
##$DATMOD= 1
##$DC= 0
##$DFILT= <>
##$DTYPP= 0
##$F1P= 0
##$F2P= 0
##$FCOR= 1
##$FTSIZE= 65536
##$FT_mod= 6
##$GAMMA= 0
##$GB= 0
##$INTBC= 1
##$INTSCL= 9.790993e-09
##$ISEN= 30
##$LB= 1.5
##$LEV0= 0
##$LPBIN= 0
##$MAXI= 10000
##$MC2= 0
##$MEAN= 0
##$ME_mod= 0
##$MI= 50
##$NCOEF= 0
##$NC_proc= -8
##$NLEV= 6
##$NOISF1= 182.463
##$NOISF2= 159.3651
##$NSP= 0
##$NTH_PI= 0
##$NZP= 0
##$OFFSET= 198.0616
##$PC= 4
##$PHC0= 2435.444
##$PHC1= 507.6879
##$PH_mod= 1
##$PKNL= yes
##$PPARMOD= 0
##$PSCAL= 0
##$PSIGN= 0
##$REVERSE= no
##$SF= 81.0140089999434
##$SI= 65536
##$SIGF1= 159.3651
##$SIGF2= -187.1042
##$SINO= 113.3802
##$SIOLD= 16384
##$SREGLST= <1H.CDCl3>
##$SSB= 0
##$STSI= 65536
##$STSR= 0
##$SW_p= 32467.5324675325
##$SYMM= 0
##$S_DEV= 0
##$TDeff= 32768
##$TDoff= 0
##$TI= <>
##$TILT= no
##$TM1= 0
##$TM2= 0
##$TOPLEV= 0
##$USERP1= <user>
##$USERP2= <user>
##$USERP3= <user>
##$USERP4= <user>
##$USERP5= <user>
##$WDW= 1
##$XDIM= 65536
##$YMAX_p= 431052077
##$YMIN_p= -22216691
$$ End of Bruker specific parameters
$$ ---------------------------------
##NTUPLES= NMR SPECTRUM
##VAR_NAME=  FREQUENCY,     SPECTRUM/REAL,   SPECTRUM/IMAG
##SYMBOL=    X,             R,               I
##VAR_TYPE=  INDEPENDENT,   DEPENDENT,       DEPENDENT
##VAR_FORM=  AFFN,          ASDF,            ASDF
##VAR_DIM=   65536,         65536,           65536
##UNITS=     HZ,            ARBITRARY UNITS, ARBITRARY UNITS
##FACTOR=    0.49542278885378, 1,            1
##FIRST=     16045.7642231865, 0,            0
##LAST=      -16421.768244346, 0,            0
##MIN=       -16421.768244346, -22216691,    0
##MAX=       16045.7642231865, 431052077,    0
$$ Real data points
##PAGE= N=1
##DATA TABLE= (X++(R..R)), XYDATA
$$ [...]
##PAGE= N=2
##DATA TABLE= (X++(I..I)), XYDATA
$$ plain form
7450 -1540479 -708789 958150 2705180 3525064 4515822 6746736 9089373 10046234 9707426
7441 9707426 8455860 5953884 2836183 1067044 1042993 622593 -1350438 -2914203 -2197190
7432 -2197190 -427888 402114 785037 2240705 4400591 6064922 7744327 10478823 12943736
7423 12943736 12210090 7209371 -178444 -6978621 -10654020 -9719288 -4804608 1082190
7415 1082190 4799470 5513094 4147834 1250543 -3238136 -8521177 -12624649 -13760601
7407 -13760601 -11628741 -7661250 -4126632 -2276444 -1167418 917384 3974075 6371601
7399 6371601 7239043 7100847 6211304 4359473 2532227 2343124 3260060 3017392 1554503
7390 1554503 1500565 3387644 3732010 264666 -3857266 -4147593 -937988 1792917 2105514
$$ packed form
7450a540479Q31690J666939J747030Q19884R90758K230914K342637R56861l38808
7441I707426j251566k501976l117701j769139k4051m20400j973031j563765P17013
7432b197190J769302Q30002L82923J455668K159886J664331J679405K734496K464913
7423A2943736p33646n000719p387815o800177l675399R34732M914680N886798
7415A082190L717280P13624j365260k897291m488679n283041m103472j135952
7407a3760601K131860L967491L534618J850188J109026K084802L056691K397526
7399F371601Q67442j38196q89543j851831j827246j89103R16936k42668j462889
7390A554503n3938J887079L44366l467344m121932k90327L209605K730905L12597
$$ plain form
7381 2105514 1303759 572176 -223615 -761379 -245507 747093 678946 -617512 -1772358
7372 -1772358 -1876517 -1259200 -813173 -1707741 -4613634 -7833038 -7849959 -3674897 1083864
7363 1083864 2820706 2785989 4422262 7535297 8813436 7280464 5399758 4870850 4830842
7354 4830842 4430485 3965204 3123114 1182368 -671667 -265952 1856146 2696494 1370712
7345 1370712 293734 924808 1513607 491626 -792585 -562418 492095 726449 165995
7336 165995 -139558 11435 256337 665575 1158520 828620 -1137327 -4455000 -7974868
7327 -7974868 -10144923 -9548346 -6457607 -3586764 -3409332 -4848817 -4717733 -2266435 242519
7318 242519 1488722 2544927 3760815 3411238 838220 -1769659 -2275653 -985004 1078553
$$ packed form
7381B105514q01755p31583p95791n37764N15872R92600o8147j296458j154846
7372a772358j04159O17317M46027q94568k905893l219404j6921M175062M758761
7363A083864J736842l4717J636273L113035J278139j532972j880706n28908m0008
7354D830842m00357m65281q42090j940746j854035M05715K122098Q40348j325782
7345A370712j076978O31074N88799j021981j284211K30167J054513K34354n60454
7336A65995l05553J50993K44902M09238M92945l29900j965947l317673l519868
7327g974868k170055N96577L090739K870843J77432j439485J31084K451298K508954
7318B42519J246203J056205J215888l49577k573018k607879n05994J290649K063557
$$ plain form
7309 1078553 3784360 6497827 7763407 7877645 8976251 10929462 10408455 6378131 3118139
7300 3118139 4333891 7025211 5454785 -358048 -4343998 -2054435 4912890 11869815
7292 11869815 15261923 14181752 10766780 9174478 11429290 14236114 12487801 5834210
7284 5834210 -946338 -3984624 -3660564 -1781041 1005674 3808262 4710675 3343110 1993981
7275 1993981 2362713 3129144 2508279 1328780 1392203 2204833 1817579 211537 -554103
7266 -554103 497616 2092680 3156269 4620134 7697677 11395742 13069851 11403942
7258 11403942 8010013 5704835 5502631 5752991 4340698 1340757 -989179 -820482 1158378
7249 1158378 2561298 1945217 236212 -509057 560346 2334964 3319868 3452074 3799874
$$ packed form
7309A078553K705807K713467J265580J14238J098606J953211n21007m030324l259992
7300C118139J215752K691320j570426n812833l985950K289563O967325O956925
7292A1869815L392108j080171l414972j592302K254812K806824j748313o653591
7284E834210o780548l038286L24060J879523K786715K802588R02413j367565j349129
7275A993981L68732P66431o20865j179499O3423Q12630l87254j606042p65640
7266e54103J051719J595064J063589J463865L077543L698065J674109j665909
7258A1403942l393929k305178k02204K50360j412293k999941k329936J68697J978860
7249A158378J402920o16081j709005p45269J069403J774618R84904J32206L47800
$$ plain form
7240 3799874 4709514 5214481 4593928 3516711 2802990 1911799 69402 -1530525 -605407
7231 -605407 2656002 4877449 3759431 1471432 1536956 3313102 2750270 -1041277 -3626344
7222 -3626344 -1757413 1060468 -725765 -6149017 -8500788 -4704906 757040 2728436
7214 2728436 1732651 571593 -1633371 -7563087 -15716711 -20759020 -19644907 -14234755
7206 -14234755 -8154888 -3963659 -2927194 -4401645 -5486223 -4155851 -2474317 -3683386
7198 -3683386 -6616723 -6770404 -2929180 1331733 3217628 3530088 3081592 1013051 -1583404
7189 -1583404 -1145867 2507106 4124441 216515 -5453700 -7271877 -5179223 -2543184
7181 -2543184 33159 3638430 6207865 4600456 737301 275752 4880059 10335215
$$ packed form
7240C799874R09640N04967o20553j077217p13721q91191j842397j599927R25118
7231f05407L261409K221447j118018k287999O5524J776146n62832l791547k585067
7222c626344J868931K817881j786233n423252k351771L795882N461946J971396
7214B728436r95785j161058k204964n929716q153624n042309J114113N410152
7206a4234755O079867M191229J036465j474451j084578J330372J681534j209069
7198c683386k933337j53681L841224M260913J885895L12460m48496k068541k596455
7189a583404M37537L652973J617335l907926n670215j818177K092654K636039
7181b543184K576343L605271K569435j607409l863155m61549M604307N455156
$$ plain form
7173 10335215 12898102 13362121 13807087 13992089 12567026 9363983 5257928 1450442 -777746
7164 -777746 -1298291 -1813641 -3371835 -4108672 -2125178 410396 -430219 -4429761 -7559980
7155 -7559980 -8220103 -8848021 -10577686 -10773055 -7714648 -3867978 -2094701 -1735530 -910677
7146 -910677 -2969 -275376 -1250726 -1970187 -2957914 -4542257 -5006512 -2990811 -396880
7137 -396880 -327476 -2859459 -4939779 -3957133 90631 5164643 8509960 8387640 5852880
7128 5852880 3752825 2797172 327982 -5178790 -10196297 -9615998 -3430750 2890458 4840310
7119 4840310 3325951 2178099 3249512 5098975 5419991 3655856 1350078 274304
7111 274304 378411 71581 -1338743 -2514460 -2189115 -1390504 -2133411 -4402866 -6066860
$$ packed form
7173A0335215K562887M64019M44966J85002j425063l203043m106055l807486k228188
7164g77746n20545n15350j558194p36837J983494K535574q40615l999542l130219
7155g559980o60123o27918j729665j95369L058407L846670J773277L59171Q24853
7146i10677R07708k72407r75350p19461r87727j584343m64255K015701K593931
7137c96880O9404k531983k080320R82646M047764N074012L345317j22320k534760
7128E852880k100055r55653k469190n506772n017507N80299O185248O321208J949852
7119D840310j514359j147852J071413J849463L21016j764135k305778j075774
7111B74304J04107l06830j410324j175717L25345P98611p42907k269455j663994
$$ plain form
7102 -6066860 -5784725 -4369555 -2797510 -517420 2942790 5735377 5037157 796769 -3617711
7093 -3617711 -5448979 -5738837 -6877306 -8276760 -7289611 -4207745 -2857924 -4899421 -6808711
7084 -6808711 -5047332 -1450885 6626 -267949 1437234 5482241 8016198 7133958 5488397
7075 5488397 5514579 5940613 4869856 3038277 1913070 1236873 428900 2361 -221871
7066 -221871 -1862259 -5075133 -7343566 -7105486 -6158460 -6469434 -7233810 -7405078 -8336909
7057 -8336909 -10972616 -12948335 -11896714 -9527002 -8767013 -8613250 -5863230 -888860 2418482
7048 2418482 2165979 333471 -789149 -835818 -169677 433587 -955068 -5335641 -10011889
7039 -10011889 -11071233 -8606264 -6119405 -4687197 -1669574 3853168 8317175 8374859
$$ packed form
7102f066860K82135J415170J572045K280090L460210K792587o98220m240388m414480
7093c617711j831268k89858j138469j399454R87149L081866J349821k041497j909290
7084f808711J761379L596447J457511k74575J705183M045007K533957q82240j645561
7075E488397K6182M26034j070757j831579j125207o76197q07973m26539k24232
7066b21871j640388l212874k268433K38080R47026l10974p64376j71268r31831
7057h336909k635707j975719J051621K369712P59989J53763K750020M974370L307342
7048B418482k52503j832508j122620m6669O66141O03264j388655m380573m676248
7039a0011889j059344K464969K486859J432208L017623N522742M464007N7684
$$ plain form
7031 8374859 5394948 3054568 2613200 2638815 1787298 17357 -1835553 -2504453 -1494237
7022 -1494237 -527870 -2078703 -5654152 -7590741 -5777635 -2576229 -1502988 -2909298
7014 -2909298 -4814821 -6293506 -7677111 -8535047 -8017993 -6912687 -7152772 -9054446 -10661707
7005 -10661707 -10187442 -7913204 -5387049 -3754191 -3212682 -3239730 -2793917 -779882 3012014
6996 3012014 7256614 9624899 8439347 4208248 -592084 -3639433 -4605057 -4613794 -4354528
6987 -4354528 -3633110 -2668037 -2562869 -3797463 -4993724 -4193766 -1422119 706864 -453880
6978 -453880 -4364365 -7253421 -6026826 -2009039 243989 -1934914 -6478663 -9322540
6970 -9322540 -8833461 -6708768 -5467203 -6043109 -7205782 -6667361 -3494142 291405 1814252
$$ packed form
7031H374859k979911k340380m41368K5615q51517j769941j852910o68900J010216
7022a494237R66367j550833l575449j936589J813106L201406J073241j406310
7014b909298j905523j478685j383605q57936N17054J105306k40085j901674j607261
7005a0661707M74265K274238K526155J632858N41509k7048M45813K014035L791896
6996C012014M244600K368285j185552m231099m800332l047349r65624q737K59266
6987d354528P21418R65073J05168j234594j196261P99958K771647K128983j160744
6978d53880l910485k889056J226595M017787K253028k178903m543749k843877
6970i322540M89079K124693J241565n75906j162673N38421L173219L785547J522847
$$ plain form
6961 1814252 1254247 1495271 3292380 3964688 2690289 3381465 8602280 13614858 11605660
6952 11605660 3414905 -3328556 -4461048 -3253218 -3567267 -4609052 -4411659 -3661284 -3318376
6943 -3318376 -2340041 -528046 -156762 -2029903 -3379110 -2710159 -3218802 -7624555 -12766020
6934 -12766020 -13872858 -11849938 -11271623 -12532563 -11394010 -6326193 -1269341 80292
6926 80292 -1383713 -3195085 -5190909 -8085106 -10632262 -10798926 -8636004 -6000737 -3944597
6917 -3944597 -1894266 633754 2607139 2360543 -103343 -2160105 -870883 3390009
6909 3390009 6723430 6080179 2827289 574403 400933 273535 -1174713 -2748402 -3227537
6900 -3227537 -3637105 -5371982 -7273297 -6619856 -3103583 -144072 -1162685 -5300650 -8256666
$$ packed form
6961A814252n60005K41024J797109O72308j274399O91176N220815N012578k009198
6952A1605660q190755o743461j132492J207830l14049j041785J97393P50375L42908
6943c318376R78335J811995L71284j873141j349207O68951n08643m405753n141465
6934a2766020j106838K022920N78315j260940J138553N067817N056852J349633
6926H0292j464005j811372j995824k894197k547156j66664K162922K635267K056140
6917c944597K050331K528020J973385k46596k463886k056762J289222M260892
6909C390009L333421o43251l252890k252886j73470j27398j448248j573689m79135
6900c227537m09568j734877j901315O53441L516273K959511j018613m137965k956016
$$ plain form
6891 -8256666 -7378912 -4350931 -2134546 -1009919 587327 2619643 3452198 2922471 2700645
6882 2700645 3303179 3251228 1728020 -335503 -2338937 -4569539 -6185423 -5779033 -4748622
6873 -4748622 -6305616 -9584301 -9104548 -2935014 2879833 2158844 -2746681 -5090592 -3627191
6864 -3627191 -2461441 -2764998 -1253110 2985027 6271572 6352494 5560696 6151911 6767368
6855 6767368 5527223 2972752 3052 -3757936 -7607579 -8944940 -6907322 -4131592
6847 -4131592 -3002905 -2740945 -1987839 -1544320 -2382938 -3322632 -2909436 -1709954 -873805
6838 -873805 -262907 390840 396294 -428051 -1234232 -2079213 -3648675 -4045528 306138 8373697
6828 8373697 13163091 10091438 3326151 -183866 158692 267198 -470066 1186178 5359073
$$ packed form
6891h256666Q77754L027981K216385J124627J597246K032316Q32555n29727k21826
6882B700645O02534n1951j523208k063523k003434k230602j615884M06390J030411
6873d748622j556994l278685M79753O169534N814847p20989m905525k343911J463401
6864c627191J165750l03557J511888M238137L286545Q0922p91798N91215O15457
6855F767368j240145k554471k969700l760988l849643j337361K037618K775730
6847d131592J128687K61960P53106M43519q38618r39694M13196J199482Q36149
6838h73805O10898O53747N454q24345q06181q44981j569462l96853M351666Q067559
6828H373697M789394l071653o765287l510017L42558J08506p37264J656244M172895
$$ plain form
6819 5359073 7833303 6665335 4804786 4446242 3283824 -1127912 -6781891 -9908632
6811 -9908632 -10000507 -9448221 -9580757 -9486491 -8134325 -5761822 -3184164 -843815 1251110
6802 1251110 2947893 3455961 2056119 -145581 -261993 2984445 6635689 6432356 2243023
6793 2243023 -1772256 -2774655 -2566083 -4222925 -7517910 -9379429 -7719144 -3368334
6785 -3368334 1043584 3076721 2016317 -656311 -2701731 -3348005 -3372233 -2974718 -1098745
6776 -1098745 2476516 5937608 7610984 8210735 9392253 10722451 9798983 5564435 290279
6767 290279 -2412538 -1227520 1638976 2912874 1668559 -168264 -672209 -212757 -208123
6758 -208123 -840822 -1720093 -4034194 -9479059 -16578902 -20437336 -17600742 -9845908 -2005060
$$ packed form
6819E359073K474230j167968j860549l58544j162418m411736n653979l126741
6811i908632r1875N52286j32536R4266J352166K372503K577658K340349K094925
6802A251110J696783N08068j399842k201700j16412L246438L651244k03333m189333
6793B243023m015279j002399K08572j656842l294985j861519J660285M350810
6785c368334M411918K033137j060404k672628k045420o46274k4228L97515J875973
6776a098745L575261L461092J673376N99751J181518J330198r23468m234548n274156
6767B90279k702817J185018K866496J273898j244315j836823n03945M59452M634
6758b08123o32699q79271k314101n444865p099843l858434K836594P754834P840848
$$ plain form
6749 -2005060 2694637 3940379 2473056 -909465 -4628259 -6335367 -4571660 -318224
6741 -318224 3315095 3491829 504610 -2111022 -1475952 1014023 1830065 899192 2143126
6732 2143126 7308960 12290055 12153237 7672699 3658849 2115758 750382 -1949579
6724 -1949579 -4000597 -3520261 -2095829 -2482697 -4522996 -5339172 -3068841 942187 3672455
6715 3672455 3558067 2003020 1652122 3059531 3882396 2190759 -449551 -845757 1532680
6706 1532680 4231773 5516944 5928896 5864981 4374092 1521555 -535176 -623078 -754121
6697 -754121 -3206992 -6895398 -8779374 -7786768 -5242453 -2389082 222327 1589711 1039308
6688 1039308 -38056 380234 1730626 1499270 -603649 -1736128 -183647 1985058 2277867
$$ packed form
6749b005060M699697J245742j467323l382521l718794j707108J763707M253436
6741c18224L633319J76734k987219k615632O35070K489975Q16042r30873J243934
6732B143126N165834M981095j36818m480538m013850j543091j365376k699961
6724a949579k051018M80336J424432l86868k040299q16176K270331M011028K730268
6715C672455j14388j555047l50898J407409Q22865j691637k640310l96206K378437
6706A532680K699093J285171M11952o3915j490889k852537k056731q7902j31043
6697g54121k452871l688406j883976R92606K544315K853371K611409J367384n50403
6688A039308j077364M18290J350392k31356k102919j132479J552481K168705K92809
$$ plain form
6679 2277867 1768562 3254002 6459544 7803361 5165938 770306 -1607641 -939980 684719
6670 684719 1223162 868687 1052858 2340837 3938743 4770832 4353989 2853825 1015541
6661 1015541 -56577 115020 607043 298160 -111063 1236203 4151022 5724874 4260578
6652 4260578 2176293 2814013 5612386 7241178 6866874 6921455 8329186 8555610 5960619
6643 5960619 3016436 2717858 3898564 2873722 -1434655 -6460381 -9264210 -8645036 -4783915
6634 -4783915 753944 4917701 5407033 3318290 1975782 3199808 6218781 9709080
6626 9709080 12739794 13930232 12240954 9091083 7411170 7893846 8320481 7336276 6445885
6617 6445885 6920410 7128284 5137863 2320625 1826213 4186763 6669287 6787314 4626729
$$ packed form
6679B277867n09305J485440L205542J343817k637423m395632k377947O67661J624699
6670F84719N38443l54475J84171J287979J597906Q32089m16843j500164j838284
6661A015541j072118J71597M92023l08883m09223J347266K914819J573852j464296
6652D260578k084285O37720K798373J628792l74304N4581J407731K26424k594991
6643E960619k944183k98578J180706j024842m308377n025726k803829O19174L861121
6634d783915N537859M163757M89332k088743j342508J224026L018973L490299
6626I709080L030714J190438j689278l149871j679913M82676M26635r84205q90391
6617F445885M74525K07874j990421k817238m94412K360550K482524J18027k160585
$$ plain form
6608 4626729 1735135 -651308 -2070216 -2808133 -3633868 -4652530 -4619249 -2542175 295163
6599 295163 1484938 814348 735662 2827066 5285280 5071810 1439190 -3944403 -9325534
6590 -9325534 -13472459 -14561194 -11105166 -4922554 -969515 -2137665 -5307336 -4901824
6582 -4901824 11053 4745372 5456084 3618444 2455999 1697412 -936032 -4594332 -5715732
6573 -5715732 -3768906 -2723693 -5184011 -8142588 -7145941 -2684186 543676 -123591 -2619791
6564 -2619791 -3694135 -2679311 -1063838 -230524 -740890 -2639658 -5198147 -6878215 -6650961
6555 -6650961 -5368831 -5122163 -7004583 -9935832 -12012147 -12649359 -12677843 -12379659 -10653836
6546 -10653836 -6993843 -3262528 -1871506 -2590671 -3032527 -2325065 -2118598 -3309686 -4130892
$$ packed form
6608D626729k891594k386443j418908p37917q25735j018662L3281K077074K837338
6599B95163J189775o70590p8686K091404K458214k13470l632620n383593n381131
6590i325534m146925j088735L456028O182612L953039j168150l169671M05512
6582d901824M912877M734319P10712j837640j162445p58587k633444l658300j121400
6573e715732J946826J045213k460318k958577R96647M461755L227862o67267k496200
6564b619791j074344J014824J615473Q33314n10366j898768k558489j680068K27254
6555f650961J282130K46668j882420k931249k076315o37212k8484K98184J725823
6546a0653836L659993L731315J391022p19165m41856P07462K06467j191088q21206
$$ plain form
6537 -4130892 -3026118 -1455319 -1735552 -3449483 -4254672 -3338841 -1791758 -254289 1306962
6528 1306962 1847777 19800 -2993332 -3968885 -1768853 1191167 2483324 2581809 3080167
6519 3080167 4010427 4555559 4806048 4917650 3741232 438237 -3179743 -4167720 -2420899
6510 -2420899 -1203181 -2984865 -6133831 -6886503 -4003838 -281232 809326 -762346
6502 -762346 -1587883 1124741 6412961 11065545 13427965 14391675 14924009 14481773 12591167
6493 12591167 10417063 9323881 8760662 7158837 4545880 2596247 1924323 990916 -1388657
6484 -1388657 -3686689 -3400725 -878550 301455 -2378274 -6776847 -8238888 -5102055
6476 -5102055 -507849 1721389 1440547 1185992 2060738 2686570 2099926 1602844 2870307
$$ packed form
6537d130892J104774J570799k80233j713931q05189R15831J547083J537469J561251
6528A306962N40815j827977l013132r75553K200032K960020J292157R8485M98358
6519C080167R30260N45132K50489J11602j176418l302995l617980r87977J746821
6510b420899J217718j781684l148966p52672K882665L722606J090558j571672
6502g62346q25537K712624N288220M652584K362420R63710N32334m42236j890606
6493A2591167k174104j093182n63219j601825k612957j949633o71924r33407k379573
6484a388657k298032K85964K522175J180005k679729m398573j462041L136833
6476e102055M594206K229238k80842k54555Q74746O25832n86644m97082J267463
$$ plain form
6467 2870307 5559580 7926132 9149888 10094146 12013072 15111676 18195152 19343236
6459 19343236 17148569 11726861 4705104 -1607086 -5138487 -5102621 -2996263 -1853685
6451 -1853685 -3136207 -4662402 -3155255 1260018 4905284 5154248 3249133 1871843
6443 1871843 1930517 2887784 4289346 5240432 3969537 10587 -4207126 -5941112 -5495879
6434 -5495879 -5101360 -5362502 -5154323 -4420401 -4325043 -4543528 -3114797 306415 3459445
6425 3459445 4826175 5886279 8609556 12335489 14726374 14702545 13064049 11200627 10479324
6416 10479324 11839650 14379232 15103376 11892579 6486037 2882720 2706864 3585506 2360263
6407 2360263 -1423222 -5714063 -8465843 -9107533 -8198025 -6553338 -4711639 -2904872 -1558801
$$ packed form
6467B870307K689273K366552J223756R44258J918926L098604L083476J148084
6459A9343236k194667n421708p021757o312190l531401L5866K106358J142578
6451a853685j282522j526195J507147M415273L645266K48964j905115j377290
6443A871843N8674R57267J401562R51086j270895l958950m217713j733986M45233
6434e495879L94519k61142K08179P33922R5358k18485J428731L421212L153030
6425C459445J366730J060104K723277L725933K390885k3829j638496j863422p21303
6416A0479324J360326K539582P24144l210797n406542l603317j75856Q78642j225243
6407B360263l783485m290841k751780o41690R09508J644687J841699J806767J346071
$$ plain form
6398 -1558801 -1694402 -4176474 -8096998 -10350001 -7777472 -349145 7910056 11834219
6390 11834219 9681363 4913967 2860334 5232143 8459936 8016703 3799893 97681
6382 97681 314767 3109185 4395242 2080219 -2297665 -5969117 -7500786 -6947991 -4896477
6373 -4896477 -2177965 230939 2010686 4002833 7114301 10648980 12412671 10853541
6365 10853541 6753751 2436849 -442908 -1832142 -2181014 -1383652 460378 1786131
6357 1786131 445804 -3607952 -7442132 -7884466 -4756586 -624235 2138842 2955332 2225680
6348 2225680 644206 -424655 355778 2327832 2963602 1067349 -1344577 -1656882 -63561
6339 -63561 1167005 884240 -326079 -2014015 -4183357 -5910932 -5786006 -3933606 -1745212
$$ packed form
6398a558801j35601k482072l920524k253003K572529P428327Q259201L924163
6390A1834219k152856m767396k053633K371809L227793m43233m216810l702212
6382I7681K17086K794418J286057k315023m377884l671452j531669N52795K051514
6373d896477K718512K408904J779747J992147L111468L534679J763691j559130
6365A0853541m099790m316902k879757j389234l48872P97362J844030J325753
6357A786131j340327m053756l834180m42334L127880M132351K763077Q16490p29652
6348B225680j581474j068861P80433J972054O35770j896253k411926l12305J593321
6339f3561J230566k82765j210319j687936k169342j727575J24926J852400K188394
$$ plain form
6330 -1745212 394968 2868707 4248698 2065247 -2646728 -4669561 -934763 4665928
6322 4665928 5767584 1543584 -2801736 -2963010 64164 2658209 2884301 1307349 -333080
6313 -333080 -99610 2984763 7567710 10557081 9763733 5421414 -777640 -6762005 -10000934
6304 -10000934 -8267332 -1877780 5663219 10426182 11240825 9776447 8232074 7585285
6296 7585285 7474483 7052225 6159939 5821798 7032123 9092495 10218584 9987782 9741528
6287 9741528 9903586 8586323 4393295 -585812 -2607351 -751376 2221118 3439826
6279 3439826 2648520 1200014 189579 340048 2103420 4592581 5547309 3895423 1767383
6270 1767383 2455377 6528916 11292545 14007431 14184291 12556055 9646201 6388255 4643211
$$ packed form
6330a745212K140180K473739J379991k183451m711975k022833L734798N600691
6322D665928J101656m224000m345320j61274L027174K594045K26092j576952j640429
6313c33080K33470L084373M582947K989371p93348m342319o199054n984365l238929
6304a0000934J733602O389552P540999M762963Q14643j464378j544373o46789
6296G585285j10802m22258q92286l38141J210325K060372J126089k30802k46254
6287I741528J62058j317263m193028m979107k021539J855975K972494J218708
6279C439826p91306j448506j010435J50469J763372K489161R54728j651886k128040
6270A767383O87994M073539M763629K714886J76860j628236k909854l257946j745044
$$ plain form
6261 4643211 5386591 7061081 7336176 6142644 5373695 5796668 6125050 5423380 4552103
6252 4552103 4456542 4679705 4625763 4812118 5532616 5533717 3614810 715194 -1089354 -1045882
6242 -1045882 31005 1011499 498567 -3149714 -9666882 -15535862 -17283556 -15794430 -14837814
6233 -14837814 -15530690 -15265133 -12492754 -9219784 -7382384 -5822549 -3056615 -594195
6225 -594195 -783316 -2940607 -4350042 -4189277 -3982220 -4684825 -5533634 -5487936 -3975155
6216 -3975155 -681781 3546419 6216744 5721297 3842807 3404480 3885311 2246291 -1832607
6207 -1832607 -4860464 -4706081 -3674177 -4434428 -5530767 -3769348 540348 3842742 4328636
6198 4328636 3851628 4566391 6012048 6470243 5592108 4482261 3974626 3725614 2655549
$$ packed form
6261D643211P43380J674490K75095j193532p68949M22973L28382p01670q71277
6252D552103r5561K23163n3942J86355P20498J101j918907k899616j804548M3472
6242a045882J076887R80494n12932l648281o517168n868980j747694J489126R56616
6233a4837814o92876K65557K772379L272970J837400J559835K765934K462420
6225e94195j89121k157291j409435J60765K07057p02605q48809M5698J512781
6216c975155L293374M228200K670325m95447j878490m38327M80831j639020m078898
6207a832607l027857J54383J031904p60251j096339J761419M309696L302394M85894
6198D328636m77008P14763J445657M58195q78135j109847n07635k49012j070065
$$ plain form
6189 2655549 -136332 -4451201 -8668116 -10845014 -10478871 -8721871 -6641816 -4006037
6181 -4006037 -358393 3397099 5540751 5525194 4401302 3040445 934960 -2504600 -6172819
6172 -6172819 -8002994 -7514752 -6560040 -7029200 -8619321 -9648830 -9484763 -9016543 -8791347
6163 -8791347 -7905296 -5360429 -1807370 840365 1330827 146775 -1164364 -1384874 -602838
6154 -602838 -177932 -1461855 -4095807 -5849523 -4763670 -1365231 1792403 2696477 1430758
6145 1430758 -552786 -1704167 -843166 2398816 6889805 10603912 12697288 14214500
6137 14214500 15885087 16239828 13514200 8910975 5964709 6348740 8053890 8326624 6670894
6128 6670894 3974041 577991 -2853928 -3887630 -403604 5898611 10351212 10323364 7736206
$$ packed form
6189B655549k791881m314869m216915k176898L66143J757000K080055K635779
6181d006037L647644L755492K143652j5557j123892j360857k105485l439560l668219
6172f172819j830175M88242R54712m69160j590121j029509J64067M68220K25196
6163h791347Q86051K544867L553059K647735M90462j184052j311139k20510P82036
6154f02838M24906j283923k633952j753716J085853L398439L157634R04074j265719
6145A430758j983544j151381Q61001L241982M490989L714107K093376J517212
6137A4214500J670587L54741k725628m603225k946266L84031J705150K72734j655730
6128F670894k696853l396050l431919j033702L484026O302215M452601k7848k587158
$$ plain form
6119 7736206 5924452 5619137 5195958 3695967 2108547 2114082 4659284 9362812 14166448
6110 14166448 15834820 12331703 5408501 -4872 2369 4666005 9481623 10717266 8508558
6101 8508558 5530407 3671690 2973596 3101939 3980813 4578283 2984778 -916085 -4264786
6092 -4264786 -4601502 -3522280 -4759201 -9015525 -13123180 -14434496 -13490971 -11676656 -8898590
6083 -8898590 -5122437 -2007610 -928148 -733489 640820 3400424 6353026 8873937
6075 8873937 10480873 9648742 5570729 728664 -618375 3224293 10011358 16260446
6067 16260446 19773587 19922172 17422422 13973362 10703944 7189986 3249677 642554
6059 642554 723406 1258911 -1373269 -6873121 -11012766 -11314519 -9542715 -7809616 -5726751
$$ packed form
6119G736206j811754l05315m23179j499991j587420N535K545202M703528M803636
6110A4166448J668372l503117o923202n413373P241M663636M815618J235643k208708
6101H508558k978151j858717o98094J28343Q78874N97470j593505l900863l348701
6092d264786l36716J079222j236921m256324m107655j311316R43525J814315K778066
6083h898590L776153L114827J079462J94659J374309K759604K952602K520911
6075H873937J606936q32131m078013m842065j347039L842668O787065O249088
6067A6260446L513141J48585k499750l449060l269418l513958l940309k607123
6059F42554Q0852N35505k632180n499852m139645l01753J771804J733099K082865
$$ plain form
6050 -5726751 -2975959 -1283311 -1462323 -1348092 673228 2627820 2338260 1356961 2014081
6041 2014081 2719650 558942 -2724061 -2241473 2512383 6330712 5521619 2277165 158672
6032 158672 -884053 -2401495 -3481882 -2236223 491119 2022373 1713018 1449189 2660307
6023 2660307 4781586 6396352 6315827 3932839 83903 -2729996 -2483742 58605 2196001
6014 2196001 2049779 -535387 -4981400 -10154953 -13953131 -14569860 -12392844 -9376750 -6652117
6005 -6652117 -4134380 -2177603 -1617870 -1864703 -899761 2006547 5152140 6897143 7869470
5996 7869470 9509530 11538201 12224500 10585323 7276426 3764016 1404394 742173 862956
5987 862956 5465 -2292883 -4171498 -3509780 -632218 1982787 2457149 1147071 -263285
$$ packed form
6050e726751K750792J692648j79012J14231K021320J954592k89560r81299O57120
6041B014081P05569k160708l283003M82588M753856L818329q09093l244454k118493
6032A58672j042725j517442j080387J245659K727342J531254l09355k63829J211118
6023B660307K121279J614766q0525k382988l848936k813899K46254K542347K137396
6014B196001j46222k585166m446013n173553l798178o16729K177016L016094K724633
6005f652117K517737J956777N59733k46833R64942K906308L145593J745003R72327
5996G869470J640060K028671O86299j639177l308897l512410k359622o62221J20783
5987H62956q57491k298348j878615O61718K877562K615005M74362j310078j410356
$$ plain form
5978 -263285 -476057 574734 1977835 2902321 3554100 4661193 5920049 5990486 4660874
5969 4660874 3846866 5224016 7753264 9049108 8612957 8052155 8365837 8756483 8274393
5960 8274393 7085101 5706759 4188151 2365132 -11108 -3320522 -7041246 -8898181
5952 -8898181 -6753275 -1528521 3464359 6432912 8553909 11108210 13280680 13753415
5944 13753415 12491499 9754157 5389222 741907 -786442 2514145 7675377 10266317
5936 10266317 9663728 8609167 8309411 7106902 4231366 1799068 1751186 2952451 2958183
5927 2958183 1288190 -653446 -2060294 -3465467 -5083701 -5744854 -4216798 -1274998
5919 -1274998 365277 -1085137 -3837980 -3923152 75634 4710284 5295587 1154364 -4110906
$$ packed form
5978b63285k12772J050791J403101R24486O51779J107093J258856P0437j329612
5969D660874q14008J377150K529248J295844m36151n60802L13682L90646m82090
5960H274393j189292j378342j518608j823019k376240l309414l720724j856935
5952h898181K144906N224754M992880K968553K120997K554301K172470M72735
5944A3753415j261916k737342m364935m647315j528349L300587N161232K590940
5936A0266317o02589j054561k99756j202509k875536k432298m7882J201265N732
5927B958183j669993j941636j406848j405173j618234o61153J528056K941800
5919a274998J640275j450414k752843q5172L998786M634650N85303m141223n265270
$$ plain form
5910 -4110906 -6939834 -6641252 -4277448 -1042267 1661990 2558866 2138260 2637422 5184620
5901 5184620 7929955 8109355 5151559 714540 -3531134 -6936409 -9341335 -10922460
5893 -10922460 -12353763 -13812110 -13802033 -10316603 -3698405 2696954 5639655 5416844 5187031
5884 5187031 6969042 9167807 8591524 4329883 -1206485 -4883305 -5467769 -3540990 -80554
5875 -80554 3849025 6664663 6886350 4525929 1329771 -586891 -298506 1456125 3164399
5866 3164399 4185981 5391513 7408430 8502606 5973176 260582 -4383057 -4852198
5858 -4852198 -2981310 -2253139 -2494231 -1051150 1724161 2171305 -964834 -4189588 -4156672
5849 -4156672 -1914016 -279935 458063 1654838 2895903 2385345 162201 -1440545 -652759
$$ packed form
5910d110906k828928K98582K363804L235181K704257Q96876m20606M99162K547198
5901E184620K745335J79400k957796m437019m245674l405275k404926j581125
5893a0922460j431303j458347J0077L485430O618198O395359K942701k22811k29813
5884E187031J782011K198765n76283m261641n536368l676820n84464J926779L460436
5875h0554L929579K815638K21687k360421l196158j916662K88385J754631J708274
5866C164399J021582J205532K016917J094176k529430n712594m643639m69141
5858d852198J870888P28171k41092J443081K775311M47144l136139l224754L2916
5849d156672K242656J634081P37998J196775J241065n10558k223144j602746P87786
$$ plain form
5840 -652759 1869119 4005837 4030732 1815456 -1002475 -2502107 -2655614 -3100804 -4158235
5831 -4158235 -3629966 27787 4699278 6775830 5643055 4048826 4267201 5737492 6644482
5822 6644482 6310767 5584992 5722896 6996451 7899089 6304607 2325548 -767233 65963
5813 65963 3782517 6353697 5416337 2131600 -1447434 -4745961 -7776589 -9762280 -9971253
5804 -9971253 -8868961 -7186296 -4480573 132512 5970044 10568584 11815311 9793922
5796 9793922 6255515 2683042 -624179 -3726310 -6120515 -7146434 -6847206 -5750926
5788 -5750926 -4065424 -1805198 573171 2598427 4654264 7333134 10048211 11569073
5780 11569073 11902969 12152256 12439574 11755123 10131391 8886123 8113711 6286721 3370163
$$ packed form
5840f52759K521878K136718K4895k215276k817931j499632j53507m45190j057431
5831d158235N28269L657753M671491K076552j132775j594229K18375J470291R06990
5822F644482l33715p25775J37904J273555R02638j594482l979059l092781Q33196
5813F5963L716554K571180r37360l284737l579034l298527l030628j985691k08973
5804i971253J102292J682665K705723M613085N837532M598540J246727k021389
5796I793922l538407l572473l307221l102131k394205j025919K99228J096280
5788e750926J685502K260226K378369K025256K055837K678870K715077J520862
5780A1569073L33896K49287K87318o84451j623732j245268p72412j826990k916558
$$ plain form
5771 3370163 1714813 2135509 1692519 -2119284 -7082795 -9043114 -7307782 -4228924 -979745
5762 -979745 2571071 4810329 3537707 361299 -184478 2922357 5138902 2500760 -2920300
5753 -2920300 -5726599 -3506350 1295851 4411718 3246765 -1411251 -5845698 -6365747
5745 -6365747 -2686370 2153248 5199788 5741930 4369514 1927209 -246713 -1028837 -1015544
5736 -1015544 -1480572 -1537025 1266019 6783489 11279637 11842492 9409995 6004577 1616873
5727 1616873 -3916947 -8131180 -7927359 -3417020 2382386 6860046 9159211 9505797 9164033
5718 9164033 9834541 11010734 9310601 3075331 -3519590 -4321935 924091 5807547 5041727
5709 5041727 162035 -3767201 -4534979 -3824111 -3575414 -3832476 -3867176 -3389266 -2120623
$$ packed form
5771C370163j655350M20696m42990l811803m963511j960319J735332L078858L249179
5762i79745L550816K239258j272622l176408n45777L106835K216545k638142n421060
5753b920300k806299K220249M802201L115867j164953m658016m434447n20049
5745f365747L679377M839618L046540N42142j372416k442305k173922p82124J3293
5736a015544m65028n6453K803044N517470M496148N62855k432497l405418m387704
5727A616873n533820m214233K03821M510339N799406M477660K299165L46586l41764
5718I164033O70508J176193j700133o235270o594921q02345N246026M883456p65820
5709E041727m879692l929236p67778P10868K48697k57062l4700M77910J268643
$$ plain form
5700 -2120623 484844 4137182 6935667 6822344 3978841 920559 -310064 -300293 -798042
5691 -798042 -1882169 -2145295 -1421001 -1305217 -2351501 -2620144 -299975 3568078 6404491
5682 6404491 7111060 6384503 5027101 3701092 3718133 6056677 9528258 11556931 11070773
5673 11070773 9315110 7625579 5913727 3968115 2808259 3431428 4840450 4668253
5665 4668253 1912763 -1797215 -3955493 -3536098 -1244344 1661321 3658995 2714134 -2134371
5656 -2134371 -8289870 -10795262 -7760653 -3133955 -1902477 -3728469 -4162355 -1500821
5648 -1500821 1099856 805759 -1133255 -2255967 -2436528 -2460832 -1609171 763997 3037902
5639 3037902 3316224 2398623 2412804 3444946 3723388 2365309 -66649 -2954655 -5594815
$$ packed form
5700b120623K605467L652338K798485j13323k843503l058282j230623R771m97749
5691g98042j084127k63126P24294J15784j046284k68643K320169L868053K836413
5682F404491P06569p26557j357402j326009J7041K338544L471581K028673m86158
5673A1070773j755663j689531j711852j945612j159856O23169J409022j72197
5665D668253k755490l709978k158278M19395K291754K905665J997674r44861m848505
5656b134371o155499k505392L034609M626698J231478j825992m33886K661534
5648a500821K600677k94097j939014j122712j80561k4304Q51661K373168K273905
5639C037902K78322r17601J4181J032142K78442j358079k431958k888006k640160
$$ plain form
5630 -5594815 -6509245 -4747453 -1334375 2150290 5503829 8763935 10496555 9490139
5622 9490139 7068839 5253640 3564589 279849 -4028603 -7205863 -9087587 -11025800
5614 -11025800 -12128196 -9719636 -4153642 381346 1135071 -100240 -533778 -167037 -203538
5605 -203538 -86816 1604786 4728304 7780098 9393382 8503865 4665482 -295070 -2480417
5596 -2480417 315305 5879202 10060843 11128386 10338059 9198822 7940476 6275049
5588 6275049 4069152 1175031 -2359060 -5798815 -8079675 -8636415 -7568868 -5373479
5580 -5373479 -2972451 -1603433 -2035619 -3864832 -5756697 -6339481 -5041404 -2463181 102628
5571 102628 1775728 2495645 2284214 1043146 -360654 -139861 1883992 2847945 -169961
$$ packed form
5630e594815r14430J761792L413078L484665L353539L260106J732620j006416
5622I490139k421300j815199j689051l284740m308452l177260j881724j938213
5614a1025800j102396K408560N565994M534988P53725j235311m33538L66741l6501
5605b03538J16722J691602L123518L051794J613284q89517l838383m960552k185347
5596b480417K795722N563897M181641J067543p90327j139237j258346j665427
5588F275049k205897k894121l534091l439755k280860n56740J067547K195389
5580e373479K401028J369018m32186j829213j891865n82784J298077K578223K565809
5571A02628J673100P19917k11431j241068j403800K20793K023853R63953l017906
$$ plain form
5562 -169961 -6279722 -11697918 -14004767 -13548422 -11259405 -7623545 -3771255 -1054503 769601
5553 769601 2776834 4422350 4440888 3971360 5393954 7766449 7435850 4384629 3604717
5544 3604717 7624823 11582918 9390162 2015465 -4273083 -5962787 -4659538 -2753796
5536 -2753796 -772291 1352354 3822185 7612603 12542280 15152985 12057978 5581034
5528 5581034 2378903 5308248 9770382 9790117 5207982 790759 2140 1977986 3883633
5519 3883633 4124946 2985782 1449673 239781 -182724 652154 2819969 5324744 6703627
5510 6703627 6788385 7004081 8178943 8964254 7500305 3893879 -175743 -3630200 -6381663
5501 -6381663 -8102535 -8159403 -6562056 -3703512 403776 5151131 8109323 6819846 2037510
$$ packed form
5562a69961o109761n418196k306849M56345K289017L635860L852290K716752J824104
5553G69601K007233J645516J8538m69528J422594K372495l30599l051221p79912
5544C604717M020106L958095k192756p374697o288548j689704J303249J905742
5536b753796J981505K124645K469831L790418M929677K610705l095007o476944
5528E581034l202131K929345M462134J9735m582135m417223p88619J975846J905647
5519C883633K41313j139164j536109j209892m22505Q34878K167815K504775J378883
5510F703627Q4758K15696J174862P85311j463949l606426m069622l454457k751463
5501f381663j720872n6868J597347K858544M107288M747355K958192j289477m782336
$$ plain form
5492 2037510 -2509578 -4052544 -3218237 -2393435 -3108572 -5369609 -8175883 -10149235 -10682994
5483 -10682994 -10743135 -11514294 -12340560 -11559606 -9547648 -9028917 -11510881 -15018733 -16540412
5474 -16540412 -15493509 -13506579 -11724310 -9771449 -7011900 -3705808 -957697 -7124
5466 -7124 -1141591 -2885696 -3054140 -1353817 -112038 -1304092 -3496878 -3254613 471202
5457 471202 4821724 6342832 4649193 2097913 809800 1077985 2116897 3004536 2792580
5448 2792580 870250 -2219588 -5024466 -6688204 -7574686 -8046717 -7590544 -5919699 -3994580
5439 -3994580 -2773843 -1744558 -210819 579999 -1314299 -5060712 -7008308 -5038012
5431 -5038012 -1328786 363626 -1005393 -3318640 -4161193 -3007295 -1242094 -973424 -3262604
$$ packed form
5492B037510m547088j542966Q34307Q24802p15137k261037k806274j973352n33759
5483a0682994o0141p71159q26266P80954K011958N18731k481964l507852j521679
5474a6540412J046903J986930J782269J952861K759549L306092K748111R50573
5466g124j134467j744105j68444J700323J241779j192054k192786K42265L725815
5457D71202M350522J521108j693639k551280j288113K68185J038912Q87639k11956
5448B792580j922330l089838k804878j663738q86482m72031M56173J670845J925119
5439c994580J220737J029285J533739P90818j894298l746413j947596J970296
5431e038012L709226J692412j369019k313247q42553J153898J765201K68670k289180
$$ plain form
5422 -3262604 -6734268 -8423700 -6578040 -2141304 2681238 6297286 7864968 6989725
5414 6989725 4244069 1131720 -1121439 -2032409 -1197797 1205087 3044055 1600319 -2703088
5405 -2703088 -6026754 -5825453 -3795984 -2725058 -2667644 -2233989 -1619259 -1964263 -3215121
5396 -3215121 -4738442 -6495365 -7625197 -5899506 -1039950 3526869 5061929 5450382
5388 5450382 7406199 9115207 7089355 2662549 561907 1781901 3081036 3369298
5380 3369298 5027964 8113739 8864334 5907249 3000034 3037242 3611866 1394468 -2841071
5371 -2841071 -6660926 -10106395 -13939632 -16361954 -15070502 -11001711 -7095882 -4607013
5363 -4607013 -2972916 -1923924 -1487434 -1175968 -1011441 -1854363 -3057153 -1759890 3344126
$$ packed form
5422c262604l471664j689432J845660M436736M822542L616048J567682q75243
5414F989725k745656l112349k253159r10970Q34612K402884J838968j443736m303407
5405b703088l323666K01301K029469J070926N7414M33655O14730l45004j250858
5396c215121j523321j756923j129832J725691M859556M566819J535060L88453
5388E450382J955817J709008k025852m426806k100642J219994J299135K88262
5380C369298J658666L085775P50595k957085k907215L7208N74624k217398m235539
5371b841071l819855l445469l833237k422322J291452M068791L905829K488869
5363d607013J634097J048992M36490L11466J64527q42922j202790J297263N104016
$$ plain form
5354 3344126 9245761 11768699 10048744 6168347 2229116 -244706 -32166 2259458
5346 2259458 4026782 4100607 4466900 6523755 8045499 6614553 3778579 2587042 3021381
5337 3021381 3338310 4020801 6384187 8704425 8099177 5534679 4698082 6167643 6849428
5328 6849428 5282633 3461881 2959749 3071642 3414724 4596111 5451836 3373396 -1329245
5319 -1329245 -4767379 -4552260 -2422960 -547909 1449017 4072415 5810221 5646495 5128682
5310 5128682 5804298 6917567 7547488 8461818 9618175 8440906 3478957 -2228272 -4497317
5301 -4497317 -3303246 -1885442 -1800876 -1864441 -1197551 -306547 649795 2082517 3581174
5292 3581174 4594593 6225685 9844706 13922941 14846073 11397557 6269329 2651771
$$ packed form
5354C344126N901635K522938j719955l880397l939231k473822K12540K291624
5346B259458J767324P3825L66293K056855J521744j430946k835974j191537M34339
5337C021381L16929O82491K363386K320238o05248k564498q36597J469561O81785
5328F849428j566795j820752n02132J11893L43082J181387Q55725k078440m702641
5319a329245l438134K15119K129300J875051J996926K623398J737806j63726n17813
5310E128682O75616J113269O29921R14330J156357j177269m961949n707229k269045
5301d497317J194071J417804Q4566o3565O66890Q91004R56342J432722J498657
5292C581174J013419J631092L619021M078235R23132l448516n128228l617558
$$ plain form
5284 2651771 1453972 2355744 5089811 8440773 10035250 8682083 5508082 1702319
5276 1702319 -2986594 -7986186 -10233814 -7384368 -1520541 3104093 5411594 7632412
5268 7632412 10271940 10597982 7492488 4518423 5395749 8417785 8571894 4409325 -356378
5259 -356378 -2234650 -2003246 -2304144 -3475426 -3510938 -1037298 3118996 6821910 8231406
5250 8231406 7080630 4996931 3998009 4282419 4244294 2859505 863361 -791736 -2057106
5241 -2057106 -2573098 -1137222 2125879 4602151 4159286 2178550 1438779 1767584 393023
5232 393023 -3411684 -6635082 -6333530 -3249382 -548631 -218584 -1691944 -3095861 -2909377
5223 -2909377 -897782 1905592 4289824 5958646 7122612 7375756 6055140 3698714
$$ packed form
5284B651771j197799R01772K734067L350962J594477j353167l174001l805763
5276A702319m688913m999592k247628K849446N863827M624634K307501K220818
5268G632412K639528L26042l105494k974065Q77326L022036J54109m162569m765703
5259c56378j878272K31404l00898j171282l5512K473640M156294L702914J409496
5250H231406j150776k083699r98922K84410l8125j384789j996144j655097j265370
5241b057106n15992J435876L263101K476272m42865j980736p39771L28805j374561
5232C93023l804707l223398L01552L084148K700751L30047j473360j403917J86484
5223b909377K011595K803374K384232J668822J163966K53144j320616k356426
$$ plain form
5215 3698714 1908512 1420602 1388502 977094 521994 452654 143980 -1133147 -2783101
5206 -2783101 -3516241 -3157968 -2793037 -2984890 -2789173 -1211997 806293 923427 -1709508
5197 -1709508 -4977037 -6226060 -5588583 -5320104 -5909728 -5021705 -1334736 2590033 3264041
5188 3264041 802072 -1783313 -2987449 -3869042 -4916480 -4859654 -3524607 -3266244 -5710602
5179 -5710602 -8677307 -8396872 -4128585 1124363 4265504 5018963 5087754 5679755 6565428
5170 6565428 7009550 6834042 6431537 6127430 5837038 5223343 3972842 2192073 936161
5161 936161 1818433 5003773 7791098 6809822 2140379 -2349584 -3737900 -3536824 -4988381
5152 -4988381 -8274660 -10469196 -9526424 -6301764 -2959860 -1257227 -2184203 -5345548 -8470247
$$ packed form
5215C698714j790202m87910l2100m11408m55100o9340l08674j277127j649954
5206b783101p33140L58273L64931j91853J95717J577176K018290J17134k632935
5197a709508l267529j249023O37477K68479n89624Q88023L686969L924769O74008
5188C264041k461969k585385j204136q81593j047438N6826J335047K58363k444358
5179e710602k966705K80435M268287N252948L141141P53459O8791N92001Q85673
5170F565428M44122j75508m02505l04107k90392o13695j250501j780769j255912
5161I36161Q82272L185340K787325r81276m669443m489963j388316K01076j451557
5152d988381l286279k194536R42772L224660L341904J702633r26976l161345l124699
$$ plain form
5143 -8470247 -9101146 -7041947 -4053975 -1506964 175843 301060 -1596178 -3831430 -3366902
5134 -3366902 533935 4920006 6347376 4579651 2557076 3299816 6985374 10637793
5126 10637793 11104508 8815753 7465153 9010127 10759435 9404473 6169920 4953069
5118 4953069 6521323 8061079 7847402 6539847 4122412 -20097 -3462150 -2001361
5110 -2001361 3690002 7125273 4293705 -980136 -2941531 -1512755 -253961 168887
5102 168887 1801105 4394678 5312193 4123158 3388047 4557334 6196466 6713688 6242555
5093 6242555 5352809 4154288 3175147 3162157 3524347 2750570 915000 162313 1957640
5084 1957640 5042963 6890265 6455485 4913748 4081034 4533312 5285422 5283679 4900712
$$ packed form
5143h470247o30899K059199K987972K547011J682807J25217j897238k235252M64528
5134c366902L900837M386071J427370j767725k022575P42740L685558L652419
5126A0637793M66715k288755j350600J544974J749308j354962l234553j216851
5118D953069J568254J539756k13677j307555k417435m142509l442053J460789
5110b001361N691363L435271k831568n273841j961395J428776J258794M22848
5102A68887J632218K593573R17515j189035p35111J169287J639132N17222m71133
5093F242555q89746j198521r79141j2990L62190p73777j835570p52687J795327
5084A957640L085323J847302m34780j541737q32714M52278P52110j743l82967
$$ plain form
5075 4900712 5353607 6814614 8095100 8288463 7611481 6487805 5160976 4461226 5295997
5066 5295997 6819069 6842008 4866091 2969767 2753173 3226103 2862459 1847521 850697
5057 850697 -561963 -2473349 -3110310 -769108 3717393 7924062 10268014 10469722 9096266
5048 9096266 7856275 8646658 10934875 11849717 10154163 7923681 6783141 5265369 2201091
5039 2201091 -165264 332731 1615311 460954 -2099125 -2643590 -1324876 -1449401 -3454131
5030 -3454131 -3764313 -369601 4126427 6180993 5332258 3625659 3178515 4897123 7829120
5021 7829120 9672613 9499028 9306931 10901194 12485774 11303527 8572541 8009608 9853930
5012 9853930 10580659 8997754 8282686 10464925 12768646 11805216 8527789 6431975 6696065
$$ packed form
5075D900712M52895J461007J280486J93363o76982j123676j326829o99750Q34771
5066E295997J523072K2939j975917j896324k16594M72930l63644j014938r96824
5057H50697j412660j911386o36961K341202M486501M206669K343952K01708j373456
5048I096266j239991P90383K288217R14842j695554k230482j140540j517772l064278
5039B201091k366355M97995J282580j154357k560079n44465J318714j24525k004730
5030c454131l10182L394712M496028K054566q48735j706599m47144J718608K931997
5021G829120J843493j73585j92097J594263J584580j182247k730986n62933J844322
5012I853930P26729j582905p15068K182239K303721r63430l277427k095814K64090
$$ plain form
5003 6696065 7407940 6518004 3877885 1064490 93493 1457382 3038443 2182591 -927753
4994 -927753 -3502911 -3908981 -3282909 -2967483 -2470476 -921915 1298481 3586993 6314786
4985 6314786 9786635 13029747 14647231 14214489 12248526 9521785 6929770 5510626
4977 5510626 6154006 9154318 13465885 16319453 15071375 10467197 6636852 6421010 8141690
4968 8141690 8683444 8046682 8405007 10033659 11057163 10464269 8693836 5935594 2520765
4959 2520765 289968 750138 2378190 2462353 1063264 433225 1173916 1868336 1946846
4950 1946846 2007953 1854783 1046911 665579 1672875 2551105 1658575 613403 1792968
4941 1792968 3858396 3805433 2226817 2147324 3685394 4495765 4534181 5429511 5989017 3746765
$$ packed form
5003F696065P11875q89936k640119k813395r70997J363889J581061q55852l110344
4994i27753k575158m06070O26072L15426M97007J548561K220396K288512K727793
4985F314786L471849L243112J617484m32742j965963k726741k592015j419144
4977E510626O43380L000312M311567K853568j248078m604178l830345k15842J720680
4968H141690N41754o36762L58325J628652J023504n92894j770433k758242l414829
4959B520765k230797M60170J628052Q4163j399089o30039P40691O94420P8510
4950A946846O1107j53170q07872l81332J007296Q78230q92530j045172J179565
4941A792968K065428n2963j578616p9493J538070Q10371L8416Q95330N59506k242252
$$ plain form
4931 3746765 564023 1103155 5603016 9363970 9450897 6952091 3140066 -1132896 -2929190
4922 -2929190 -87601 4139257 5522097 6622968 12803470 21805508 26069032 24937483
4914 24937483 24922782 27473083 26958857 22446960 20694727 24519705 28522647 29616665 31322528
4905 31322528 33964941 31598911 23314205 16838281 16012365 15590385 13302489 15019734
4897 15019734 22090040 26246917 24075452 23591960 28877205 32061747 29329969 30015015
4889 30015015 39258290 46885496 45499788 43797350 48608317 50981495 45744306 46187461
4881 46187461 60513053 73560358 74243581 79295355 102301409 124163621 131498875 156985012
4873 156985012 224751481 271236772 195060934 417 -179953342 -231483455 -182953836
$$ packed form
4931C746765l182742N39132M499861L760954Q6927k498806l812025m272962j796294
4922b929190K841589M226858J382840J100871O180502R002038M263524j131549
4914B4937483j4701K550301n14226m511897j752233L824978M002942J094018J705863
4905C1322528K642413k366030q284706o475924q25916m21980k287896J717245
4897A5019734P070306M156877k171465m83492N285245L184542k731778O85046
4889C0015015R243275P627206j385708j702438M810967K373178n237189M43155
4881D6187461J4325592J3047305O83223N051774K3006054K1862212P335254K5486137
4873A56985012O7766469M6485291p6175838j95060517j79953759n1530113M8529619
$$ plain form
4866 -182953836 -135500976 -126363721 -119103508 -93733402 -74866066 -75773475 -75153609 -60236507
4858 -60236507 -48363165 -52016315 -57339214 -51538981 -43135747 -41273161 -39174351 -31678155
4850 -31678155 -28275633 -35172500 -42049520 -39439366 -33911471 -34021613 -35237693 -30946653
4842 -30946653 -26123691 -27800549 -31994794 -31587047 -28785391 -29256330 -31177029 -29839157
4834 -29839157 -26787561 -25566704 -24189076 -19973787 -16397110 -17299572 -19207206 -16897983
4826 -16897983 -12345803 -11220003 -14175637 -17672511 -19875976 -20409727 -18017864 -13441824
4818 -13441824 -10772062 -11510071 -11691050 -9153776 -8236308 -11984048 -15307242 -12551673 -7283383
4809 -7283383 -7224786 -12638188 -16821999 -15997796 -12174330 -7733983 -3296462 -167870 421164
$$ packed form
4866a82953836M7452860R137255P260213K5370106J8867336r07409O19866J4917102
4858f0236507J1873342l653150n322899N800233Q403234J862586K098810P496196
4850c1678155L402522o896867o877020K610154N527895j10142j216080M291040
4842c0946653M822962j676858m194245M07747K801656m70939j920699J337872
4834b9839157L051596J220857J377628M215289L576677r02462j907634K309223
4826a6897983M552180J125800k955634l496874k203465n33751K391863M576040
4818a3441824K669762p38009j80979K537274R17468l747740l323194K755569N268290
4809g283383N8597n413402m183811Q24203L823466M440347M437521L128592N89034
$$ plain form
4800 421164 241722 2087509 5380254 7035638 5665318 2109404 -2516084 -6576906 -7943906
4791 -7943906 -7078027 -7552026 -10692182 -12857963 -11316160 -9228169 -10667927 -14055107 -15236257
4782 -15236257 -14124252 -13297877 -12658361 -10749791 -9186418 -10406459 -12817387 -13369762 -13085993
4773 -13085993 -14485751 -15280393 -10970599 -3011197 1912203 957180 -2236778 -4360523
4765 -4360523 -6159629 -8332248 -9218269 -8512364 -8764369 -11094172 -13091214 -12830005 -11756578
4756 -11756578 -11904268 -13032918 -13927824 -14062534 -12982617 -10435125 -7751325 -6684273 -6613507
4747 -6613507 -5541852 -3740652 -3116112 -3020616 -757900 3093191 4210709 934613 -2908244
4738 -2908244 -3696011 -2810163 -3141002 -4166617 -3781752 -2471734 -2061181 -1882198 234618
$$ packed form
4800D21164j79442J845787L292745J655384j370320l555914m625488m060822j367000
4791g943906Q65879m73999l140156k165781J541803K087991j439758l387180j181150
4782a5236257J112005Q26375O39516J908570J563373j220041k410928n52375K83769
4773a3085993j399758p94642M309794P959402M923400r55023l193958k123745
4765d360523j799106k172619q86021P05905k52005k329803j997042K61209J073427
4756a1756578j47690j128650q94906j34710J079917K547492K683800J067052P0766
4747f613507J071655J801200O24540R5496K262716L851091J117518l276096l842857
4738b908244p87767Q85848l30839j025615L84865J310018M10553J78983K116816
$$ plain form
4729 234618 3691205 4956319 2054434 -2833148 -5833006 -5307395 -3022258 -2111609 -4094844
4720 -4094844 -7724265 -10792002 -12640694 -14106044 -15397110 -15488357 -13800124 -11166263 -8778533
4711 -8778533 -7246346 -6829464 -7393206 -8024503 -7913026 -7554257 -7730657 -7658516 -6065406
4702 -6065406 -3880429 -3367811 -4291546 -3716462 -601502 2192071 2218553 1341697 2813900
4693 2813900 5979806 6651373 2432082 -4468340 -9938003 -12060906 -12220658 -13028276 -15506436
4684 -15506436 -18037915 -18025566 -14488832 -8738720 -2904026 1323903 2816443 1330378
4676 1330378 -1979786 -5467985 -8613270 -11729832 -14335821 -15484055 -15661980 -16187568 -16288361
4667 -16288361 -13338157 -7320247 -2706739 -3724904 -9185879 -14135422 -15616211 -14651787
$$ packed form
4729B34618L456587J265114k901885m887582k999858N25611K285137R10649j983235
4720d094844l629421l067737j848692j465350j291066r1247J688233K633861K387730
4711h778533J532187M16882n63742o31297J11477L58769j76400P2141J593110
4702f065406K184977N12618r23735N75084L114960K793573K6482q76856J472203
4693B813900L165906O71567m219291o900422n469663k122903j59752q07618k478160
4684a5506436k531479J2349L536734N750112N834694M227929J492540j486065
4676A330378l310164l488199l145285l116562k605989j148234j77925n25588j00793
4667a6288361K950204O017910M613508j018165n460975m949543j480789R64424
$$ plain form
4659 -14651787 -13231714 -11791440 -9979493 -8041409 -6520100 -5345050 -3757321 -925378
4651 -925378 3250086 7563909 9984330 9223577 5840790 1713561 -1284811 -2189699 -1311755
4642 -1311755 56780 896535 1406788 1913487 1202926 -2377787 -7870179 -11633211 -11318222
4633 -11318222 -8452579 -6009076 -4843935 -3832894 -2184360 -10309 2390245 4185605
4625 4185605 3770722 568194 -3446366 -5560315 -5296564 -4300570 -3870975 -4057086 -4612030
4616 -4612030 -5149165 -4696809 -2787517 -767673 -300140 -707044 261914 2806409 4242844
4607 4242844 2590662 -666414 -2581133 -2432630 -2191506 -3780122 -6850694 -9296751 -9553971
4598 -9553971 -8299720 -7721556 -8890068 -10268057 -9431413 -5914084 -1558457 1612099 2865037
$$ packed form
4659a4651787J420073J440274J811947J938084J521309J175050J587729K831943
4651i25378M175464M313823K420421p60753l382787m127229k998372r04888Q77944
4642a311755J368535Q39755N10253N06699p10561l580713n492392l763032L14989
4633a1318222K865643K443503J165141J011041J648534K174051K400554J795360
4625D185605m14883l202528m014560k113949K63751R95994M29595j86111n54944
4616d612030n37135M52356J909292K019844M67533m06904R68958K544495J436435
4607D242844j652182l257076j914719J48503K41124j588616l070572k446057k57220
4598i553971J254251N78164j168512j377989Q36644L517329M355627L170556J252938
$$ plain form
4589 2865037 2393479 786308 -1014462 -2343393 -3514380 -4806439 -4878077 -1944765 2939040
4580 2939040 5635722 3349455 -1869739 -5519378 -5700647 -4149532 -2779054 -1320474
4572 -1320474 1076985 3655380 4813914 4287946 3206943 2192203 779392 -884491
4564 -884491 -1124003 1213965 4407786 5168930 2537111 -879824 -2137300 -1198175 -99286
4555 -99286 -118206 -1126164 -2770244 -4453894 -4595950 -1989089 1896323 3900013 3111489
4546 3111489 2096725 3197252 5131061 4729919 1080567 -3634042 -6977658 -8475053
4538 -8475053 -8952702 -8870388 -7862779 -5543471 -2400673 243457 1309268 803276 -770138
4529 -770138 -3319732 -6428152 -8104344 -6201429 -1636157 1702148 1437201 -543238 -1244495
$$ packed form
4589B865037m71558j607171j800770j328931j170987j292059p1638K933312M883805
4580B939040K696682k286267n219194l649639j81269J551115J370478J458580
4572a320474K397459K578395J158534n25968j081003j014740j412811j663883
4564h84491k39512K337968L193821P61144k631819l416935j257476R39125J098889
4555i9286j8920j007958j644080j683650j42056K606861L885412K003690p88524
4546C111489j014764J100527J933809m01142l649352m714609l343616j497395
4538h475053m77649Q2314J007609K319308L142798K644130J065811n05992j573414
4529g70138k549594l108420j676192J902915M565272L338305k64947j980439p01257
$$ plain form
4520 -1244495 -715661 -956317 -2215079 -3216839 -4219605 -6561843 -9161861 -8854591 -5140466
4511 -5140466 -1576988 -986193 -1976051 -2065095 -1686308 -2519122 -3856499 -3777091 -2873215 -3657949
4501 -3657949 -6526718 -9145283 -9998887 -9904687 -9520977 -7998876 -5291233 -3629750 -4981088
4492 -4981088 -8308993 -10933378 -11809206 -12039243 -12577918 -12773184 -11330916 -7939838 -3654367
4483 -3654367 25689 2223245 2857100 2115073 411396 -1128920 -1300625 -606562 -1177259
4474 -1177259 -3705010 -5780284 -5174863 -3570200 -4268552 -6850145 -7576056 -5395639 -3729896
4465 -3729896 -4855748 -6287523 -5366589 -4183010 -6138985 -9720772 -10141961 -6682066 -4226301
4456 -4226301 -6696838 -12152773 -15788862 -15564732 -13383763 -12090124 -12601653 -13452520 -12636720
$$ packed form
4520a244495N28834k40656j258762j001760j002766k342238k600018L07270L714125
4511e140466L563478N90795r89858q9044L78787q32814j337377P9408R03876p84734
4501c657949k868769k618565q53604R4200L83710J522101K707643J661483j351338
4492d981088l327905k624385q75828k30037n38675j95266J442268L391078M285471
4483c654367L680056K197556O33855p42027j703677j540316j71705O94063n70697
4474a177259k527751k075274O05421J604663o98352k581593p25911K180417J665743
4465c729896j125852j431775R20934J183579j955975l581787m21189L459895K455765
4456d226301k470537n455935l636089K24130K180969J293639n11529q50867Q15800
$$ plain form
4447 -12636720 -10222772 -8744878 -10095980 -12697662 -13318627 -11307479 -9125834 -8674548
4439 -8674548 -9094397 -8744323 -7639745 -7005826 -7431695 -8168739 -7817493 -5765514 -3390433
4430 -3390433 -2975760 -4419625 -4389162 -694962 3837107 4724738 2151165 314803 647278
4421 647278 -66576 -3757443 -7502953 -8160445 -7027502 -6908281 -7259578 -5610307 -2013705
4412 -2013705 1168285 2840195 3722930 4158180 3857976 3144388 2246610 170921 -3617476
4403 -3617476 -7328561 -8880518 -8870359 -9267829 -10195518 -10509471 -10500453 -11049004 -10863629 -7877946
4393 -7877946 -3190579 -325433 -411357 -1315868 -1860567 -3257895 -5242985 -4389273 1424306
4384 1424306 9325974 14609413 15916796 15097372 13231408 9370680 3273964 -2374908
$$ packed form
4447a2636720K413948J477894j351102k601682o20965K011148K181645M51286
4439h674548m19849L50074J104578O33919m25869p37044L51246K051979K375081
4430c390433M14673j443865L0463L694200M532069Q87631k573573j836362L32475
4421F47278p13854l690867l745510o57492J132943J19221l51297J649271L596602
4412b013705L181990J671910Q82735M35250l00204p13588q97778k075689l788397
4403c617476l711085j551957J0159l97470r27689l13953R018n48551J85375K985683
4393g877946M687367K865146q5924r04511n44699j397328j985090Q53712N813579
4384A424306P901668N283439J307383q19424j865964l860728o096716n648872
$$ plain form
4376 -2374908 -3551544 1073671 7833976 10837276 7988170 3247506 1477900 2447567
4368 2447567 2465486 658138 -341750 132763 -766899 -3978676 -5799333 -3285230 903178
4359 903178 2135076 -238280 -3532835 -5922945 -6701257 -4533151 728051 5905971 7882993
4350 7882993 7965084 9194553 10601176 8646158 3857986 1004143 1981546 3364567 2603224
4341 2603224 2067504 4252667 6788640 5798187 1793818 -1314219 -1739779 -1277183 -1942904
4332 -1942904 -3667214 -5026408 -4547125 -1831161 1281273 1720387 -1160956 -4278557 -4952685
4323 -4952685 -4782292 -6853366 -10306748 -10935688 -7058100 -1798552 1011619 778381 -644646
4314 -644646 -1527686 -1252668 -468667 -834468 -3017010 -4835253 -3553475 -295580 521484
$$ packed form
4376b374908j176636M625215O760305L003300k849106m740664j769606R69667
4368B447567J7919j807348r99888M74513q99662l211777j820657K514103M188408
4359I03178J231898k373356l294555k390110p78312K168106N261202N177920J977022
4350G882993Q2091J229469J406623j955018m788172k853843R77403J383021p61343
4341B603224n35720K185163K535973r90453m004369l108037m25560M62596o65721
4332a942904j724310j359194M79283K715964L112434M39114k881343l117601o74128
4323d952685J70393k071074l453382o28940L877588N259548K810171k33238j423027
4314f44646q83040K75018P84001l65801k182542j818243J281778L257895Q17064
$$ plain form
4305 521484 -2944400 -7482891 -9654551 -10045320 -10316786 -8974304 -3932501 2365665 4880034
4296 4880034 2996245 1536934 3754928 6928700 6864182 3837183 1247026 139920 -1711245
4287 -1711245 -5603287 -9608526 -11319003 -11066536 -11133798 -12632555 -14471318 -15336652 -15559747
4278 -15559747 -16298717 -17363779 -16975746 -14067062 -9955121 -6869573 -5318422 -4006115
4270 -4006115 -2220028 -1059384 -1888008 -4450100 -7060712 -8142774 -7280041 -5352686 -3984749
4261 -3984749 -4330456 -6033640 -7662795 -8135651 -7241183 -5164608 -2664108 -1526360 -3065569
4252 -3065569 -5675641 -5864536 -3032976 -1365368 -4743922 -10983742 -14014664 -11636124
4244 -11636124 -7990974 -7309619 -8181428 -6581711 -2699261 -1075469 -3777568 -6851792
$$ packed form
4305E21484l465884m538491k171660l90769k71466J342482N041803O298166K514369
4296D880034j883789j459311K217994L173772o4518l026999k590157j107106j851165
4287a711245l892042m005239j710477K52467o7262j498757j838763q65334k23095
4278a5559747p38970j065062L88033K908684M111941L085548J551151J312307
4270d006115J786087J160644q28624k562092k610612j082062Q62733J927355J367937
4261c984749l45707j703184j629155m72856Q94468K076575K500500J137748j539209
4252c065569k610072j88895K831560J667608l378554o239820l030922K378540
4244a1636124L645150O81355q71809J599717L882450J623792k702099l074224
$$ plain form
4236 -6851792 -5545616 -945944 1365169 -1428831 -6311107 -9039260 -9153415 -8858407 -8940965
4227 -8940965 -8250647 -6538632 -5455032 -6338346 -8420700 -9633875 -8490918 -5403516 -2881242
4218 -2881242 -3605284 -6967653 -8492042 -4764867 1728440 5286448 4240228 2369620
4210 2369620 2629423 3102896 1049764 -2143685 -2942526 -696890 2126978 3572368 3462917
4201 3462917 1848146 -1292767 -4913062 -7292097 -7579484 -6051758 -3705684 -2536342
4193 -2536342 -4548037 -8740973 -10698623 -7424114 -1277462 3167835 4649423 4863097
4185 4863097 4311679 2374999 681958 1981914 5179149 5525998 1035360 -4630197 -7051418
4176 -7051418 -5753433 -2506994 1844587 6420507 8632145 6536683 1923142 -1218221
$$ packed form
4236f851792J306176M599672K311113k794000m882276k728153j14155K95008q2558
4227h940965O90318J712015J083600q83314k082354j213175J142957L087402K522274
4218b881242p24042l362369j524389L727175O493307L558008j046220j870608
4210B369620K59803M73473k053132l193449p98841K245636K823868J445390j09451
4201C462917j614771l140913l620295k379035k87387J527726K346074J169342
4193b536342k011695m192936j957650L274509O146652M445297J481588K13674
4185D863097n51418j936680j693041J299956L197235L46849m490638n665557k421221
4176g051418J297985L246439M351581M575920K211638k095462m613541l141363
$$ plain form
4168 -1218221 -910506 1546515 3890080 5040247 5169912 4727555 3708785 1906487 -37541
4159 -37541 -509459 1344933 4421122 7103641 8854884 9176485 6793689 2143019 -1152898
4150 -1152898 -485303 1663144 1719816 1475844 5371488 12270562 16188770 15272201 12888624
4141 12888624 8742699 -2236649 -18261798 -27046354 -21318501 -11225023 -12008487 -23529956
4133 -23529956 -31826794 -28783386 -19968899 -12823165 -7251615 -933254 4380852 6444277
4125 6444277 6565883 5888709 2335026 -4707414 -10625505 -10625998 -5696600 -225790 3462707
4116 3462707 4999816 3441713 -1146689 -5528868 -6471667 -4918453 -4062437 -4682348 -5349429
4107 -5349429 -5796666 -6726347 -7243107 -5931076 -4113189 -4774144 -8131561 -11230648 -12325670
$$ packed form
4168a218221L07715K457021K343565J150167J29665m42357j018770j802298j944028
4159c7541m71918J854392L076189K682519J751243L21601k382796m650670l295917
4150a152898O67595K148447N6672k43972L895644O899074L918208r16569k383577
4141A2888624m145925j0979348j6025149q784556N727853J0093478p83464j1521469
4133b3529956q296838L043408Q814487P145734N571550O318361N314106K063425
4125F444277J21606o77174l553683p042440n918091m93M929398N470810L688497
4116C462707J537109j558103m588402m382179r42799J553214Q56016o19911o67081
4107e349429m47237r29681n16760J312031J817887o60955l357417l099087j095022
$$ plain form
4098 -12325670 -12847768 -14196755 -15191507 -14231641 -12160869 -11189331 -11876095 -12705323 -12319384
4089 -12319384 -10967876 -9664027 -8754584 -7749362 -6228205 -4434260 -2905156 -1926921
4081 -1926921 -1674898 -2505839 -4418591 -6335824 -6802122 -5726885 -4771161 -5486457 -7415603
4072 -7415603 -8520288 -7446807 -5099355 -3768615 -4586732 -6164417 -6396541 -5365837 -5107840
4063 -5107840 -6259496 -6879141 -5741091 -4705450 -5608502 -6529640 -4245042 552831 3991859
4054 3991859 4762099 5399378 7282506 8132520 5945708 2079991 -1433125 -4646936 -7714284
4045 -7714284 -9104436 -8343655 -7874186 -9295552 -10155737 -7743373 -3959193 -2698918 -4023668
4036 -4023668 -4984769 -5077889 -6329624 -8276031 -7693269 -4247095 -1994672 -3443004 -5860780
$$ packed form
4098a2325670n22098j348987r94752R59866K070772R71538o86764q29228L85939
4089a2319384J351508J303849R09443J005222J521157J793945J529104R78235
4081a926921K52023q30941j912752j917233m66298J075237R55724p15296j929146
4072g415603j104685J073481K347452J330740q18117j577685k32124J030704K57997
4063e107840j151656o19645J138050J035641r03052r21138K284598M797873L439028
4054C991859P70240O37279J883128Q50014k186812l865717l513116l213811l067348
4045g714284j390152P60781M69469j421366q60185K412364L784180J260275j324750
4036d023668r61101r3120j251735j946407N82762L446174K252423j448332k417776
$$ plain form
4027 -5860780 -5870682 -4555571 -5054371 -7364640 -8785322 -8316317 -7592171 -7779875 -7962147
4018 -7962147 -6693893 -3494355 1061779 5209182 6243650 2684747 -3637412 -8981074
4010 -8981074 -11182367 -10598683 -8215232 -5021875 -3273831 -5484535 -10686279 -13938537
4002 -13938537 -11781427 -6757202 -4080218 -4777502 -5052366 -2399575 698266 286559 -4108535
3993 -4108535 -9475155 -12671232 -12527168 -10046396 -7759184 -7578367 -8291348 -6791613 -2752256
3984 -2752256 327749 453397 643947 4056101 8077653 7585249 2759735 -1092237 -1197381
3975 -1197381 47840 522845 1363461 2967810 2935428 573445 -840603 530583 1246712
3966 1246712 -2066086 -6797929 -8094818 -5973597 -4030983 -2906344 -188755 3872403
$$ packed form
4027e860780r902J315111m98800k310269j420682M69005P24146j87704j82272
4018g962147J268254L199538M556134M147403J034468l558903o322159n343662
4010h981074k201293N83684K383451L193357J748044k210704n201744l252258
4002a3938537K157110N024225K676984o97284k74864K652791L097841m11707m395094
3993d108535n366620l196077J44064K480772K287212J80817p12981J499735M039357
3984b752256L080005J25648J90550L412154M021552m92404m825514l851972j05144
3975a197381J245221M75005Q40616J604349l2382k361983j414048J371186P16129
3966A246712l312798m731843j296889K121221J942614J124639K717589M061158
$$ plain form
3958 3872403 5761140 4391828 2961064 3811510 5110035 4281878 1748500 -608519 -2319740
3949 -2319740 -3674298 -3937643 -2297204 259954 1695879 1358305 595691 727331 853839
3940 853839 -1630361 -7571521 -13424425 -13917038 -8173568 -1302274 1629797 1313684 1759677
3931 1759677 4083701 5951341 6126921 5888040 5962938 5506921 4659707 5002940 6590583
3922 6590583 7304942 6223879 5123124 5488723 6339644 6225643 5246892 3813132 1393087
3913 1393087 -2080520 -5193999 -6703352 -6810872 -5930094 -3819446 -834205 1705085 3333210
3904 3333210 4819788 5844042 4543881 894007 -1618042 88662 4389557 6680088
3896 6680088 4687735 375592 -2918089 -3771789 -3353927 -3815571 -5936057 -8140338 -8402763
$$ packed form
3958C872403J888737j369312j430764Q50446J298525q28157k533378k357019j711221
3949b319740j354558k63345J640439K557158J435925l37574p62614J31640J26508
3940H53839k484200n941160n852904m92613N743470O871294K932071l16113M45993
3931A759677K324024J867640J75580k38881P4898m56017q47214L43233J587643
3922F590583P14359j081063j100755L65599Q50921j14001r78751j433760k420045
3913A393087l473607l113479j509353j07520Q80778K110648K985241K539290J628125
3904C333210J486578J024254j300161l649874k512049J706704M300895K290531
3896F680088j992353m312143l293681q53700M17862m61644k120486k204281k62425
$$ plain form
3887 -8402763 -6932636 -5700376 -5435662 -4967669 -3739410 -2712037 -2132364 -885473 787787
3878 787787 476944 -2772614 -6330277 -7590323 -7673978 -9044328 -11081880 -10917366 -7828065
3869 -7828065 -4111590 -1823396 -851982 -242540 341747 685774 493762 -85447 96924
3860 96924 2267033 5541148 7108716 5756470 3670431 3378739 4742322 6764403 10191962
3851 10191962 15455890 19682298 19359073 15416968 12215591 11478327 10617118 7646987 4377926
3842 4377926 3147069 3027101 1526615 -1379910 -3101669 -1980679 529563 1585645
3834 1585645 256375 -1405196 -862032 1631083 3256901 2402439 760553 631648 1550991
3825 1550991 1388788 -159914 -1407377 -1712938 -2447177 -4428564 -6062227 -4876648 -183119
$$ packed form
3887h402763J470127J232260K64714M67993J228259J027373N79673J246891J673260
3878G87787l10843l249558l557663j260046q3655j370350k037552J64514L089301
3869g828065L716475K288194R71414O09442N84287L44027j92012n79209J82371
3860I6924K170109L274115J567568j352246k086039k91692J363583K022081L427559
3851A0191962N263928M226408l23225l942105l201377p37264q61209k970131l269061
3842D377926j230857j19968j500486k906525j721759J120990K510242J056082
3834A585645j329270j661571N43164K493115J625818q54462j641886j28905R19343
3825A550991j62203j548702j247463l05561p34239j981387j633663J185579M693529
$$ plain form
3816 -183119 6080471 10660888 11383862 8926023 5930160 3974054 2274901 -109081 -2378068
3807 -2378068 -3582375 -4546384 -6376462 -8402119 -9647693 -10925700 -12919268 -13550099 -10578673
3798 -10578673 -6107785 -4767934 -7275252 -9428660 -8232171 -5452654 -3758825 -2755941
3790 -2755941 -1068219 361502 -178014 -1963077 -2831496 -2570940 -3045366 -5149133 -7403869
3781 -7403869 -7841989 -6218141 -3996830 -2667611 -2517826 -3173679 -4803545 -7543874 -9549315
3772 -9549315 -7696648 -1898501 3016100 2309551 -2793073 -6979683 -7646239 -6380993 -4213440
3763 -4213440 101228 5881981 8733043 5499195 -1546409 -7646432 -10653387 -11394081
3755 -11394081 -11055827 -10261734 -9251309 -7429127 -4164097 -937156 -502973 -2798942 -4351183
$$ packed form
3816a83119O263590M580417P22974k457839k995863j956106j699153k383982k268987
3807b378068j204307r64009j830078k025657j245574j278007j993568o30831K971426
3798a0578673M470888J339851k507318k153408J196489K779517J693829J002884
3790b755941J687722J429721n39516j785063q68419K60556m74426k103767k254736
3781g403869m38120J623848K221311J329219J49785o55853j629866k740329k005441
3772i549315J852667N798147M914601p06549n102624m186610o66556J265246K167553
3763d213440M314668N780753K851062l233848p045604o100023l006955p40694
3755a1394081L38254P94093J010425J822182L265030L226941M34183k295969j552241
$$ plain form
3746 -4351183 -3325654 -2222857 -3313581 -4388010 -2193927 2227261 5130335 5337203
3738 5337203 4534447 3702698 2761475 2719322 4492006 6077197 4491000 493165 -1916213
3729 -1916213 -911068 1336202 2521589 2744113 2502537 1275591 -515987 -586709 2476811
3720 2476811 7063860 10353956 11077136 9579653 6352496 1602636 -4122622 -9356731
3712 -9356731 -11878016 -10420399 -6985259 -5922111 -8808628 -11567785 -9428921 -3943197
3704 -3943197 -1580443 -5121008 -10009408 -10530084 -6543588 -2225465 -600164 -1600662
3696 -1600662 -3790494 -5578278 -5611717 -4009129 -2806800 -3704495 -5755589 -6552458 -5339567
3687 -5339567 -3746174 -3577907 -4912275 -6472875 -7138424 -6749254 -5708581 -4263333 -2634063
$$ packed form
3746d351183J025529J102797j090724j074429K194083M421188K903074K06868
3738E337203q02756q31749r41223m2153J772684J585191j586197l997835k409378
3729a916213J005145K247270J185387K22524k41576j226946j791578p0722L063520
3720B476811M587049L290096P23180j497483l227157m749860n725258n234109
3712i356731k521285J457617L435140J063148k886517k759157K138864N485724
3704c943197K362754l540565m888400n20676L986496M318123J625301j000498
3696a600662k189832j787784l3439J602588J202329q97695k051094p96869J212891
3687e339567J593393J68267j334368j560600o65549L89170J040673J445248J629270
$$ plain form
3678 -2634063 -1695594 -2424423 -4046574 -3943224 -778184 3118506 4166286 1815364 -1284775
3669 -1284775 -2868147 -2851586 -2026846 -1284362 -1965557 -4478424 -6516615 -5356688 -2151849
3660 -2151849 -910765 -2652967 -4013941 -2865184 -1675456 -3152028 -5849208 -6892131
3652 -6892131 -6283511 -5412794 -3724178 -365116 2746821 3188194 2022308 1973432 2789859
3643 2789859 2157282 293680 -455116 -237380 -1718220 -5211313 -7772712 -7812908 -6871310
3634 -6871310 -6090967 -4895752 -4207960 -6587994 -11188396 -12823398 -8958190 -3890458 -2486634
3625 -2486634 -3113658 -1171401 2874454 4212972 1518140 -999097 155582 3658805
3617 3658805 6632117 8469689 9755222 10056157 8736287 6372597 3973147 1947944
$$ packed form
3678b634063R38469p28829j622151J03350L165040L896690J047780k350922l100139
3669a284775j583372J6561Q24740P42484o81195k512867k038191J159927L204839
3660b151849J241084j742202j360974J148757J189728j476572k697180j042923
3652f892131O08620Q70717J688616L359062L111937M41373j165886m8876Q16427
3643B789859o32577j863602p48796K17736j480840l493093k561399m0196R41598
3634f871310P80343J195215O87792k380034m600402j635002L865208N067732J403824
3625b486634o27024J942257M045855J338518k694832k517237J154679L503223
3617C658805K973312J837572J285533L00935j319870k363690k399450k025203
$$ plain form
3609 1947944 601296 266281 323654 -417924 -1790148 -2382160 -2224200 -3394127 -6815598
3600 -6815598 -10253401 -10998958 -9160213 -6785557 -4949149 -3309151 -1576903 229154
3592 229154 2361833 4761682 6416216 6447559 5209323 3356778 876326 -1757715 -2802556
3583 -2802556 -1486252 -29062 -1253384 -4695496 -7216710 -7174757 -5844916 -4799962 -4085734
3574 -4085734 -3266096 -2336380 -1278733 -418944 -1213451 -4595014 -8426343 -9046038 -5934544
3565 -5934544 -2480398 -1393775 -1913319 -2565395 -3727910 -5469277 -5478778 -2049683 2386255
3556 2386255 3522492 270898 -4576064 -7934010 -8457332 -5823894 -746854 4149692
3548 4149692 5696658 3114442 -1517068 -5617631 -7745581 -7393105 -4979009 -2210347
$$ packed form
3609A947944j346648l35015N7373p41578j372224n92012J57960j169927l421471
3600f815598l437803p45557J838745K374656J836408J639998J732248J806057
3592B29154K132679K399849J654534L1343j238236j852545k480452k634041j044841
3583b802556J316304J457190j224322l442112k521214M1953J329841J044954P14228
3574d085734Q19638R29716J057647Q59789p94507l381563l831329o19695L111494
3565e934544L454146J086623n19544o52076j162515j741367r501L429095M435938
3556B386255J136237l251594m846962l357946n23322K633438N077040M896546
3548D149692J546966k582216m631510m100563k127950L52476K414096K768662
$$ plain form
3540 -2210347 -1006538 -1693849 -3017124 -3665421 -2933656 -560782 2784696 5399907 6250097
3531 6250097 6195563 6262788 5711045 3621912 1385763 1161934 2365499 2275923 65369
3522 65369 -2298645 -3277163 -3337000 -2995492 -1877530 -315656 573786 1070289 2602004
3513 2602004 4597694 4337520 1081026 -2355984 -3523612 -3112108 -2216318 116111 4124549
3504 4124549 6816994 5390032 1307684 -2176797 -4946550 -8961184 -13429008 -15044026
3496 -15044026 -13030542 -10319405 -9045421 -8050823 -5933226 -3772884 -3299624 -4470595
3488 -4470595 -6371734 -8723763 -10937405 -11287708 -8914967 -5603607 -3700371 -2906595 -1055663
3479 -1055663 2110564 4007347 2785546 270098 -175176 1884696 3338669 1799213
$$ packed form
3540b210347J203809o87311j323275o48297P31765K372874L345478K615211Q50190
3531F250097n4534O7225n51743k089133k236149k23829J203565q9576k210554
3522F5369k364014r78518n9837L41508J117962J561874Q89442M96503J531715
3513B602004J995690k60174l256494l437010j167628M11504Q95790K332429M008438
3504D124549K692445j426962m082348l484481k769753m014634m467824j615018
3496a5044026K013484K711137J273984R94598K117597K160342M73260j170971
3488d470595j901139k352029k213642l50303K372741L311360J903236P93776J850932
3479a055663L166227J896783j221801k515448m45274K059872J453973j539456
$$ plain form
3471 1799213 -1004569 -1491487 865159 2851875 2014265 -113751 -540235 859247 1457771
3462 1457771 -246215 -2823624 -4101413 -3438053 -1313351 1769365 4907320 6398275
3454 6398275 5105383 1972179 -792165 -1954628 -1970429 -1702704 -1484995 -1615521 -2637938
3445 -2637938 -4372673 -5457463 -4859239 -3321151 -2125097 -865526 1825069 5330304
3437 5330304 7091451 6563967 6845507 10320980 14424645 14512983 10054832 4954125 1974289
3428 1974289 60819 -2275052 -4105143 -4022865 -2399740 -95435 2976091 6372498 8154958
3419 8154958 7117196 4348703 1190960 -2331267 -5501885 -5972457 -3346161 -1275054
3411 -1275054 -2670520 -4796564 -3205427 644403 482583 -5817874 -12951147 -15289229
$$ packed form
3471A799213k803782m86918K356646J986716q37610k128016m26484J399482N98524
3462A457771j703986k577409j277789O63360K124702L082716L137955J490955
3454F398275j292892l133204k764344j162463j5801K67725K17709j30526j022417
3445b637938j734735j084790N98224J538088J196054J259571K690595L505235
3437E330304J761147n27484K81540L475473M103665Q8338m458151n100707k979836
3428A974289j913470k335871j830091Q2278J623125K304305L071526L396407J782460
3419H154958j037762k768493l157743l522227l170618m70572K626296K071107
3411a275054j395466k126044J591137L849830j61820o300457p133273k338082
$$ plain form
3403 -15289229 -13371834 -11073177 -9596365 -7514968 -4875922 -3718367 -4698419 -5842217
3395 -5842217 -5306020 -3792293 -3417963 -4997143 -7163805 -7900889 -6389046 -3336394 -55061
3386 -55061 2306150 3081467 2742239 3316138 6803451 12397008 16321265 15447541 10388426
3377 10388426 4303461 -357382 -3058124 -4377493 -5269688 -6116314 -5489115 -1365349 5059279
3368 5059279 8766486 6451452 1025293 -2181044 -2265665 -2504712 -4422509 -6201379 -6792879
3359 -6792879 -7340302 -7819081 -6385732 -3480630 -2692408 -5346091 -7459632 -4694380 2067203
3350 2067203 8466513 11808873 12083567 9942940 6453284 3450834 1532978 -1263832
3342 -1263832 -6431344 -11664814 -13109807 -10396228 -7101910 -6405592 -8261232 -10672962
$$ packed form
3403a5289229J917395K298657J476812K081397K639046J157555r80052j143798
3395e842217N36197J513727L74330j579180k166662p37084J511843L052652L281333
3386e5061K361211P75317l39228N73899L487313N593557L924257q73724n059115
3377A0388426o084965m660843k700742j319369q92195q46626O27199M123766O424628
3368E059279L707207k315034n426159l206337q4621k39047j917797j778870n91500
3359f792879n47423m78779J433349K905102P88222k653683k113541K765252O761583
3350B067203O399310L342360K74694k140627l489656l002450j917856k796810
3342a263832n167512n233470j444993K713579L294318O96318j855640k411730
$$ plain form
3334 -10672962 -11716974 -10113664 -5687739 -62683 4139534 5506880 4925224 4320176
3326 4320176 4611573 5002644 4303304 2959070 3076118 5575917 8053085 7190083 3135836
3317 3135836 -582840 -1843094 -2371798 -4500224 -7614759 -9333640 -8681055 -6667511 -4913216
3308 -4913216 -4802379 -6735863 -9205522 -9881396 -8412238 -6677160 -5731184 -4648936 -3282126
3299 -3282126 -3539497 -6225524 -8937121 -9141846 -7407719 -5693792 -4511995 -3799258 -4346454
3290 -4346454 -5935256 -6174191 -3821092 -1241289 -794901 -892022 1183438 4507636 6134890
3281 6134890 5800528 5276998 4574903 2850496 1789973 3549844 6047220 5036370 809473
3272 809473 -1805956 -521774 1849305 2669489 2884826 3870544 4922355 5496538 6407871
$$ packed form
3334a0672962j044012J603310M425925N625056M202217J367346n81656o05048
3326D320176K91397L91071o99340j344234J17048K499799K477168q63002m054247
3317C135836l718676j260254n28704k128426l114535j718881O52585K013544J754295
3308d913216J10837j933484k469659o75874J469158J735078R45976J082248J366810
3299c282126k57371k686027k711597k04725J734127J713927J181797P12737n47196
3290d346454j588802k38935K353099K579803M46388r7121K075460L324198J627254
3281F134890l34362n23530p02095j724407j060523J759871K497376j010850m226897
3272H09473k615429J284182K371079Q20184K15337R85718J051811N74183R11333
$$ plain form
3263 6407871 7327032 6527144 4509490 4246688 6176378 6734893 4045080 1383807 2128410
3254 2128410 4367443 3890869 393584 -2553727 -2484755 -428541 821690 -900603 -5439475
3245 -5439475 -9818655 -10849004 -9078449 -8150296 -9437466 -10081619 -7749700 -4246958 -2236242
3236 -2236242 -1260852 250598 1506916 930161 -693861 -1578192 -1884887 -2662839 -3488745
3227 -3488745 -3849411 -5130890 -8256559 -10932343 -10481729 -8186284 -7522513 -9042502 -10295161
3218 -10295161 -10095327 -9494353 -8836073 -7100822 -4298787 -1802275 -234969 656915 428175
3209 428175 -1245026 -2659231 -1761300 615210 1959421 2083849 2856369 4304717 4499730
3200 4499730 3430981 3291289 4226871 3534788 426342 -1901786 -950720 1158027 701589
$$ packed form
3263F407871R19161p99888k017654k62802J929690N58515k689813k661273P44603
3254B128410K239033m76574l497285k947311O8972K056214J250231j722293m538872
3245e439475m379180j030349J770555R28153j287170o44153K331919L502742K010716
3236b236242R75390J511450J256318n76755j624022q84331l06695p77952q25906
3227c488745l60666j281479l125669k675784M50614K295445O63771j519989j252659
3218a0295161J99834O00974O58280J735251K802035K496512J567306Q91884k28740
3209D28175j673201j414205Q97931K376510J344211J24428P72520J448348J95013
3200D499730j068749j39692R35582o92083l108446k328128R51066K108747m56438
$$ plain form
3191 701589 -2818543 -6979689 -9813019 -10791501 -9782851 -7058723 -3712648 -770934 1456325
3182 1456325 2457390 1272836 -1795310 -4495909 -4889043 -3400306 -1722452 -704601
3174 -704601 -199823 106170 644144 1681835 2329717 1189729 -982255 -806219 3841677
3165 3841677 10445165 14152875 13095926 9870646 7849665 7523350 7002134 5175559 3341639
3156 3341639 3389283 4756419 4238003 -329643 -6764187 -10253489 -8455469 -3741566 -178112
3147 -178112 552251 -139430 45199 2078409 5000164 7121687 8081784 9293398 11574748
3138 11574748 13054316 10995148 5487952 -258340 -3258013 -2935371 -400915 2434367
3130 2434367 3231377 1129608 -1453468 -1267953 1257150 2557113 1347721 313244 1358353
$$ packed form
3191G01589l520132m161146k833330r78482J008650K724128L346075K941714K227259
3182A456325J001065j184554l068146k700599l93134J488737J677854J017851
3174g04601N04778L05993N37974J037691O47882j139988k171984J76036M647896
3165C841677O603488L707710j056949l225280k020981l26315n21216j826575j833920
3156C341639M7644J367136n18416m567646o434544l489302J798020M713903L563454
3147a78112P30363o91681J84629K033210K921755K121523R60097J211614K281350
3138A1574748J479568k059168n507196n746292k999673L22642K534456K835282
3130B434367P97010k101769k583076J85515K525103J299963j209392j034477J045109
$$ plain form
3121 1358353 2601038 2033582 1059612 1768661 3185199 3100525 1739404 817484 487020
3112 487020 -200345 -1194989 -2104049 -3260906 -3869796 -1330639 4608715 9296003 8455187
3103 8455187 4080793 988714 -497842 -3229369 -6026551 -4367431 1129178 3392823
3095 3392823 -1537085 -9004658 -12809778 -13022759 -13004022 -12797381 -10322027 -6552753 -4583267
3086 -4583267 -4604734 -3919670 -1473762 1026513 2168504 2020387 642703 -1733458 -3366560
3077 -3366560 -2649843 -852514 -452080 -1092652 -417375 1153380 330427 -3391644 -5811762
3068 -5811762 -3853957 -164093 936480 -331554 -486169 1110078 1308051 -1510708 -4556178
3059 -4556178 -4429903 -1579001 723924 550881 -1152771 -2546826 -2919429 -2819260 -3244970
$$ packed form
3121A358353J242685n67456r73970P09049J416538q4674j361121r21920l30464
3112D87020o87365r94644r09060j156857o08890K539157N939354M687288q40816
3103H455187m374394l092079j486556k731527k797182J659120N496609K263645
3095C392823m929908p467573l805120k12981J8737K06641K475354L769274J969486
3086d583267k1467O85064K445908K500275J141991j48117j377684k376161j633102
3077c366560P16717J797329M00434o40572O75277J570755q22953l722071k420118
3068e811762J957805L689864J100573j268034j54615J596247J97973k818759l045470
3059d556178J26275K850902K302925j73043j703652j394055l72603J00169m25710
$$ plain form
3050 -3244970 -4828228 -7097178 -8500722 -7855759 -5857409 -4450237 -4564476 -5299732 -5650509
3041 -5650509 -5964951 -6798592 -7234301 -5901069 -3517442 -2807420 -5310362 -9412425 -12203185
3032 -12203185 -12261578 -9863869 -5693139 -853269 2551838 2778376 607199 -1307643 -1650102
3023 -1650102 -1660274 -2598742 -3551663 -3089103 -1990165 -2361160 -4202870 -4807458 -2315494
3014 -2315494 1578679 3744389 3627588 3650131 5734854 8891044 10758713 10411777 8725100
3005 8725100 6723274 4753310 3030251 1785121 712398 -654086 -1672073 -841371
2997 -841371 1904498 4151066 3486823 544438 -1722041 -1571277 91959 1784044 3190157
2988 3190157 4157354 3642229 1212636 -1380541 -1940766 -819184 -429303 -1664707 -2535643
$$ packed form
3050c244970j583258k268950j403544O44963J998350J407172j14239p35256l50777
3041e650509l14442q33641m35709J333232K383627P10022k502942m102063k790760
3032a2203185n8393K397709M170730M839870L405107K26538k171177j914842l42459
3023a650102j0172r38468r52921M62560J098938l70995j841710o04588K491964
3014b315494L894173K165710j16801K2543K084723L156190J867669l46936j686677
3005H725100k001826j969964j723059j245130j072723j366484j017987Q30702
2997h41371K745869K246568o64243k942385k266479J50764J663236J692085J406113
2988C190157R67197n15125k429593k593177n60225J121582L89881j235404q70936
$$ plain form
2979 -2535643 -1039601 2024871 4088530 3661578 1237998 -1709226 -3586046 -3399896 -1893527
2970 -1893527 -1279675 -2518376 -3629805 -2498227 -674946 -1728435 -5485853 -6871949
2962 -6871949 -2221088 5422648 9733298 8586437 5493690 4057372 3844222 2473478
2954 2473478 -512188 -3479749 -5304769 -6572139 -8270771 -10132698 -10541686 -8137963
2946 -8137963 -3661128 184329 1375017 795283 860004 2125463 2675805 1144634 -1223949
2937 -1223949 -2470441 -2681152 -3546284 -5744210 -8013329 -8794132 -8042031 -7332381 -8342863
2928 -8342863 -10890086 -12464530 -10581031 -5842582 -1543559 239298 692869 1506826 1905091
2919 1905091 437236 -1537025 -904544 2737130 6128204 6447260 4448727 2756840 2626140
$$ packed form
2979b535643J496042L064472K063659m26952k423580k947224j876820J86150J506369
2970a893527O13852j238701j111429J131578J823281j053489l757418j386096
2962f871949M650861P643736M310650j146861l092747j436318k13150j370744
2954B473478k985666k967561j825020j267370j698632j861927m08988K403723
2946h137963M476835L845457J190688n79734O4721J265459N50342j531171k368583
2937a223949j246492k10711q65132k197926k269119p80803P52101P09650j010482
2928h342863k547223j574444J883499M738449M299023J782857M53571Q13957L98265
2919A905091j467855j974261O32481L641674L391074L19056j998533j691887j30700
$$ plain form
2910 2626140 3290866 3360157 2115944 289226 -225202 1406533 2999989 1355100 -3434329
2901 -3434329 -7655746 -8656850 -7694861 -7023723 -6497746 -4911872 -2668310 -803653 988826
2892 988826 2870067 2921865 -271288 -4114223 -4424190 -1081216 1926131 2071062 586440
2883 586440 -1091641 -3437274 -6122720 -6683513 -4026778 -595950 1164371 2105350 3743467
2874 3743467 4634573 2449566 -1810572 -4810287 -5258411 -4386428 -2706727 493465 4311904
2865 4311904 5991959 4545970 2337971 1788453 2064285 279784 -4893036 -11631735 -16442783
2856 -16442783 -17001823 -14218980 -11546338 -11540714 -13288262 -13968889 -12374083 -9644132 -7128339
2847 -7128339 -5254423 -4308627 -4465881 -4828371 -4021110 -1946592 430971 2814777 5264600
$$ packed form
2910B626140O64726O9291j244213j826718n14428J631735J593456j644889m789429
2901c434329m221417j001104R61989O71138N25977J585874K243562J864657J792479
2892I88826J881241N1798l193153l842935l09967L342974L007347J44931j484622
2883E86440j678081k345633k685446n60793K656735L430828J760321R40979J638117
2874C743467Q91106k185007m260138k999715m48124Q71983J679701L200192L818439
2865D311904J680055j445989k207999n49518K75832j784501n172820o738699m811048
2856a6442783n59040K782843K672642N624j747548o80627J594806K729951K515793
2847g128339J873916R45796j57254l62490Q07261K074518K377563K383806K449823
$$ plain form
2838 5264600 6462793 4803043 1451125 -480398 -628048 -2237079 -6675966 -10004743
2830 -10004743 -7825651 -1713635 2371019 1458215 -1423638 -1754874 1130373 3902581
2822 3902581 3243693 -656828 -4352489 -4877663 -3012020 -1942032 -2930300 -4226950 -4692925
2813 -4692925 -5883138 -8837704 -11165775 -10016206 -6487104 -4181404 -4159655 -4166579 -2582943
2804 -2582943 -476918 380163 -723164 -3685781 -7399144 -9326012 -7646888 -4066607
2796 -4066607 -2224827 -3087109 -4304192 -4415337 -4838795 -6744818 -8736605 -9262620 -9082111
2787 -9082111 -9473215 -9799057 -8855646 -7319711 -6873570 -7672925 -8286111 -7574670 -5434432
2778 -5434432 -2347752 761396 2968432 4467131 6211165 7643506 6372079 1635576
$$ packed form
2838E264600J198193j659750l351918j931523j47650j609031m438887l328777
2830a0004743K179092O112016M084654r12804k881853l31236K885247K772208
2822C902581o58888l900521l695661n25174J865643J069988r88268j296650m65975
2813d692925j190213k954566k328071J149569L529102K305700K1749o924J583636
2804b582943K106025Q57081j103327k962617l713363j926868J679124L580281
2796d066607J841780q62282j217083j11145m23458j906023j991787n26015J80509
2787i082111l91104l25842R43411J535935M46141p99355o13186P11441K140238
2778e434432L086680L109148K207036J498699J744034J432341j271427m736503
$$ plain form
2770 1635576 -3284402 -4193701 -897632 2839127 3768454 1796269 -1485467 -4776292 -7120721
2761 -7120721 -7644203 -6293933 -4366745 -3812017 -5961042 -10490294 -15221858 -17535577 -16622982
2752 -16622982 -13836765 -10458900 -6386209 -2022644 145605 -1840712 -5813238 -6999256
2744 -6999256 -3596431 1105939 2885300 1226679 -1163534 -2129604 -1958138 -2068970 -3097321
2735 -3097321 -4488392 -5414745 -5651074 -5365453 -4299157 -2014291 620432 1302587 -988620
2726 -988620 -3755824 -3319227 411336 3285447 1908466 -2053590 -3820947 -1017458 4058398
2717 4058398 7507596 7987412 7257059 7111148 6763449 4056456 -931809 -4827700 -4477329
2708 -4477329 -643865 3248163 5496822 7263540 9292110 9953208 7849089 4435562
$$ packed form
2770A635576m919978r09299L296069L736759R29327j972185l281736l290825k344429
2761g120721n23482J350270J927188N54728k149025m529252m731564k313719R12595
2752a6622982K786217L377865M072691M363565K168249j986317l972526j186018
2744f999256L402825M702370J779361j658621k390213r66070J71466j10832j028351
2735c097321j391071r26353k36329K85621J066296K284866K634723O82155k291207
2726i88620k767204M36597L730563K874111j376981l962056j767357K803489N075856
2717D058398L449198M79816p30353j45911l47699k706993m988265l895891L50371
2708d477329L833464L892028K248659J766718K028570O61098k104119l413527
$$ plain form
2700 4435562 2057511 550480 -1939657 -5264150 -6825355 -5141258 -1725277 1396584
2692 1396584 4097658 6711275 7868769 6009162 2411820 356528 887711 1377957 -767116
2683 -767116 -4596004 -7229606 -7811246 -7883172 -8180097 -7194299 -3702646 728886 3006191
2674 3006191 1734756 -1700126 -4947333 -6792159 -7573048 -8238046 -9234867 -10046078 -9630313
2665 -9630313 -7379404 -3771394 -230944 1725242 1680580 905791 1156284 2366582 2335048
2656 2335048 -257059 -3266358 -3213944 230454 3766599 4601261 3004842 285277 -3296699
2647 -3296699 -7238970 -9714270 -9840706 -9356774 -9861811 -9924864 -7494161 -3898565 -2359746
2638 -2359746 -3142384 -3459255 -2225092 -1584836 -2981254 -4822519 -5455159 -5815159 -7292598
$$ packed form
2700D435562k378051j507031k490137l324493j561205J684097L415981L121861
2692A396584K701074K613617J157494j859607l597342k055292N31183M90246k145073
2683g67116l828888k633602n81640p1926k96925R85798L491653M431532K277305
2674C006191j271435l434882l247207j844826p80889o64998r96821q11211M15765
2665i630313K250909L608010L540450J956186m4662p74789K50493J210298l1534
2656B335048k592107l009299N2414L444398L536145Q34662j596419k719565l581976
2647c296699l942271k475300j26436M83932n05037o3053K430703L595596J538819
2638b359746p82638l16871J234163O40256j396418j841265o32640l60000j477439
$$ plain form
2629 -7292598 -8958070 -8841183 -6616025 -3469938 -562929 1056488 478541 -1532266 -2366571
2620 -2366571 -670024 1567438 1867014 1095789 2219296 5801493 8988607 8968409 5654031
2611 5654031 947948 -2962897 -4542551 -3853550 -2823547 -3072410 -3351733 -881894 4375309
2602 4375309 8674822 8717115 5447366 2452697 1747979 2468969 2781943 1465542 -1949122
2593 -1949122 -6911659 -11544244 -13915114 -13998007 -13333650 -12484671 -10217622 -6091153 -2529752
2584 -2529752 -2557562 -5866509 -8947548 -9359460 -8162747 -7465956 -7334787 -6581783 -5328409
2575 -5328409 -4853933 -5480831 -6502400 -8017312 -10974392 -15242676 -19314101 -22135690 -23590991
2566 -23590991 -23094633 -19901186 -15393853 -12631529 -12277396 -11167207 -6767958 -1166113
$$ packed form
2629g292598j665472J16887K225158L146087K907009J619417n77947k010807q34305
2620b366571J696547K237462K99576p71225J123507L582197L187114k0198l314378
2611E654031m706083l910845j579654O89001J030003k48863k79323K469839N257203
2602D375309M299513M2293l269749k994669p04718P20990L12974j316401l414664
2593a949122m962537m632585k370870q2893O64357Q48979K267049M126469L561401
2584b529752k7810l308947l081039m11912J196713O96791J31169P53004J253374
2575e328409M74476o26898j021569j514912k957080m268284m071425k821589j455301
2566b3590991M96358L193447M507333K762324L54133J110189M399249N601845
$$ plain form
2558 -1166113 1667171 1111207 -187782 -603087 -871484 -1568123 -2151751 -2770649 -4363061
2549 -4363061 -6344665 -6673099 -5156603 -4317066 -5506248 -6244583 -3462242 1967325 6164519
2540 6164519 7154517 6790015 7701618 10090490 12254246 13121515 13082117 12521462 10686726
2531 10686726 6846995 2186093 -780953 -1196978 -988860 -1845834 -2375898 -439295 2437882
2522 2437882 2097402 -2216804 -6007164 -5493836 -2755480 -2222458 -4094198 -4801265 -3071361
2513 -3071361 -1557209 -2032050 -2718948 -1903181 -1003119 -1711838 -2590205 -1525086 36448
2504 36448 -1181754 -4762559 -6305182 -3366089 1304948 3897470 4372944 5029984 6170155
2495 6170155 6144968 5066783 5376689 7959588 10118884 9129134 6453210 6291801 9986453
$$ packed form
2558a166113K833284n55964j298989m15305k68397o96639n83628o18898j592412
2549d363061j981604l28434J516496Q39537j189182p38335K782341N429567M197194
2540F164519R89998l64502R11603K388872K163756Q67269l9398n60655j834736
2531A0686726l839731m660902k967046m16025K08118q56974n30064J936603K877177
2522B437882l40480m314206l790360N13328K738356N33022j871740p07067J729904
2513c071361J514152m74841o86898Q15767R00062p08719q78367J065119J561534
2504C6448j218202l580805j542623K939093M671037K592522M75474O57040J140171
2495F170155k5187j078185L09906K582899K159296r89750k675924j61409L694652
$$ plain form
2486 9986453 13695082 12699080 7141375 1936311 795398 1930401 1020398 -2635819 -5305279
2477 -5305279 -4292547 -1556656 -399704 -850689 -885679 -709321 -2504117 -6232437 -8991014
2468 -8991014 -9156084 -8272993 -7834363 -6980098 -4922702 -3134980 -3147006 -4175479 -4879327
2459 -4879327 -5510807 -6253768 -5545704 -2701766 -314967 -925210 -2886927 -3099570 -2477529
2450 -2477529 -4287663 -7537204 -7105258 -1553870 3898480 4452779 1853071 545577 1004506
2441 1004506 524800 -1567666 -3512514 -4952260 -7398364 -10734482 -12335269 -10522468
2433 -10522468 -6849203 -4107312 -3430492 -3951152 -4255929 -3687604 -2870784 -3095742 -4663373
2424 -4663373 -6055301 -5393685 -2449364 1355048 4375873 5517444 4468405 2346270
$$ packed form
2486I986453L708629r96002n557705n205064j140913J135003r10003l656217k669460
2477e305279J012732K735891J156952m50985l4990J76358j794796l728320k758577
2468h991014j65070Q83091M38630Q54265K057396J787722j2026j028473p03848
2459d879327o31480p42961P08064K843938K386799o10243j961717k12643O22041
2450b477529j810134l249541M31946N551388N452350N54299k599708j307494M58929
2441A004506m79706k092466j944848j439746k446104l336118j600787J812801
2433a0522468L673265K741891O76820n20660l04777N68325Q16820k24958j567631
2424d663373j391928O61616K944321L804412L020825J141571j049039k122135
$$ plain form
2416 2346270 1398642 2609938 3962962 2507461 -1976360 -6662588 -8937636 -8776285 -7958968
2407 -7958968 -8120093 -9567995 -10994603 -10492315 -7879036 -5606028 -6039188 -8314838 -9606780
2398 -9606780 -9136935 -8705685 -9188473 -9180827 -8058205 -7763088 -9661933 -11581999 -10383391
2389 -10383391 -6388834 -2843319 -1452386 -823567 544066 1936232 1889736 371131 -1562482
2380 -1562482 -3225846 -4387829 -4619206 -3697449 -2448393 -2230336 -3378354 -4655193 -4450681
2371 -4450681 -2347588 470554 2149104 1610428 -544098 -2493223 -2817506 -1755309 -688948
2362 -688948 -528482 -1102238 -2125647 -3858873 -6167114 -7687473 -7104288 -5022632 -3345227
2353 -3345227 -2786880 -2455066 -2231333 -3743312 -7718410 -11857988 -13222440 -11871760 -10128006
$$ packed form
2416B346270r47628J211296J353024j455501m483821m686228k275048J61351Q17317
2407g958968j61125j447902j426608N02288K613279K273008m33160k275650j291942
2398i606780M69845M31250m82788P646J122622K95117j898845j920066J198608
2389a0383391L994557L545515J390933O28819J367633J392166m6496j518605j933613
2380a562482j663364j161983k31377R21757J249056K18057j148018j276839K04512
2371d450681K103093K818142J678550n38676k154526j949125l24283J062197J066361
2362f88948J60466n73756j023409j733226k308241j520359N83185K081656J677405
2353c345227N58347L31814K23733j511979l975098m139578j364452J350680J743754
$$ plain form
2344 -10128006 -8855332 -7006145 -4882728 -4876124 -7690615 -10338935 -9998938 -8142669 -8357978
2335 -8357978 -11061180 -13008755 -11795386 -8314756 -4526934 -1277781 855243 953028 -392681
2326 -392681 -391310 2734628 6816377 7961501 5175946 969953 -2206640 -4021965 -4698287
2317 -4698287 -3723583 -1181009 1281741 2174700 1932563 1951027 2771051 4160932 5879685
2308 5879685 7042944 5801436 1495014 -3438724 -5708668 -5251932 -5166237 -7387392 -10390228
2299 -10390228 -11720534 -10860213 -8656604 -5783231 -3146354 -2221206 -3237357 -4147729 -3136271
2290 -3136271 -1221281 -583922 -1223554 -1424182 -924706 -1124911 -2212319 -2684955 -2185050
2281 -2185050 -2196041 -2922542 -2064255 1544236 5223390 5693239 3538757 1923706 1860678
$$ packed form
2344a0128006J272674J849187K123417O604k814491k648320L39997J856269k15309
2335h357978k703202j947575J213369L480630L787822L249153K133024R7785j345709
2326c92681J371L125938M081749J145124k785555m205993l176593j815325o76322
2317d698287R74704K542574K462750Q92959k42137J8464Q20024J389881J718753
2308E879685J163259j241508m306422m933738k269944M56736Q5695k221155l002836
2299a0390228j330306Q60321K203609K873373K636877R25148j016151r10372J011458
2290c136271J914990O37359o39632k00628M99476k00205j087408m72636M99905
2281b185050j0991p26501Q58287L608491L679154M69849k154482j615051o3028
$$ plain form
2272 1860678 1545344 11174 -1498977 -2195137 -3011842 -4248196 -4461339 -3211410 -2668657
2263 -2668657 -4491667 -7024527 -8107869 -9098585 -12787557 -17961392 -19797291 -16367439
$$ packed form
2272A860678l15334j534170j510151o96160q16705j236354k13143J249929N42753
2263b668657j823010k532860j083342r90716l688972n173835j835899L429852
$$ [...]
##END NTUPLES=NMR SPECTRUM
##END=
