##TITLE=31Pdec_3xp
 CDCl3
  24 sc
 3.11.2023
##JCAMPDX= 6.0         $$ Bruker NMR JCAMP-DX V2.0
##DATA TYPE= NMR SPECTRUM
##DATA CLASS= NTUPLES
##ORIGIN= UXNMR, Bruker Analytische Messtechnik GmbH
##OWNER= root
$$ XWIN-NMR		Version 3.5
$$ Fri Nov  3 15:42:41 2023 Russian Standard Time (UT+4h)  she@DPX200
##.OBSERVE FREQUENCY= 81.013821
##.OBSERVE NUCLEUS= ^31P
##.ACQUISITION MODE= SIMULTANEOUS
##.ACQUISITION SCHEME= undefined
##.AVERAGES= 24
##.DIGITISER RES= 16
##SPECTROMETER/DATA SYSTEM= spect
##.PULSE SEQUENCE= zgpg30
##.SOLVENT NAME= CDCl3
##.SHIFT REFERENCE= (INTERNAL, CDCl3, 0, 248.564)
##AUDIT TRAIL= $$ (NUMBER, WHEN, WHO, WHERE, WHAT)
$$ ##TITLE= Audit trail, XWIN-NMR		Version 3.5
$$ ##JCAMPDX= 5.01
$$ ##ORIGIN= Bruker BioSpin GmbH
$$ ##OWNER= she
$$ F:/spectra/data/she/nmr/P31/1/pdata/1/auditp.txt
$$ ##AUDIT TRAIL=  $$ (NUMBER, WHEN, WHO, WHERE, WHAT)
(   1,<2023-11-03 15:41:52.32 +0400>,<she>,<DPX200>,
      <created by zg, POWCHK disabled, PULCHK disabled
       configuration hash MD5:
       00 E9 B6 7A A2 85 ED C7 34 08 36 98 17 FE 4E 26
       data hash MD5: 32K
       4E 1C 31 B4 64 85 81 06 36 1B A3 FB D1 77 54 A4>)
(   2,<2023-11-03 15:41:54.59 +0400>,<she>,<DPX200>,
      <Start of raw data processing
       efp BC_mod = 2 LB = 5 FT_mod = 6 PKNL = 1 PHC0 = -10352.58 PHC1 = -400.9095 SI = 64K 
       data hash MD5: 64K
       80 6C 2B F1 F2 5F 12 B1 5B E4 6F 30 F0 A3 65 30>)
(   3,<2023-11-03 15:42:17.01 +0400>,<she>,<DPX200>,
      <pk PHC0 = 309.2807 PHC1 = -681.2 
       data hash MD5: 64K
       BC 59 15 AB 3C 50 84 E9 25 51 59 C5 EA 4C 74 33>)
(   4,<2023-11-03 15:42:21.43 +0400>,<she>,<DPX200>,
      <abs ABSG = 5 
       data hash MD5: 64K
       5A EA BD E1 B0 30 6E 3F 1C F4 17 5A DE 91 E9 82>)
$$ ##END=
$$ 
$$ hash MD5
$$ CC A9 B6 78 B4 19 2B 07 05 33 C2 A6 74 59 AE 23
##$RELAX= 
##$RELAX= 
##$RELAX= 
##$RELAX= 
##$RELAX= 
##$RELAX= 
##$RELAX= 
##$RELAX= 
##$RELAX= 
$$ Bruker specific parameters
$$ --------------------------
##$DU= <F:/spectra>
##$EXPNO= 1
##$NAME= <P31>
##$PROCNO= 1
##$TYPE= <nmr>
##$USER= <she>
##$AMP= (0..31)
100 100 100 100 100 100 100 100 100 100 100 100 100 100 100 100 100 100 
100 100 100 100 100 100 100 100 100 100 100 100 100 100 
##$AQSEQ= 0
##$AQ_mod= 1
##$AUNM= <au_zg>
##$AUTOPOS= <>
##$BF1= 81.014009
##$BF2= 200.13
##$BF3= 200.13
##$BF4= 200.13
##$BF5= 200.13
##$BF6= 200.13
##$BF7= 200.13
##$BF8= 200.13
##$BYTORDA= 1
##$CFDGTYP= 0
##$CFRGTYP= 5
##$CHEMSTR= <none>
##$CNST= (0..31)
1 1 145 1 1 1 1 1 1 1 1 1 1 1 1 1 1 1 1 1 1 1 1 1 1 1 1 1 1 1 1 1 
##$CPDPRG= <waltz16>
##$CPDPRG1= <>
##$CPDPRG2= <waltz16>
##$CPDPRG3= <>
##$CPDPRG4= <mlev>
##$CPDPRG5= <mlev>
##$CPDPRG6= <mlev>
##$CPDPRG7= <mlev>
##$CPDPRG8= <mlev>
##$CPDPRGB= <>
##$CPDPRGT= <>
##$D= (0..31)
0 1 0 0 0 0 0 0 0 0 0 0.03 2e-05 3e-06 0 0 0 0 0 0 0 0 0 0 0 0 0 0 0 0 
0 0 
##$DATE= 1699011711
##$DBL= (0..7)
120 120 120 11 120 120 24 19 
##$DBP= (0..7)
150 150 150 150 150 150 150 150 
##$DBP07= 0
##$DBPNAM0= <>
##$DBPNAM1= <>
$$ [...]
##$SUBNAM3= <"">
##$SUBNAM4= <"">
##$SUBNAM5= <"">
##$SUBNAM6= <"">
##$SUBNAM7= <"">
##$SUBNAM8= <"">
##$SUBNAM9= <"">
##$SW= 501.771253377433
##$SWIBOX= (0..15)
0 1 3 0 0 0 0 0 0 0 0 0 0 0 0 0 
##$SW_h= 40650.406504065
##$TD= 32768
##$TD0= 1
##$TE= 0
##$TE2= 300
##$TE3= 300
##$TEG= 300
##$TL= (0..7)
0 120 53 12 22 120 120 120 
##$TP= (0..7)
150 150 150 150 150 150 150 150 
##$TP07= 0
##$TPNAME0= <>
##$TPNAME1= <>
##$TPNAME2= <>
##$TPNAME3= <>
##$TPNAME4= <>
##$TPNAME5= <>
##$TPNAME6= <>
##$TPNAME7= <>
##$TPOAL= (0..7)
0.5 0.5 0.5 0.5 0.5 0.5 0.5 0.5 
##$TPOFFS= (0..7)
0 0 0 0 0 0 0 0 
##$TUNHIN= 0
##$TUNHOUT= 0
##$TUNXOUT= 0
##$USERA1= <user>
##$USERA2= <user>
##$USERA3= <user>
##$USERA4= <user>
##$USERA5= <user>
##$V9= 5
##$VALIST= <valist>
##$VCLIST= <CCCCCCCCCCCCCCC>
##$VD= 0
##$VDLIST= <DDDDDDDDDDDDDDD>
##$VPLIST= <PPPPPPPPPPPPPPP>
##$VTLIST= <TTTTTTTTTTTTTTT>
##$WBST= 1024
##$WBSW= 4
##$XGAIN= (0..3)
0 0 0 0 
##$XL= 0
##$YL= 0
##$YMAX_a= 213
##$YMIN_a= -186
##$ZGOPTNS= <>
##$ZL1= 120
##$ZL2= 120
##$ZL3= 120
##$ZL4= 120
##$ABSF1= 248.5645
##$ABSF2= -253.2056
##$ABSG= 5
##$ABSL= 3
##$ALPHA= 0
##$AQORDER= 0
##$ASSFAC= 0
##$ASSFACI= 0
##$ASSFACX= 0
##$ASSWID= 0
##$AUNMP= <proc_1d>
##$AZFE= 0.1
##$AZFW= 0.5
##$BCFW= 0
##$BC_mod= 2
##$BYTORDP= 0
##$COROFFS= 0
##$CY= -3
##$DATMOD= 1
##$DC= 0
##$DFILT= <>
##$DTYPP= 0
##$F1P= 0
##$F2P= 0
##$FCOR= 1
##$FTSIZE= 65536
##$FT_mod= 6
##$GAMMA= 0
##$GB= 0
##$INTBC= 1
##$INTSCL= 6.047779e-11
##$ISEN= 30
##$LB= 5
##$LEV0= 0
##$LPBIN= 0
##$MAXI= 10000
##$MC2= 0
##$MEAN= 0
##$ME_mod= 0
##$MI= 50
##$NCOEF= 0
##$NC_proc= -11
##$NLEV= 6
##$NOISF1= 182.463
##$NOISF2= 159.3651
##$NSP= 0
##$NTH_PI= 0
##$NZP= 0
##$OFFSET= 248.5645
##$PC= 4
##$PHC0= -10043.3
##$PHC1= -1082.109
##$PH_mod= 1
##$PKNL= yes
##$PPARMOD= 0
##$PSCAL= 0
##$PSIGN= 0
##$REVERSE= no
##$SF= 81.0140089999694
##$SI= 65536
##$SIGF1= 159.3651
##$SIGF2= -187.1042
##$SINO= 113.3802
##$SIOLD= 16384
##$SREGLST= <1H.CDCl3>
##$SSB= 0
##$STSI= 65536
##$STSR= 0
##$SW_p= 40650.406504065
##$SYMM= 0
##$S_DEV= 0
##$TDeff= 32768
##$TDoff= 0
##$TI= <>
##$TILT= no
##$TM1= 0
##$TM2= 0
##$TOPLEV= 0
##$USERP1= <user>
##$USERP2= <user>
##$USERP3= <user>
##$USERP4= <user>
##$USERP5= <user>
##$WDW= 1
##$XDIM= 65536
##$YMAX_p= 343199905
##$YMIN_p= -6848932
$$ End of Bruker specific parameters
$$ ---------------------------------
##NTUPLES= NMR SPECTRUM
##VAR_NAME=  FREQUENCY,     SPECTRUM/REAL,   SPECTRUM/IMAG
##SYMBOL=    X,             R,               I
##VAR_TYPE=  INDEPENDENT,   DEPENDENT,       DEPENDENT
##VAR_FORM=  AFFN,          ASDF,            ASDF
##VAR_DIM=   65536,         65536,           65536
##UNITS=     HZ,            ARBITRARY UNITS, ARBITRARY UNITS
##FACTOR=    0.620285442955139, 1,           1
##FIRST=     20137.2065510682, 0,            0
##LAST=      -20513.1999529968, 0,           0
##MIN=       -20513.1999529968, -6848932,    0
##MAX=       20137.2065510682, 343199905,    0
$$ Real data points
##PAGE= N=1
##DATA TABLE= (X++(R..R)), XYDATA
$$ [...]
38638a831326K96837M37409N22061M72766L11167J40872J9117q1374j72813j93111
$$ -1831326 -1534489 -1097080 -575019 -102253 208914 349786 368903 287529 114716 -78395
38628g8395q9098R1894K40669K88049K36115J22614j675q1219q8035m6907n534
$$ -78395 -167493 -75599 165070 453119 689234 811848 810173 728954 640919 594012 588478
38617E88478J2843R713j6054o6067j25093j77565k36580l26495m34923n06697
$$ 588478 601321 611034 594980 528913 403820 226255 -10325 -336820 -771743 -1278440
38607a278440m92219l88807k35964q4953K9744J05536J58664J86464J54982M7195
$$ -1278440 -1770659 -2159466 -2395430 -2480383 -2450639 -2345103 -2186439 -1999975 -1844993 -1797798
38597a797798q4196j45613r4367K1095J23336J85262K28856K63664K59481J85936
$$ -1797798 -1881994 -2027607 -2121974 -2100879 -1977543 -1792281 -1563425 -1299761 -1040280 -854344
38587h54344N6499q5324k15703l42961m60711n10116m23632k14332O849J27862
$$ -854344 -797845 -883169 -1098872 -1441833 -1902544 -2412660 -2836292 -3050624 -3043775 -2915913
38577b915913J37815J11955J09908J24365J29422J35083J65756K08458K17348
$$ -2915913 -2778098 -2666143 -2556235 -2431870 -2302448 -2167365 -2001609 -1793151 -1575803
38568a575803J69202R3738M6182O0159J23562J88242K07021J74302J27952J00907
$$ -1575803 -1406601 -1312863 -1266681 -1206522 -1082960 -894718 -687697 -513395 -385443 -284536
38558b84536P9704K9579m5212r1350n9965M9741J99506L34847L92973L27514J55312
$$ -284536 -204832 -175253 -220465 -311815 -371780 -322039 -122533 212314 605287 932801 1088113
38547A088113m3651k01076l15662m04980m30084l23770r3609J56580L27376M07509
$$ 1088113 1044462 843386 527724 122744 -307340 -631110 -724719 -568139 -240763 166746
38537A66746M36936M26038L49876K04951L4884j01904j74554j94976k01300k15504
$$ 166746 603682 1029720 1379596 1584547 1619431 1517527 1342973 1147997 946697 731193
38527G31193k09816j34639O574J34493J70200J17145M3006L67j713L3127R7460
$$ 731193 521377 386738 393312 527805 698005 815150 858156 858523 856810 889937 987397
38516I87397J54834J51458P2940l8711j41125k38717l53228m67397n24254m78454
$$ 987397 1142231 1293689 1366629 1327918 1186793 948076 594848 127451 -396803 -875257
38506h75257l34608j41538L8099J58191K06508K00315J64899J15652N6399j3102
$$ -875257 -1209865 -1351403 -1313304 -1155113 -948605 -748290 -583391 -467739 -411340 -424442
38496d24442q8874j55886j90394j76427j19911m2019L5074Q6075P6850j3863j57955
$$ -424442 -513316 -669202 -859596 -1036023 -1155934 -1197953 -1162879 -1076804 -999954 -1013817 -1171772
38485a171772k77472k95641j93548k2322J35076K21284K36725K16540J77351J04160
$$ -1171772 -1449244 -1744885 -1938433 -1960755 -1825679 -1604395 -1367670 -1151130 -973779 -869619
38475h69619q02q3540q5225j1693P7456J41410J82234K02393J88300J48014J17949
$$ -869619 -870421 -953961 -1039186 -1050879 -973423 -832013 -649779 -447386 -259086 -111072 6877
38464F877J08708Q5209K9471j5724l192N0712R6250J20235J36189J26459N5530
$$ 6877 115585 200794 230265 214541 211349 262061 358311 478546 614735 741194 796724
38453G96724o1868j65217k30798k94461l72236m13797l75405l00417k76666l29632
$$ 796724 734856 569639 338841 44380 -327856 -741653 -1117058 -1417475 -1694141 -2023773
38443b023773m00846m24790l87160l07862k08268j11280m5048k4750m1756p9207
$$ -2023773 -2424619 -2849409 -3236569 -3544431 -3752699 -3863979 -3909027 -3933777 -3975533 -4054740
38433d054740j20952j35144p4445P7150K62403L82452L81659K94679K09328J89318
$$ -4054740 -4175692 -4310836 -4385281 -4308131 -4045728 -3663276 -3281617 -2986938 -2777610 -2588292
38423b588292K28267K66796K54912K05435J79017K05122K32481J85796O5110m8591
$$ -2588292 -2360025 -2093229 -1838317 -1632882 -1453865 -1248743 -1016262 -830466 -765356 -813947
38413h13947r1829p9360m7209J6027J31842K53710K88268J97275L2314j36443
$$ -813947 -905776 -985136 -1032345 -1016318 -884476 -630766 -342498 -145223 -112909 -249352
38403b49352k77773l71977l79660k81223j23649J3132R2952J41989J94536K40287
$$ -249352 -527125 -899102 -1278762 -1559985 -1683634 -1670502 -1577550 -1435561 -1241025 -1000738
38393a000738K26323J03209j22354l70522n35989n69842n11276m32633l67735
$$ -1000738 -774415 -671206 -793560 -1164082 -1700071 -2269913 -2781189 -3213822 -3581557
38384c581557l05886k35300j62339r0989r857R0733J98719K81912L08868K78026
$$ -3581557 -3887443 -4122743 -4285082 -4376071 -4385928 -4295195 -4096476 -3814564 -3505696 -3227670
38374c227670K33771K39472L16137M12200M45201L64804J68814j10292l95371
$$ -3227670 -2993899 -2754427 -2438290 -2026090 -1580889 -1216085 -1047271 -1157563 -1552934
38365a552934n60204n02355k54149R977J14426K9353j30494k29747k11783r7893
$$ -1552934 -2113138 -2615493 -2869642 -2859665 -2745239 -2715886 -2846380 -3076127 -3287910 -3385803
38355c385803O2818K24889L52764M21603M15144L21389J40514r4587l14047m44503
$$ -3385803 -3322985 -3098096 -2745332 -2323729 -1908585 -1587196 -1446682 -1541269 -1855316 -2299819
38345b299819m57906l90817l16253k90015l08264l04631j96835M0136L32194N44075
$$ -2299819 -2757725 -3148542 -3464795 -3754810 -4063074 -4367705 -4564540 -4524404 -4192210 -3648135
38335c648135N75504M31879K09296J8199q3890j08970j09235j25906j50276j33680
$$ -3648135 -3072631 -2640752 -2431456 -2413257 -2497147 -2606117 -2715352 -2841258 -2991534 -3125214
38325c125214m3391R6163K25618L02499L17527K78868K14610J83702K37134L49842
$$ -3125214 -3168605 -3072442 -2846824 -2544325 -2226798 -1947930 -1733320 -1549618 -1312484 -962642
38315i62642M27501M08223L30186K69929K43895K16727J87866K05507K78591L26649
$$ -962642 -535141 -126918 203268 473197 717092 933819 1121685 1327192 1605783 1932432
38305A932432K56463O6863j55640l33175m55518n44629n94264n65917m36940k41140
$$ 1932432 2188895 2255758 2100118 1766943 1311425 766796 172532 -393385 -830325 -1071465
38295a071465o3075Q263o2361k22207l52717l47955j93648K7125K10826L12010
$$ -1071465 -1134540 -1126277 -1188638 -1410845 -1763562 -2111517 -2305165 -2278040 -2067214 -1755204
38285a755204L42048L08789J92055p046k14900l14409k35833j6006K30681L96543
$$ -1755204 -1413156 -1104367 -912312 -919358 -1134258 -1448667 -1684500 -1700506 -1469825 -1073282
38275a073282M45064M10744L50875L02784K78829K77632K79026K38968J22493
$$ -1073282 -628218 -217474 133401 436185 715014 992646 1271672 1510640 1633133
38266A633133m7596j97177k69617k71562k40819j94338j30467o0871o652K8615
$$ 1633133 1585537 1388360 1118743 847181 606362 412024 281557 220686 214034 242649
38256B42649M9997L8992l3126j48389k27364j94407n0165J31602K72619L49569
$$ 242649 292646 331638 298512 150123 -77241 -271648 -321813 -190211 82408 431977
38246D31977L94498M45706M97292M95548L87420J72771q8104l07045m06694l53961
$$ 431977 826475 1272181 1769473 2265021 2652441 2825212 2737108 2430063 2023369 1669408
38236A669408j84521J2187J60004K52558L27331L90523L97035L08740J42676n1456
$$ 1669408 1484887 1497074 1657078 1909636 2236967 2627490 3024525 3333265 3475941 3424485
38226C424485k35872l88221m81443m88116m05600k67714j34775o9944j02444j97084
$$ 3424485 3188613 2800392 2318949 1830833 1425233 1157519 1022744 952800 850356 653272
38216F53272k72392k67075j86046p6101K8004J18240J90556K36394K59838K82224
$$ 653272 380880 113805 -72241 -148342 -120338 -2098 188458 424852 684690 966914
38206I66914L17119L46505L29578K36810P7546j01227k40070k92206k35346q2807
$$ 966914 1284033 1630538 1960116 2196926 2274472 2173245 1933175 1640969 1405623 1322816
38196A322816J01900K21065K11681J09002J7446M045L6746L6996k8681j24713
$$ 1322816 1424716 1645781 1857462 1966464 1983910 1987955 2024701 2061697 2033016 1908303
38186A908303j91810j93339j31419m1383L6615R6396J62639K31816K40330J30501
$$ 1908303 1716493 1523154 1391735 1350352 1386967 1483363 1646002 1877818 2118148 2248649
38176B248649n9069k10803k45157j92312j42112j55704k39548l70169n08157n97949
$$ 2248649 2189580 1978777 1733620 1541308 1399196 1243492 1003944 633775 125618 -472331
38166d72331n88218m70449k97910j62286j36695k18083l18930l31896k15214j2043
$$ -472331 -1060549 -1530998 -1828908 -1991194 -2127889 -2345972 -2664902 -2996798 -3212012 -3224055
38156c224055K06762L95707N27296N64943M76126K73552L0561j48006j78641m8751
$$ -3224055 -3017293 -2621586 -2094290 -1529347 -1053221 -779669 -749108 -897114 -1075755 -1124506
38146a124506J68614L58373M36641L85584K32370K6501j57439k38780j91436p3362
$$ -1124506 -955892 -597519 -160878 224706 457076 483577 326138 87358 -104078 -177440
38136a77440K8759P1592N6659q262j11064k19519l06543l74769m09690l33654
$$ -177440 -148681 -77089 -20430 -28692 -139756 -359275 -665818 -1040587 -1450277 -1783931
38126a783931q9123K20626L61503J98123j49560m26508m83499l55655j51974M9373
$$ -1783931 -1873054 -1652428 -1290925 -1092802 -1242362 -1668870 -2152369 -2508024 -2659998 -2610625
38116b610625K03284K76820K62595J82165O0401q1053k06357k78876l01213l09293
$$ -2610625 -2407341 -2130521 -1867926 -1685761 -1625360 -1706413 -1912770 -2191646 -2492859 -2802152
38106b802152l16096k91762k10552q6415N2347J95204L41199M84677O20034P28627
$$ -2802152 -3118248 -3410010 -3620562 -3706977 -3654630 -3459426 -3118227 -2633550 -2013516 -1284889
38096a284889P49464O10289L25894L4280j10548p2493O3475J92830K55141K24098
$$ -1284889 -535425 74864 400758 435038 324490 251997 315472 508302 763443 987541
38086I87541J01609o6488k14102l11253l69245l88020l39020k13418m9405J08056
$$ 987541 1089150 1022662 808560 497307 128062 -259958 -598978 -812396 -861801 -753745
38076g53745K41473L36082L62056L19064K68396K70770L01871K77215J64081K4654
$$ -753745 -512272 -176190 185866 504930 773326 1044096 1345967 1623182 1787263 1811917
38066A811917o7424j13656j62583k20324k33143j63650n2848J2860j5135j10383
$$ 1811917 1744493 1630837 1468254 1247930 1014787 851137 798289 811149 796014 685631
38056F85631k06093k48216k19082j35787l9591K9327O5931J01461J53359J84808
$$ 685631 479538 231322 12240 -123547 -163138 -133811 -67880 33581 186940 371748
38046C71748J43263L8629n3508q4304r6483j64474k87404l82382l85613l23596
$$ 371748 515011 553640 500132 415828 319345 154871 -132533 -514915 -900528 -1224124
38036a224124k68043k46366k19548j34751K2978K25315M23317N68470O23895N69036
$$ -1224124 -1492167 -1738533 -1958081 -2092832 -2069854 -1844539 -1421222 -852752 -228857 340179
38026C40179M05594J72455m5817j53393j17753q569O4472O0998L6990N4992R5651
$$ 340179 745773 918228 872411 719018 601265 592696 657168 718166 755156 810148 905799
38015I05799Q5823r88j08521j65524j59603j29786j08792r6124p9878o3304o4660
$$ 905799 991622 990634 882113 716589 556986 427200 318408 222284 142406 79102 14442
38004A4442r7182j47324j70190j20299l965J05540J27685N4947m2489r6847j07960
$$ 14442 -82740 -230064 -400254 -520553 -524518 -418978 -291293 -236346 -278835 -375682 -483642
37993d83642j16040j30165j12576l1605R5653K19415K92416K77221J45764r2310
$$ -483642 -599682 -729847 -842423 -874028 -778375 -558960 -266544 10677 156441 64131
37983F4131l60931n48079n84341m86628l23187j51225N386J39716K46772L18511
$$ 64131 -296800 -844879 -1429220 -1915848 -2239035 -2390260 -2384874 -2245158 -1998386 -1679875
37973a679875L35552K68588J09072r7691k65755l23325k53041q9676R9119K29124
$$ -1679875 -1344323 -1075735 -966663 -1064354 -1330109 -1653434 -1906475 -1996151 -1897032 -1667908
37963a667908K28303Q0852j51276l59525m52084m04458k68712j34830o2931l9263
$$ -1667908 -1439605 -1358753 -1510029 -1869554 -2321638 -2726096 -2994808 -3129638 -3192569 -3231832
37953c231832l252Q0007J83951K55730K67717K26797J53947P4109J6969R054O1604
$$ -3231832 -3235084 -3155077 -2971126 -2715396 -2447679 -2220882 -2066935 -1992826 -1975857 -1966803 -1905199
37942a905199J65593K86774L64640L41636K14602M6618q8226j61790j82659j53269
$$ -1905199 -1739606 -1452832 -1088192 -746556 -531954 -485336 -573562 -735352 -918011 -1071280
37932a071280o7897N3367J60368K09773J90130J12387l109j28770k40746l34236
$$ -1071280 -1139177 -1085810 -925442 -715669 -525539 -413152 -416261 -545031 -785777 -1120013
37922a120013m12283m56650m29380l13060j38318L3130J43032J59141R0131r350
$$ -1120013 -1532296 -1988946 -2418326 -2731386 -2869704 -2836574 -2693542 -2534401 -2444270 -2453620
37912b453620o8780o0374k6212l4767j09381k04202k47128k00685q4159N3744
$$ -2453620 -2522400 -2582774 -2608986 -2643753 -2753134 -2957336 -3204464 -3405149 -3489308 -3435564
37902c435564J75417K67084L22128L28810K80296J85843O5385n4747j32678j16940
$$ -3435564 -3260147 -2993063 -2670935 -2342125 -2061829 -1875986 -1810601 -1865348 -1998026 -2114966
37892b114966J2582K09936L85110M63653M24581L00042J58578P3254P2158J14094
$$ -2114966 -2102384 -1892448 -1507338 -1043685 -619104 -319062 -160484 -87230 -15072 99022
37882I9022J29841Q6404k100j10839k19126k93802k95299k12925p5794P1156J81609
$$ 99022 228863 315267 313167 202328 -16798 -310600 -605899 -818824 -894618 -823462 -641853
37871f41853K11407J51674O3728L7329R6372J79259K24699K34305K27795J82452
$$ -641853 -430446 -278772 -215044 -177715 -81343 97916 322615 556920 784715 967167
37861I67167O1250j22120l03681m19727m32566l34834j67922j6969N5202O1573
$$ 967167 1028417 906297 602616 182889 -249677 -584511 -752433 -769402 -714200 -652627
37851f52627M7615J4797o6143j77080k45365k26865j52358p4952q407O2372J40721
$$ -652627 -605012 -590215 -656358 -833438 -1078803 -1305668 -1458026 -1532978 -1541385 -1479013 -1338292
37840a338292K11727K54282K40517J46490j0777j62095k40275k43814k28736k38233
$$ -1338292 -1126565 -872283 -631766 -485276 -496053 -658148 -898423 -1142237 -1370973 -1609206
37830a609206k55283k25960j17234N4024K43213M19254N76053P03263P60916P02615
$$ -1609206 -1864489 -2090449 -2207683 -2153659 -1910446 -1491192 -915139 -211876 549040 1251655
37820A251655N26556K90943P4106p3145j38036j29151o4880K5714J02493J23312
$$ 1251655 1778211 2069154 2143260 2070115 1932079 1802928 1738048 1763762 1866255 1989567
37810A989567O4635n4679j73596k33725k37338k51217l36718m73584n61010m99434
$$ 1989567 2054202 1999523 1825927 1592202 1354864 1103647 766929 293345 -267665 -767099
37800g67099k75019K7543K85187M10953L89046K64438J10893p790p5544j31664
$$ -767099 -1042118 -1014575 -729388 -318435 70611 335049 445942 438152 362608 230944
37790B30944k20931l24754l62180k79913j26245p833K2516J0484L8405J49423
$$ 230944 10013 -314741 -676921 -956834 -1083079 -1090912 -1068396 -1057912 -1019507 -870084
37780h70084L30917N28093O51679O12632L99574J17645q7602j55020j38341j16605
$$ -870084 -539167 -11074 640605 1253237 1652811 1770456 1682854 1527834 1389493 1272888
37770A272888j08850r0191n6880l6295l7930k8057L2778J39196K36414K61187
$$ 1272888 1164038 1073847 1016967 980672 942742 914685 947463 1086659 1323073 1584260
37760A584260J89190N5662o6403j21555j15810j01128j14685j44631j58422j45029
$$ 1584260 1773450 1829112 1762709 1641154 1525344 1424216 1309531 1164900 1006478 861449
37750H61449j13266o3495J3428J07244J74799J64021N6090j02926k10972j81292
$$ 861449 748183 684688 698116 805360 980159 1144180 1200270 1097344 886372 705080
37740G05080l2972J05728J15508j533j51942k67327l38252l47101k49026n4160
$$ 705080 672108 777836 893344 891811 739869 472542 134290 -212811 -461837 -515997
37730e15997J30326J93730J31093K3722n5917p6114j6541J24887K93030L94848
$$ -515997 -385671 -191941 -60848 -37126 -93043 -169157 -185698 -60811 232219 627067
37720F27067L77055K63951J18520j0651j09680j95553k88885l65376l46274j77257
$$ 627067 1004122 1268073 1386593 1375942 1266262 1070709 781824 416448 70174 -107083
37710a07083Q1223K79293L05733J73587j2868j42827j58705q3031m549k643o5183
$$ -107083 -25860 253433 559166 732753 719885 577058 418353 335322 330773 328130 262947
37699B62947j04597o5093J4776N6131K3349o1117j51661k07587k13915j96963
$$ 262947 158350 93257 108033 164164 187513 126396 -25265 -232852 -446767 -643730
37689f43730j98461k20140k22053j88359j52200j26349n4634J14031L27915M67492
$$ -643730 -842191 -1062331 -1284384 -1472743 -1624943 -1751292 -1805926 -1691895 -1363980 -896488
37679h96488M73318L88229K71689J28380n4537k40260l51594l39650k26031q3710
$$ -896488 -423170 -34941 236748 365128 310591 70331 -281263 -620913 -846944 -930654
37669i30654J5502M7466M4506N4950Q7361R8087L6035j05205k78005m11694m50211
$$ -930654 -915152 -867686 -823180 -768230 -680869 -582782 -546747 -651952 -929957 -1341651 -1791862
37658a791862l74128k04875J694J67322K15838J17894p0030k26084k49335j32464
$$ -1791862 -2165990 -2370865 -2369171 -2201849 -1986011 -1868117 -1938147 -2164231 -2413566 -2546030
37648b546030N5781K45661M01836M97735N02733M20848L16838K67123K82050K95856
$$ -2546030 -2490249 -2244588 -1842752 -1345017 -842284 -421436 -104598 162525 444575 740431
37638G40431K36848R4563q2861k40885l58338m44609n09119n35378m86068l42219
$$ 740431 977279 1071842 988981 748096 389758 -54851 -563970 -1099348 -1585416 -1927635
37628a927635j41661L2995J19639J29232J23999J48338J96744K44921K82176K98100
$$ -1927635 -2069296 -2036301 -1916662 -1787430 -1663431 -1515093 -1318349 -1073428 -791252 -493152
37618d93152K63737J57849N111j38399k35427k79825k64976j77397l3721J08465
$$ -493152 -229415 -71566 -66455 -204854 -440281 -720106 -985082 -1162479 -1196200 -1087735
37608a087735K00331K42869K58634K44601J83638R1017J5259j0073Q141M6008
$$ -1087735 -887404 -644535 -385901 -141300 42338 133355 148614 138541 146682 192690
37598A92690Q5773J09220R3396L0304o0644j50485k20489k58125k53557k20200
$$ 192690 278463 387683 481079 511383 450739 300254 79765 -178360 -431917 -652117
37588f52117k06144k56091l55801m32638m21037l17789j68034j1651J42940L00586
$$ -652117 -858261 -1114352 -1470153 -1902791 -2323828 -2641617 -2809651 -2821302 -2678362 -2377776
37578b377776M52319N68055O09025N53620M25851K95093K24828K10133J79758
$$ -2377776 -1925457 -1357402 -748377 -194757 231094 526187 751015 961148 1140906
37569A140906P3849q8109k28115k90477k87839k70526k65742k53032j95009q9677
$$ 1140906 1214755 1126646 898531 608054 320215 49689 -216053 -469085 -664094 -753771
37559g53771J0168L7730k4430j30700k25030k91865l46276l94177m24930m30662
$$ -753771 -743603 -705873 -730303 -861003 -1086033 -1377898 -1724174 -2118351 -2543281 -2973943
37549b973943m04523l22256j54455R1239L52095N40967N96656N24209M05768L51290
$$ -2973943 -3378466 -3700722 -3855177 -3763938 -3411843 -2870876 -2274220 -1750011 -1344243 -992953
37539i92953L97199M53204L87496J74778p0376k13615k18069j33434j9987P7419
$$ -992953 -595754 -142550 244946 419724 349348 135733 -82336 -215770 -235757 -158338
37529a58338J15151O8457l4118j28723j77238j95135k23298k90683l96885n04172
$$ -158338 -43187 25270 -8848 -137571 -314809 -509944 -733242 -1023925 -1420810 -1924982
37519a924982n44242m59265k54469o732J84847K61025K30619J56149J11840J37849
$$ -1924982 -2469224 -2928489 -3182958 -3189690 -3004843 -2743818 -2513199 -2357050 -2245210 -2107361
37509b107361K19201L02800L34728K89569J79997M6921o6009j38271j78182k08165
$$ -2107361 -1888160 -1585360 -1250632 -961063 -781066 -734145 -800154 -938425 -1116607 -1324772
37499a324772k45762k86571k93785k18498n4432J33524K60679K98481K74063K07932
$$ -1324772 -1570534 -1857105 -2150890 -2369388 -2423820 -2290296 -2029617 -1731136 -1457073 -1249141
37489a249141R9886k2972j04912j33172j57450k01546k06437j14721K7562J19756
$$ -1249141 -1149255 -1172227 -1277139 -1410311 -1567761 -1769307 -1975744 -2090465 -2062903 -1943147
37479a943147J37559J46984J89744K20762J79134P3461k9421p2744m9954N56K7744
$$ -1943147 -1805588 -1658604 -1468860 -1248098 -1068964 -995503 -1024924 -1097668 -1147622 -1147066 -1119322
37468a119322J1357j9590k1605J6974P8545J44439J88404J62664M4013j04729
$$ -1119322 -1107965 -1127555 -1149160 -1132186 -1053641 -909202 -720798 -558134 -514121 -618850
37458f18850j71437j11266Q421R0680J00408O4665K8152L2276R8778K00400K71560
$$ -618850 -790287 -901553 -893132 -802452 -702044 -637379 -609227 -576951 -478173 -277773 -6213
37447f213K75291K40594K14284K00628J72185J17498N2296J340r681L3105J00365
$$ -6213 269078 509672 723956 924584 1096769 1214267 1266563 1267903 1258222 1291327 1391692
37436A391692J21722N2567p0897j69536k04412j98084j85787j75943j55505j08355
$$ 1391692 1513414 1565981 1495084 1325548 1121136 923052 737265 561322 405817 297462
37426B97462k9137N9634J07013P4002k1623j16716j59677j42889q5358q658O2221
$$ 297462 268325 327959 434972 508974 487351 370635 210958 68069 -17289 -25947 36274
37415C6274R4358O4125j6760r7318j18744o1504L6241J16388J58703J87530K17879
$$ 36274 130632 194757 177997 80679 -38065 -99569 -63328 53060 211763 399293 617172
37404F17172K15999J30401m7674k65791m41008n02360m27282k60935q7550M1312
$$ 617172 833171 963572 915898 650107 209099 -293261 -720543 -981478 -1069028 -1027716
37394a027716J42522K46724L25250L10245J88878L7810n6784q8097j11250j51768
$$ -1027716 -885194 -638470 -313220 -2975 185903 223713 166929 78832 -32418 -184186
37384a84186j66717j06880Q185J05398J45747J66941K20352K85879K83105J66438
$$ -184186 -350903 -457783 -449598 -344200 -198453 -31512 188840 474719 757824 924262
37374I24262k2904k09387l56606m67501n36817n38708m59017l14704j36287N4291
$$ 924262 901358 691971 335365 -132136 -668953 -1207661 -1666678 -1981382 -2117669 -2063378
37364b063378K41559L97415M71447M15111K33996J0496j54819k33036k73723l17460
$$ -2063378 -1821819 -1424404 -952957 -537846 -303850 -293354 -448173 -681209 -954932 -1272392
37354a272392l40544l06289k27493j37656l5147Q9021J88007J88830R0619j9776
$$ -1272392 -1612936 -1919225 -2146718 -2284374 -2319521 -2230500 -2042493 -1853663 -1763044 -1782820
37344a782820o5293n1540l1055l6791o9507j12494j32786r6138p223Q4091J35029
$$ -1782820 -1848113 -1899653 -1930708 -1967499 -2037006 -2149500 -2282286 -2378424 -2385647 -2301556 -2166527
37333b166527J48498J44443J19495O0460j9912q5548j05449o4984L3256J59170
$$ -2166527 -2018029 -1873586 -1754091 -1693631 -1713543 -1799091 -1904540 -1969524 -1936268 -1777098
37323a777098K60023K98015K78423K31847J83121J44766J15202O8296k4899j39665
$$ -1777098 -1517075 -1219060 -940637 -708790 -525669 -380903 -265701 -197405 -222304 -361969
37313c61969j96373j54883q3566q3828j59936k19086j97929j29792p4301m0142
$$ -361969 -558342 -713225 -796791 -880619 -1040555 -1259641 -1457570 -1587362 -1661663 -1701805
37303a701805q753J6557L3791Q2109J99385L43959M09174L33623J69586K4415
$$ -1701805 -1710558 -1694001 -1660210 -1578101 -1378716 -1034757 -625583 -291960 -122374 -97959
37293i7959m9804r0278j54404k37308k72413k11231q3368L7597J12567J50983
$$ -97959 -147763 -238041 -392445 -629753 -902166 -1113397 -1196765 -1159168 -1046601 -895618
37283h95618J51950Q0330o9434k19749k67507j90335o1279L8706Q7840J04213
$$ -895618 -743668 -663338 -732772 -952521 -1220028 -1410363 -1471642 -1432936 -1345096 -1240883
37273a240883J04388J02852J21615J68961K18937K34693K10491J78638J75812
$$ -1240883 -1136495 -1033643 -912028 -743067 -524130 -289437 -78946 99692 275504
37264B75504K03940K15868J44258k9453k25075l09783k20804l3205J10963J29849
$$ 275504 479444 695312 839570 810117 585042 275259 54455 21250 132213 262062
37254B62062M6783o4938j46108j70573j43579r8189p3252p9731r3908q4491l8532
$$ 262062 308845 243907 97799 -72774 -216353 -314542 -387794 -467525 -561433 -645924 -684456
37243f84456L3011R9764J26221R9321M0331k4774r7479j87429k72454l14177l14935
$$ -684456 -651445 -551681 -425460 -326139 -285808 -310582 -408061 -595490 -867944 -1182121 -1497056
37232a497056l19484l44216l37728k36736m1802J81775L59811M48186M38425L54622
$$ -1497056 -1816540 -2160756 -2498484 -2735220 -2777022 -2595247 -2235436 -1787250 -1348825 -994203
37222i94203K41305J36700N6502P56m2812j02025j91051k64311k43122j22826
$$ -994203 -752898 -616198 -559696 -558940 -601752 -703777 -894828 -1159139 -1402261 -1525087
37212a525087j4428k6496j28868j95554j73776j39012j67581k26045k32467j77913
$$ -1525087 -1539515 -1566011 -1694879 -1890433 -2064209 -2203221 -2370802 -2596847 -2829314 -3007227
37202c007227j25139j05590p6972J1204J53239L01254M08419M38609L65001J98476
$$ -3007227 -3132366 -3237956 -3314928 -3303724 -3150485 -2849231 -2440812 -2002203 -1637202 -1438726
37192a438726J2148r9682j05450o4386n6407r5534j29085j12451n9852k0425k7763
$$ -1438726 -1426578 -1526260 -1631710 -1696096 -1752503 -1848037 -1977122 -2089573 -2149425 -2169850 -2197613
37181b197613q0873j54023k12230k31350k13883j73699j04256J1406J50025K44500
$$ -2197613 -2278486 -2432509 -2644739 -2876089 -3089972 -3263671 -3367927 -3356521 -3206496 -2961996
37171b961996K59069K36825K33533K32091J77864Q4150L1993N0659O4333j190
$$ -2961996 -2702927 -2466102 -2232569 -2000478 -1822614 -1738464 -1706471 -1655812 -1591479 -1592669
37161a592669j03973j32314m8039O5878J04111N1494j3197m217R3080K20112L06486
$$ -1592669 -1696642 -1828956 -1876995 -1811117 -1707006 -1655512 -1668709 -1672926 -1579846 -1359734 -1053248
37150a053248L28167L08014K72005K19643J34874J0517j38920k74703l48107l41511
$$ -1053248 -725081 -417067 -145062 74581 209455 219972 81052 -193651 -541758 -883269
37140h83269k98405k84316l05597k93457j89797l1073P5586N3151p6608k08695
$$ -883269 -1181674 -1465990 -1771587 -2065044 -2254841 -2285914 -2210328 -2157177 -2233785 -2442480
37130b442480k31583j16217M9932J38355J09326M4279L0728N4109M5729O19k4230
$$ -2442480 -2674063 -2790280 -2740348 -2601993 -2492667 -2448388 -2417660 -2363551 -2317822 -2317203 -2341433
37119b341433j9630m9535j38741k02203j38068M7153K55994M13130N03899N15901
$$ -2341433 -2361063 -2410598 -2549339 -2751542 -2889610 -2842457 -2586463 -2173333 -1669434 -1153533
37109a153533M14336K00924m7326k34642l24350l37850k95511j90790j9671J91258
$$ -1153533 -739197 -538273 -585599 -820241 -1144591 -1482441 -1777952 -1968742 -1988413 -1797155
37099a797155L93474N39271N94715N48292M16026K29398J6447j92209l41470l68547
$$ -1797155 -1403681 -864410 -269695 278597 694623 924021 940468 748259 406789 38242
37089C8242k65353j05133K3616J02226J72353K50303K95638K78947K38720K33210
$$ 38242 -227111 -332244 -308628 -206402 -34049 216254 511892 790839 1029559 1262769
37079A262769K53540K23035Q6017j24606l10628l85244l31440k06582r6153n0280
$$ 1262769 1516309 1739344 1825361 1700755 1390127 1004883 673443 466861 370708 320428
37069C20428n7256p8526j00188j39328k09257k98786l85296m49263m71202m31614
$$ 320428 263172 184646 84458 -54870 -264127 -562913 -948209 -1397472 -1868674 -2300288
37059b300288l25506j71451k545J46438K46361K84328K73869K44933K17867J94478
$$ -2300288 -2625794 -2797245 -2799790 -2653352 -2406991 -2122663 -1848794 -1603861 -1385994 -1191516
37049a191516J75124J67673J67036J38692M5752j01238k34893k83895k34183j30595
$$ -1191516 -1016392 -848719 -681683 -542991 -497239 -598477 -833370 -1117265 -1351448 -1482043
37039a482043k1724P9998J75218K35563K17532J23847K2591j6087R519M0003J8475
$$ -1482043 -1503767 -1423769 -1248551 -1012988 -795456 -671609 -649018 -665105 -655586 -615583 -597108
37028e97108p0352k06535l48016m40533m46531l75238k66754j42870N329J75295
$$ -597108 -667460 -873995 -1222011 -1662544 -2109075 -2484313 -2751067 -2893937 -2888608 -2713313
37018b713313L23587L98104L90753L44766L12371L09388L07137K69916K05802
$$ -2713313 -2389726 -1991622 -1600869 -1256103 -943732 -634344 -327207 -57291 148511
37009A48511J69514J95920K39496K11637Q3335p9209j91379k30750k24134j90057
$$ 148511 318025 513945 753441 965078 1048413 969204 777825 547075 322941 132884
36999A32884j31170o6389k9736l3012n1815n0865j0753O2170J33896J56138J00500
$$ 132884 1714 -64675 -94411 -127423 -179238 -230103 -240856 -178686 -44790 111348 211848
36988B11848j9901j67681l03923l84683l69042k69738j76146j74803k44481k75620
$$ 211848 191947 24266 -279657 -664340 -1033382 -1303120 -1479266 -1654069 -1898550 -2174170
36978b174170k04565q7178k3669n1405j35464k24474k77770k65684j89336r1818
$$ -2174170 -2378735 -2465913 -2489582 -2540987 -2676451 -2900925 -3178695 -3444379 -3633715 -3725533
36968c725533j4107N4502J50443K67313L50838L65548L31609K84969K32711J66334
$$ -3725533 -3739640 -3685138 -3534695 -3267382 -2916544 -2550996 -2219387 -1934418 -1701707 -1535373
36958a535373R4991M2086K1525L4430P5100J18870J16316L1761j04356k03298
$$ -1535373 -1440382 -1398296 -1376771 -1342341 -1267241 -1148371 -1032055 -1000294 -1104650 -1307948
36948a307948j95033r2531K8648J08696J51954K00569K73664L41486L57600L09232
$$ -1307948 -1502981 -1595512 -1566864 -1458168 -1306214 -1105645 -831981 -490495 -132895 176337
36938A76337K31124J69887J38291J07921M5589m8505j39427j84278j53132l7290
$$ 176337 407461 577348 715639 823560 869149 820644 681217 496939 343807 306517
36928C06517J37066L00822L78436L56263K97235K61324K26650J25465n0786k33065
$$ 306517 443583 744405 1122841 1479104 1776339 2037663 2264313 2389778 2338992 2105927
36918B105927l71737m97156o46973p76261p98031o98645n58855m58416m04498
$$ 2105927 1734190 1237034 590061 -186200 -984231 -1682876 -2241731 -2700147 -3104645
36909c104645l59511k94106j96698o9539O2005J64536K38264L13388L88451M12567
$$ -3104645 -3464156 -3758262 -3954960 -4024499 -3962494 -3797958 -3559694 -3246306 -2857855 -2445288
36899b445288L61349K93601K82655L10594K85146J61499J005r9770j00859l2079
$$ -2445288 -2083939 -1790338 -1507683 -1197089 -911943 -750444 -749439 -849209 -950068 -982147
36889i82147M4286O4597n389j36347k47046k77444k44213k07204j92533j71324
$$ -982147 -937861 -873264 -878653 -1015000 -1262046 -1539490 -1783703 -1990907 -2183440 -2354764
36879b354764j09515j4918P1122J14982J16711J02719R9242J11765J27822J37418
$$ -2354764 -2464279 -2479197 -2408075 -2293093 -2176382 -2073663 -1974421 -1862656 -1734834 -1597416
36869a597416J44902J55974J54841J01368m0041k59293m85182o20190o04386m52099
$$ -1597416 -1452514 -1296540 -1141699 -1040331 -1080372 -1339665 -1824847 -2445037 -3049423 -3501522
36859c501522k31572k0487J18668J49903Q6210k467l7197Q46O5830J14053J49668
$$ -3501522 -3733094 -3753581 -3634913 -3485010 -3398800 -3401267 -3438464 -3437618 -3371788 -3257735 -3108067
36848c108067J95425K48042K84703K94122K80199K52913K36010K59222L08026
$$ -3108067 -2912642 -2664600 -2379897 -2085775 -1805576 -1552663 -1316653 -1057431 -749405
36839g49405K98714J52633r6725l06113l46030k00933M9724L02401M57548M27898
$$ -749405 -450691 -298058 -394783 -700896 -1046926 -1247859 -1198135 -895734 -438186 -10288
36829a0288J92909j38450l63558l31129o6159K49810M24020L87629K10925J1734
$$ -10288 182621 44171 -319387 -650516 -716675 -466865 -42845 344784 555709 567443
36819E67443j40405k44261l23048l83056m11360l94483l29855k27411j08407M38
$$ 567443 427038 182777 -140271 -523327 -934687 -1329170 -1659025 -1886436 -1994843 -1994405
36809a994405P7363J11228R9808N0492j5086o5468p5843m0467K8568J05966J57011
$$ -1994405 -1917042 -1805814 -1706006 -1655514 -1670600 -1736068 -1811911 -1852378 -1823810 -1717844 -1560833
36798a560833J54345J06898O5773Q2501J54310K18944K09947J15511j4838j10187
$$ -1560833 -1406488 -1299590 -1233817 -1151316 -997006 -778062 -568115 -452604 -467442 -577629
36788e77629j20232l4442J14017K55074L11068K43488P6324j33201l41655n21860
$$ -577629 -697861 -732303 -618286 -363212 -52144 191344 267668 134467 -207188 -729048
36778g29048o25864n87318l96070j55115j5486l3483j14186j15690N526J69833
$$ -729048 -1354912 -1942230 -2338300 -2493415 -2508901 -2542384 -2656570 -2772260 -2766734 -2596901
36768b596901K74739K86645K36655J65045R3510L4099k746j1719R469O7592J68607
$$ -2596901 -2322162 -2035517 -1798862 -1633817 -1540307 -1506208 -1508954 -1520673 -1511204 -1443612 -1275005
36757a275005L00112M24311M93763M79119L90581K76699J92071J54459J38207
$$ -1275005 -974893 -550582 -56819 422300 812881 1089580 1281651 1436110 1574317
36748A574317J17731J02679J07707J00678K4871j14612k28241k39687j80224j46159
$$ 1574317 1692048 1794727 1902434 2003112 2027983 1913371 1685130 1445443 1265219 1119060
36738A119060j78328k29907k49433k43420k39938k32869j92641j09559l771Q9744
$$ 1119060 940732 710825 461392 217972 -21966 -254835 -447476 -557035 -560806 -471062
36728d71062J30924R4442M02r7164j71774k46635l31315l71740l07686j59227
$$ -471062 -340138 -245696 -245294 -342458 -514232 -760867 -1092182 -1463922 -1771608 -1930835
36718a930835q947Q9361J37422J40193Q6615r436j00659j54622j69404j33563
$$ -1930835 -1939782 -1850421 -1712999 -1572806 -1486191 -1495627 -1596286 -1750908 -1920312 -2053875
36708b053875k4774J28940K39033K45014J78008J08539P4863R6556K01045L68595
$$ -2053875 -2078649 -1949709 -1710676 -1465662 -1287654 -1179115 -1104252 -1007696 -806651 -438056
36698d38056M85831M36741K39511K7791j07100j89903k67337l16061k89646k07784
$$ -438056 47775 484516 724027 751818 644718 454815 187478 -128583 -418229 -626013
36688f26013j41759j27554j33104j01763J584J73890L65973M91284M76780L23191
$$ -626013 -767772 -895326 -1028430 -1130193 -1128609 -954719 -588746 -97462 379318 702509
36678G02509J07199q0001j92000k35030k39464k33352k32063k36164k31407j96187
$$ 702509 809708 729707 537707 302677 63213 -170139 -402202 -638366 -869773 -1065960
36668a065960j21331k7499M7281Q6428J11226J45384J74812J63833J03427J6513
$$ -1065960 -1187291 -1214790 -1167509 -1081081 -969855 -824471 -649659 -485826 -382399 -365886
36658c65886p9613j81147k65346k91862k53917j91091j28895m6816N6613J06363
$$ -365886 -445499 -626646 -891992 -1183854 -1437771 -1628862 -1757757 -1804573 -1747960 -1641597
36648a641597J9104j83016l81610m84140m87641m22651k97818j25657M8431J82983
$$ -1641597 -1622493 -1805509 -2187119 -2671259 -3158900 -3581551 -3879369 -4005026 -3956595 -3773612
36638c773612K76444L34987L36079K64555J63563J05673J19572J77066K39233
$$ -3773612 -3497168 -3162181 -2826102 -2561547 -2397984 -2292311 -2172739 -1995673 -1756440
36629a756440K76077K51592J44283k872r6797q6271j4735L9366N0209M8593O2100
$$ -1756440 -1480363 -1228771 -1084488 -1087360 -1184157 -1270428 -1285163 -1245797 -1195588 -1146995 -1084895
36618a084895Q6484J07962J19756J13233Q0141L3125L453O344K3366L0503K8666
$$ -1084895 -998411 -890449 -770693 -657460 -577319 -544194 -540741 -534397 -511031 -480528 -451862
36607d51862K9936K6327p05l6988k8552N9899J84870K40853J46132q6609l57551
$$ -451862 -421926 -395599 -396304 -433292 -461844 -401945 -217075 23778 169910 83301 -274250
36596b74250n49957o03164n38578m25034l13496k02018o6162Q7153K15944K89625
$$ -274250 -824207 -1427371 -1965949 -2390983 -2704479 -2906497 -2972659 -2885506 -2669562 -2379937
36586b379937L08677K68256J40712o8453k68276l36988k37120m2952J51466L10884
$$ -2379937 -2071260 -1803004 -1662292 -1730745 -1999021 -2336009 -2573129 -2616081 -2464615 -2153731
36576b153731M30171M77461M20031K93742J92129J67371J72417J26241K0832o6157
$$ -2153731 -1723560 -1246099 -826068 -532326 -340197 -172826 -409 125832 146664 80507
36566H0507o8714j7367m066o8695j50220j65738j14283p0243q2737j20924j26583
$$ 80507 11793 -5574 -9640 -78335 -228555 -394293 -508576 -578819 -661556 -782480 -909063
36555i09063q2182m705R3914K01473K76374K65274J55328j2923j83474l15200
$$ -909063 -991245 -995950 -902036 -700563 -424189 -158915 -3587 -16510 -199984 -515184
36545e15184l81117l69168k92311j76876l4434J34917L04870M12101M03020K85969
$$ -515184 -896301 -1265469 -1557780 -1734656 -1769090 -1634173 -1329303 -917202 -514182 -228213
36535b28213J27883J749o3097q9658j17629j54833j67117j23957m4905J6615L1345
$$ -228213 -100330 -98581 -161678 -251336 -368965 -523798 -690915 -814872 -859777 -843162 -811817
36524h11817J6846O218J6934M8101P9426O9348j1703j30232j99938j64776n2984
$$ -811817 -794971 -788753 -771819 -723718 -644292 -574944 -586647 -716879 -916817 -1081593 -1134577
36513a134577O7058J58723K20593K44718K12681J28700K3357p8135j65542k19247
$$ -1134577 -1067519 -908796 -688203 -443485 -230804 -102104 -78747 -156882 -322424 -541671
36503e41671k04889j08105L7500J68840K38481K44905K27820K30512K52959K41057
$$ -541671 -746560 -854665 -817165 -648325 -409844 -164939 62881 293393 546352 787409
36493G87409J36035n8963k68044m02023m27056l79079l20070k81986k48443j87759
$$ 787409 923444 864481 596437 194414 -232642 -611721 -931791 -1213777 -1462220 -1649979
36483a649979r8668j4980L1925L7817R515n1179j29510j83237j73315j02585m737
$$ -1649979 -1748647 -1763627 -1731702 -1693885 -1684370 -1735549 -1865059 -2048296 -2221611 -2324196 -2328933
36472b328933R2325J66693J81949J10986j2731j04552j06481l2726P0043J75081
$$ -2328933 -2236608 -2069915 -1887966 -1776980 -1789711 -1894263 -2000744 -2033470 -1963427 -1788346
36462a788346K69872L31075L39714L07720K60458K00748J14710O089j00579j86407
$$ -1788346 -1518474 -1187399 -847685 -539965 -279507 -78759 35951 42040 -58539 -244946
36452b44946k41461k42703j59435L880J84090K89930K54992P3390j88460m11905
$$ -244946 -486407 -729110 -888545 -884665 -700575 -410645 -155653 -82263 -270723 -682628
36442f82628m93392m23693k92957j97002j43033o3475Q6182K68101M00614M31969
$$ -682628 -1176020 -1599713 -1892670 -2089672 -2232705 -2296180 -2209998 -1941897 -1541283 -1109314
36432a109314L69124K57744J51995Q8754O7167N3032J6799l3481o6506o9293o0047
$$ -1109314 -740190 -482446 -330451 -241697 -174530 -121498 -104699 -138180 -204686 -273979 -334026
36421c34026o3019q6839j26595j68774j91582j78845j37463q1636J866J40666
$$ -334026 -397045 -483884 -610479 -779253 -970835 -1149680 -1287143 -1368779 -1366913 -1226247
36411a226247L13561M34685M35299L40545K26610J18994j4819j73354k84420k90551
$$ -1226247 -912686 -478001 -42702 297843 524453 643447 628628 455274 170854 -119697
36401a19697k28158j81496j84241k06585k19279k21694k11557j77587j35956j32669
$$ -119697 -347855 -529351 -713592 -920177 -1139456 -1361150 -1572707 -1750294 -1886250 -2018919
36391b018919j83980k42567k52294k18181j89138j78734j38909k3870J43220K86937
$$ -2018919 -2202899 -2445466 -2697760 -2915941 -3105079 -3283813 -3422722 -3446592 -3303372 -3016435
36381c016435L55642L64358L59471L53650L10942J99467M4620q7042j52000j54404
$$ -3016435 -2660793 -2296435 -1936964 -1583314 -1272372 -1072905 -1028285 -1115327 -1267327 -1421731
36371a421731j04083J3013J89322L43203L67765K49721J02488N0226R6316J35343
$$ -1421731 -1525814 -1512801 -1323479 -980276 -612511 -362790 -260302 -210076 -113760 21583
36361B1583Q5872j9636q1356m5064M4847R5977N7709m4883j61493k81004m23460
$$ 21583 107455 87819 6463 -38601 6246 102223 159932 115049 -46444 -327448 -750908
36350g50908n75836o74056o65754n60460l94729j82175O1582K74168L89630M23383
$$ -750908 -1326744 -2000800 -2666554 -3227014 -3621743 -3803918 -3742336 -3468168 -3078538 -2655155
36340b655155M53225N02792N01603L89085K09115O1719l694p037J8836N4069P7556
$$ -2655155 -2201930 -1699138 -1197535 -808450 -599335 -537616 -541310 -548347 -529511 -475442 -397886
36329c97886P3746N1737K4517k4347j19942k46975l54313m06892m04925l58010
$$ -397886 -324140 -272403 -247886 -272233 -392175 -639150 -993463 -1400355 -1805280 -2163290
36319b163290k74048j71327o6309N0776J90265L08786L25024K13504N5459k8171
$$ -2163290 -2437338 -2608665 -2674974 -2624198 -2433933 -2125147 -1800123 -1586619 -1531160 -1559331
36309a559331J6216J40892K48293K67334K01684J17919P3735N4648J542r9015
$$ -1559331 -1543115 -1402223 -1153930 -886596 -684912 -566993 -493258 -438610 -437068 -536083
36299e36083j84921j92453j30826o4228m3938p6872j35130j69692j34466k8021
$$ -536083 -721004 -913457 -1044283 -1108511 -1152449 -1229321 -1364451 -1534143 -1668609 -1696630
36289a696630R5342J76207K01932J93420J62210J10337N7582L0872K6346J3063
$$ -1696630 -1601288 -1425081 -1223149 -1029729 -867519 -757182 -699600 -668728 -642382 -629319
36279f29319k1199n4885p0062p8578r7979j22131j32947j26770j09103p0405R262
$$ -629319 -650518 -705403 -775465 -854043 -952022 -1074153 -1207100 -1333870 -1442973 -1513378 -1504116
36268a504116J24438K29715K78748K76540K76896L19775L80876L93212L10442
$$ -1504116 -1379678 -1149963 -871215 -594675 -317779 1996 382872 776084 1086526
36259A086526J39720p1689k58186l56646l47144k84418k54356k78482k90187k30700
$$ 1086526 1226246 1154557 896371 539725 192581 -91837 -346193 -624675 -914862 -1145562
36249a145562j39269j08220j65096k45541k80002k58767j99115r8328M1544J69957
$$ -1145562 -1284831 -1393051 -1558147 -1803688 -2083690 -2342457 -2541572 -2639900 -2598356 -2428399
36239b428399K18763J79888J17385Q9119Q2193M7005k1344o4970k7553Q5416K16579
$$ -2428399 -2209636 -2029748 -1912363 -1823244 -1741051 -1694046 -1715390 -1780360 -1807913 -1722497 -1505918
36228a505918L06106L21138K60783J59075P3444M2543N4432P5607J06207J78534
$$ -1505918 -1199812 -878674 -617891 -458816 -385372 -342829 -288397 -212790 -106583 71951
36218G1951K98977M21774M91503M86688M11946K79720J24192P929k1900J7427
$$ 71951 370928 792702 1284205 1770893 2182839 2462559 2586751 2594680 2572780 2590207
36208B590207N7485L7682n7283k00243l38444m17558m14572l50921k64558j76555
$$ 2590207 2647692 2685374 2628091 2427848 2089404 1671846 1257274 906353 641795 465240
36198D65240r3958k9144L403J22l7613j07378j81466j95498r9864P0896K05441
$$ 465240 371282 342138 345541 345663 308050 200672 19206 -176292 -276156 -205260 181
36187A81K06473P0362j17507k54184k94332k74792k66615k95153l15953k77462
$$ 181 206654 277016 159509 -94675 -389007 -663799 -930414 -1225567 -1541520 -1818982
36177a818982j87456r8530n0296n6107j24579k44541l49332l45531j99116L0281
$$ -1818982 -2006438 -2104968 -2155264 -2211371 -2335950 -2580491 -2929823 -3275354 -3474470 -3444189
36167c444189K49024L97928M58883M34737L52213K68353K46860L18030M51353
$$ -3444189 -3195165 -2797237 -2338354 -1903617 -1551404 -1283051 -1036191 -718161 -266808
36158b66808N57050N36872L75124J79488Q8978J28118J87072J57828M9163n2551
$$ -266808 290242 827114 1202238 1381726 1470704 1598822 1785894 1943722 1992885 1940334
36148A940334r0603o9429j7036L2040L1672m7596j78513k92076l35052l00667
$$ 1940334 1849731 1780302 1763266 1795306 1826978 1779382 1600869 1308793 973741 673074
36138F73074k20463j51201j49657k20163k93923k97597k36769j69262j00748K9745
$$ 673074 452611 301410 151753 -68410 -362333 -659930 -896699 -1065961 -1166709 -1136964
36128a136964K31577L82507L27177M9553k91800n03868n11612l78328k14971r0834
$$ -1136964 -905387 -522880 -195703 -146150 -437950 -941818 -1453430 -1831758 -2046729 -2137563
36118b137563j2837L9693P2346O3952n211j13548j91932j68107k5409J81519L72613
$$ -2137563 -2150400 -2110707 -2038361 -1974409 -1979620 -2093168 -2285100 -2453207 -2478616 -2297097 -1924484
36107a924484N05589N92668O56546O79903O11612M25764J64096q8714k66010l47645
$$ -1924484 -1418895 -826227 -169681 510222 1121834 1547598 1711694 1622980 1356970 1009325
36097A009325l40322k57779j30776j3357M8598N3849L3323K883n2246j42443k41022
$$ 1009325 669003 411224 280448 267091 315689 369538 402861 405744 353498 211055 -29967
36086b9967k95712k65218j47996N967J12158J09442J7465p9995j18323r9470n3629
$$ -29967 -325679 -590897 -738893 -732926 -620768 -511326 -493861 -573856 -692179 -791649 -845278
36075h45278N495O2464P8662L7006j5259k1168M25j9665r0306j34390r0479J1098
$$ -845278 -839783 -777319 -698657 -661651 -676910 -698078 -697653 -717318 -807624 -942014 -1032493 -1021395
36063a021395R8317J39138J43764J26412J04520J07682J46060J86199J92038J72965
$$ -1021395 -923078 -783940 -640176 -513764 -409244 -301562 -155502 30697 222735 395700
36053C95700J56016J27826M9890p1073j72737k09576k03365k04282k23801k25489
$$ 395700 551716 679542 729432 658359 485622 276046 72681 -131601 -355402 -580891
36043e80891j72062o6763M7457J18869J16984M2068q0927k08040k84520k72261
$$ -580891 -752953 -819716 -772259 -653390 -536406 -494338 -575265 -783305 -1067825 -1340086
36033a340086j82079o6806K8161R6238J44255J57130J12206K0622o9691j15061
$$ -1340086 -1522165 -1588971 -1560810 -1464572 -1320317 -1163187 -1050981 -1030359 -1100050 -1215111
36023a215111j07880p1567l8868l2340n0427p0918p7753q0935r7042j13195q7959
$$ -1215111 -1322991 -1394558 -1433426 -1465766 -1516193 -1587111 -1664864 -1745799 -1842841 -1956036 -2043995
36012b043995M521J38854K52967K99524K85751K62071K65098K74042K37691J45415
$$ -2043995 -2039474 -1900620 -1647653 -1348129 -1062378 -800307 -535209 -261167 -23476 121939
36002A21939M8570j306j2980l1071o6901q5720o3008k6808l2599j06221k16823
$$ 121939 170509 169203 156223 125152 58251 -27469 -90477 -117285 -149884 -256105 -472928
35991d72928l00600l11934k56322j71684p9875K7927J53489K62746L13757K98142
$$ -472928 -773528 -1085462 -1341784 -1513468 -1593343 -1565416 -1411927 -1149181 -835424 -537282
35981e37282K35316J41299K8409p6967j48231j89001k23751k58059k71332k48849
$$ -537282 -301966 -160667 -132258 -209225 -357456 -546457 -770208 -1028267 -1299599 -1548448
35971a548448j97260j25806l4511P3877J86221K83169L35740L08609J99673P9000
$$ -1548448 -1745708 -1871514 -1906025 -1832148 -1645927 -1362758 -1027018 -718409 -518736 -439736
35961d39736N2380J64084L48580M87859N04203L98188K27188O8248j5438k101
$$ -439736 -387356 -223272 125308 613167 1117370 1515558 1742746 1810994 1795556 1793455
35951A793455Q1818J84730K66689L25951L95569M99375N96937N89209M07848R6516
$$ 1793455 1875273 2060003 2326692 2652643 3048212 3547587 4144524 4733733 5141581 5238097
35941E238097k18057m30141n10548m79929l76099k51737j55980r2815k2274Q3053
$$ 5238097 5020040 4589899 4079351 3599422 3223323 2971586 2815606 2722791 2700517 2783570
35931B783570K05263L08691L65358L43758K15986K681k20906l89272m88890n17450
$$ 2783570 2988833 3297524 3662882 4006640 4222626 4225307 4004401 3615129 3126239 2608789
35921B608789m46954k73356p2479N1711P2722N5798O8711J13827J49953J48942
$$ 2608789 2161835 1888479 1816000 1867711 1940433 1996231 2064942 2178769 2328722 2477664
35911B477664J21253J02548J15777J35689J04290J379j15759j69757j46409r0949
$$ 2477664 2598917 2701465 2817242 2952931 3057221 3058600 2942841 2773084 2626675 2535726
35901B535726l7053J9678Q4625J45798J96994K38186K44808J79606N4666n3572
$$ 2535726 2498673 2518351 2602976 2748774 2945768 3183954 3428762 3608368 3663034 3609462
35891C609462p7891k9493K2033J6193o2423j82915k75033k60710j17047R0202
$$ 3609462 3531571 3502078 3524111 3540304 3477881 3294966 3019933 2759223 2642176 2732378
35881B732378K54655L13217K78740K03706J27778N7237j4638o9308n4556O5990
$$ 2732378 2987033 3300250 3578990 3782696 3910474 3967711 3953073 3883765 3829209 3895199
35871C895199K55932M26026N20459N58109N78351N80053N38894M56264L57094
$$ 3895199 4151131 4577157 5097616 5655725 6234076 6814129 7353023 7809287 8166381
35862H166381K58180J72638J31160J63028K64197M14817O13747Q54126J073936
$$ 8166381 8424561 8597199 8728359 8891387 9155584 9570401 10184148 11038274 12112210
35853A2112210J184753J165082J089660J054655J104174J231732J405503J573044
$$ 12112210 13296963 14462045 15551705 16606360 17710534 18942266 20347769 21920813
35845B1920813J688025J768368J900167K156459K539677L025724L619473M322924
$$ 21920813 23608838 25377206 27277373 29433832 31973509 34999233 38618706 42941630
35837D2941630N090662N886377O769227P853784R178082J0675413J2298197J4111720
$$ 42941630 48032292 53918669 60687896 68541680 77719762 88395175 100693372 114805092
35829A14805092J6220704J8630289K1214118K3791715K6162895K7989398K8597792
$$ 114805092 131025796 149656085 170870203 194661918 220824813 248814211 277412003
35822B77412003K6956234K2072974J3733109L025585p926896j6981081k2955595
$$ 277412003 304368237 326441211 340174320 343199905 335273009 318291928 295336333
35815B95336333k5853670k6367934k5289691k3260644k0784809j8246842j5882517
$$ 295336333 269482663 243114729 217825038 194564394 173779585 155532743 139650226
35808A39650226j3784720j1957622j0366731q975020p777173o801740o059136
$$ 139650226 125865506 113907884 103541153 94566133 86788960 79987220 73928084
35801G3928084n491692m997617m508732m031904l612559l271955k987951k725667
$$ 73928084 68436392 63438775 58930043 54898139 51285580 48013625 45025674 42300007
35793D2300007k466293k197655j894101j536332j159968q58556p10257p03545
$$ 42300007 39833714 37636059 35741958 34205626 33045658 32187102 31476845 30773300
35785C0773300p50147p66440p30564o73496o38329o42177o52812o05110m66453
$$ 30773300 30023153 29256713 28526149 27852653 27214324 26572147 25919335 25314225 24847772
35776B4847772k86624j57478j21648j46640j85642k21684k38263j92937o2447
$$ 24847772 24561148 24403670 24282022 24135382 23949740 23728056 23489793 23296856 23234409
35767B3234409J05058K24527K62776K66170K93164L37021L28971K17056L3623
$$ 23234409 23339467 23563994 23826770 24092940 24386104 24723125 25052096 25269152 25302775
35758B5302775j28771k15916k70680l72332n31242o80534p68964q13349q43968
$$ 25302775 25174004 24958088 24687408 24315076 23783834 23103300 22334336 21520987 20677019
35749B0677019q50618q22056p97988q24968q77738q81424q13885p37919p18776
$$ 20677019 19826401 19004345 18206357 17381389 16503651 15622227 14808342 14070423 13351647
35740A3351647p46063p53773o91408n61647m11744l04817k84190l49926m72100
$$ 13351647 12605584 11851811 11160403 10598756 10187012 9882195 9598005 9248079 8775979
35731H775979o20092p60695q38658q02933o69486n22670m23466l38778j96462
$$ 8775979 8155887 7395192 6556534 5753601 5084115 4561445 4137979 3799201 3602739
35722C602739L012J70848K29258J91556J30150R4933Q6514Q6350P5439K6275q4240
$$ 3602739 3605751 3776599 4005857 4197413 4327563 4422496 4509010 4595360 4670799 4697074 4612834
35711D612834k33810l48777l66239k99001k23185k04499k47187l03632l12668
$$ 4612834 4379024 4030247 3664008 3365007 3141822 2937323 2690136 2386504 2073836
35702B073836k37003r6578K5482L7372p9577k51023l77670m11495l67619k95114
$$ 2073836 1836833 1740255 1765737 1803109 1723532 1472509 1094839 683344 315725 20611
35692B0611k56782l09471m62726o50237p57723o86232m01771L8795M88082P69272
$$ 20611 -236171 -545642 -1008368 -1658605 -2416328 -3102560 -3504331 -3465536 -2977454 -2208182
35682b208182P92863O25019M19249K80154K08202J56094R2823Q929r4180j91362
$$ -2208182 -1415319 -790300 -371051 -90897 117305 273399 366222 375151 280971 89609
35672H9609k33362j87548p5234M3201J15600J28177J03214P6143O5268N5795J9577
$$ 89609 -143753 -331301 -406535 -363334 -247734 -119557 -16343 59800 125068 180863 200440
35661B00440m7154j14985j52699j56672j43737j23168q3254p204R5195J74701
$$ 200440 153286 38301 -114398 -271070 -414807 -537975 -621229 -628433 -533238 -358537
35651c58537J77274J01150M926n2402o0179l1488L4105J21374J60563Q4851o8858
$$ -358537 -181263 -80113 -75187 -127589 -187768 -219256 -185151 -63777 96786 181637 112779
35640A12779j78795j79914j33792j28672j62655j72840j40056j04708r5702r9208
$$ 112779 -66016 -245930 -379722 -508394 -671049 -843889 -983945 -1088653 -1184355 -1283563
35630a283563r5611q1424n2628q357K2340j369o9902j10366n9600O3859J74714
$$ -1283563 -1379174 -1460598 -1513226 -1521583 -1499243 -1500612 -1570514 -1680880 -1740480 -1676621 -1501907
35619a501907J98583J32023M2221J1360O0855J21479R7467k7162j60451j90538
$$ -1501907 -1303324 -1171301 -1129080 -1117720 -1056865 -935386 -837919 -865081 -1025532 -1216070
35609a216070q7171R0267K56880L48872L30489K02697J6462j50276k44687k57048
$$ -1216070 -1303241 -1212974 -956094 -607222 -276733 -74036 -57574 -207850 -452537 -709585
35599g09585j90213m4820J48765L18415M09298M40359M61314M61019L71785J80185
$$ -709585 -899798 -944618 -795853 -477438 -68140 372219 833533 1294552 1666337 1846522
35589A846522j7667j11712j00131p5185j06983j85207k63636l10906l13620k78083
$$ 1846522 1828855 1717143 1617012 1541827 1434844 1249637 986001 675095 361475 83392
35579H3392k45617k65784l31074l69242l24333k20103j21329n7936j3046L6678
$$ 83392 -162225 -428009 -759083 -1128325 -1452658 -1672761 -1794090 -1852026 -1865072 -1828394
35569a828394R6662J50306J50918M1318j75476l92380m68194l53643j28575Q2308
$$ -1828394 -1731732 -1581426 -1430508 -1389190 -1564666 -1957046 -2425240 -2778883 -2907458 -2825150
35559b825150K04112K29947J91988J39994J23615J63275K35310K96104L20135
$$ -2825150 -2621038 -2391091 -2199103 -2059109 -1935494 -1772219 -1536909 -1240805 -920670
35550i20670L09788K73246K04011R0917m9641j61466j86240j18475j0719P7971
$$ -920670 -610882 -337636 -133625 -42708 -92349 -253815 -440055 -558530 -569249 -491278
35540d91278J19277R8537p68j59716k90852k90695j39294P2012K16575K24718
$$ -491278 -372001 -273464 -274232 -433948 -724800 -1015495 -1154789 -1082777 -866202 -641484
35530f41484J14600l4226j33255j42030r1662m3675k4892j7180n536p431m4914
$$ -641484 -526884 -561110 -694365 -836395 -928057 -971732 -996624 -1013804 -1019340 -1026771 -1071685
35519a071685j07465j53642j40123n1470P9928J83765K04262J47552O0491l0617
$$ -1071685 -1179150 -1332792 -1472915 -1524385 -1444457 -1260692 -1056430 -908878 -848387 -879004
35509h79004j28931k16973k44021j87556r6823m5950n8811r9405j20440j02747
$$ -879004 -1007935 -1224908 -1468929 -1656485 -1753308 -1799258 -1858069 -1957474 -2077914 -2180661
35499b180661o0707k5137j0571O083N4542J17925J50086J62068K40111M30168
$$ -2180661 -2241368 -2266505 -2277076 -2270993 -2216451 -2098526 -1948440 -1786372 -1546261 -1116093
35489a116093O38167P08544N97363M13497K80865K07744J12053n9980k69416m24469
$$ -1116093 -477926 230618 827981 1241478 1522343 1730087 1842140 1782160 1512744 1088275
35479A088275m65204m10556l25842k46285j50719k4433Q0101Q6827q554j32232
$$ 1088275 623071 212515 -113327 -359612 -510331 -534764 -454663 -367836 -376390 -508622
35469e08622k24361k91277l51997l79121l25240j82330R172J86711K84484K64373
$$ -508622 -732983 -1024260 -1376257 -1755378 -2080618 -2262948 -2253776 -2067065 -1782581 -1518208
35459a518208J63922Q4082Q4569J08028N1559r9513k58284l50596l85739m00344
$$ -1518208 -1354286 -1270204 -1185635 -1077607 -1026048 -1125561 -1383845 -1734441 -2120180 -2520524
35449b520524l87063l14039j81301k1531J34589K63271L38613L54897L45698L43989
$$ -2520524 -2907587 -3221626 -3402927 -3424458 -3289869 -3026598 -2687985 -2333088 -1987390 -1643401
35439a643401L30655K63927J61863J08482J54334K43900K73590K03716Q2849k6927
$$ -1643401 -1312746 -1048819 -886956 -778474 -624140 -380240 -106650 97066 179915 152988
35429A52988j14046k03659l06462l93903m14812l35747j78093j6956O9973N6762
$$ 152988 38942 -164717 -471179 -865082 -1279894 -1615641 -1793734 -1810690 -1740717 -1683955
35419a683955l1682j61416l04820m17005m33934l19760j06103J27866L03967L70776
$$ -1683955 -1715637 -1877053 -2181873 -2598878 -3032812 -3352572 -3458675 -3330809 -3026842 -2656066
35409b656066L11950J60605j517q5684m6053J09790L37909N65094O97567O63173
$$ -2656066 -2344116 -2183511 -2185028 -2270712 -2316765 -2206975 -1869066 -1303972 -606405 56768
35399E6768M60867J60150j46360l82278n00185m92058l93988k58026j12635L3997
$$ 56768 517635 677785 531425 149147 -351038 -843096 -1237084 -1495110 -1607745 -1573748
35389a573748J55766K01878J36199l6099k82150n53564p79662q85918q47876p13685
$$ -1573748 -1417982 -1216104 -1079905 -1116004 -1398154 -1951718 -2731380 -3617298 -4465174 -5178859
35379e178859n57376m22619l17446k32296j39280j056J81831L42983M05137L65331
$$ -5178859 -5736235 -6158854 -6476300 -6708596 -6847876 -6848932 -6667101 -6324118 -5918981 -5553650
35369e553650L00429K85455L26562L75894L90826L69944L44416L44682L73953
$$ -5553650 -5253221 -4967766 -4641204 -4265310 -3874484 -3504540 -3160124 -2815442 -2441489
35360b441489M10774M30926M15779L45273K11757N2704o0607r4164r0778j09736
$$ -2441489 -2030715 -1599789 -1184010 -838737 -626980 -574276 -634883 -729047 -819825 -929561
35350i29561j46447j48825r9766l9912j2338k8329q9058j91985l00245l49972
$$ -929561 -1076008 -1224833 -1324599 -1364511 -1376849 -1405178 -1494236 -1686221 -1986466 -2336438
35340b336438l15017k34667j55988q0203R254R8889J62350K03894K46203K87198
$$ -2336438 -2651455 -2886122 -3042110 -3122313 -3113059 -3014170 -2851820 -2647926 -2401723 -2114525
35330b114525L07562L18113L61913M56319N52349N61463M16648J17610k57706
$$ -2114525 -1806963 -1488850 -1126937 -670618 -118269 443194 859842 977452 719746
35321G19746n81008p40237p08519n55946l85467k47301j15206M5997J94736K25802
$$ 719746 138738 -601499 -1310018 -1865964 -2251431 -2498732 -2613938 -2567941 -2373205 -2147403
35311b147403R4321r9634k00511j66135q9857m8008l171R6355J96398K06202J51523
$$ -2147403 -2053082 -2152716 -2353227 -2519362 -2609219 -2657227 -2660398 -2564043 -2367645 -2161443 -2009920
35300b009920J52870K43401L05120K28212O1893n2205n2465k476J2421k4509p1227
$$ -2009920 -1857050 -1613649 -1308529 -1080317 -1018424 -1070629 -1123094 -1125570 -1113149 -1137658 -1208885
35289a208885q1444m1913J3811K1248o1299k04008l22753l49257k76726j43505
$$ -1208885 -1290329 -1332242 -1318431 -1297183 -1358482 -1562490 -1885243 -2234500 -2511226 -2654731
35279b654731N068J31481K04465K09460J69002J40432J72468K52370L05410K64220
$$ -2654731 -2649663 -2518182 -2313717 -2104257 -1935255 -1794823 -1622355 -1369985 -1064575 -800355
35269h00355J39724J0625n6859o3373n2065n4320p1178r0128j02979j13408j32978
$$ -800355 -660631 -650006 -706865 -770238 -822303 -876623 -947801 -1037929 -1140908 -1254316 -1387294
35258a387294j58171j48828n4448J19096K85582L45494K75077J37321J2863o7646
$$ -1387294 -1545465 -1694293 -1748741 -1629645 -1344063 -998569 -723492 -586171 -573308 -640954
35248f40954j31246k16579l16579l66049l03287j47461J2624J15459J73103J99216
$$ -640954 -772200 -988779 -1305358 -1671407 -1974694 -2122155 -2109531 -1994072 -1820969 -1621753
35238a621753J47368j3591j92602k31510q2045J35692K71913K85553K19304J06197
$$ -1621753 -1474385 -1487976 -1680578 -1912088 -1994133 -1858441 -1586528 -1300975 -1081671 -975474
35228i75474l6727j61099k05301j57660n7587N7817J64432K18856J74322M5274
$$ -975474 -1012201 -1173300 -1378601 -1536261 -1593848 -1536031 -1371599 -1152743 -978421 -933147
35218i33147q5727j46806j34814q3590j1794P2286J44312J79089J83065J86705
$$ -933147 -1018874 -1165680 -1300494 -1384084 -1395878 -1323592 -1179280 -1000191 -817126 -630421
35208f30421K10046K50637K90443K94563K21833P0204r6129j99977k32088k45466
$$ -630421 -420375 -169738 120705 415268 637101 707305 611176 411199 179111 -66355
35198f6355k66832k57089j80004p0125O928M0829Q1738J66726K80323L89636M78893
$$ -66355 -333187 -590276 -770280 -840405 -833477 -792648 -710910 -544184 -263861 125775 604668
35187F04668N32669N14775L91321J68996r9331l40272m94780n53126n63972n81865
$$ 604668 1137337 1652112 2043433 2212429 2113098 1772826 1278046 724920 160948 -420917
35177d20917n90203n05418k85369r465J87008K46137K16895J61843Q6975k1211
$$ -420917 -1011120 -1516538 -1801907 -1811372 -1624364 -1378227 -1161332 -999489 -912514 -933725
35167i33725j34279j92636j60982n3222Q0012J70912J64696O1161p9625j91578
$$ -933725 -1068004 -1260640 -1421622 -1474844 -1394832 -1223920 -1059224 -998063 -1077688 -1269266
35157a269266k53622k73681k46256j59687l3522Q9691J87813K56824K65898J67019
$$ -1269266 -1522888 -1796569 -2042825 -2202512 -2236034 -2146343 -1958530 -1701706 -1435808 -1268789
35147a268789k4702k01984k60102k02695j16649n9681k1965M719j6318j03879
$$ -1268789 -1293491 -1495475 -1755577 -1958272 -2074921 -2134602 -2156567 -2151848 -2168166 -2272045
35137b272045j90050j68094j1447J87677L07033L01061K15376J23924P4111P7764
$$ -2272045 -2462095 -2630189 -2641636 -2453959 -2146926 -1845865 -1630489 -1506565 -1432454 -1354690
35127a354690J20932J68674J75837J14778J707j05864j44189q7340L0531J31861
$$ -1354690 -1233758 -1065084 -889247 -774469 -772762 -878626 -1022815 -1110155 -1079624 -947763
35117i47763J42510L6963j48578l38009m51615m41272l19215j62363o6617o8395
$$ -947763 -805253 -768290 -916868 -1254877 -1706492 -2147764 -2466979 -2629342 -2695959 -2764354
35107b764354j08524r1663J2566J40049K06286J92678J51807J49216K19818L61645
$$ -2764354 -2872878 -2964541 -2951975 -2811926 -2605640 -2412962 -2261155 -2111939 -1892121 -1530476
35097a530476N33898O57510O52270M97234K46744j7851k35510l63379l66606k48685
$$ -1530476 -996578 -339068 313202 810436 1057180 1039329 803819 440440 73834 -174851
35087a74851q2092K8229K5003o6548j77250k48833k58833k22758j81715j68224
$$ -174851 -256943 -228714 -203711 -270259 -447509 -696342 -955175 -1177933 -1359648 -1527872
35077a527872j75846j77435j71982j84502k10686j96177r7927N5080J91315K71729
$$ -1527872 -1703718 -1881153 -2053135 -2237637 -2448323 -2644500 -2742427 -2687347 -2496032 -2224303
35067b224303L04940L01271K54960J78696J16475R6599R1569N1782k4735p7034
$$ -2224303 -1919363 -1618092 -1363132 -1184436 -1067961 -971362 -879793 -828011 -852746 -929780
35057i29780m3504O7242J75114K01363J42377O7459M3354O9187R1578P6718N8090
$$ -929780 -973284 -906042 -730928 -529565 -387188 -319729 -276375 -207188 -115610 -38892 19198
35046A9198J12144K82161N10256O43925N42874K10780j88657m71490n82011n85818
$$ 19198 131342 413503 923759 1567684 2110558 2321338 2132681 1661191 1079180 493362
35036D93362n47287m71395l63235k73741k44362k43485k01414r3095M3093J50726
$$ 493362 -53925 -525320 -888555 -1162296 -1406658 -1650143 -1851557 -1944652 -1901559 -1750833
35026a750833J90702J53107P4990L7146R8676K24677L08267K77654J66211P2264
$$ -1750833 -1560131 -1407024 -1332034 -1294888 -1196212 -971535 -663268 -385614 -219403 -147139
35016a47139O2711J14939J39647O6286p6535j73705j39933j7754O6629L9317o1140
$$ -147139 -84428 30511 170158 236444 159909 -13796 -153729 -171483 -104854 -65537 -126677
35005a26677j54290k02928k14953k03994j79711j53945j30142j02701q3974j06418
$$ -126677 -280967 -483895 -698848 -902842 -1082553 -1236498 -1366640 -1469341 -1553315 -1659733
34995a659733j69929k06735j34495N6987K89843M58820M93569L87333K02716L9982
$$ -1659733 -1829662 -2036397 -2170892 -2113905 -1824062 -1365242 -871673 -484340 -281624 -241642
34985b41642l9716o3607r3947j32683j19414k6542R1780J67817J96696K09606
$$ -241642 -281358 -344965 -438912 -571595 -691009 -717551 -625771 -457954 -261258 -51652
34975e1652K00936J31059m149j50389k50863k91841k78425j98851m7814J27151
$$ -51652 149284 280343 276194 125805 -125058 -416899 -695324 -894175 -941989 -814838
34965h14838K42057K51866J87451J04565J8713q3858j85229k24802j59590j1163
$$ -814838 -572781 -320915 -133464 -28899 -10186 -94044 -279273 -504075 -663665 -674828
34955f74828J58171K92445L52592L10512J67222k9511k10864l31451l81234l72169
$$ -674828 -516657 -224212 128380 438892 606114 576603 365739 34288 -346946 -719115
34945g19115l33064k97496k67162k04489r6902q621j4405q5186j00349R719J86361
$$ -719115 -1052179 -1349675 -1616837 -1821326 -1918228 -1926849 -1941254 -2026440 -2126789 -2117070 -1930709
34934a930709L30173M10637M50212M47375L71782K14483j267k40184m46944n44814
$$ -1930709 -1600536 -1189899 -739687 -292312 79470 293953 292686 52502 -394442 -939256
34924i39256m96827l58508k21754j15904j3190Q2479J22773J00174P5271Q5438
$$ -939256 -1436083 -1794591 -2016345 -2132249 -2145439 -2062960 -1940187 -1840013 -1764742 -1679304
34914a679304Q1608K538j24335k06572j94339j21027m1960K9869J17680K29057
$$ -1679304 -1597696 -1595158 -1719493 -1926065 -2120404 -2241431 -2283391 -2253522 -2135842 -1906785
34904a906785L19758L13634J75628k6414j53988j16236M5434J97470K27807J17833
$$ -1906785 -1587027 -1273393 -1097765 -1124179 -1278167 -1394403 -1348969 -1151499 -923692 -805859
34894h05859o7100k29791k98766k68198j87519j00106J602J46115L19932M60555
$$ -805859 -872959 -1102750 -1401516 -1669714 -1857233 -1957339 -1955737 -1809622 -1489690 -1029135
34884a029135N15118M87594M21522L47176K52494J03610j06089l27497m84463
$$ -1029135 -514017 -26423 395099 742275 994769 1098379 992290 664793 180330
34875A80330n36384n06061m43966l78971l10287k28967j31833k9164M3559L8022
$$ 180330 -356054 -862115 -1306081 -1685052 -1995339 -2224306 -2356139 -2385303 -2341744 -2303722
34865b303722n3355j59568j76042n9887J29766K87736L47546L13528K31514J44170
$$ -2303722 -2357077 -2516645 -2692687 -2752574 -2622808 -2335072 -1987526 -1673998 -1442484 -1298314
34855a298314P0833J5820j9710m3259p8709j45844k26096k68725k43844j73572
$$ -1298314 -1227481 -1211661 -1231371 -1274630 -1353339 -1499183 -1725279 -1994004 -2237848 -2411420
34845b411420r8930l6586J1679K8559l974o2728q8085m1904N2170J28533J31486
$$ -2411420 -2510350 -2546936 -2535257 -2506698 -2510672 -2573400 -2661485 -2703389 -2651219 -2522686 -2391200
34834b391200N5823m6290j01406p3892P947Q5169J11577N8081r0572l04376m88421
$$ -2391200 -2335377 -2381667 -2483073 -2556965 -2549018 -2463849 -2352272 -2294191 -2384763 -2689139 -3177560
34823c177560n40364m37479k45999n2352Q4328J24589N0439j02376k47883l12781
$$ -3177560 -3717924 -4155403 -4401402 -4453754 -4369426 -4244837 -4194398 -4296774 -4544657 -4857438
34813d857438k83778j87342n0080J04404K42121L27218L43747L06909K59251K44854
$$ -4857438 -5141216 -5328558 -5378638 -5274234 -5032113 -4704895 -4361148 -4054239 -3794988 -3550134
34803c550134K64689K64758J98064R2448J8862o006l5578r8792j42002r8262K2926
$$ -3550134 -3285445 -3020687 -2822623 -2730175 -2711313 -2717319 -2752897 -2851689 -2993691 -3091953 -3069027
34792c069027J50434K27003K36284J84408R9659L6606L8633R5484J60370J99163
$$ -3069027 -2918593 -2691590 -2455306 -2270898 -2171239 -2134633 -2096000 -2000516 -1840146 -1640983
34782a640983K00481J56546P2092j1698l7209J5598J09236J80792J82690J04294
$$ -1640983 -1440502 -1283956 -1211864 -1223562 -1260771 -1245173 -1135937 -955145 -772455 -668161
34772f68161k3674j46419k18761k20600j45971r085J26699J69257Q9935k2975
$$ -668161 -691835 -838254 -1057015 -1277615 -1423586 -1432671 -1305972 -1136715 -1046780 -1069755
34762a069755m1719P7981K73908M48285N19451M31214J82330j40118m06296n44945
$$ -1069755 -1111474 -1033493 -759585 -311300 208151 639365 821695 681577 275281 -269664
34752b69664n76019n45606m72374l69944k77537k34998k41286k54001k23060j27608
$$ -269664 -845683 -1391289 -1863663 -2233607 -2511144 -2746142 -2987428 -3241429 -3464489 -3592097
34742c592097J819J02258J41438J53161J82797K15601K06044J67821J70994K37679
$$ -3592097 -3590278 -3488020 -3346582 -3193421 -3010624 -2795023 -2588979 -2421158 -2250164 -2012485
34732b012485L00155K86287J93576N4044j11444k58414k96895j78563J3335J21981
$$ -2012485 -1712330 -1426043 -1232467 -1178423 -1289867 -1548281 -1845176 -2023739 -2010404 -1888423
34722a888423O4354j12959l05616m34972m75911m54570m21870l95392l33756k01494
$$ -1888423 -1824069 -1937028 -2242644 -2677616 -3153527 -3608097 -4029967 -4425359 -4759115 -4960609
34712d960609m2268O1113R0719J02898J33944J55627J37098R2367M2255j4603
$$ -4960609 -5002877 -4941764 -4851045 -4748147 -4614203 -4458576 -4321478 -4229111 -4186856 -4201459
34702d201459n7553k5910R8307K25484K43003J53873P1028P2511J21218J44996
$$ -4201459 -4259012 -4284922 -4186615 -3961131 -3718128 -3564255 -3493227 -3420716 -3299498 -3154502
34692c154502J39401J50034J88898K22114K34143K57146L20587L98210M23781
$$ -3154502 -3015101 -2865067 -2676169 -2454055 -2219912 -1962766 -1642179 -1243969 -820188
34683h20188L49116J81154j8704j60093j74377p4851L5126M2659p5338k42733
$$ -820188 -471072 -289918 -308622 -468715 -643092 -717943 -682817 -640158 -715496 -958229
34673i58229l65675l98454l37629k02413m6509N1534N5663J2687j4011l4070j03008
$$ -958229 -1323904 -1722358 -2059987 -2262400 -2308909 -2257375 -2201712 -2189025 -2203036 -2237106 -2340114
34662b340114k12159k67907k01677n1638R5347K01718K81065L37276L54606L36262
$$ -2340114 -2552273 -2820180 -3021857 -3073495 -2978148 -2776430 -2495365 -2158089 -1803483 -1467221
34652a467221L07066K80746K62445K76722L43451M15712L89310K04983q0661l44562
$$ -1467221 -1160155 -879409 -616964 -340242 3209 418921 808231 1013214 932553 587991
34642E87991m96356n16910m35976l11080k14061j96689k57351l52828m37818m78582
$$ 587991 91635 -425275 -861251 -1172331 -1386392 -1583081 -1840432 -2193260 -2631078 -3109660
34632c109660m40597k95727n4738K18655M34292N19369M53873K85733J10150J2827
$$ -3109660 -3550257 -3845984 -3900722 -3682067 -3247775 -2728406 -2274533 -1988800 -1878650 -1865823
34622a865823J9913R9497K00882K83962L26000L24300K94401K56454K29899K45030
$$ -1865823 -1845910 -1746413 -1545531 -1261569 -935569 -611269 -316868 -60414 169485 414515
34612D14515L29371M52907N12882M23383K16639J1259j17643j88391k37366k63771
$$ 414515 743886 1196793 1709675 2133058 2349697 2360956 2243313 2054922 1817556 1553785
34602A553785k71583k96888l47856l73033l43653l18077l56329m07686l64361
$$ 1553785 1282202 985314 637458 264425 -79228 -397305 -753634 -1161320 -1525681
34593a525681k12254m9426M3776P4302O6531O763j02740j95986k01319j17773
$$ -1525681 -1737935 -1787361 -1743585 -1669283 -1602752 -1595989 -1698729 -1894715 -2096034 -2213807
34583b213807m528P1374N3390q8140l07362m77899m88682l44120j46417N347P5589
$$ -2213807 -2218335 -2146961 -2093571 -2181711 -2489073 -2966972 -3455654 -3799774 -3946191 -3940844 -3865255
34572c865255P9163N0018J7519j4283n9731j08117j05816p400J69758L64197N22460
$$ -3865255 -3786092 -3736074 -3718555 -3732838 -3792569 -3900686 -4006502 -4013902 -3844144 -3479947 -2957487
34561b957487O04089N63476L82611J26153p8049j33237l9521J24413K60282K99272
$$ -2957487 -2353398 -1789922 -1407311 -1281158 -1359207 -1492444 -1531965 -1407552 -1147270 -847998
34551h47998K28627Q5334q0457k26108k98268k37362m7337J60484K52532K05975
$$ -847998 -619371 -534037 -614494 -840602 -1138870 -1376232 -1423569 -1263085 -1010553 -804578
34541h04578J11179M1900j9558j11683k07141k38685j80247o5609N3444J37048
$$ -804578 -693399 -651499 -671057 -782740 -989881 -1228566 -1408813 -1474422 -1420978 -1283930
34531a283930J62046J28495N9989j4427p0307q0545l0250M4141O3876j0959j27883
$$ -1283930 -1121884 -993389 -933400 -947827 -1018134 -1098679 -1128929 -1084788 -1020912 -1031871 -1159754
34520a159754k01002k09932k08958k47575l15182l62521l47150k53576r6387Q1024
$$ -1159754 -1360756 -1570688 -1779646 -2027221 -2342403 -2704924 -3052074 -3305650 -3402037 -3321013
34510c321013K22571K87641K70144K00384J31609J06951J24321J46512J59112
$$ -3321013 -3098442 -2810801 -2540657 -2340273 -2208664 -2101713 -1977392 -1830880 -1671768
34501a671768J96709K84018L68588L55743K17962L8905o5613n6187R40o372j42885
$$ -1671768 -1475059 -1191041 -822453 -466710 -248748 -209843 -275456 -331643 -330703 -337075 -479960
34490d79960l59161n09273m68947k59750l8847N0566J436r2337j55057j75665
$$ -479960 -839121 -1348394 -1817341 -2077091 -2115938 -2065372 -2063936 -2156273 -2311330 -2486995
34480b486995j59915r6652J0664J16798J70516J67742J51447J64346K10983K56182
$$ -2486995 -2646910 -2743562 -2732898 -2616100 -2445584 -2277842 -2126395 -1962049 -1751066 -1494884
34470a494884K49609J64087K8170q4880j19355q6838l7819R047P8534J74425K42404
$$ -1494884 -1245275 -1081188 -1053018 -1137898 -1257253 -1344091 -1381910 -1372863 -1294329 -1119904 -877500
34459h77500K28760J54603R2480P5094O5548K1375n3623j40433k49974l97744
$$ -877500 -648740 -494137 -401657 -326563 -261015 -239640 -293263 -433696 -683670 -1081414
34449a081414n46418o12160n37992l47446j26116L8668J10154J20531J43017K28228
$$ -1081414 -1627832 -2239992 -2777984 -3125430 -3251546 -3212878 -3102724 -2982193 -2839176 -2610948
34439b610948L58984M73761N30969N34190M95665M01828K34482J4929j95304l41569
$$ -2610948 -2251964 -1778203 -1247234 -713044 -217379 184449 418931 433860 238556 -103013
34429a03013m11178m15578l51989k07042o880J59141J98878J09375j3962p3414
$$ -103013 -514191 -929769 -1281758 -1488800 -1495680 -1336539 -1137661 -1028286 -1042248 -1115662
34419a115662n7337k0531k413K516K880k0053q5256j74105k36063k28803j51246
$$ -1115662 -1172999 -1193530 -1195943 -1193427 -1190547 -1210600 -1295856 -1469961 -1706024 -1934827 -2086073
34408b086073m3623M6281J02249J38193J55307J28024N8733J8915Q0854K06805
$$ -2086073 -2129696 -2083415 -1981166 -1842973 -1687666 -1559642 -1500909 -1481994 -1401140 -1194335
34398a194335K60652J53273o2314k63077l82229m30756m32588l91324l06747j76051
$$ -1194335 -933683 -780410 -842724 -1105801 -1488030 -1918786 -2351374 -2742698 -3049445 -3225496
34388c225496J7781K74283N26188O61699O16997M30789K01854J1057j14934j92830
$$ -3225496 -3207715 -2933432 -2407244 -1745545 -1128548 -697759 -495905 -484848 -599782 -792612
34378g92612k52314l01291l11131k47911j21090J7415J29214K22973L17352L88818
$$ -792612 -1044926 -1346217 -1657348 -1905259 -2026349 -2008934 -1879720 -1656747 -1339395 -950577
34368i50577L82491K75839J14278k6060j05148j39496j57041j50890j01145l5944
$$ -950577 -568086 -292247 -177969 -204029 -309177 -448673 -605714 -756604 -857749 -893693
34358h93693k9373j12801k17139k44519j85179j18033r5519p9395j3061Q4560
$$ -893693 -923066 -1035867 -1253006 -1497525 -1682704 -1800737 -1896256 -1975651 -1988712 -1904152
34348a904152J36899J02831J5083p0766j35691j97633k69844l32702l48369l00876
$$ -1904152 -1767253 -1664422 -1649339 -1720105 -1855796 -2053429 -2323273 -2655975 -3004344 -3305220
34338c305220k16095j37766q9714o7567n4277k7686L2154J14880J68207J50350
$$ -3305220 -3521315 -3659081 -3748795 -3816362 -3870639 -3898325 -3866171 -3751291 -3583084 -3432734
34328c432734R1520O3197Q4917J11155J20880J57598K44983L21040L15800K58177
$$ -3432734 -3341214 -3278017 -3193100 -3081945 -2961065 -2803467 -2558484 -2237444 -1921644 -1663467
34318a663467K39809K91436L58599L91129L91162L66993L00888J83702L6389j20881
$$ -1663467 -1423658 -1132222 -773623 -382494 8668 375661 676549 860251 896640 775759
34308G75759k79423m02790m18373k80094k1151K67713M88108N60769M52936K13216
$$ 775759 496336 93546 -324827 -604921 -626072 -358359 129749 690518 1143454 1356670
34298A356670m6956k36944l41831l89871m01392l88615l65940l25105k28417o4490
$$ 1356670 1309714 1072770 730939 341068 -60324 -448939 -814879 -1139984 -1368401 -1432891
34288a432891J08829K11491K15212J43653K7655r6998j72179j58079r0905m7954
$$ -1432891 -1324062 -1112571 -897359 -753706 -726051 -823049 -995228 -1153307 -1244212 -1292166
34278a292166m6959k7546N2905J51242J93424J62890J02180N0516J5545l030L799
$$ -1292166 -1339125 -1366671 -1313766 -1162524 -969100 -806210 -704030 -653514 -637969 -640999 -637200
34267f37200M0767R5280J45806J76832J84114J71868J49160J29790J33914J80707
$$ -637200 -596433 -501153 -355347 -178515 5599 177467 326627 456417 590331 771038
34257G71038K66302L45737L47578K20513k2679k98093m90555n23563m13594k54513
$$ 771038 1037340 1383077 1730655 1951168 1928489 1630396 1139841 616278 202684 -51829
34247e1829j32604n4890K9110J40911K30087K25135J13631l8349j41252j51902
$$ -51829 -184433 -239323 -210213 -69302 160785 385920 499551 461202 319950 168048
34237A68048r4841k2249M0942J05645J78225K35765K55871K48920K32664J90085
$$ 168048 73207 50958 91900 197545 375770 611535 867406 1116326 1348990 1539075
34227A539075R2929l1934j02063o4900M3432J42071J81838J57577P5956m6004
$$ 1539075 1632004 1600070 1498007 1433107 1476539 1618610 1800448 1958025 2033981 1987977
34217A987977j56994j89364j22375j3624M8076K0119o7642j58902k30408k92476
$$ 1987977 1830983 1641619 1519244 1505620 1553696 1573815 1506173 1347271 1116863 824387
34207H24387l33888k99244j57006J8898Q4292l3452k55561m37223n07634m95434
$$ 824387 490499 191255 34249 53147 137439 103987 -151574 -588797 -1096431 -1591865
34197a591865m41167l39236j75706J7012J70591K34605K07624J24750K5179p0931
$$ -1591865 -2033032 -2372268 -2547974 -2530962 -2360371 -2125766 -1918142 -1793392 -1768213 -1839144
34187a839144j57955k20544k27884j68006q1058l5830o5946j38371j83661j47212
$$ -1839144 -1997099 -2217643 -2445527 -2613533 -2694591 -2730421 -2796367 -2934738 -3118399 -3265611
34177c265611k1370J45543K68832K84689K06606J14022P6231R9431J51030K08927
$$ -3265611 -3286981 -3141438 -2872606 -2587917 -2381311 -2267289 -2191058 -2091627 -1940597 -1731670
34167a731670K64343K91566K46905J09530q1970k37814k71515j67664n492J02433
$$ -1731670 -1467327 -1175761 -928856 -819326 -901296 -1139110 -1410625 -1578289 -1583781 -1481348
34157a481348J13000Q7252J11482J94921K59219K16881M4151k05928m32474n36910
$$ -1481348 -1368348 -1281096 -1169614 -974693 -715474 -498593 -454442 -660370 -1092844 -1629754
34147a629754m84948l36473j95307j16505p3675j8023N5836J17541J54299J90915
$$ -1629754 -2114702 -2451175 -2646482 -2762987 -2836662 -2854685 -2798849 -2681308 -2527009 -2336094
34137b336094K56338L43023M03683L88843K92588J61029M9311k5768q0468j22420
$$ -2336094 -2079756 -1736733 -1333050 -944207 -651619 -490590 -441279 -467047 -547515 -669935
34127f69935j40072j32967j21886j20112j22979j33690j59975j66666q2850R7160
$$ -669935 -810007 -942974 -1064860 -1184972 -1307951 -1441641 -1601616 -1768282 -1851132 -1753972
34117a753972K60852K92873K23534J86116K27251K45494J47492j4964j21821j39891
$$ -1753972 -1493120 -1200247 -976713 -790597 -563346 -317852 -170360 -185324 -307145 -447036
34107d47036j28324j26685j22480j21417j63075k39458k62509j58866L4226K03426
$$ -447036 -575360 -702045 -824525 -945942 -1109017 -1348475 -1610984 -1769850 -1735624 -1532198
34097a532198K69415K35862J52433O7749J3999M047L1553Q3981J54209K27891
$$ -1532198 -1262783 -1026921 -874488 -806739 -792740 -788693 -757140 -673159 -518950 -291059
34087b91059K66966K30711J22785K162o7105p2802n3548m8296o2434q5356j22982
$$ -291059 -24093 206618 329403 331565 264460 191658 138110 89814 27380 -57976 -180958
34076a80958j94269k96313l85529l99175k96680r2034J40094L00915L40496L04137
$$ -180958 -375227 -671540 -1057069 -1456244 -1752924 -1844958 -1704864 -1403949 -1063453 -759316
34066g59316K85767L25874L74900L63166K75815J42484r032j52746k47350k66917
$$ -759316 -473549 -147675 227225 590391 866206 1008690 999658 846912 599562 332645
34056C32645k35463j87893j12876J0455J28985J42150L1045j02945j61777j59167
$$ 332645 97182 -90711 -203587 -193132 -64147 78003 109048 6103 -155674 -314841
34046c14841j65577j96816k15765k12768k19338k48944k74892k67746k17034j18813
$$ -314841 -480418 -677234 -892999 -1105767 -1325105 -1574049 -1848941 -2116687 -2333721 -2452534
34036b452534K1768J75132L03648L89369M20801L69871K23847L2035j23964k05354
$$ -2452534 -2430766 -2255634 -1951986 -1562617 -1141816 -771945 -548098 -516063 -640027 -845381
34026h45381k22167j75659n6549R1655J77092J65685J34199J71931K62643L11580
$$ -845381 -1067548 -1243207 -1299756 -1208101 -1031009 -865324 -731125 -559194 -296551 15029
34016A5029K68665J75462R5151M0515j7828j01844k03582l01415l82552m42183
$$ 15029 283694 459156 554307 594822 576994 475150 271568 -29847 -412399 -854582
34006h54582m63381m16766l00294j68142q6730n9167k5335N7307J68559K67447
$$ -854582 -1317963 -1734729 -2035023 -2203165 -2289895 -2349062 -2374397 -2317090 -2148531 -1881084
33996a881084L30852L30189K26903L9023j30002j88858j61963j41646j60236j73125
$$ -1881084 -1550232 -1220043 -993140 -954117 -1084119 -1272977 -1434940 -1576586 -1736822 -1909947
33986a909947j53420j28000j13998q9584m4340N359P0018J85065L20563L64302
$$ -1909947 -2063367 -2191367 -2305365 -2394949 -2439289 -2433930 -2363912 -2178847 -1858284 -1493982
33976a493982K54790Q0927j6483o797L3343N3208P3032R8815P8689k0065j43323
$$ -1493982 -1239192 -1158265 -1174748 -1181545 -1148202 -1094994 -1021962 -923147 -844458 -864523 -1007846
33965a007846j99557j52664m3747N6311R9463R0809Q5551J37407K36448L16342
$$ -1007846 -1207403 -1360067 -1403814 -1347503 -1248040 -1157231 -1071680 -934273 -697825 -381483
33955c81483L29666K86812K08198P9561j06136k85668l54902k69230q7690Q9229
$$ -381483 -51817 234995 443193 522754 416618 130950 -223952 -493182 -580872 -491643
33945d91643K04606K61890K78587K44066J28138p0003k87128m25932m32590l40157
$$ -491643 -287037 -25147 253440 497506 625644 555641 268513 -157419 -590009 -930166
33935i30166k25969j33296m6975O1475J84912K80980L09176K62151J66090N4588
$$ -930166 -1156135 -1289431 -1336406 -1274931 -1090019 -809039 -499863 -237712 -71622 -17034
33925a7034n6079j61317k41547k61094k08005j21982o0953m1282k7032K1022R7092
$$ -17034 -73113 -234430 -475977 -737071 -945076 -1067058 -1128011 -1169293 -1196325 -1175303 -1078211
33914a078211J49611J22165N885j36947k16309k01140j48174j20962j02304k9882
$$ -1078211 -928600 -806435 -800550 -937497 -1153806 -1354946 -1503120 -1624082 -1726386 -1756268
33904a756268R5702J99060K32333K24924K07299J53906N3758k0179Q902R9814
$$ -1756268 -1660566 -1461506 -1229173 -1004249 -796950 -643044 -589286 -609465 -600563 -500749
33894e00749J34956P9688J7866J1689P660o9378j85592k25659j29539M7156J98915
$$ -500749 -365793 -286105 -268239 -256550 -248890 -318268 -503860 -729519 -859058 -811902 -612987
33883f12987K59046K33635J84964J78719K16739K22737J19853p9747k83791m08634
$$ -612987 -353941 -120306 64658 243377 460116 682853 802706 722959 439168 30534
33873C0534m30920l63260k26041n6902Q8813J73935K03463K03689J94655J87321
$$ 30534 -400386 -763646 -989687 -1046589 -957776 -783841 -580378 -376689 -182034 5287
33863E287J80075J45510N0390q9186j97696k13187j51771p1335Q207J07816K22549
$$ 5287 185362 330872 381262 292076 94380 -118807 -270578 -341913 -333706 -225890 -3341
33852c341L01220L06314K59244K06950J67344J24397N6906m3642j63764k58857
$$ -3341 297879 604193 863437 1070387 1237731 1362128 1419034 1375392 1211628 952771
33842I52771k74080k00056r6928m0434n1385r5806j38501j67146j75447j65065
$$ 952771 678691 478635 381707 341273 289888 194082 55581 -111565 -287012 -452077
33832d52077j70073k36287l49619m12645l28768j05998J43859L04221L34104K60762
$$ -452077 -622150 -858437 -1208056 -1620701 -1949469 -2055467 -1911608 -1607387 -1273283 -1012521
33822a012521J27795l1170j81734k75944k65762j38228O1081K50002L66839M04790
$$ -1012521 -884726 -915896 -1097630 -1373574 -1639336 -1777564 -1716483 -1466481 -1099642 -694852
33812f94852L87182L23716K10451O4124p4168j77685k51176k94933k77814j77484
$$ -694852 -307670 16046 226497 290621 216453 38768 -212408 -507341 -785155 -962639
33802i62639l9017M0509r43j30921k54393k96075k55508j99833k03434k72244
$$ -962639 -1001656 -961147 -962090 -1093011 -1347404 -1643479 -1898987 -2098820 -2302254 -2574498
33792b574498l20346k46807n3390J34905J90938J12660N341m3194k6451L3799
$$ -2574498 -2894844 -3141651 -3195041 -3060136 -2869198 -2756538 -2751197 -2794391 -2820842 -2787043
33782b787043J41230K90834M20643M50114L63355K21239R2237n42o4379j01035
$$ -2787043 -2645813 -2354979 -1934336 -1484222 -1120867 -899628 -807391 -807933 -872312 -973347
33772i73347r8416m3110N9503J58677J59635n600k87478n28237n91432m71252
$$ -973347 -1071763 -1114873 -1055370 -896693 -737058 -742658 -1030136 -1558373 -2149805 -2621057
33762b621057k60588m2242J51664K96545L54548L15992K24279J34939P2257M6284
$$ -2621057 -2881645 -2923887 -2772223 -2475678 -2121130 -1805138 -1580859 -1445920 -1373663 -1327379
33752a327379Q5872K14403L91078N06681M59267K38515n9261k94104l72533l01327
$$ -1327379 -1241507 -1027104 -636026 -129345 329922 568437 509176 215072 -157461 -458788
33742d58788j67344o1124j2484N578K2309L2990J6745k5255o2207o3366k8352
$$ -458788 -626132 -687256 -699740 -694162 -671853 -638863 -622118 -647373 -709580 -772946 -801298
33731h01298J5587M5221O4911R1909J20495J16418N6952l7766j32147k20750l13309
$$ -801298 -785711 -740490 -675579 -583670 -463175 -346757 -289805 -327571 -459718 -680468 -993777
33720i93777l75845l36009j80119j2761L0806p1580k12787k85077k82218k61290
$$ -993777 -1369622 -1705631 -1885750 -1898511 -1867705 -1939285 -2152072 -2437149 -2719367 -2980657
33710b980657k48227k16028j32051P193J74226L14147L63840L02524J81895Q1072
$$ -2980657 -3228884 -3444912 -3576963 -3569770 -3395544 -3081397 -2717557 -2415033 -2233138 -2152066
33700b152066L5205K7175L0468K3218k3945j17546j95330j72616o1029J4387l7488
$$ -2152066 -2116861 -2089686 -2059218 -2036000 -2059945 -2177491 -2372821 -2545437 -2606466 -2592079 -2629567
33689b629567j47910j64100l0097J62589K95015L33462L13621K66070J90270Q0141
$$ -2629567 -2777477 -2941577 -2971674 -2809085 -2514070 -2180608 -1866987 -1600917 -1410647 -1330506
33679a330506m9400j57354j99621j77344j60629k30518l82884n15775n28475m11234
$$ -1330506 -1379906 -1537260 -1736881 -1914225 -2074854 -2305372 -2688256 -3204031 -3732506 -4143740
33669d143740k25067k8164J44465K55422K72963K12198J32246P6980M1812J3010
$$ -4143740 -4368807 -4396971 -4252506 -3997084 -3724121 -3511923 -3379677 -3302697 -3260885 -3247875
33659c247875J4866Q8010K25195L55542M05820L68351K97787K45458K09639J54028
$$ -3247875 -3233009 -3144999 -2919804 -2564262 -2158442 -1790091 -1492304 -1246846 -1037207 -883179
33649h83179O3344l4457j03607j47101k05417l03497m03042m20366l06193j09777
$$ -883179 -819835 -854292 -957899 -1105000 -1310417 -1613914 -2016956 -2437322 -2743515 -2853292
33639b853292N0808R4936N1826J9633O1530J55105K34440K59363K44141K42501
$$ -2853292 -2802484 -2707548 -2655722 -2636089 -2574559 -2419454 -2185014 -1925651 -1681510 -1439009
33629a439009L09507M50522N90201O13775M67527K14766k4707j83433k77063l38719
$$ -1439009 -1129502 -678980 -88779 524996 992523 1207289 1182582 999149 722086 383367
33619C83367l59184l07071j86897n3626K9783M0025K166m0108o3459q0888j20912
$$ 383367 24183 -282888 -469785 -523411 -493628 -453603 -451437 -491545 -555004 -635892 -756804
33608g56804j89814k56952k78818k32047j18791M9248K52701M47576N68527N71890
$$ -756804 -946618 -1203570 -1482388 -1714435 -1833226 -1783978 -1531277 -1083701 -515174 56716
33598E6716M74443L35254K01374Q7441L589l0618j9974j7780q4264k23881l83284
$$ 56716 531159 866413 1067787 1155228 1158817 1128199 1108225 1090445 1006181 782300 399016
33587C99016n02864n47414m98574l57313j61001L5886K09711L65527M77272M75577
$$ 399016 -103848 -651262 -1149836 -1507149 -1668150 -1632264 -1422553 -1057026 -579754 -104177
33577a04177L30421J14263o1952j58524k09614k33709k04380j21014m8711m7709
$$ -104177 226244 340507 278555 120031 -89583 -323292 -527672 -648686 -697397 -745106
33567g45106r4080j09172n0352O1462J88023L01191L61742L19865J70631j1184
$$ -745106 -839186 -948358 -998710 -937248 -749225 -448034 -86292 233573 404204 393020
33557C93020j27613j51082j39241j52488j79079j55900m6465J22644K94121M24534
$$ 393020 265407 114325 -24916 -177404 -356483 -512383 -558848 -436204 -142083 282451
33547B82451M98105N22956N22778N09326M49392K82709r15l13738n27784n82210
$$ 282451 780556 1303512 1826290 2335616 2785008 3067717 3066802 2753064 2225280 1643070
33537A643070n16845m05979k86515j56289j4932J15581K02646K20569J60112L4187
$$ 1643070 1126225 720246 433731 277442 262510 378091 580737 801306 961418 995605
33527I95605j19329k44283k90512k51849j83694j58290j81561j71800n1347J48848
$$ 995605 876276 631993 341481 89632 -94062 -252352 -433913 -605713 -657060 -508212
33517e08212L10049L49811K89367J95422J03799K5537j5546N46N2763J00013J32599
$$ -508212 -198163 151648 441015 636437 740236 765773 750227 750773 803536 903549 1036148
33506A036148J66013J87028J46543J8716j58948l16499m05110m17355l79045l30270
$$ 1036148 1202161 1389189 1535732 1554448 1395500 1079001 673891 256536 -122509 -452779
33496d52779k92785k47075j64068o7320k9525q0952j49073j30420j3170J12582
$$ -452779 -745564 -992639 -1156707 -1224027 -1253552 -1334504 -1483577 -1613997 -1627167 -1514585
33486a514585J68288J68245J70579J86174J74987J17517M8513J2632J4745K7866
$$ -1514585 -1346297 -1178052 -1007473 -821299 -646312 -528795 -480282 -467650 -452905 -425039
33476d25039L1616K6340J9132J0180j2742p5531k00099l63781m82185m64565l05297
$$ -425039 -393423 -367083 -347951 -337771 -350513 -426044 -626143 -989924 -1472109 -1936674 -2241971
33465b241971j06903P355K455n5121q2934n9943j6547K6591Q2972J63631K39062
$$ -2241971 -2348874 -2341519 -2339064 -2394185 -2477119 -2537062 -2553609 -2527018 -2444046 -2280415 -2041353
33454b041353K56517J93401Q1549k2040p6703o9501p012Q3691J54975J65628J14077
$$ -2041353 -1784836 -1591435 -1509886 -1531926 -1608629 -1678130 -1685142 -1601451 -1446476 -1280848 -1166771
33443a166771K9330p1557j92073l12805l70526l14077j71728l1667M5083O6107
$$ -1166771 -1137441 -1208998 -1401071 -1713876 -2084402 -2398479 -2570207 -2601874 -2556791 -2490684
33433b490684O3238M5589J6864O188L9250Q4944P1910k5007j38617j71069r0325
$$ -2490684 -2427446 -2381857 -2364993 -2358805 -2319555 -2234611 -2162701 -2187708 -2326325 -2497394 -2587719
33422b587719N3333J95073L08010L82485L89648L04055J57572L2750j6339j5239
$$ -2587719 -2534386 -2339313 -2031303 -1648818 -1259170 -955115 -797543 -764793 -781132 -796371
33412g96371j9054k8794O226J00565J84513J69636M7391j00800j84005j70617
$$ -796371 -815425 -844219 -837993 -737428 -552915 -383279 -335888 -436688 -620693 -791310
33402g91310q5022K9904J33046J93282K05176J92337J76666J46618P4474l3303
$$ -791310 -876332 -846428 -713382 -520100 -314924 -122587 54079 200697 275171 241868
33392B41868j23512j45183r7775j8886O1253J31033J70117J43360L9591r9734
$$ 241868 118356 -26827 -124602 -143488 -82235 48798 218915 362275 401866 302132
33382C02132k12702k75039l10455l46173l79518l94647l89503l65607l05294j90980
$$ 302132 89430 -185609 -496064 -842237 -1221755 -1616402 -2005905 -2371512 -2676806 -2867786
33372b867786n1750L9252L6816j9857m4824P008J11558K27403L39546M37411M81751
$$ -2867786 -2919536 -2880284 -2843468 -2863325 -2908149 -2901141 -2789583 -2562180 -2222634 -1785223 -1303472
33361a303472M30069K90683J25222n585q1084j07624r1659l7950L9983J19982
$$ -1303472 -873403 -582720 -457498 -463083 -544167 -651791 -743450 -781400 -741417 -621435
33351f21435J74866J71712Q3221q2609k64174l68395l23343j27923J31163L18145
$$ -621435 -446569 -274857 -191636 -274245 -538419 -906814 -1230157 -1358080 -1226917 -908772
33341i08772L38761K16686O8548j5097n4272j27791k49363l26982k55420l1986
$$ -908772 -570011 -353325 -284777 -299874 -354146 -481937 -731300 -1058282 -1313702 -1345688
33331a345688K28441L80986L47402J46958j37758m13216o06615o73502n99570
$$ -1345688 -1117247 -736261 -388859 -241901 -379659 -792875 -1399490 -2072992 -2672562
33322b672562m04143j35083J47170L82817N21057N38896M62660L54617K60879
$$ -2672562 -3076705 -3211788 -3064618 -2681801 -2160744 -1621848 -1159188 -804571 -543692
33313e43692J81046J02169M5568M9536J06282J45699R8245l3583j69532k11014
$$ -543692 -362646 -260477 -214909 -165373 -59091 86608 184853 151270 -18262 -229276
33303b29276j16697N6924J88063J85595O3013r2808k18933l13298l73590l46011
$$ -229276 -345973 -289049 -100986 84609 147622 54814 -164119 -477417 -851007 -1197018
33293a197018j74090J14142L97981N43926M84619K39265j08890m49092o80582
$$ -1197018 -1371108 -1256966 -858985 -315059 169560 408825 299935 -149157 -829739
33284h29739p37775n99392k98939O4982L58616M92451M77411L89658K86936J76377
$$ -829739 -1567514 -2166906 -2465845 -2400863 -2042247 -1549796 -1072385 -682727 -395791 -219414
33274b19414N1215p5228j78087k38753k46466k03307j36136q3312n7116l3677
$$ -219414 -168199 -243427 -421514 -660267 -906733 -1110040 -1246176 -1329488 -1386604 -1420281
33264a420281J0422O6733J09171J21998J00708M3727l4998r6549j05275o5927
$$ -1420281 -1409859 -1343126 -1233955 -1111957 -1011249 -967522 -1002520 -1099069 -1204344 -1270271
33254a270271j4994K2499M7717O1510N1821K0664q4J4729M2039L4024j5367n3228
$$ -1270271 -1285265 -1262766 -1215049 -1153539 -1101718 -1081054 -1081138 -1066409 -1024370 -990346 -1005713 -1058941
33242a058941k7509N6247J51524K23290K60681K53987J95211J04382K5354j4885
$$ -1058941 -1086450 -1030203 -878679 -655389 -394708 -140721 54490 158872 184226 169341
33232A69341k2207o615L3750Q9004J29651J42725J46139J40964Q2023o1567k38691
$$ 169341 147134 140519 174269 263273 392924 535649 681788 822752 904775 843208 604517
33221F04517l60089m00230m00892l74256k69372o4366J61122K93473K99685K35220
$$ 604517 244428 -155802 -556694 -930950 -1200322 -1264688 -1103566 -810093 -510408 -275188
33211b75188J58290Q1296K298n9061p4606l9234K0505O0970M2785n1359k10162
$$ -275188 -116898 -35602 -33304 -92365 -166971 -206205 -185700 -124730 -81945 -133304 -343466
33200c43466l96427n48637n90510m71103k15953P2618K81657L54498L02153J80203
$$ -343466 -739893 -1288530 -1879040 -2350143 -2566096 -2493478 -2211821 -1857323 -1555170 -1374967
33190a374967O4914J5123K3304K0638m1103j28053j73107j67238j59976j74393
$$ -1374967 -1310053 -1294930 -1271626 -1250988 -1292091 -1420144 -1593251 -1760489 -1920465 -2094858
33180b094858j66888q4961O4457K17590L05001K94624K06309R3960J014o7172
$$ -2094858 -2261746 -2346707 -2282250 -2064660 -1759659 -1465035 -1258726 -1164766 -1163752 -1230924
33170a230924j16734j29311q6208j8558J3957J454o075J6579K5750j6323o7525
$$ -1230924 -1347658 -1476969 -1563177 -1581735 -1567778 -1566324 -1572399 -1555820 -1530070 -1546393 -1613918
33159a613918o0700q383Q378m3127r4191n7002P4435K24834L12175L00481K02639
$$ -1613918 -1674618 -1683001 -1674623 -1717750 -1811941 -1868943 -1794508 -1569674 -1257499 -957018 -754379
33148g54379O5569m9980j05921j20144j51771k35607l30294l45686k32414m2247
$$ -754379 -688810 -738790 -844711 -964855 -1116626 -1352233 -1682527 -2028213 -2260627 -2302874
33138b302874J06506J24356J5239j38331k42676k57634k17114j89024k02680k17037
$$ -2302874 -2196368 -2072012 -2056773 -2195104 -2437780 -2695414 -2912528 -3101552 -3304232 -3521269
33128c521269j73318p1208L0643Q6235J02851J06226J04612J08932J52373K48885
$$ -3521269 -3694587 -3765795 -3735152 -3648917 -3546066 -3439840 -3335228 -3226296 -3073923 -2825038
33118b825038L46702L63788K73890J35261L4046J6392O8514J38195J76062J77341
$$ -2825038 -2478336 -2114548 -1840658 -1705397 -1671351 -1654959 -1586445 -1448250 -1272188 -1094847
33108a094847J84310K31364K93999L14842K73729K01957J29212N4715j8447o0371
$$ -1094847 -910537 -679173 -385174 -70332 203397 405354 534566 589281 570834 510463
33098E10463n5454m3499q6320j97915l27215m04332l90092k93668j65100o4825
$$ 510463 455009 411510 325190 127275 -199940 -604272 -994364 -1288032 -1453132 -1517957
33088a517957j6292J3095O6721J37197J73444J51318J07014Q2459O2435q13j08214
$$ -1517957 -1534249 -1521154 -1454433 -1317236 -1143792 -992474 -885460 -803001 -740566 -741379 -849593
33077h49593j96902k15827j88742j73316j72381j24403Q917J77088K88994L13695
$$ -849593 -1046495 -1262322 -1451064 -1624380 -1796761 -1921164 -1912247 -1735159 -1446165 -1132470
33067a132470L05696L28338L74691L77032K85078J22917l1172j16071j37345j46788
$$ -1132470 -826774 -498436 -123745 253287 538365 661282 630110 514039 376694 229906
33057B29906j77923k11671k07700j53864p1245J5915R0603J28393J04196K6567
$$ 229906 51983 -159688 -367388 -521252 -592497 -576582 -485979 -357586 -253390 -226823
33047b26823n5313r3470p6389j5593P6671J74046K22538J76956M8459j11141k67367
$$ -226823 -282136 -375606 -451995 -467588 -390917 -216871 5667 182623 231082 119941 -147426
33036a47426m11933n14141n10119l67817j34597J09892L27120N12540O33283O24394
$$ -147426 -559359 -1073500 -1583619 -1951436 -2086033 -1976141 -1649021 -1136481 -503198 121196
33026A21196M61500K07342l0667j73101j96836j24809j2127P6063J01599P0556
$$ 121196 582696 790038 759371 586270 389434 264625 252498 328561 430160 500716
33016E00716R156o2187j21535j38318j03663n5772m1840n4854l7825M2013J47064
$$ 500716 509872 447685 326150 187832 84169 28397 -13443 -68297 -106122 -64109 82955
33005H2955K08452J95224J35429P9204M6645N876r1222k36157l36338k92985j14426
$$ 82955 291407 486631 622060 701264 747909 753785 662563 426406 90068 -202917 -317343
32994c17343P6256J62040J40613R9928J08568J51815J61711Q6895o3890k32014
$$ -317343 -241087 -79047 61566 161494 270062 421877 583588 670483 606593 374579
$$ [...]
##END NTUPLES=NMR SPECTRUM
##END=
