##TITLE=31Pdec_3d1411F
 aceton-d6, 24 sc
 15.11.2022
##JCAMPDX= 6.0         $$ Bruker NMR JCAMP-DX V2.0
##DATA TYPE= NMR SPECTRUM
##DATA CLASS= NTUPLES
##ORIGIN= UXNMR, Bruker Analytische Messtechnik GmbH
##OWNER= root
$$ XWIN-NMR		Version 3.5
$$ Tue Nov 15 14:28:38 2022 Russian Standard Time (UT+4h)  she@DPX200
##.OBSERVE FREQUENCY= 81.013821
##.OBSERVE NUCLEUS= ^31P
##.ACQUISITION MODE= SIMULTANEOUS
##.ACQUISITION SCHEME= undefined
##.AVERAGES= 24
##.DIGITISER RES= 16
##SPECTROMETER/DATA SYSTEM= spect
##.PULSE SEQUENCE= zgpg30
##.SOLVENT NAME= Acetone
##.SHIFT REFERENCE= (INTERNAL, Acetone, 0, 248.564)
##AUDIT TRAIL= $$ (NUMBER, WHEN, WHO, WHERE, WHAT)
$$ ##TITLE= Audit trail, XWIN-NMR		Version 3.5
$$ ##JCAMPDX= 5.01
$$ ##ORIGIN= Bruker BioSpin GmbH
$$ ##OWNER= she
$$ F:/spectra/data/she/nmr/P31/1/pdata/1/auditp.txt
$$ ##AUDIT TRAIL=  $$ (NUMBER, WHEN, WHO, WHERE, WHAT)
(   1,<2022-11-15 14:27:47.21 +0400>,<she>,<DPX200>,
      <created by zg, POWCHK disabled, PULCHK disabled
       configuration hash MD5:
       00 E9 B6 7A A2 85 ED C7 34 08 36 98 17 FE 4E 26
       data hash MD5: 32K
       32 EF B9 3A 15 F6 90 5D A6 D9 91 BB 5A 3E A9 2B>)
(   2,<2022-11-15 14:27:51.50 +0400>,<she>,<DPX200>,
      <Start of raw data processing
       efp BC_mod = 2 LB = 1 FT_mod = 6 PKNL = 1 PHC0 = -10224.1 PHC1 = 26.45589 SI = 64K 
       data hash MD5: 64K
       71 F9 24 50 80 B7 1B F2 EF 0A 35 6B BA 72 06 83>)
(   3,<2022-11-15 14:28:05.60 +0400>,<she>,<DPX200>,
      <pk PHC0 = -10.1965 PHC1 = 0 
       data hash MD5: 64K
       20 A8 4E FF B9 C8 6A BD 14 E6 FA 18 40 B0 87 60>)
(   4,<2022-11-15 14:28:15.42 +0400>,<she>,<DPX200>,
      <abs ABSG = 5 
       data hash MD5: 64K
       D2 D4 EC 39 53 3E D3 DA ED FB 5D 02 DC 03 AB B7>)
$$ ##END=
$$ 
$$ hash MD5
$$ B5 DD 96 4B BE FA FC 7D B5 90 3C 7D 86 44 85 95
##$RELAX= 
##$RELAX= 
##$RELAX= 
##$RELAX= 
##$RELAX= 
##$RELAX= 
##$RELAX= 
##$RELAX= 
##$RELAX= 
$$ Bruker specific parameters
$$ --------------------------
##$DU= <F:/spectra>
##$EXPNO= 1
##$NAME= <P31>
##$PROCNO= 1
##$TYPE= <nmr>
##$USER= <she>
##$AMP= (0..31)
100 100 100 100 100 100 100 100 100 100 100 100 100 100 100 100 100 100 
100 100 100 100 100 100 100 100 100 100 100 100 100 100 
##$AQSEQ= 0
##$AQ_mod= 1
##$AUNM= <au_zg>
##$AUTOPOS= <>
##$BF1= 81.014009
##$BF2= 200.13
##$BF3= 200.13
##$BF4= 200.13
##$BF5= 200.13
##$BF6= 200.13
##$BF7= 200.13
##$BF8= 200.13
##$BYTORDA= 1
##$CFDGTYP= 0
##$CFRGTYP= 5
##$CHEMSTR= <none>
##$CNST= (0..31)
1 1 145 1 1 1 1 1 1 1 1 1 1 1 1 1 1 1 1 1 1 1 1 1 1 1 1 1 1 1 1 1 
##$CPDPRG= <waltz16>
##$CPDPRG1= <>
##$CPDPRG2= <waltz16>
##$CPDPRG3= <>
##$CPDPRG4= <mlev>
##$CPDPRG5= <mlev>
##$CPDPRG6= <mlev>
##$CPDPRG7= <mlev>
##$CPDPRG8= <mlev>
##$CPDPRGB= <>
##$CPDPRGT= <>
##$D= (0..31)
0 1 0 0 0 0 0 0 0 0 0 0.03 2e-05 3e-06 0 0 0 0 0 0 0 0 0 0 0 0 0 0 0 0 
0 0 
##$DATE= 1668508066
##$DBL= (0..7)
120 120 120 11 120 120 24 19 
##$DBP= (0..7)
150 150 150 150 150 150 150 150 
##$DBP07= 0
##$DBPNAM0= <>
##$DBPNAM1= <>
$$ [...]
##$SUBNAM3= <"">
##$SUBNAM4= <"">
##$SUBNAM5= <"">
##$SUBNAM6= <"">
##$SUBNAM7= <"">
##$SUBNAM8= <"">
##$SUBNAM9= <"">
##$SW= 501.771253377433
##$SWIBOX= (0..15)
0 1 3 0 0 0 0 0 0 0 0 0 0 0 0 0 
##$SW_h= 40650.406504065
##$TD= 32768
##$TD0= 1
##$TE= 0
##$TE2= 300
##$TE3= 300
##$TEG= 300
##$TL= (0..7)
0 120 53 12 22 120 120 120 
##$TP= (0..7)
150 150 150 150 150 150 150 150 
##$TP07= 0
##$TPNAME0= <>
##$TPNAME1= <>
##$TPNAME2= <>
##$TPNAME3= <>
##$TPNAME4= <>
##$TPNAME5= <>
##$TPNAME6= <>
##$TPNAME7= <>
##$TPOAL= (0..7)
0.5 0.5 0.5 0.5 0.5 0.5 0.5 0.5 
##$TPOFFS= (0..7)
0 0 0 0 0 0 0 0 
##$TUNHIN= 0
##$TUNHOUT= 0
##$TUNXOUT= 0
##$USERA1= <user>
##$USERA2= <user>
##$USERA3= <user>
##$USERA4= <user>
##$USERA5= <user>
##$V9= 5
##$VALIST= <valist>
##$VCLIST= <CCCCCCCCCCCCCCC>
##$VD= 0
##$VDLIST= <DDDDDDDDDDDDDDD>
##$VPLIST= <PPPPPPPPPPPPPPP>
##$VTLIST= <TTTTTTTTTTTTTTT>
##$WBST= 1024
##$WBSW= 4
##$XGAIN= (0..3)
0 0 0 0 
##$XL= 0
##$YL= 0
##$YMAX_a= 6035
##$YMIN_a= -6175
##$ZGOPTNS= <>
##$ZL1= 120
##$ZL2= 120
##$ZL3= 120
##$ZL4= 120
##$ABSF1= 248.5645
##$ABSF2= -253.2056
##$ABSG= 5
##$ABSL= 3
##$ALPHA= 0
##$AQORDER= 0
##$ASSFAC= 0
##$ASSFACI= 0
##$ASSFACX= 0
##$ASSWID= 0
##$AUNMP= <proc_1d>
##$AZFE= 0.1
##$AZFW= 0.5
##$BCFW= 0
##$BC_mod= 2
##$BYTORDP= 0
##$COROFFS= 0
##$CY= -3
##$DATMOD= 1
##$DC= 0
##$DFILT= <>
##$DTYPP= 0
##$F1P= 0
##$F2P= 0
##$FCOR= 1
##$FTSIZE= 65536
##$FT_mod= 6
##$GAMMA= 0
##$GB= 0
##$INTBC= 1
##$INTSCL= 6.047779e-11
##$ISEN= 30
##$LB= 1
##$LEV0= 0
##$LPBIN= 0
##$MAXI= 10000
##$MC2= 0
##$MEAN= 0
##$ME_mod= 0
##$MI= 50
##$NCOEF= 0
##$NC_proc= -5
##$NLEV= 6
##$NOISF1= 182.463
##$NOISF2= 159.3651
##$NSP= 0
##$NTH_PI= 0
##$NZP= 0
##$OFFSET= 248.5645
##$PC= 4
##$PHC0= -10234.3
##$PHC1= 26.45589
##$PH_mod= 1
##$PKNL= yes
##$PPARMOD= 0
##$PSCAL= 0
##$PSIGN= 0
##$REVERSE= no
##$SF= 81.0140089999694
##$SI= 65536
##$SIGF1= 159.3651
##$SIGF2= -187.1042
##$SINO= 113.3802
##$SIOLD= 16384
##$SREGLST= <1H.CDCl3>
##$SSB= 0
##$STSI= 65536
##$STSR= 0
##$SW_p= 40650.406504065
##$SYMM= 0
##$S_DEV= 0
##$TDeff= 32768
##$TDoff= 0
##$TI= <>
##$TILT= no
##$TM1= 0
##$TM2= 0
##$TOPLEV= 0
##$USERP1= <user>
##$USERP2= <user>
##$USERP3= <user>
##$USERP4= <user>
##$USERP5= <user>
##$WDW= 1
##$XDIM= 65536
##$YMAX_p= 412070633
##$YMIN_p= -33179940
$$ End of Bruker specific parameters
$$ ---------------------------------
##NTUPLES= NMR SPECTRUM
##VAR_NAME=  FREQUENCY,     SPECTRUM/REAL,   SPECTRUM/IMAG
##SYMBOL=    X,             R,               I
##VAR_TYPE=  INDEPENDENT,   DEPENDENT,       DEPENDENT
##VAR_FORM=  AFFN,          ASDF,            ASDF
##VAR_DIM=   65536,         65536,           65536
##UNITS=     HZ,            ARBITRARY UNITS, ARBITRARY UNITS
##FACTOR=    0.620285442955139, 1,           1
##FIRST=     20137.2065510682, 0,            0
##LAST=      -20513.1999529968, 0,           0
##MIN=       -20513.1999529968, -33179940,   0
##MAX=       20137.2065510682, 412070633,    0
$$ Real data points
##PAGE= N=1
##DATA TABLE= (X++(R..R)), XYDATA
$$ [...]
39557g9060K5018K75556j4877l19789k06667J1416q4308k56349l6452M28229N55067
$$ -79060 -54042 221514 206637 -113152 -319819 -308403 -392711 -649060 -685512 -257283 297784
39546B97784K09931j44424j73901n6937o3371j68898k29026k01040n4032K35382
$$ 297784 507715 363291 189390 132453 69082 -99816 -328842 -529882 -583914 -348532
39536c48532M61209K87507k37242n68149l10450K69932O18618N28256J59167k86226
$$ -348532 112677 400184 162942 -405207 -715657 -445725 172893 701149 860316 574090
39526E74090n86419m74966L251L28047J29474k23324j41510K69757M03107J28429
$$ 574090 -12329 -487295 -484044 -155997 -26523 -249847 -391357 -121600 281507 409936
39516D09936r5575p3839j08266k66007j69394K22082L41896p9344m77649k90310
$$ 409936 314361 240522 132256 -133751 -303145 -81063 260833 181489 -296160 -586470
39506e86470K20484M65954L58666J45666j09913l49987k75583J56166M12523J43262
$$ -586470 -365986 99968 458634 604300 494387 144400 -131183 24983 437506 580768
39496E80768j75601M368L49443K00358k89458m24574j25242O7972M775N0149K31275
$$ 580768 405167 409535 758978 959336 669878 245304 120062 188034 192809 242958 474233
39485D74233J29114k91187n16226k82854J17387M00575N22897L55152j79942o50992
$$ 474233 603347 312160 -204066 -486920 -369533 31042 553939 909091 729149 78157
39475G8157n35167q2483K1002j94183r8735K61296J32345m91137n83873K56370
$$ 78157 -457010 -539493 -518491 -712674 -811409 -550113 -417768 -908905 -1492778 -1236408
39465a236408J013574P96347J43111n2896Q712l04385o78998l31770N26708Q58222
$$ -1236408 -222834 573513 716624 663728 672440 368055 -310943 -642713 -116005 742217
39455G42217L32204k84339l31357m1516M0333k02371n13360o43794n01330j63083
$$ 742217 1074421 790082 458725 417209 457542 255171 -258189 -901983 -1403313 -1566396
39445a566396J77265L83027M29564K55697j63693n00281k51152N11249R98033
$$ -1566396 -1389131 -1006104 -576540 -320843 -484536 -984817 -1235969 -724720 273313
39436B73313O71458l3044l50643j80043K4051K1674o1347j29360j87046j60155
$$ 273313 944771 911727 561084 381041 405092 426766 365419 236059 49013 -111142
39426a11142k0701O8406K3138J5982J24223J33214k1088k7746K22172L00114o1909
$$ -111142 -131843 -63437 -40299 -24317 99906 233120 212032 184286 406458 706572 644663
39415F44663m09895k57387J10350J58427J7285J37852L57010J37140m19910o20227
$$ 644663 234768 -22619 87731 246158 263443 401295 758305 895445 475535 -144692
39405a44692k36912K02738K63434J06057K3774L783q6054k43526l67462l15458
$$ -144692 -381604 -178866 84568 190625 214399 218182 132128 -111398 -478860 -794318
39395g94318J0433M17231M68351O1851l21032k82968o7215l1072L212L09244N92352
$$ -794318 -783885 -366654 101697 163548 -157484 -440452 -507667 -538739 -535527 -226283 366069
39384C66069M53964J59026J76255K68728r8449o74303o85066r3229L32765K16990
$$ 366069 820033 979059 1155314 1424042 1325593 651290 -33776 -127005 205760 422750
39374D22750m5198j58491k78016l61957p4902M28812M73344p4857m83041k49077
$$ 422750 377552 219061 -58955 -420912 -495814 -67002 406342 331485 -151556 -400633
39364d00633J82198K02409p9880j85263n218K15013K84211J59600p4376j67761
$$ -400633 -218435 -16026 -95906 -281169 -286387 -71374 212837 372437 298061 130300
39354A30300L7450K70820J48374j99709l04797j16225N384J6391K22050N47024
$$ 130300 167750 438570 586944 387235 82438 -33787 -28403 -12012 210038 757062
39344G57062N22860J26709j19351o2349j69486o24735r21942o70853j41036K84300
$$ 757062 1279922 1406631 1287280 1224931 1055445 430710 -491232 -1162085 -1303121 -1018821
39334a018821N54168O13039L03587j52544k69320r0654j18974l12168q8143M55906
$$ -1018821 -464653 148386 451973 299429 30109 -60545 -179519 -491687 -579830 -123924
39324a23924M44123k47582n59493J2867M61226m7385o61365k15357P91899R60710
$$ -123924 320199 72617 -486876 -474009 -12783 -60168 -721533 -936890 -144991 815719
39314H15719J47222n26419n05574l27648l89847l78048n6049L01590M30156L49564
$$ 815719 962941 436522 -69052 -396700 -786547 -1164595 -1220644 -919054 -488898 -139334
39304a39334R0307k61484l49293J1007L50273J62794k25603j50177K60588L09269
$$ -139334 -49027 -310511 -659804 -648797 -298524 -135730 -361333 -511510 -250922 58347
39294E8347m4092j15502L04261N80234K51955l31378o22402n05121j31896L11662
$$ 58347 14255 -101247 203014 783248 1035203 703825 81423 -423698 -555594 -243932
39284b43932N30842L18365o6528j68844P797J01674O6583J48268K56269N5029
$$ -243932 286910 605275 538747 369903 377700 479374 545957 694225 950494 1005523
39274A005523l05389k85410J14262K51203j44064n48942m95915j98291l6060J0520
$$ 1005523 700134 414724 528986 780189 636125 87183 -408732 -607023 -643083 -632563
39264f32563J01015J94145K39782K88664K39420o1912l62614k05902K81724M51263
$$ -632563 -531548 -337403 -97621 191043 430463 368551 5937 -199965 81759 533022
39254E33022J56600r244K19656K80193j98626o48095m68818k3930K2496j89284
$$ 533022 689622 680378 900034 1180227 981601 333506 -135312 -159242 -136746 -326030
39244c26030j14830J05297r6213n71697n48558J07512O13455M58078P9800J7835
$$ -326030 -440860 -335563 -431776 -1003473 -1552031 -1444519 -831064 -372986 -293186 -275351
39234b75351Q6594j00144l22854j16593L63503N07379J98989l5220Q5726J68670
$$ -275351 -188757 -288901 -611755 -728348 -364845 142534 341523 306303 392029 560699
39224E60699j16640m10188k45341J38565J84509k6482N0334L61467K30577m15914
$$ 560699 444059 33871 -211470 -72905 111604 85122 135456 496923 727500 311586
39214C11586o98678j31194N16509M03648n9031R209M37817L89228r6981k09809
$$ 311586 -387092 -518286 -1777 401871 342840 352049 789866 1179094 1082113 872304
39204H72304Q8525l2273o51540p50613M1439O44178K14435m96023m25353J13707
$$ 872304 960829 928556 277016 -473597 -432158 212020 426455 -69568 -494921 -381214
39194c81214J63395k07994k22966J10006J27461j25731J3568M28462K51571n19525
$$ -381214 -217819 -425813 -648779 -538773 -411312 -537043 -523475 -95013 156558 -362967
39184c62967p46012N1456Q05610N20712k27805l13181J97249L72894K4764j31774
$$ -362967 -1108979 -1057523 -251913 268799 40994 -272187 -74938 297956 322720 190946
39174A90946K14600N09857L03014j39161m14124n21969n56109m13553j09469Q6928
$$ 190946 405546 915403 1218417 1079256 665132 143163 -412946 -826499 -935968 -849040
39164h49040J09715K40441N18522N06651J7352m32720l87901j86502k98443l93190
$$ -849040 -739325 -498884 19638 526289 543641 110921 -276980 -463482 -761925 -1155115
39154a155115P5219O69458M34020m62268p18896J44282R57939O54799j51042k44049
$$ -1155115 -1079896 -410438 23582 -438686 -1157582 -1013300 -55361 599438 448396 204347
39144B04347L11125M85620J7467l64852k98309k29178m03734m16915l0139L81511
$$ 204347 515472 1001092 1018559 653707 355398 126220 -277514 -694429 -724568 -343057
39134c43057M93794M45500L29512l4674n33576o54003k92046j7188j54095k56285
$$ -343057 150737 596237 925749 891075 357499 -296504 -588550 -605738 -759833 -1016118
39124a016118O1278M20189L65319J57987K26601L28529J1356m47385l64461K45695
$$ -1016118 -954840 -534651 -169332 -11345 215256 543785 555141 107756 -256705 -11010
39114a1010O33141L70196j62576m01307k21453J31418L52316K67108j7885j81946
$$ -11010 622131 992327 829751 428444 206991 338409 690725 957833 939948 758002
39104G58002r7563l598n5128m371L14564N06633J19983n95739r59486p36298k58478
$$ 758002 660439 656841 601713 597342 911906 1418539 1538522 942783 -16703 -753001 -1011479
39093a011479J60165M13732L73185L1448k34196r5290J58129M9032k53987k05596
$$ -1011479 -851314 -437582 -64397 -32949 -267145 -362435 -204306 -155274 -409261 -614857
39083f14857J51418K55325K082j65972j53855l05376n07213j81855N71518Q43974
$$ -614857 -463439 -208114 -206032 -372004 -525859 -831235 -1338448 -1520303 -948785 -104811
39073a04811L54635J7649M55361R00279M22750n33890q37346l27686K19054M00967
$$ -104811 249824 267473 722834 1623113 2045863 1511973 674627 346941 565995 966962
39063I66962M45173L82261k3830n57693o54214k78480L7342O1420N8452J15092
$$ 966962 1412135 1794396 1770566 1212873 558659 280179 317521 378941 437393 552485
39053E52485P818k02533j73368M1022M0069j07744J05977O17208O54897n1173
$$ 552485 560303 357770 184402 225424 265493 157749 263726 880934 1535831 1484658
39043A484658p19813o21937m7340L10359L02849J48819r8910l47155k64077J34627
$$ 1484658 764845 142908 95568 405927 708776 857595 758685 411530 147453 282080
39033B82080K29173k60468o33727k54833L04288J08755n51551n40039K86061P86547
$$ 282080 511253 250785 -382942 -637775 -333487 -224732 -776283 -1316322 -1030261 -243714
39023b43714K85816m57176m84930J1366K13232l8589j76002J34262N39938N11929
$$ -243714 42102 -415074 -900004 -888638 -675406 -713995 -889997 -755735 -215797 296132
39013B96132q006n26006n09874j0752L49624J76542j56714j26877P4837p9408
$$ 296132 288126 -237880 -747754 -758506 -408882 -232340 -389054 -515931 -441094 -520502
39003e20502m07068j93970N45353R15067N06722L195j2588O3529k10788l90946
$$ -520502 -927570 -1121540 -576187 338880 845602 848797 836209 899738 688950 298004
38993B98004P244M56262K18307l47601l66566N6319R0754k88121k73012K56134
$$ 298004 305248 761510 979817 632216 265650 321969 412723 124602 -148410 107724
38983A07724M39931o5252m60808j45053L37419K94770k4113n0636P9604j07403
$$ 107724 547655 482403 21595 -123458 213961 508731 484618 433982 513586 406183
38973D06183n10200o26782l34740Q3189M06086M89502J76106l13877l21859L35226
$$ 406183 -104017 -730799 -1065539 -982350 -576264 -86762 89344 -224533 -546392 -211166
38963b11166Q08812K86254p28124j022194l68116K76276K31317j29667k37306
$$ -211166 597646 883900 155776 -866418 -1234534 -958258 -726941 -856608 -1093914
38954a093914j32684o3039N9382L32604M77424K47100r3354j19532J40179L10943
$$ -1093914 -1226598 -1289637 -1230255 -897651 -420227 -173127 -266481 -386013 -245834 65109
38944F5109K26482M1536j07199k39154l41130k81690J3726L95107N54840L10234
$$ 65109 291591 333127 225928 -13226 -354356 -636046 -622320 -227213 327627 637861
38934F37861j35161l16164m9332K55933R2504m13053o34576l29564N2315R3864
$$ 637861 502700 186536 137204 393137 485641 72588 -561988 -891552 -839237 -745373
38924g45373j3539P9599K60931K27873Q5264J39218K53575R757m82202n54687
$$ -745373 -758912 -679313 -418382 -190509 -105245 33973 287548 297305 -184897 -739584
38914g39584J6629N39265L45006k14896k89842J76397L68491j16426o08212l78578
$$ -739584 -722955 -183690 161316 -53580 -343422 -167025 201466 85040 -523172 -901750
38904i01750K24309K98219k24323m77605m857N51824M51235o9045k74496p9505
$$ -901750 -677441 -379222 -603545 -1081150 -1086007 -534183 -82948 -151993 -426489 -505994
38894e05994j5753k29661k53995J28180M49752K78551j22824k32289k5920J02590
$$ -505994 -521747 -751408 -1005403 -877223 -427471 -148920 -271744 -504033 -529953 -427363
38884d27363j7346j59206r6102J37734L72807M55692K69906j78388o27174o68530
$$ -427363 -444709 -603915 -700017 -562283 -189476 266216 536122 357734 -269440 -937970
38874i37970j42104N82254Q46716L80969k99701m25800K4272K35637k47309p06665
$$ -937970 -1080074 -497820 348896 729865 430164 4364 28636 264273 16964 -689701
38864f89701k77409N51622M62554o32701j212607l16684R78681J135282L42271
$$ -689701 -967110 -415488 47066 -585635 -1798242 -2114926 -1136245 -963 341308
38855C41308n0264K72640L61796j67052m99873j00547M10799L60874j7033k98657
$$ 341308 291044 563684 925480 758428 258555 158008 568807 929681 912648 613991
38845F13991n98948r08046o08161M56975J194787O21972n20938o86157K41271
$$ 613991 15043 -893003 -1501164 -1044189 150598 772570 251632 -434525 -193254
38836a93254Q52500L51525m38364n15544q9010M8678k15134l44169m1855M24388
$$ -193254 659246 1010771 572407 56863 -32147 16531 -198603 -542772 -584627 -160239
38826a60239N96850K57017l08173m10875K63153R67212O25026n86293j196504
$$ -160239 436611 693628 385455 -25420 237733 1204945 1829971 1243678 47174
38817D7174m30902N90430M17139o36024j017845k31309N85495M47720j88915l50639
$$ 47174 -383728 206702 623841 -12183 -1030028 -1261337 -675842 -228122 -417037 -767676
38807g67676O1277L96787K76244r9134l86664l82988m1818M04160M90497N2922
$$ -767676 -706399 -309612 -33368 -132502 -519166 -902154 -943972 -539812 -49315 3607
38797C607m15522l22640J83924L68423n7966n07939l58872J51091K93152o6605
$$ 3607 -411915 -734555 -550631 -182208 -240174 -748113 -1106985 -955894 -662742 -729347
38787g29347k93857J4493L97374K64334j45260j33283L04239M19734p9851m93767
$$ -729347 -1023204 -1008711 -611337 -347003 -492263 -625546 -321307 98427 18576 -475191
38777d75191j83768M28079N02346J1345l57107k96638j57804j65028o3535K93009
$$ -475191 -658959 -230880 271466 282811 -74296 -370934 -528738 -693766 -757301 -464292
38767d64292N72488M38282R278l51823m16973j70259J80596K51278q0879l09640
$$ -464292 108196 546478 555756 203933 -213040 -383299 -202703 48575 -32304 -341944
38757c41944J20462Q50648Q81218n551p94612n92732J98319N86633L36790k2889
$$ -341944 -221482 629166 1510384 1504833 710221 117489 315808 902441 1239231 1216342
38747A216342j48418j33834l0341K04965L39612N1517m71502o27669k09402K83780
$$ 1216342 1067924 934090 903749 1108714 1448326 1499843 1028341 400672 191270 475050
38737D75050K90001j34740m38481k44871K08573L41324k4698l52729j08432L79410
$$ 475050 765051 630311 191830 -53041 155532 496856 472158 119429 10997 390407
38727C90407L38500k05248m06678k0507J25259l99394o98318n85Q56628O37537
$$ 390407 728907 523659 116981 96474 221733 -177661 -875979 -876564 -19936 617601
38717F17601k48751l76592L78446P40686K15104k62132j27158n4731m61462o20331
$$ 617601 368850 -7742 370704 1111390 1326494 1064362 937204 882473 421011 -199320
38707a99320p9489L33825r8423p01998n75240p1488J9648p7951K53911O47896
$$ -199320 -278809 55016 -43407 -745405 -1320645 -1392133 -1372485 -1450436 -1196525 -548629
38697e48629L41282l19229l28284K79511N05103O9348k45889r201K84793K52910
$$ -548629 -207347 -526576 -854860 -575349 -70246 -898 -246787 -255988 28805 281715
38687B81715J89235L09276L26120Q4954j30314j61766j75911j66057M9364K60198
$$ 281715 470950 780226 1106346 1191300 1060986 899220 723309 557252 606616 866814
38677H66814N1402l85050m37774j27462o8947l03372j91280L38762N31245J20229
$$ 866814 918216 533166 95392 -32070 -101017 -404389 -595669 -256907 274338 394567
38667C94567k07015q9128p3907l64024k09965O42048J086262K96178q02819r08057
$$ 394567 187552 98424 24517 -339507 -549472 92576 1178838 1475016 672197 -235860
38657b35860l08596j37216l78283j39030N30000O55689O0303l85621k75443j12658
$$ -235860 -544456 -681672 -1059955 -1198985 -668985 -13296 47007 -338614 -614057 -726715
38647g26715j25852Q5974M98505M74150m5486l01231l6392P6401k35711k61774
$$ -726715 -852567 -766593 -268088 206062 160576 -140655 -177047 -100646 -336357 -598131
38637e98131L27764O60212N1303p31257n79775K92810Q11132O24225K41047l1318
$$ -598131 -270367 389845 441148 -290109 -869884 -577074 234058 858283 1099330 1068012
38627A068012k97916m50475k57038J9779q1963l65752k07042L53108N43644M5128
$$ 1068012 770096 319621 62583 82362 399 -365353 -572395 -219287 324357 369485
38617C69485m78243l12264L81154Q74846P23699N2274o77986r59255n60944K07841
$$ 369485 -108758 -421022 -39868 834978 1558677 1610951 932965 -26290 -587234 -379393
38607c79393P12313O06840J26947k57426l10341j33485J1180n6846k44489k66922
$$ -379393 332920 939760 1066707 809281 498940 365455 376635 319789 75300 -191622
38597a91622m3383J29179J8352j11138J21276N11170M40157j95163p11713n16394
$$ -191622 -235005 -105826 -87474 -198612 -77336 433834 873991 678828 -32885 -549279
38587e49279J24983M87082K92203r2351k15226j5046K23185J99319r4831l19190
$$ -549279 -424296 62786 354989 262638 47412 32366 255551 454870 360039 40849
38577D0849j34968L18576M84405Q7946m20217m07912O7821L14552k9207m85645
$$ 40849 -94119 224457 708862 796808 376591 -31321 36500 351052 321845 -163800
38567a63800m35615J003K02881R864r2921J57583L08151p4362o01939n64591j4295
$$ -163800 -599415 -598412 -395531 -385667 -478588 -321005 -12854 -87216 -689155 -1253746 -1268041
38556a268041K96920N3091k11456j6661L62669M56700L42113L40323L60405J06115
$$ -1268041 -971121 -918030 -1129486 -1146147 -783478 -326778 15335 355658 716063 822178
38546H22178k87031l85928j39754P9545Q4931N0505O8007r420j93255k45380p5494
$$ 822178 535147 149219 9465 89010 173941 224446 292453 283033 89778 -155602 -231096
38535b31096J00757J47631K18367L89926L98144J5787m96889o26382k51293J91174
$$ -231096 -130339 17292 235659 625585 1023729 1039516 542627 -83755 -335048 -143874
38525a43874K50844R589r3418O5257Q8882k66849n07628n196Q86642J039978J35789
$$ -143874 106970 116559 23141 88398 177280 -89569 -597197 -602393 284249 1324227 1460016
38514A460016p00505m28527L78271M08103l95203q11342k64048L77690K39440
$$ 1460016 759511 330984 709255 1117358 722155 -89187 -353235 24455 263895
38505B63895l12317m49525j49967M0999J5294J04972L29370L36520M7783j87370
$$ 263895 -48422 -497947 -647914 -606915 -591621 -486649 -157279 179241 227024 39654
38495C9654j23649R6294K45454K81982K43234J14168r3856k62833k58554r1564
$$ 39654 -83995 12299 257753 539735 782969 897137 803281 540448 281894 190330
38485A90330L4721q7106l60649m02224n3163K87426J75491j66732j38160K74003
$$ 190330 225051 137945 -222704 -624928 -678091 -390665 -215174 -381906 -520066 -246063
38475b46063M22367L8314l02478r2168L18868L34744L8335r2216m3298j74852
$$ -246063 176304 214618 -87860 -180028 138840 473584 511919 419703 376405 201553
38465B01553m45434l97997O8850M83311M74524K23930P8878N3405o8105l08038
$$ 201553 -243881 -641878 -573028 -89717 384807 608737 687615 741020 672915 364877
38455C64877l86381o3082M57472O00151Q5607n65915n69070N0501M05548r546
$$ 364877 -21504 -84586 372886 973037 1058644 492729 -76341 -25840 379708 370162
38445C70162n57078l75653L76089P88985M65004j03528l25613j40485J47591K34422
$$ 370162 -186916 -562569 -186480 602505 1067509 963981 638368 497883 645474 879896
38435H79896K939l40176l88162o7296J60096l0908k55124k2948L75254K68771
$$ 879896 882835 542659 154497 87201 247297 216389 -38735 -61683 313571 582342
38425E82342k74918n01143j43976K12787J03349j90687k36649q1353J7863J4790
$$ 582342 307424 -193719 -337695 -124908 -21559 -212246 -448895 -530248 -512385 -497595
38415d97595m0580j30739j07681J57664L47782j0816o47015o12075L79895J317944
$$ -497595 -538175 -668914 -776595 -618931 -271149 -281965 -928980 -1541055 -1161160 156784
38405A56784J142280J25761o05317n60222k26226j27054k13807k20381j08838
$$ 156784 1299064 1424825 819508 259286 33060 -93994 -307801 -528182 -637020
38396f37020j0549p955q0780j40595j16901n7255l1162P2708M02316P52314O84679
$$ -637020 -647569 -655524 -736304 -876899 -993800 -1051055 -1082217 -1009509 -607193 145121 829800
38385H29800J81751k26310k05481n3881r9675j43569O1064K23042q981l21411
$$ 829800 1011551 785241 579760 525879 426204 282635 343699 566741 557760 236349
38375B36349j52269L59751N12834O4675m96195o98850n42643j81579K76263N65229
$$ 236349 84080 443831 956665 1021340 525145 -173705 -716348 -897927 -621664 -56435
38365e6435L81673j47164n28265n12931k45054J64994O71859Q99939M08413m69546
$$ -56435 325238 178074 -350191 -863122 -1108176 -943182 -271323 628616 1037029 567483
38355E67483p55811j35183N11768L33287l27114n58956j86972K25937L30813K39885
$$ 567483 -188328 -323511 188257 521544 194430 -364526 -551498 -325561 5252 245137
38345B45137K8464l10610n01897k32897K44562L59792P8935q3427O4628J55768
$$ 245137 273601 -37009 -538906 -771803 -527241 -167449 -88514 -171941 -107313 48455
38335D8455k422j32949j15516k09428l76574j32037N00369O61729o0284p39861
$$ 48455 46033 -86916 -202432 -411860 -788434 -920471 -420102 241627 181343 -558518
38325e58518l86011M70027N59787j14259l54380J89782M67030j07488n87448r7456
$$ -558518 -944529 -474502 85285 -28974 -383354 -193572 273458 165970 -421478 -518934
38315e18934O26628M21396l67966m54032K82088O26487O416o46491l96549L53572
$$ -518934 107694 529090 161124 -292908 -10820 615667 622083 -24408 -420957 -67385
38305f7385O22600K31817k37418m06742l81817l07921j77578q84J81040L76944
$$ -67385 555215 787032 549614 142872 -238945 -546866 -724444 -725328 -544288 -167344
38295a67344N22153M37684J25473j01784l5552Q0497j06929n29510p81675o17910
$$ -167344 354809 792493 917966 816182 780630 861127 754198 224688 -556987 -1174897
38285a174897j39094L83798O60567N15708R8509j91634j81531j11459j49427o1923
$$ -1174897 -1313991 -930193 -269626 246082 344591 152957 -28574 -140033 -289460 -351383
38275c51383K76239M17056m2260o27737n02514K42037O06787J63814k95971k5188
$$ -351383 -75144 341912 299652 -328085 -830599 -588562 18225 182039 -113932 -139120
38265a39120M91666L18636m38567p88967l53265J74015J98591N5564K43330M64384
$$ -139120 352546 671182 232615 -556352 -909617 -735602 -537011 -481447 -238117 226267
38255B26267J05645o32713q37251j52093O72777P63897K09350k11907j09743J50758
$$ 226267 331912 -300801 -1138052 -1290145 -617368 146529 355879 143972 34229 184987
38245A84987R2910k67099n61056n39886k44652J34604M06232M42955K33497r6353
$$ 184987 277897 10798 -550258 -1090144 -1334796 -1200192 -793960 -351005 -117508 -213861
38235b13861l38051l18695n0683K04050J42175j99245l94119j36987L14781M67114
$$ -213861 -551912 -870607 -921290 -717240 -575065 -774310 -1168429 -1305416 -990635 -523521
38225e23521K83535J97206L81429M13438q3038p52518q45511j70977O15345P53521
$$ -523521 -239986 -42780 338649 752087 669049 -83469 -928980 -1099957 -484612 268909
38215B68909K17376l15336k63576K12685M43674Q2609m70807n97259k37810J12102
$$ 268909 486285 170949 -92627 120058 563732 646341 175534 -421725 -659535 -547433
38205e47433J04710r9827k01735j42092L978J95387L18417K09375k1249N456L55242
$$ -547433 -442723 -542550 -744285 -886377 -882399 -687012 -368595 -159220 -180469 -175013 180229
38194A80229N19243R0487n50403o70364j76906K87409K46042m4498o2884K57259
$$ 180229 699472 789959 239556 -430808 -607714 -320305 -74263 -118761 -181645 75614
38184G5614M95976L13603j26055l49061j72383J9559j96504n69074m18260L05304
$$ 75614 571590 885193 759138 410077 237694 257253 60749 -508325 -926585 -621281
38174f21281P65597M13036j37479l8083M11865K19193o14483r01563l1837R96867
$$ -621281 144316 557352 419873 381790 793655 1012848 398365 -503198 -535035 461832
38164D61832Q95984j96867j014266q25132j25423K30426J4860l45153l73284l5504
$$ 461832 1357816 1160949 146683 -678449 -803872 -573446 -558586 -903739 -1277023 -1312527
38154a312527K67594J90193r3836j08741K18902M21009K14757l0213J20412M54358
$$ -1312527 -1044933 -854740 -948576 -1057317 -838415 -417406 -202649 -232862 -112450 341908
38144C41908M40315M4393k71060k59063j25626p8662p2719l8783O89P8110K05920
$$ 341908 782223 826616 555556 296493 170867 92205 19486 -19297 -18608 59502 265422
38133B65422J70978k00623n72113l72325L39303P74978M30010k36572m58177j42272
$$ 265422 436400 235777 -336336 -708661 -369358 405620 835630 599058 140881 -1391
38123a391J96966K30061R8672K7833M6468Q2106N0265j30523l91489m60528j99263
$$ -1391 195575 425636 524308 552141 598609 680715 730980 600457 208968 -251560 -450823
38112d50823J13882J36581l810Q7536L78169L85390m3342l97275k22503K02047
$$ -450823 -336941 -200360 -204170 -116634 261535 646925 603583 206308 -16195 185852
38102A85852K88837j1161k24565j07421O8327J6076j69847k59755k24457j37812
$$ 185852 474689 463528 238963 131542 199869 215945 46098 -213657 -438114 -575926
38092e75926J8135K30492L23444K03340R8413K48109M23708J39919n77831j027455
$$ -575926 -557791 -327299 -3855 199485 297898 546007 969715 1109634 531803 -495652
38082d95652o86582O5892M62121L79638L53910N84332N49370j02433q11577p97143
$$ -495652 -1182234 -1116342 -654221 -274583 79327 663659 1213029 1110596 299019 -498124
38072d98124j80740K15478Q3893n2155J61234L09402j5489m31638l34808J32061
$$ -498124 -678864 -463386 -379493 -431648 -270414 38988 23499 -408139 -742947 -610886
38062f10886L23596J07145l6422J13830K12486L4853j41444q1974J2719l1288
$$ -610886 -287290 -180145 -216567 -102737 109749 144602 3158 -78816 -66097 -97385
38052i7385l096K04021K19475j71443m24636N4212Q27334Q32659j01827r01009
$$ -97385 -100481 103540 323015 151572 -273064 -218852 608482 1441141 1339314 438305
38042D38305o48398K65791P76343M55500k38804o94821o74428l01930P5299J20533
$$ 438305 -210093 55698 832041 1287541 1048737 353916 -320512 -622442 -547143 -426610
38032d26610j09978j62836J89865N64090N13878J82193j6098o7593j69585j37685
$$ -426610 -536588 -699424 -509559 54531 568409 750602 734504 666911 497326 359641
38022C59641K75925O31702K43557o00340q14105j42855L90915J20207k27934J26340
$$ 359641 635566 1267268 1510825 910485 96380 -46475 344440 464647 236713 363053
38012C63053O08016K86524m66649n92317j26270J7832k10842K4630P09196P65146
$$ 363053 971069 1257593 790944 198627 72357 90189 -120653 -96023 613173 1378319
38002A378319o4881o10365j71322L54026Q8306l45752o4431M30298J56337n75913
$$ 1378319 1313438 703073 531751 885777 974083 628331 563900 994198 1150535 574622
37992E74622o92037j56249J30910m9195n1474K98571M41638J96248P152M959j30329
$$ 574622 -117415 -273664 -142754 -191949 -243423 55148 496786 693034 700186 705145 574816
37981E74816l06914r8655K41360P70o03866n14047L71718Q03267J55466m86184
$$ 574816 267902 169247 410607 411377 -192489 -706536 -334818 468449 623915 137731
37971A37731o8295P32686O53572j68790n84160k76838N084j37521k31547R8770
$$ 137731 69436 802122 1455694 1286904 702744 425906 430990 293469 61922 160692
37961A60692N04702M85091L5936m56740o40029m37842q4735J10906J38578K39163
$$ 160692 665394 1150485 1186421 729681 89652 -348190 -432925 -322019 -183441 55722
37951E5722M28701M26554J75412k9993j08519l34660o73921o28455j14621J99484
$$ 55722 484423 910977 1086389 1056396 947877 613217 -60704 -689159 -803780 -604296
37941f04296p1890l62765j28138K23511J24159r5736J53892N82211N05606M5220
$$ -604296 -676186 -1038951 -1167089 -943578 -819419 -915155 -761263 -179052 326554 371774
37931C71774j69306j25669k20828k63995J76534O68888L79918m49026p25434k31257
$$ 371774 202468 76799 -144029 -408024 -231490 437398 817316 368290 -357144 -588401
37921e88401J33386k2108j3226N02323P94921L17957l74668n93939m74740l51931
$$ -588401 -455015 -477123 -490349 11974 806895 1124852 750184 156245 -318495 -670426
37911f70426n9123M68596O87164K69954k26617k15707K5423j0292j51852p943
$$ -670426 -729549 -260953 426211 696165 469548 253841 279264 268972 117120 109177
37901A09177K23120J58902k7752o619L2345j60048k22830K00339N96525K56672
$$ 109177 332297 491199 463447 456828 489173 329125 106295 306634 903159 1159831
37891A159831m80160o33200r7467K23197j53564o36273n54982n6459L06196L23195
$$ 1159831 679671 46471 -50996 172201 18637 -617636 -1172618 -1229077 -922881 -599686
37881e99686J66109N6838J05735K19947J36655j87895l50910n9743K79315J07851
$$ -599686 -433577 -376739 -271004 -51057 85598 -102297 -453207 -512950 -233635 -125784
37871a25784k98199j50123N26503P59554J02686o08450n01464N0672J32570k42980
$$ -125784 -423983 -574106 -47603 711951 814637 206187 -295277 -244605 -112035 -355015
37861c55015k75716K16931M91442J20929k94796j00000L56398K71579l30509o01988
$$ -355015 -630731 -413800 77642 198571 -96225 -196225 160173 431752 101243 -500745
37851e00745j44401M09783L53432j08983k91652p2620P7763m8061j40216j0678
$$ -500745 -645146 -235363 118069 9086 -282566 -355186 -277423 -325484 -465700 -476378
37841d76378J07219Q2591J68468M60576N55219J50609l95997n60527l75773j79516
$$ -476378 -369159 -286568 -118100 342476 897695 1048304 652307 91780 -283993 -463509
37831d63509L9691M29207O39377J74778o33950q16330j43159M30908J35104m66676
$$ -463509 -423818 5389 644766 819544 185594 -630736 -773895 -342987 -207883 -674559
37821f74559l53957L70840O25657k7168p38938o03344J26192N12565K30059j68603
$$ -674559 -1028516 -657676 -32019 -59187 -798125 -1401469 -1275277 -762712 -532653 -701256
37811g01256j41643K04301M36361L60170R2012j65390k34307m2836K32527K75188
$$ -701256 -842899 -638598 -202237 157933 249945 84555 -149752 -192588 39939 315127
37801C15127N4653l9759K68916O38279M68207k62094q61959p40127r5904L64533
$$ 315127 369780 330021 598937 1237216 1705423 1443329 581370 -158757 -254661 109872
37791A09872K45437j93374m54829l75325j76799m5488J02975L18255L29005p0725
$$ 109872 355309 161935 -292894 -668219 -845018 -890506 -787531 -469276 -140271 -210996
37781b10996m71998k34976M87566P37999Q7754o39278n16959J70723N01191L31483
$$ -210996 -682994 -917970 -430404 307595 395349 -243929 -760888 -590165 -88974 242509
37771B42509K16267K14896j18054o12517n28660R0548K82240k29081m53173K09713
$$ 242509 458776 673672 555618 -56899 -585559 -495011 -212771 -441852 -895025 -685312
37761f85312Q49813M81004l60052n47982j58700p9080l36106j73171M15391N81443
$$ -685312 164501 645505 285453 -262529 -421229 -500309 -836415 -1009586 -594195 -12752
37751a2752J23778j60547J13089L05082k3187l17498o5260K61468L5408m29618
$$ -12752 111026 -49521 63568 368650 345463 27965 -37295 224173 259581 -170037
37741a70037m21000j1397J12148k33899n18476l33128J56579N87297P30879M55937
$$ -170037 -591037 -602434 -490286 -724185 -1242661 -1575789 -1419210 -831913 -101034 354903
37731C54903j70945o95956o23654o1995L45979K59892N0796J75777M78132M46216
$$ 354903 183958 -511998 -1135652 -1197647 -851668 -591776 -540980 -365203 112929 559145
37721E59145l147l76034k59721J56672L60149J54362j61636k29418p9321l6840
$$ 559145 555998 179964 -79757 76915 437064 591426 429790 200372 121051 84211
37711H4211k37969m00732j85151L03662N63404K89007k54275n64303m50908q8463
$$ 84211 -153758 -554490 -739641 -435979 127425 416432 162157 -402146 -853054 -941517
37701i41517L08117N88491N72887K19841j43775j56670J0590j02909m04925k95556
$$ -941517 -633400 -44909 527978 747819 604044 447374 457964 355055 -49870 -345426
37691c45426K34777L40890l31319q25223k46441O90028O24236l14931o70296Q3513
$$ -345426 -110649 230241 -101078 -926301 -1172742 -482714 141522 -173409 -843705 -760192
37681g60192Q22930O25563K2761j86765j92006m17743n17598j08139K67951j8845
$$ -760192 62738 688301 711062 524297 332291 -85452 -603050 -711189 -443238 -462083
37671d62083m64583j64843O27743Q22430J88065l72276k73917J7617q3259m25064
$$ -462083 -926666 -1091509 -463766 358664 546729 174453 -99464 -81847 -165106 -590170
37661e90170n02571j54454L63877O57404M80139L4168j43817Q9085J82288k11251
$$ -590170 -1092741 -1247195 -883318 -225914 254225 288393 144576 233661 415949 204698
37651B04698m85518K0333P63547O46836k47592p09152k60845J99362m0300m21529
$$ 204698 -280820 -260487 503060 1149896 902304 193152 -67693 131669 91369 -330160
37641c30160k13322K37710J81497k47825l06609J24884L93008Q0109m54559o07360
$$ -330160 -543482 -305772 -124275 -372100 -678709 -553825 -160817 -80708 -535267 -1142627
37631a142627k17862L44855N77646L17651q9499j67457J34420M33574M42274K28952
$$ -1142627 -1360489 -1015634 -437988 -120337 -209836 -377293 -242873 190701 632975 861927
37621H61927m9496l26661m78467l68512j45837j31143k96816k55768R7207L72663
$$ 861927 812431 485770 7303 -361209 -507046 -638189 -935005 -1190773 -1093566 -720903
37611g20903L23803K50059M47493O38425L63443k81395p02045n35119l3678K78465
$$ -720903 -397100 -147041 300452 938877 1302320 1020925 318880 -216239 -249917 28548
37601B8548J68374j31123k59889j64484m6988Q7200M48875Q61266O68826k64698
$$ 28548 196922 65799 -194090 -358574 -405562 -318362 130513 991779 1660605 1395907
37591A395907r73174n71161L47725M71972k57980o03144k8957N09004K10703l30132
$$ 1395907 422733 -148428 199297 671269 413289 -189855 -218812 290192 500895 170763
37581A70763k63442J35629J35681j54516j39976J40663K09830R5808J76639L46008
$$ 170763 -92679 42950 178631 24115 -115861 24802 234632 330440 507079 853087
37571H53087J94182j66536k69608j45853k17395m35255l15615J66259M66971L28777
$$ 853087 1047269 880733 611125 465272 247877 -187378 -502993 -336734 130237 459014
37561D59014O9162o9069k15666l97007l63389o4030K15197L24596L80483L43368
$$ 459014 528176 459107 243441 -153566 -516955 -580985 -365788 -41192 339291 682659
37551F82659J6519m11723m25780j0900J68716k39190o48822l67547L72504P69499
$$ 682659 699178 287455 -138325 -149225 19491 -219699 -868521 -1236068 -863564 -94065
37541i4065N73997K66123J97379J36027j98206n94280o29934k62730J38058K64154
$$ -94065 479932 746055 943434 1079461 881255 286975 -342959 -605689 -467631 -203477
37531b03477J45686j8427r3230l4004J26570K38282J58207J409L8765K10899P0132
$$ -203477 -57791 -76218 -169448 -203452 -76882 161400 319607 321016 359781 570680 640812
37520F40812m91873q11389k91062N51937O07722k40777q47795l90097N19084P86356
$$ 640812 148939 -662450 -953512 -401575 206147 -34630 -882425 -1272522 -753438 32918
37510C2918K99116k03812k93861j77941q2057J2093N5364q4999k82192k13195
$$ 32918 332034 128222 -165639 -343580 -425637 -413544 -358180 -443179 -725371 -938566
37500i38566J71393N35793N34264J10669m67310p01186k40245N66244Q12992J28141
$$ -938566 -767173 -231380 302884 413553 -53757 -754943 -995188 -428944 384048 512189
37490E12189o92410o51684J05470N41712J85038l52855l67715O3088M02400L65530
$$ 512189 -180221 -831905 -726435 -184723 315 -352540 -720255 -657167 -254767 110763
37480A10763O0508k51997l23059n8182L56651N94628M79522O1335m50172o82446
$$ 110763 171271 -80726 -403785 -461967 -105316 489312 968834 1030169 579997 -102449
37470a02449l12595M24560P54880L07514k80615k35473K11119K67598q2961j19132
$$ -102449 -415044 9516 764396 1071910 791295 555822 766941 1034539 951578 832446
37460H32446K76204L27213l11791q83548o78407r5112P1182j77816k48381K4757
$$ 832446 1108650 1435863 1124072 240524 -437883 -532995 -461813 -639629 -888010 -863253
37450h63253K39365J36101j03731k13595j10861J28825L03390K12546m7255j28235
$$ -863253 -623888 -487787 -591518 -805113 -915974 -787149 -483759 -271213 -318468 -446703
37440d46703L1212K7815l56934o71504l85076K95695O93360N87413L59484K68298
$$ -446703 -415491 -387676 -744610 -1416114 -1801190 -1505495 -812135 -224722 134762 403060
37430D03060J24829j93642l78998j23487L54825N21572J76993l29288n49124m39432
$$ 403060 527889 334247 -44751 -168238 186587 708159 885152 555864 6740 -432692
37420d32692l06149l14747k55583R1902N21696N82791J79957k63824l16838k657
$$ -432692 -738841 -1053588 -1309171 -1217269 -695573 -112782 67175 -196649 -513487 -516144
37410e16144L34167M37383L01402P6850o4639n3492L3324R8797J33072R0418j66963
$$ -516144 -181977 255406 556808 633658 569019 515527 548851 647648 780720 871138 704175
37399G04175n53606o00980n3014N19346L04585n29684q97231k82983N34174O46466
$$ 704175 150569 -450411 -503425 15921 320506 -209178 -1106409 -1389392 -855218 -208752
37389b08752K42473Q0404K72381L25619P2178j79378k63787k79336j97208M7889
$$ -208752 33721 114125 386506 712125 784303 604925 341138 61802 -135406 -87517
37379h7517J86628n5761l67898k45916J15687P7020l27269l81595P0403L12845
$$ -87517 99111 43350 -324548 -570464 -454777 -377757 -705026 -1086621 -1016218 -703373
37369g03373K1411j05971M17894Q55159L30141o70703r05140j87249M32880K71238
$$ -703373 -681962 -787933 -370039 485120 815261 144558 -760582 -947831 -514951 -243713
37359b43713j74610k19476L9447J54896J03994J27232J93407J11721n2191q8276
$$ -243713 -418323 -637799 -598352 -443456 -339462 -212230 -18823 92898 40707 -47569
37349d7569l6511j16567l27027m06216j91170J85660M66567N09290L67914K09425
$$ -47569 -84080 -200647 -527674 -933890 -1125060 -939400 -472833 36457 404371 613796
37339F13796J27483M1306j24657k10996j771L61997M58353J64686j86419l81471
$$ 613796 741279 782585 657928 446932 445161 807158 1265511 1430197 1243778 862307
37329H62307o21594r46024q44441J201R35511J009126K98633k15917j01015M2321
$$ 862307 240713 -705311 -1549752 -1548551 -613040 396086 694719 478802 377787 420108
37319D20108k33763m26237k7109M48838J97458n22546o71887K7426O75014M82684
$$ 420108 186345 -239892 -267001 181837 379295 -143251 -815138 -787712 -112698 369986
37309C69986k03327n01611j40405L81022N03769J54796k82947l41136Q0180N27820
$$ 369986 166659 -334952 -475357 -94335 409434 564230 281283 -59853 20327 548147
37299E48147M40964j38320n52166l52671J52024L81688K09539r4863l59159n20963
$$ 548147 989111 850791 298625 -54046 97978 479666 689205 594342 235183 -285780
37289b85780l57738K49054Q23309O61647j55366o65115k46168N20725O53822Q3917
$$ -285780 -643518 -394464 428845 1090492 935126 270011 23843 544568 1198390 1282307
37279A282307l89619k81401M9391Q5880j72547m07825m43745k88125k7297J29080
$$ 1282307 892688 611287 660678 746558 574011 166186 -277559 -565684 -592981 -463901
37269d63901j1944k71816k11297K06557M38786J34723k96966k92328L8080J84602
$$ -463901 -475845 -747661 -958958 -752401 -313615 -178892 -475858 -768186 -730106 -545504
37259e45504P6165N1932J52266Q5462j15571n1931L14818M92193K10334j82747
$$ -545504 -469339 -417407 -265141 -179679 -295250 -347181 -32363 459830 670164 487417
37249D87417l06264k26700j01636J40412M32157L83721r2150m05533o6661N00049
$$ 487417 181153 -45547 -147183 -6771 425386 809107 716957 311424 244763 744812
37239G44812N07635n0523m40189k91572l1888j10801l40417k70470J29643M55958
$$ 744812 1252447 1201924 761735 470163 438275 327474 -12943 -283413 -153770 302188
37229C02188L79811k1099l68227l33298M3105L60743K81936p0034k77113j79448
$$ 302188 681999 660900 292673 -40625 2480 363223 645159 575125 298012 118564
37219A18564n1601j46706k82976j12816K88014M12025J6108m39720l49454J71821
$$ 118564 66963 -79743 -362719 -475535 -187521 224504 240612 -199108 -548562 -376741
37209c76741L94937K869m45737l18263K34795N88396M66729L5732m88610q05348
$$ -376741 18196 21065 -424672 -742935 -508140 80256 546985 582717 94107 -711241
37199g11241m51341N48382J220776O77593n23204r78043l74241K26715J66721
$$ -711241 -1162582 -614200 606576 1284169 760965 -217078 -591319 -364604 -197883
37190a97883M0386L38588M78331k5956m81709j29817M78986L45645l32824n47817
$$ -197883 -157497 181091 659422 633466 151757 21940 500926 846571 513747 -34070
37180c4070j15944K29704J74578J36063K93684L19429J31434L6279N1936j14138
$$ -34070 -150014 79690 254268 390331 684015 1003444 1134878 1171157 1223093 1108955
37170A108955l67625k86231P1341J69689j24864l87064l95054l33477k20570J06730
$$ 1108955 741330 455099 526440 696129 571265 184201 -210853 -544330 -764900 -658170
37160f58170M04917K22966k40664l02178Q7614K52624k5676j53221J79020M56573
$$ -658170 -253253 -30287 -270951 -573129 -485515 -232891 -258567 -411788 -232768 223805
37150B23805K94959Q3405J93881L07706P1487k29989k10371l8887l9175j14869
$$ 223805 518764 602169 796050 1103756 1175243 945254 734883 695996 656821 541952
37140E41952n3856L0840j4110p3909r1315k43436m74260l73447J20348M37002
$$ 541952 488096 518936 504826 430917 339602 96166 -378094 -751541 -631193 -194191
37130a94191K00025j83946j79052J27688L31592K88191K5990l99925o41800k62114
$$ -194191 5834 -178112 -357164 -229476 102116 390307 416297 16372 -625428 -887542
37120h87542M44678N53131j33870o36985k75101L03214L24660K00134N78609R14710
$$ -887542 -442864 110267 -23603 -660588 -935689 -632475 -307815 -107681 470928 1385638
37110A385638L27059o51760o83806K18290O52730L5532o17287m84782j46320l13552
$$ 1385638 1712697 1060937 377131 595421 1248151 1283683 666396 181614 35294 -278258
37100b78258n19961l1609P33701P63876L0699m73497j84641L65886M44551M4131
$$ -278258 -798219 -829828 -96127 667749 698448 224951 40310 406196 850747 894878
37090H94878l30613l77518j82869P1868K66467K71482R316l40302m07087n8809
$$ 894878 564265 186747 3878 75746 342213 613695 623011 282709 -124378 -183187
37080a83187L67346M41961J56533j37984k05531q7640J09380K67652J75926k11935
$$ -183187 184159 626120 782653 644669 439138 351498 460878 728530 904456 692521
37070F92521m90913k56237J81744J34182l54815m68116Q4142N41368L23228l2050
$$ 692521 201608 -54629 127115 261297 -93518 -561634 -477492 63876 387104 355054
37060C55054J49468M84850K36807l40024m14831j8799N3364l24242m01772J04666
$$ 355054 504522 989372 1226179 886155 471324 452525 505889 181647 -220125 -115459
37050a15459N22944L66849K0875j06019k36131n36256n76535j01369L28782J67447
$$ -115459 407485 774334 795209 689190 453059 -83197 -659732 -761101 -432319 -264872
37040b64872j96653j09225K12736Q4964l85703m06177J66495N28564J90256k83663
$$ -264872 -461525 -570750 -358014 -273050 -658753 -1064930 -898435 -369871 -179615 -463278
37030d63278k01814K37474L88963J54351n1759m6657k0617p1184r2745n7493R059
$$ -463278 -665092 -427618 -38655 115696 63937 17280 -3337 -74521 -167266 -224759 -215700
37019b15700K18034N54971O08485J16816l81827j69032M50029M45607l26713q26811
$$ -215700 2334 557305 1165790 1282606 900779 731747 1181776 1627383 1300670 473859
37009D73859m86531p5139k63424m12319K00038Q74471N27223m13204o18629j2784
$$ 473859 -12672 -87811 -351235 -763554 -563516 310955 838178 424974 -193655 -206439
36999b06439K44165j69931k94316K59267N71561P3484m42882k03638L14784L47324
$$ -206439 37726 -132205 -426521 -167254 404307 477791 34909 -168729 146055 493379
36989D93379P1208L7904J57926N5164j84317k87785k67721j26611K76289O71616
$$ 493379 564587 602491 760417 815581 631264 343479 75758 -50853 225436 897052
36979H97052M71908j98398m77325j69385q4844m86205m96207K17719N83511l1918
$$ 897052 1368960 1170562 693237 523852 439008 -47197 -543404 -325685 257826 225908
36969B25908n36812K6956O97613K47163o04399m65182K66954K59427k43369J4352
$$ 225908 -310904 -283948 413665 660828 56429 -408753 -141799 117628 -125741 -111389
36959a11389P48003M99579o28823r73003j56741L65157l1468k08771L92787O90942
$$ -111389 636614 1136193 507370 -465633 -622374 -257217 -288685 -497456 -104669 586273
36949E86273J23371j96754L94765P40784m6532q31618l46495N91813M57025m81378
$$ 586273 709644 512890 907655 1648439 1601907 770289 423794 1015607 1472632 991254
36939I91254p71339j55269L31190J94101p9330j73320k47899k34076P9667L76260
$$ 991254 219915 64646 395836 589937 510607 337287 89388 -144688 -65021 311239
36929C11239J70986k98124l81622l2275K71665L60916L53330J14019m08060o13534
$$ 311239 482225 184101 -197521 -229796 41869 402785 756115 870134 462074 -151460
36919a51460K0403Q60805P82833j64412p78731m55678R1642J11094j23639M730
$$ -151460 -131057 729748 1512581 1348169 569438 113760 205402 316496 192857 197587
36909A97587M08599N05578R7688m30898o14459l14196K30544N68983L86450j71447
$$ 197587 606186 1111764 1209452 778554 164095 -150101 80443 649426 1035876 864429
36899H64429o08047n78090k03691J21404J42714m9227j45139N5241M16656O17191
$$ 864429 256382 -321708 -525399 -403995 -261281 -310508 -455647 -400406 16250 633441
36889F33441N24338L14462K02885J95399J53105j4072k53704l98651l35120k05339
$$ 633441 1157779 1472241 1675126 1870525 2023630 2009558 1755854 1357203 1022083 816744
36879H16744k65657m15518j87065M96777R38267N62281j31472k20538K50332L76653
$$ 816744 551087 135569 -51496 445281 1383548 1945829 1814357 1593819 1844151 2220804
36869B220804j59341o68675o20140l26469j83670n8010J86316K84488J05976n1721
$$ 2220804 2061463 1392788 772648 446179 262509 204499 390815 675303 781279 729558
36859G29558n2859j55924l49441j83327L76319O68751L19031k19809m66622m85348
$$ 729558 676699 520775 171334 -11993 364326 1033077 1352108 1132299 665677 180329
36849A80329l42344R4720M59307O4198p58396p34701K95394Q13425L9962o17426
$$ 180329 -162015 -67295 392012 456210 -302186 -1036887 -741493 71932 111894 -505532
36839e05532J07293J051570N20158p32563o71695N86455R59457j60322j059768
$$ -505532 -398239 653331 1173489 440926 -230769 355686 1315143 1154821 95053
36830I5053o00333K48994M05267K39382L01716J87628l32079m96772R1830N47758
$$ 95053 -505280 -256286 148981 388363 690079 877707 545628 48856 140686 688444
36820F88444J52269m03753k62882J70803J46418n2806J71301M59089J95809j83872
$$ 688444 840713 436960 174078 344881 491299 438493 609794 1068883 1264692 1080820
36810A080820R4052O19226L35642o51840j118115n41893K75052N29174L36106
$$ 1080820 1174872 1794098 2129740 1477900 359785 -182108 92944 622118 958224
36801I58224J18505m5696j61339q7640J28237J81568l9904l31380n24886n49046
$$ 958224 1076729 1031033 869694 782054 910291 1091859 1051955 720575 195689 -353357
36791c53357k30980M16071Q18418M40561k73368l38415L02162O06937J7466o59887
$$ -353357 -584337 -168266 650152 1090713 817345 478930 781092 1388029 1405495 745608
36781G45608m89447K06681M34055J7520l10018j14010K12778J89408p3930j54819
$$ 745608 256161 462842 896897 914417 604399 490389 703167 892575 818645 663826
36771F63826O1242K67035J32038k88653n57528l29304J99996N02463L78474J23593
$$ 663826 725068 992103 1124141 835488 277960 -51344 148652 651115 1029589 1153182
36761A153182k714p4201j28505J0343K61312J56067l98293p38941l90756J04547
$$ 1153182 1150468 1076267 947762 958105 1219417 1375484 977191 238250 -152506 -47959
36751d7959K0908l40632j84258L61057M40632k2795k03106J52526L41273J09179
$$ -47959 -27051 -367683 -551941 -190884 249748 226953 23847 176373 517646 626825
36741F26825J90760Q79052J251297O45100j36015r0161L83372K72315l59005o79024
$$ 626825 817585 1696637 2947934 3593034 3457019 3366858 3750230 4022545 3663540 2984516
36731B984516n82579o22785p57828m07522L46088P45510N39645J88394p0934l80827
$$ 2984516 2401937 1779152 1021324 613802 959890 1705400 2245045 2433439 2362505 1981678
36721A981678n39490j50293M79880N98323K13930N0454K54779K22729j82688l70280
$$ 1981678 1442188 1291895 1771775 2370098 2584028 2634482 2889261 3111990 2929302 2559022
36711B559022j92671k43591o61225p44341j87251L41913L25538J19292Q3739k5607
$$ 2559022 2366351 2122760 1461535 717194 529943 871856 1197394 1316686 1400425 1374818
36701A374818k96595k69078J34478K36946k44744o13874l71261l1784r6702j65096
$$ 1374818 1078223 809145 943623 1180569 935825 321951 -49310 -81094 -177796 -342892
36691c42892J75032M91023L64260K29119M81186N90849N6523n31365l89874J61830
$$ -342892 -167860 323163 687423 916542 1397728 1988577 2045100 1513735 1123861 1285691
36681A285691L18497J04105O4314J74892O1815j30634l5766J66655J26110L3939
$$ 1285691 1604188 1708293 1772607 1947499 2009314 1878680 1842914 2009569 2135679 2169618
36671B169618J60851J88219j79662m91101k93536r101j51324l11180M9017M37560
$$ 2169618 2330469 2518688 2339026 1847925 1554389 1545288 1393964 1082784 1131801 1569361
36661A569361J44730l58506j39467N01952M49036l34849p07852j65091M97725
$$ 1569361 1714091 1355585 1216118 1718070 2167106 1832257 1124405 959314 1457039
36652A457039N18480J23532j07951k9625J65347K74832K10633J12282J99244L08828
$$ 1457039 1975519 2099051 1991100 1961475 2126822 2401654 2612287 2724569 2923813 3232641
36642C232641M5561l78910k28780M51064O21816n8394n02697p152M80609N0972
$$ 3232641 3278202 2899292 2670512 3121576 3743392 3684998 3182301 3175149 3655758 3706730
36632C706730m93352r5254O09319M69324r2542K6013N29868M42261R4542M20173
$$ 3706730 3213378 3118124 3727443 4196767 4104225 4130238 4660106 5102367 5196909 5617082
36622E617082R71922O92788K6578J42939O50910L04544n29539m15680N71402J139529
$$ 5617082 6589004 7281792 7308370 7451309 8102219 8406763 7877224 7461544 8032946 9172475
36612I172475J216710J679369K107838J428403M29877R10923K605842L717612
$$ 9172475 10389185 12068554 14176392 15604795 16034672 16945595 19551437 23269049
36604B3269049M109772N008380O070619O104853O158847Q143908J0998684J2519292
$$ 23269049 27378821 32387201 38457820 44562673 50721520 58865428 69864112 82383404
36596H2383404J4273312J9492888K6870618L3146215M1214338N5714097O7894764
$$ 82383404 96656716 116149604 143020222 176166437 217380775 273094872 340989636
36589C40989636N6745368J4335629l7586440o7249658o5558290m9625788l7276447
$$ 340989636 397735004 412070633 374484193 307234535 241676245 192050457 154774010
36582A54774010l0277265k3240221j6299720j2662323j1335047r207824o518888
$$ 154774010 124496745 101256524 84956804 72294481 60959434 51751610 45232722
36575D5232722n247527m880375l786747k541247k494451k917428k435931j627414
$$ 45232722 39985195 35104820 31318073 28776826 26282375 23364947 20929016 19301602
36567A9301602j692855k104591j808010j278904j348285j423436p83403k23828
$$ 19301602 17608747 15504156 13696146 12417242 11068957 9645521 8862118 8638290
36559H638290n74468r62822l59538M70811L41281k93376l90813k34150n43737
$$ 8638290 8063822 7101000 6741462 7212273 7553554 7260178 6869365 6635215 6091478
36550F091478q11323k88511L74079K01187l20659j89874K87728K78487J25961
$$ 6091478 5280155 4991644 5365723 5566910 5246251 5056377 5344105 5622592 5748553
36541E748553N61366J033138O07366j51981m758Q10107J028533N62226M86794
$$ 5748553 6309919 7343057 7950423 7798442 7793684 8603791 9632324 10194550 10681344
36532A0681344J082293J564542J654141J855801K210345K196177J860429J724149
$$ 10681344 11763637 13328179 14982320 16838121 19048466 21244643 23105072 24829221
36524B4829221J595774P71630n92831j561277j877386k156594k611667k763454
$$ 24829221 26424995 27196625 26603794 25042517 23165131 21008537 18396870 15633416
36516A5633416k469165k124814j808271j288433q51763r90770j309413r52607
$$ 15633416 13164251 11039437 9231166 7942733 7090970 6100200 4790787 3838180
36508C838180j39966K8868n74903q21266j95620L93303J98561k22654j47497J12127
$$ 3838180 3698214 3727082 3152179 2330913 2135293 2528596 2727157 2504503 2357006 2469133
36498B469133k9885l29419k39994O2016M788l98781n75492j96303M79754Q93488
$$ 2469133 2439248 2109829 1869835 1931851 1936639 1537858 962366 766063 1245817 2139305
36488B139305O15291k28247q74101o77633L1633L77096J71148j4582l594k40805
$$ 2139305 2754596 2526349 1652248 974615 1006248 1383344 1554492 1539910 1536316 1295511
36478A295511o48069l96799O18943J165906L68554q71050j135092m43362J48828
$$ 1295511 647442 250643 869586 2035492 2404046 1532996 397904 -45458 103370
36469A03370L15926N57053Q38327M94826m29616r30683m58945L30239O00792L41491
$$ 103370 419296 976349 1814676 2309502 1879886 949203 490258 820497 1421289 1762780
36459A762780j4868k81628m08304k61397N2875J16551j68417l23944m1523K76013
$$ 1762780 1747912 1466284 1057980 796583 849458 966009 797592 473648 432125 708138
36449G08138J53979j89250k20506Q1354K93834K29956P1370k0509p581J58126
$$ 708138 862117 672867 452361 533715 827549 1057505 1128875 1108366 1100785 1258911
36439A258911L90043L73669O12l31194k76202j24946k95304n19377k40660L38323
$$ 1258911 1648954 2022623 2023235 1692041 1415839 1290893 995589 476212 235552 573875
36429E73875M22638j35060n83668m39175j07530m3915n2248J40665K94881J80928
$$ 573875 996513 861453 277785 -161390 -268920 -312835 -365083 -224418 70463 251391
36419B51391J12372L51586M76395J6450o45007p18734j47017L73095L94296J42284
$$ 251391 363763 715349 1191744 1208194 563187 -155547 -302564 70531 464827 607111
36409F07111k2896k2955Q5160K25380K37184M1773j43349o1271J84033K82205
$$ 607111 584215 561260 646420 871800 1108984 1150757 1007408 946137 1130170 1412375
36399A412375J59681l5937k48472m74854n54818l39688M4567L76581N98807O57070
$$ 1412375 1572056 1536119 1287647 812793 257975 -81713 -37146 339435 938242 1595312
36389A595312L98093m9594j84664J40305L19146j26281o79490n38960J41469N09225
$$ 1595312 1993405 1943811 1759147 1899452 2218598 2092317 1412827 873867 1015336 1524561
36379A524561K86136l0812j10452j15540j45676j27268k23506o04202q73221n19191
$$ 1524561 1810697 1779885 1669433 1553893 1408217 1280949 1057443 453241 -419980 -939171
36369i39171J35435L02782k683k6731L68904M70653J3549l47087j96315L772j44907
$$ -939171 -803736 -500954 -503637 -530368 -161464 309189 322738 -24349 -220664 -216892 -361799
36358c61799l19147k12014o3898l232K76257O98852N73120k38799p98994m36488
$$ -361799 -680946 -892960 -956858 -960090 -683833 15019 588139 349340 -449654 -886142
36348h86142J95114J78824k69752l34011M9152K72204J29400j2079Q7257K98028
$$ -886142 -691028 -512204 -781956 -1115967 -1066815 -794611 -665211 -677290 -590033 -292005
36338b92005M28293L43650J17l61744l86842j45095k6098j2083K34365M69076
$$ -292005 136288 479938 480055 118311 -268531 -413626 -439724 -451807 -217442 251634
36328B51634M9929p19592o39527M57508J116456M20856n37701m47396J73334R0216
$$ 251634 301563 -418029 -1057556 -600048 516408 937264 399563 -47833 125501 215717
36318B15717m98572n15808K4454K35261M8864R6672K61137p7354n99700m13858
$$ 215717 -282855 -798663 -774209 -538948 -490084 -393412 -132275 -209629 -809329 -1223187
36308a223187K96937N20601J87811J34758L76017Q7920o13631o18537J80143N45441
$$ -1223187 -926250 -405649 -217838 -83080 292937 380857 -232774 -851311 -671168 -125727
36298a25727j1119m63501j66088J32465r4198j23145M93654Q65780L24945k87829
$$ -125727 -136846 -600347 -766435 -633970 -728168 -851313 -357659 508121 833066 545237
36288E45237j09815J82398l37816j041655p53056K07263N71325K31811K15822
$$ 545237 435422 617820 280004 -761651 -1514707 -1307444 -736119 -504308 -288486
36279b88486P41875Q31639K3744q12014p72030r2182M05201L65123N166l62486
$$ -288486 453389 1285028 1308772 496758 -275272 -367454 37747 402870 408036 45550
36269D5550n51297m85437k07125J52024M30435M70651K62463P6237J70868L44519
$$ 45550 -505747 -991184 -1198309 -1046285 -615850 -145199 117264 193501 364369 708888
36259G08888J94101j37699p7728L57342M06733k00455o45537k43690M51247N18727
$$ 708888 902989 765290 687562 1044904 1451637 1251182 605645 361955 813202 1331929
36249A331929N2852j79281k836J35565Q6096O9663M8959j64824l61571k47829
$$ 1331929 1384781 1205500 1202664 1338229 1424325 1493988 1542947 1378123 1016552 768723
36239G68723r2559k76015m53978o3932N54306N53598j3300k69309k1407l1458
$$ 768723 676164 400149 -53829 -117761 436545 990143 976843 707534 686127 654669
36229F54669n52462p74598k24045L48467J79385k73728j45989M18498N62798O9341
$$ 654669 102207 -672391 -896436 -547969 -368584 -642312 -788301 -369803 192995 262336
36219B62336m23694m21710r2984K04342L62132M03780L06544O6083k28481m13535
$$ 262336 -161358 -583068 -676052 -471710 -109578 294202 600746 666829 438348 24813
36209B4813l20611K3905K51364K611m79988n06168J04921O50358M81176p9873
$$ 24813 -295798 -271893 -20529 -17918 -497906 -1004074 -899153 -248795 232381 152508
36199A52508k52789N5135K23398o2531l81873k80626R2608K89678J73354l9298
$$ 152508 -100281 -45146 178252 115721 -266152 -546778 -454170 -164492 8862 -30436
36189c0436j60248k12196k77161l30986k71876o9943J62323K95430L47276M10641
$$ -30436 -190684 -402880 -680041 -1011027 -1282903 -1352846 -1190523 -895093 -547817 -137176
36179a37176M31102K53033o3994k28556j52447j18336k80627l03274J25876O67771
$$ -137176 293926 546959 482965 254409 101962 -16374 -297001 -600275 -474399 193372
36169A93372P27349L41890Q6770J14847k6424m53753n58151J2026O09538M65889
$$ 193372 920721 1262611 1349381 1464228 1437804 984051 425900 437926 1047464 1513353
36159A513353j43320l56417n8287Q1936j95176l95788k38588r7835j81386r0961
$$ 1513353 1370033 1013616 955329 1037265 842089 446301 207713 109878 -71508 -162469
36149a62469L17613M03548k39271q60706n26293M00024P18146J59351l22090r5820
$$ -162469 155144 558692 319421 -541285 -1067578 -667554 50592 209943 -112147 -207967
36139b07967K94365J66588k51659l47180q7815J26413J82477K59997L56019K95831
$$ -207967 86398 252986 1327 -345853 -433668 -307255 -124778 135219 491238 787069
36129G87069R2299p7927j53440j72781j29053o6973j16831k11774o2707L06279
$$ 787069 879368 801441 648001 475220 346167 279194 162363 -49411 -112118 194161
36119A94161L67001j35350n64906j76094O83524Q86119Q4205p62295o99966j7993
$$ 194161 561162 425812 -139094 -315188 368336 1254455 1338660 576365 -123601 -141594
36109a41594L11893L4687j77081J54593N78986L84565l41844p73446m40368J59832
$$ -141594 170299 204986 27905 182498 761484 1146049 804205 30759 -409609 -249777
36099b49777K79826p0040k53021L368K79743J95294n9823j62260j67869k32018
$$ -249777 30049 -39991 -293012 -289644 -9901 185393 125570 -36690 -204559 -436577
36089d36577j91057J37277M87684M34236K709l87413m68449k77029P1386M00030
$$ -436577 -627634 -490357 -2673 431563 434272 46859 -421590 -698619 -627233 -227203
36079b27203M37885J53239n8206Q5504K52129J5873l68980l34480L3424J19660
$$ -227203 210682 363921 305715 391219 643348 659221 290241 -44239 -10815 108845
36069A08845j75964k99853l6825J57001M0922K4347L37808M93992J00444l84584
$$ 108845 -67119 -366972 -403797 -246796 -205874 -181527 156281 650273 750717 366133
36059C66133l16293J57043L89560J89897j03274k46977k40343m7235K88705M13935
$$ 366133 49840 206883 596443 786340 683066 436089 195746 148511 437216 851151
36049H51151P8269l57553l61831n8338j8935k83896k64667K52771O66074M34220
$$ 851151 929420 571867 210036 151698 132763 -151133 -415800 -163029 503045 937265
36039I37265j29678l71876k22603j00781j17744M1680M17937N03154l6086p06803
$$ 937265 807587 435711 213108 112327 -5417 36263 454200 957354 921268 214465
36029B14465p03567J0480N82370L51160l35036o61732l99404J0788K39022L92917
$$ 214465 -489102 -478622 103748 454908 119872 -541860 -941264 -930476 -691454 -298537
36019b98537N47797N06754K34274N7720J30977R5488l38408p95131o88854q3533
$$ -298537 249260 756014 990288 1048008 1178985 1274473 936065 140934 -547920 -631453
36009f31453L86838L83904J84193J07615P4674r7443k91922k50812R866J78665
$$ -631453 -244615 139289 323482 431097 505771 408328 116406 -134406 -124540 54125
35999E4125M2548k37528l21735j17662J13724J34063M9474O9092R1042j27971
$$ 54125 96673 -140855 -462590 -580252 -466528 -332465 -282991 -213899 -122857 -250828
35989b50828m35332l59612J56651N38056L34244j69728l88900j65354K37078N51189
$$ -250828 -686160 -1045772 -889121 -351065 -16821 -186549 -575449 -740803 -503725 47464
35979D7464N98312K78973j71400k38377J63966L85728p7031p32719p30369r0014
$$ 47464 645776 924749 753349 514972 678938 1064666 987635 254916 -475453 -565467
35969e65467L88747L11353O1915n12j1848j34471k19608j37643N668J15060J82593
$$ -565467 -176720 134633 196548 196036 184188 49717 -169891 -307534 -301866 -186806 -4213
35958d213J01582j70608l22798p7834K27898R7439j85886J00617Q00456Q75198
$$ -4213 97369 -73239 -396037 -473871 -245973 -148534 -334420 -233803 566653 1441851
35948A441851k223q29015p38411j80145J8404m5625J81828N71403N56423J27615
$$ 1441851 1439628 610613 -127798 -307943 -289539 -335164 -153336 418067 974490 1102105
35938A102105k51902m29966n17507l75029P9321L51094q510n14689l70464K25139
$$ 1102105 850203 420237 -97270 -472299 -392978 -41884 -50394 -565083 -935547 -710408
35928g10408L67294n7828k41608J08909L24877N8238q8701K68875N06030Q8843
$$ -710408 -343114 -400942 -642550 -533641 -208764 -150526 -239227 29648 535678 624521
35918F24521l71876o1335O49786P25441J5436o52753p45804m87890j19520L89982
$$ 624521 252645 191310 841096 1566537 1581973 929220 183416 -304474 -423994 -34012
35908c4012P68092M61287m19086q98886l72779N10136P18609J76008l52180m04839
$$ -34012 734080 1195367 776281 -122605 -495384 14752 733361 909369 557189 152350
35898A52350k12247n9463Q2706K08782J12151k26902m88406m50483k48263l5093
$$ 152350 -59897 -119360 -36654 172128 284279 57377 -431029 -881512 -1129775 -1164868
35888a164868K36539M79602L38226k49524p00176m54443K26044N97910M12338
$$ -1164868 -928329 -448727 -110501 -360025 -1060201 -1514644 -1288600 -690690 -278352
35879b78352O8371j00981j65307k19849j82427n9721N461L3385J68307L11390
$$ -278352 -209981 -310962 -476269 -696118 -878545 -938266 -932805 -899420 -731113 -419723
35869d19723K19334j6137p1882J6381n5254j56617J51951O51707N07902l39259
$$ -419723 -200389 -216526 -288408 -272027 -327281 -483898 -331947 319760 827662 488403
35859D88403p57683o7102P54129M54831n53258q17784n7305N21928J47750m74383
$$ 488403 -269280 -336382 417747 872578 319320 -498464 -555769 -33841 113909 -360474
35849c60474m02477K07842N60681L72506O294j75934j49036j07823k60011n69925
$$ -360474 -762951 -555109 5572 378078 384372 208438 59402 -48421 -308432 -878357
35839h78357o52592k07176M44964O66395L80815J43577K30868K43394j13194m22927
$$ -878357 -1530949 -1738125 -1293161 -626766 -245951 -102374 128494 371888 258694 -164233
35829a64233j89989L33807M77493Q8220l40085l82637j26430R0796P3041j32357
$$ -164233 -354222 -20415 457078 545298 205213 -177424 -303854 -213058 -140017 -272374
35819b72374l13879k58538J8027K25215J20641j49922j93972J25975M71791M04742
$$ -272374 -586253 -844791 -826764 -601549 -480908 -630830 -824802 -698827 -227036 177706
35809A77706p6734n01315m66901r3147K00484K52949K42343K56432J49225q1101
$$ 177706 100972 -400343 -867244 -960391 -759907 -506958 -264615 -8183 141042 59941
35799E9941j57332K6519J77053Q3586l0023N1230J17489m0619j66217J6738K38467
$$ 59941 -97391 -70872 106181 189767 159744 210974 328463 287844 121627 138365 376832
35788C76832J30051q1796K7393K60001J12012k80747l18879J6067J27256j53152
$$ 376832 506883 425087 452480 712481 824493 543746 224867 240934 368190 215038
35778B15038l10564p5188J78848J69720J20083J83479J24685j45824l00016j17649
$$ 215038 -95526 -170714 8134 177854 297937 481416 606101 460277 160261 42612
35768D2612K03249M07904L81800r09o27997q52431k33994N24243L67719m19877
$$ 42612 245861 653765 1035565 1034656 406659 -445772 -679766 -155523 212196 -207681
35758b07681n24761K74457P00277J10628m47512q3560M46471J57901m69746m64093
$$ -207681 -732442 -457985 242292 352920 -94592 -178152 268319 426220 -43526 -507619
35748e07619k9714P5294O354L02559N75742J56021m87933m23509O4061m9213o45736
$$ -507619 -537333 -462039 -455685 -153126 422616 578637 90704 -332805 -268744 -317957 -963693
35737i63693o05589K49256Q54991O57021K57339J07974r8637m26448l62193R9955
$$ -963693 -1569282 -1320026 -465035 191986 449325 557299 458662 32214 -329979 -230024
35727b30024K13833k18702m19322j3455K66955j00858m55651r9404M61852L56876
$$ -230024 -16191 -234893 -654215 -667670 -400715 -501573 -957224 -1056628 -594776 -237900
35717b37900k16963l69497O3815M02394K69243N5681J65768L90004K68733k05730
$$ -237900 -454863 -824360 -760545 -358151 -88908 -33227 132541 522545 791278 585548
35707E85548n00041j74854M98551P73874L58563k10599l60209k45297k79303l30286
$$ 585548 85507 -89347 409204 1183078 1541641 1331042 970833 725536 446233 115947
35697A15947o8766K23139M5823l23695j91785K91091K95442k12158l26238K08288
$$ 115947 47181 270320 316143 -7552 -199337 91754 387196 175038 -151200 57088
35687E7088M71410o2130n76343k72933L23171L15714j14768k04956N8322J19931
$$ 57088 528498 466368 -109975 -382908 -59737 255977 141209 -63747 -5425 114506
35677A14506m3524M74K12547J56532j19318j22343J88678L06801K4509k85132
$$ 114506 70982 71456 284003 440535 321217 198874 387552 694353 718862 433730
35667D33730l25776k37857j85399r1837O3312J09416O106l8912Q7613K27389K36871
$$ 433730 107954 -129903 -315302 -407139 -343827 -234411 -228305 -267217 -179604 47785 284656
35656B84656K00988K31484K50851J22259j19309k87072k59864j18456n1650j23930
$$ 284656 485644 717128 967979 1090238 970929 683857 423993 305537 253887 129957
35646A29957j74711k1616K61772L95977K47860J4147j4749J81821K92920K4440
$$ 129957 -44754 -66370 195402 591379 839239 853386 838637 1020458 1313378 1337818
35636A337818m66627o18729j53171M09742L33446k59072m86568m1896L13288r58
$$ 1337818 871191 252462 99291 509033 842479 583407 96839 54943 368231 367273
35626C67273m19718k19168K47081K32804o5672J9567K59132q4885p37124o69276
$$ 367273 -52445 -271613 -24532 208272 142600 162167 421299 336414 -400710 -1069986
35616a069986J22181N08667Q4391k69417j7812K18730P089p5751L58049O89466
$$ -1069986 -947805 -439138 -354747 -624164 -641976 -423246 -416157 -491908 -133859 555607
35606E55607M22091L1874m9434k03402o06668n86554J04618M88716j31137q92359
$$ 555607 977698 1009572 960138 756736 150068 -436486 -331868 156848 25711 -866648
35596h66648p03978J02863N89764P19870Q26160N23669m52498j160268o97018
$$ -866648 -1570626 -1467763 -877999 -158129 668031 1191700 739202 -421066 -1118084
35587a118084J85087K45904j54922J61971R14037P80313j76629n02061J86430
$$ -1118084 -932997 -687093 -842015 -680044 233993 1014306 837677 335616 522046
35578E22046O21224P2112o18931o41207l00203J100M18406P66158L54190o54729
$$ 522046 1143270 1215382 596451 -44756 -344959 -343859 74547 840705 1194895 540166
35568E40166j028348k86004M80744L19312k32694l01069n5885k1894o80L12519
$$ 540166 -488182 -774186 -293442 25870 -206824 -507893 -563778 -585672 -586352 -273833
35558b73833M56555r732m96151j94774N59961P35099J13881n18142n50931j68457
$$ -273833 182722 172990 -323161 -517935 42026 777125 891006 372864 -178067 -346524
35548c46524J59741K27544J23331P3052K14617L61768J90214k39750m88968l73986
$$ -346524 -186783 40761 164092 237144 451761 813529 1003743 763993 275025 -98961
35538i8961j57303J1877K99374O47665O48853K29763j39851k19160l34874o14663
$$ -98961 -256264 -244387 54987 702652 1351505 1581268 1441417 1222257 887383 272720
35528B72720o01330j04745K64007J0690m12638l68500p0822j03426l43030j93494
$$ 272720 -328610 -433355 -169348 -158658 -571296 -939796 -1010618 -1114044 -1457074 -1650568
35518a650568L52163O71071M47256k749l11216m16434l41080q4790K13655L38824
$$ -1650568 -1298405 -627334 -180078 -182827 -494043 -910477 -1251557 -1336347 -1122692 -783868
35508g83868K50478Q2652k5021L5337K65203L90791Q3383m70776o21647j54898
$$ -783868 -533390 -450738 -475759 -440422 -175219 215572 298955 -171821 -793468 -948366
35498i48366K91250J04004m06048m84294j4352M24109M17477J27494j04085j31701
$$ -948366 -657116 -553112 -959160 -1443454 -1457806 -1033697 -616220 -488726 -592811 -724512
35488g24512J7395K16834K70227R0054j52996k00495J0846L03543M11040J84663
$$ -724512 -707117 -490283 -220056 -130002 -282998 -483493 -472647 -169104 241936 426599
35478D26599j85619k32749K13955O10469K99206m94654q30519l28956L08839L06527
$$ 426599 240980 8231 222186 832655 1131861 637207 -193312 -522268 -213429 93098
35468I3098j97966n05407k73729K54958O38645O03674K73433R9187K67702L06135
$$ 93098 -104868 -610275 -884004 -629046 9599 613273 886706 985893 1253595 1559730
35458A559730k08289p55893n13679K21686L22966l48258o41166j7637N24738J11539
$$ 1559730 1351441 595548 81869 303555 626521 278263 -362903 -380540 144198 255737
35448B55737o17390o71272k19584O5894K43163N71777N90362p7280o97278m42712
$$ 255737 -361653 -1032925 -1252509 -1186615 -943452 -371675 218687 141407 -555871 -998583
35438i98583J73690J46169l06070k17998L84915O56005N05897N49849O84874K25870
$$ -998583 -824893 -678724 -984794 -1202792 -817877 -161872 344025 893874 1578748 1804618
35428A804618n88503p34491j51725J09499k96907m95121l8589L19633K8221l53350
$$ 1804618 1216115 481624 329899 439398 142491 -352630 -391219 -71586 -43365 -396715
35418c96715k60444l1776q8435j92101j10393r3158j49144J94886Q65075R78972
$$ -396715 -657159 -688935 -777370 -969471 -1079864 -1173022 -1322166 -1127280 -262205 716767
35408G16767K49244l62798j34527K78379O0624l65922k23643J53917m9787o00996
$$ 716767 966011 603213 468686 747065 807689 441767 218124 372041 322254 -278742
35398b78742n61464J35714O27897N16786K54954J47691m0015l51129l85815l0271
$$ -278742 -840206 -704492 -76595 440191 695145 842836 802821 451692 65877 35606
35388C5606K56687J50883r6141j59081r7965p0244J177J91072L02845J19507k37286
$$ 35606 292293 443176 347035 187954 89989 19745 20922 211994 514839 634346 397060
35377C97060m16465k45201R0175K53931J22679o5568J3532L29375M72530J68056
$$ 397060 -19405 -264606 -174431 79500 202179 136611 150143 479518 952048 1120104
35367A120104l29595n16492k40922J28563J33576k57496n90434m08997J92346
$$ 1120104 790509 274017 33095 161658 295234 37738 -552696 -961693 -769347
35358g69347O20587M89014R7439o569K22525L46515J20464k20487l46890j79249
$$ -769347 -148760 340254 437693 431124 653649 1000164 1120628 900141 553251 374002
35348C74002J52816M00155K95624j15944l52333p3492L53496L26318j12863m30309
$$ 374002 526818 926973 1222597 1106653 754320 680828 1034324 1360642 1247779 817470
35338H17470m83562n63003o38560l72411Q2170J57626j10307l6981N05219P76429
$$ 817470 333908 -229095 -867655 -1240066 -1157896 -1000270 -1110577 -1147558 -642339 134090
35328A34090M17977M2831R0217O9914l96993p21785l51599J96417K15928j483
$$ 134090 552067 594898 685115 755029 358036 -363749 -715348 -518931 -303003 -304486
35318c04486J59609M35418K36789j38497j1226L68686K27697k89243l30887J29471
$$ -304486 -144877 290541 527330 388833 377607 746293 973990 684747 353860 483331
35308D83331K38142k22770m99908k47098n8229k77835l76781M689L66648K71048
$$ 483331 721473 498703 -1205 -248303 -306532 -584367 -961148 -956459 -589811 -318763
35298c18763R8060K48598L44936m5843m91014k98377L31227N39647N1908m82818
$$ -318763 -220703 27895 372831 326988 -164026 -462403 -131176 408471 460379 -22439
35288b2439m14010J30712N06876L19102j95904m72690k55702J39253K87229K12788
$$ -22439 -436449 -305737 201139 520241 324337 -148353 -404055 -264802 22427 235215
35278B35215K25103L49592L32988J46913J5881m8456k22785l49356m5103N15744
$$ 235215 460318 809910 1142898 1289811 1305692 1257236 1034451 685095 639992 1155736
35268A155736N75138j40007r03042r44850m20012L1771K12852L10994L07437P9781
$$ 1155736 1730874 1590867 687825 -257025 -677037 -645266 -432414 -121420 186017 265798
35258B65798j30935J3359L07383K05284l38919p49482o11749j32340K72909M41687
$$ 265798 134863 148222 455605 660889 321970 -427512 -1039261 -1171601 -898692 -457005
35248d57005L86728J35795j50867k04157n811J15380l7856j92857k7506K67864
$$ -457005 -70277 65518 -85349 -289506 -295317 -179937 -217793 -410650 -438156 -170292
35238a70292K32668j31891l14810p3823J76786L0162k35915r3545L55119M97642
$$ -170292 62376 -69515 -384325 -458148 -281362 -251200 -487115 -580660 -225541 272101
35228B72101J68723j11994N849J90782O1938j81887j79451l5497n1249j52812
$$ 272101 440824 328830 334679 525461 587399 405512 226061 190564 139315 -13497
35218a3497j00605j1251j31230k80870p9812L85867O44215N02733J59174k23562
$$ -13497 -114102 -125353 -256583 -537453 -617265 -231398 412817 915550 1074724 851162
35208H51162n48187n49762j20200K63066P3702l99192m19113M2751L06104J31307
$$ 851162 302975 -246787 -366987 -103921 -30219 -429411 -848524 -805773 -499669 -368362
35198c68362J0167J99256L48945L02102L63363M90541J58140n77760q43679l06978
$$ -368362 -358195 -158939 190006 492108 855471 1346012 1504152 926392 82713 -224265
35188b24265J87587k024k60748J11097N79195L03832l35750l58691J69909L56843
$$ -224265 -36678 -38702 -299450 -188353 390842 694674 358924 233 170142 526985
35178E26985M0487j19235K7874n6771m14341m14545M7738K88192M7647p6074K12670
$$ 526985 567472 448237 476111 419340 4999 -409546 -361808 -73616 -25969 -102043 110627
35167A10627L30146p9643l88266k2429M95011L40090l11202n98995k81409O1063
$$ 110627 440773 361130 -27136 -49565 445446 785536 474334 -124661 -406070 -345007
35157c45007J2571j66699q8052K05102L98140L47074J87903R5768M4346j27353
$$ -345007 -332436 -499135 -587187 -382085 16055 363129 551032 646800 691146 563793
35147E63793l98008m85919k55331J987K347j9645K87998O35974L91468l43302
$$ 563793 165785 -320134 -575465 -573478 -571131 -590776 -302778 333196 724664 381362
35137C81362o83394k17697L88428M19232R0035j596J49433J45426n2975j89075
$$ 381362 -302032 -519729 -131301 287931 377966 376370 525803 671229 618254 429179
35127D29179k55420l84627m23001j87800N4652l9061k15651L3888N64173O91369
$$ 429179 173759 -210868 -633869 -821669 -767017 -806078 -1021729 -987841 -423668 267701
35117B67701K30246k55311l43727k49774k28092j03453K68730N71761M57588O5668
$$ 267701 497947 242636 -101091 -350865 -578957 -682410 -413680 158081 615669 681337
35107F81337k33380l26946k90042j15837J49504K45586J4843l00853l80026k49933
$$ 681337 447957 121011 -169031 -284868 -135364 110222 125065 -175788 -555814 -805747
35097h05747j06619O3530L24928M67198K68686n8588j43336o7591j94929m38591
$$ -805747 -912366 -848836 -523908 -56710 211976 153388 10052 -57539 -252468 -691059
35087f91059l06151K22942M90330J19542l55688k49978K83748N09579J21075m44329
$$ -691059 -997210 -774268 -283938 -164396 -520084 -770062 -486314 23265 144340 -299989
35077b99989n77007n5771Q05568J299559Q61797k12651q88366o05437n527O0056
$$ -299989 -876996 -932767 -127199 1172360 2034157 1821506 933140 327703 322176 382232
35067C82232k03722l9578M45262M12078k27075n90551k94903k4912k17136k74516
$$ 382232 178510 138932 584194 996272 769197 178646 -116257 -141169 -358305 -632821
35057f32821K35055O04042J24609n98580n31580J57333M38429K1762m45704n48544
$$ -632821 -397766 206276 330885 -267695 -799275 -641942 -203513 -181751 -627455 -1175999
35047a175999m43714j75867L53600P93782O59831K04991P7117J91469o8428n97549
$$ -1175999 -1619713 -1795580 -1441980 -648198 11633 216624 293741 485210 416782 -180767
35037a80767o33557j15001K08529J65513L84486Q43562N99243m67507j025012
$$ -180767 -814324 -929325 -720796 -555283 -170797 672765 1272008 804501 -220511
35028b20511k80366O45213M15349m97059p31845j68319K19932R0120l0133P0019
$$ -220511 -500877 144336 559685 62626 -669219 -837538 -617606 -527486 -557619 -487600
35018d87600Q0724K64R6160J79924q0319l09599N8949N87013L17396n67479q06026
$$ -487600 -406876 -406612 -310452 -130528 -210847 -520446 -461497 125516 442912 -124567 -930593
35007i30593K5186Q34898O64872k3599k69645K1550K78904K37015Q2160k7658
$$ -930593 -905407 -70509 594363 570764 301119 322669 601573 838588 920748 893090
34997H93090j15291k33392l84529m38077j66301L37579M78924o8647o32639l30942
$$ 893090 777799 544407 159878 -278199 -444500 -106921 372003 303356 -329283 -660225
34987f60225N49692Q85443M06694j4383P1193L8310m45263o07807P8015P54424
$$ -660225 -110533 774910 1181604 1167221 1238414 1276724 831461 223654 301669 1056093
34977A056093M08297m94452p06793o2858M54435K84799q8111r3234J78777L23561
$$ 1056093 1464390 969938 263145 200287 654722 939521 851410 758176 936953 1260514
34967A260514J54279k19660m87625l68995l2125l5491n08489p78537l15452L74261
$$ 1260514 1414793 1195133 707508 338513 306388 270897 -237592 -1016129 -1331581 -957320
34957i57320M76421J32024J27891N32106N97732P2832l30288o9383L94580L42026
$$ -957320 -480899 -348875 -220984 311122 908854 981686 651398 582015 976595 1318621
34947A318621j69311m89035k82127J43971K81236m5519n19768o43805k90845J32230
$$ 1318621 1149310 660275 378148 522119 803355 757836 238068 -405737 -696582 -564352
34937e64352K26209J10162J08492J70363M7562j38203o3676J57849J10760j80460
$$ -564352 -338143 -227981 -119489 50874 98436 -39767 -103443 54406 165166 -15294
34927a5294k88309j85877k89642n65158l87987L67619Q67468M81342k15795k63387
$$ -15294 -303603 -489480 -779122 -1344280 -1732267 -1364648 -497180 -15838 -231633 -495020
34917d95020L13863O60754L44818k33902n65105n38728k55321J24376K96171N9079
$$ -495020 -181157 479597 824415 590513 25408 -513320 -768641 -644265 -348094 -289015
34907b89015k76591j73647L16835M72064j12836q13809o73644L16747J079807
$$ -289015 -565606 -739253 -422418 49646 -63190 -876999 -1550643 -1233896 -154089
34898a54089P48465k20485o11160l8773N49735K21808n87617o90081J21382P71713
$$ -154089 594376 373891 -237269 -276042 273693 495501 -92116 -782197 -660815 110898
34888A10898M63374k69371m81315j15608K25107K99473K98488K19612p8509l68045
$$ 110898 574272 304901 -176414 -292022 -66915 232558 531046 750658 672149 304104
34878C04104l21937j78420l83882o43725k17015P29194J034478K25167o15672
$$ 304104 -17833 -196253 -580135 -1223860 -1440875 -711681 322797 547964 -67708
34869f7708l44321N71879P64747n6962q11313o59800k2344K52604L6844j72373
$$ -67708 -412029 159850 924597 867635 56322 -603478 -625822 -373218 -336374 -508747
34859e08747p5234J54048K57273K06970J20199N9646N866k5621O2964K92279M43966
$$ -508747 -583981 -429933 -172660 34310 154509 214155 220021 194400 257364 549643 993609
34848I93609K54901j73060m01925k43576m7213j53068l40373k08293J17152J75464
$$ 993609 1248510 1075450 673525 429949 382736 229668 -110705 -318998 -201846 -26382
34838b6382k7509o526L49612N14406J48526l41618m19584j58818M6490J47111
$$ -26382 -53891 -60417 289195 803601 952127 610509 190925 32107 78597 225708
34828B25708L14828L98170P2592n15915p76579m46333N4571K01858J8618n7787
$$ 225708 540536 938706 1011298 495383 -281196 -727529 -672958 -471100 -452482 -510269
34818e10269J91553M77847L76306j00147m40807k70343R1258L5453l76045l75867
$$ -510269 -318716 159131 535437 435290 -5517 -275860 -184602 -149149 -525194 -901061
34808i01061L25733Q80676M21133n47897p11286J77514Q98854N15767l27445m53073
$$ -901061 -575328 305348 726481 178584 -532702 -355188 543666 1059433 731988 278915
34798B78915J22823L54676j81919o95146m03519L46210O31795K21537k55847k94818
$$ 278915 401738 756414 574495 -120651 -524170 -177960 453835 675372 419525 124707
34788A24707j35167k30177m78973l66503K47598Q54810Q89624L39249l41578p01237
$$ 124707 -10460 -240637 -719610 -1086113 -838515 16295 905919 1245168 903590 202353
34778B02353n60930o3069L61264K97018j55140l98409j15136K37913R0848l24160
$$ 202353 -358577 -421646 -60382 236636 81496 -316913 -432049 -194136 -103288 -427448
34768d27448k80047K92694O05419J41605n69684o65858o4220N37982N80861J98381
$$ -427448 -707495 -414801 190618 332223 -237461 -903319 -967539 -429557 151304 349685
34758C49685q8292J7260L12350L58539L2822k53125n5835M53558O52052K75455
$$ 349685 261393 278653 591003 949542 982364 729239 673404 1126962 1779014 2054469
34748B054469k96404o27462o80083n39722j65851K78823K96278k88627q46045
$$ 2054469 1758065 1130603 450520 -89202 -255053 23770 320048 31421 -814624
34739h14624o41586J46560O34760M03476o1690j72449J1665Q3602j5680J4235
$$ -814624 -1456210 -1309650 -674890 -271414 -333104 -505553 -493888 -410286 -425966 -411731
34729d11731K53617L42572j1269n15348n78435j20212K43369M3303l24541j63358
$$ -411731 -158114 184458 173189 -342159 -920594 -1040806 -797437 -754134 -1078675 -1242033
34719a242033M24824O17793J00228m46180l54699J24268L72583L41384L52977
$$ -1242033 -817209 -199416 -99188 -545368 -900067 -775799 -403216 -61832 291145
34710B91145L45393J2640m72382n65836j88603J40886R1467q7772r4866k2346
$$ 291145 636538 649178 176796 -389040 -577643 -436757 -345290 -433062 -527928 -550274
34700e50274o6417j53781r1496J44023M21075N73162M55724J06836j46385l5378
$$ -550274 -616691 -770472 -861968 -717945 -296870 276292 732016 838852 692467 657089
34690F57089J95240N5342m15523n89604j44160M32135N21766J77463j40432k83649
$$ 657089 852329 907671 492148 -97456 -241616 190519 712285 889748 749316 465667
34680D65667l81701l34547M7941M59656L09693l25327n88911m7282N46102K76210
$$ 465667 83966 -250581 -202640 257016 566709 241382 -347529 -394811 151291 427501
34670D27501n19699o47223K18689J043246Q92872J19280l76033m01647l32271
$$ 427501 -92198 -739421 -520732 522514 1415386 1534666 1158633 756986 424715
34661D24715k05503J86298N52343L62648j66747k29028K89686N40082K9263n95798
$$ 424715 219212 405510 957853 1320501 1153754 924726 1214412 1754494 1783757 1187959
34651A187959n58540o4483J74340p084k53118l58127l29283j05494K55397M05001
$$ 1187959 629419 564936 739276 732192 479074 120947 -208336 -313830 -58433 346568
34641C46568J94276j907Q7868J12688k25089m52825m0250N55850M54790k51183
$$ 346568 540844 538937 626805 739493 514404 61579 21329 577179 1031969 780786
34631G80786o02350k35338J78970Q0887k39848k96007q3862J68342L50722L33808
$$ 780786 178436 -56902 122068 202955 -36893 -332900 -416762 -248420 102302 436110
34621D36110M972l76769l82604r9562m3360k71675k57116J55137L97253J31355
$$ 436110 441082 64313 -318291 -417853 -461213 -732888 -990004 -834867 -437614 -306259
34611c06259j54431K0978L26349K18220j62536l15989k12439j58021j21961J44921
$$ -306259 -460690 -439712 -113363 104857 -57679 -373668 -586107 -744128 -866089 -721168
34601g21168M81135M43634M7291j82329J6881K63291R0884m07230o80969l56818
$$ -721168 -240033 203601 250892 68563 85444 348735 439619 32389 -648580 -1005398
34591a005398L17715O62502K77219m20263n80521M2959P24552O78344P4417k57834
$$ -1005398 -687683 -25181 252038 -168225 -748746 -705787 18765 697109 771526 513692
34581E13692k270K76287L1251m61996n30399p7903K90684J18775l11541m31447
$$ 513692 511422 787709 818960 356964 -173435 -251338 39346 158121 -153420 -584867
34571e84867j58519J05034J24149R2275K00369L11943K30394O957j96242l05694
$$ -584867 -743386 -638352 -514203 -421928 -221559 90384 320778 327735 131493 -174201
34561a74201k53733P361K46313Q3950l68668m30086K13280Q99334Q26839J62995
$$ -174201 -427934 -420573 -174260 -90310 -458978 -889064 -675784 223550 1050389 1213384
34551A213384k69028j56785Q0472Q0228r5813l18289n19387m95293j25991K51686
$$ 1213384 944356 787571 868043 948271 852458 534169 14782 -480511 -606502 -354816
34541c54816K22627l2289j024L11095M05265R6795l13628o02128p30641n19033
$$ -354816 -132189 -164478 -165502 145593 550858 647653 334025 -268103 -998744 -1517777
34531a517777Q4985N41712L22222j50370n8910M32187M28762j00553k43004J69809
$$ -1517777 -1432792 -891080 -568858 -719228 -778138 -345951 82811 -17742 -260746 -90937
34521i0937J64262o15644j102221n11524L43440L90631o1064p8107L11593M06591
$$ -90937 73325 -542319 -1644540 -2156064 -1812624 -1421993 -1483057 -1561164 -1249571 -842980
34511h42980J24490n7972m1609l5192Q4110M59587O49217J95154m88401o12483
$$ -842980 -718490 -776462 -818071 -853263 -769153 -309566 339651 534805 46404 -566079
34501e66079j45934L03435M66163N11767M31501R7684k38879k16847K2608R1254
$$ -566079 -712013 -408578 57585 569352 1000853 1098537 859658 642811 665419 756673
34491G56673l647m1654r9854k75948k67641J09521L75344P5599l83567l68128
$$ 756673 753026 711372 611518 335570 67929 177450 552794 628393 244826 -123302
34481a23302o2068k1676j14218J09187L55793K6088n45641m82705J13870K78959
$$ -123302 -185370 -207046 -321264 -212077 143716 169804 -375837 -858542 -744672 -465713
34471d65713j44423k25525M06867Q57509L85380m83672q30067n23507l266M42235
$$ -465713 -610136 -835661 -428794 428715 814095 330423 -499644 -1023151 -1026417 -584182
34461e84182O74860N47738J78765p1942j60855l86269o87862n80963l2255L11570
$$ -584182 90678 638416 817181 745239 584384 198115 -489747 -1070710 -1102965 -791395
34451g91395J11703j42291p094K04792R3472q1147P6105L32522K29525j26899
$$ -791395 -679692 -821983 -829077 -624285 -530813 -611960 -535855 -203333 26192 -100707
34441a00707k89677j97644j09691n8330O5183Q2357k17361n04023k13592N38572
$$ -100707 -390384 -588028 -697719 -756049 -690866 -608509 -825870 -1329893 -1543485 -1004913
34431a004913R40337N60837o3198k26332j5751o337k60242k58156J53600M06047
$$ -1004913 -64576 496261 433063 206731 190980 184643 -75599 -333755 -180155 225892
34421B25892J09249k60348j17633K32467J02817l43757k94213L13579N95328J47527
$$ 225892 335141 74793 -42840 189627 292444 -51313 -345526 -31947 563381 710908
34411G10908l23652k21655M2912m2020j81400R25J38475j45521m08725j76155
$$ 710908 387256 165601 208513 166493 -14907 -13982 124493 -21028 -429753 -605908
34401f05908J33111O349j31349K56483O37605K68005l73409l50346M5118j37271
$$ -605908 -472797 -466448 -597797 -341314 296291 564296 190887 -159459 -114341 -251612
34391b51612o34890l20632P21722J157762N30000j77377k91930k05916j40463
$$ -251612 -886502 -1207134 -485412 672350 1202350 1024973 733043 527127 386664
34382C86664K21074N31143p6660j137061r57135O46226J544012L89525j173870
$$ 386664 607738 1138881 1062221 -74840 -1031975 -385749 1158263 1547788 373918
34373C73918r41139N70664J089826M43j081123q53418J71287Q28857P42748K99181
$$ 373918 -567221 3443 1093269 1093712 12589 -840829 -669542 159315 902063 1201244
34363A201244m3842j26972j07079j73718j99752L4793K83421J02210k69864j42082
$$ 1201244 1157402 1030430 923351 749633 549881 584674 868095 970305 700441 558359
34353E58359L53696K77857m73300p52609j1395O88950L92956k34042k12649O3056
$$ 558359 912055 1189912 716612 -35997 -47392 641558 1034514 800472 587823 650879
34343F50879k17872o16351k67047L71459K25590m32750m09016K96316M77608j66245
$$ 650879 433007 -183344 -450391 -78932 146658 -286092 -695108 -398792 78816 -87429
34333h7429n25247M1588P31766O62214O3826l80576m77755l49823o5209J66692
$$ -87429 -612676 -571088 160678 822892 886718 506142 28387 -321436 -386645 -219953
34323b19953L2806l76169o05649n05423l29245j46213K32612O92268P98471M41441
$$ -219953 -187147 -563316 -1168965 -1674388 -2003633 -2149846 -1917234 -1224966 -426495 14946
34313A4946j7234k61608k29167P8963M81705N08326l786m33627j60029M38050
$$ 14946 -2288 -263896 -493063 -414100 67605 575931 572145 138518 -21511 416539
34303D16539N09751K783m16156m66202l82738j76079K53995M55966m4300o85841
$$ 416539 926290 929073 512917 46715 -336023 -512102 -258107 197859 153559 -532282
34293e32282n01986K66654M58047q5764k85058K57237N84577J42626k25650J90091
$$ -532282 -1034268 -767614 -309567 -395331 -680389 -423152 161425 304051 78401 268492
34283B68492P08348M69696j48473l50365k69295m25263n57161j20340N52341O64736
$$ 268492 976840 1446536 1298063 947698 678403 253140 -304021 -424361 127980 792716
34273G92716K11334j39714j65363j98371l13995k64310j20908j93121l47528j36511
$$ 792716 1004050 864336 698973 500602 186607 -77703 -198611 -391732 -739260 -875771
34263h75771L83340O29903L64333K942l7773J86037M26154N59437N12251K30774
$$ -875771 -492431 137472 501805 504747 466974 653011 1079165 1638602 2150853 2381627
34253B381627j63452m58244o22287p30554o59104k14890L86196N52821L0324o58504
$$ 2381627 2218175 1759931 1137644 407090 -252014 -466904 -80708 472113 502437 -156067
34243a56067p31770m2744P30472Q35110K73418k51178j97775K22743M52170L27164
$$ -156067 -887837 -930581 -200109 635001 908419 657241 459466 682209 1134379 1461543
34233A461543R9532j07623l96070o61106n72885j36054J75902O7573j69971j35198
$$ 1461543 1561075 1453452 1057382 396276 -176609 -312663 -136761 -69188 -239159 -374357
34223c74357J35362L41920L39816J45762j75856m08006k82487Q1451J93443r7876
$$ -374357 -238995 102925 442741 588503 412647 4641 -277846 -196395 -2952 -100828
34213a00828l20666j33748R6398n3924k78378n0072M00416L93683l8990j38317
$$ -100828 -421494 -555242 -458844 -512768 -791146 -841218 -440802 -47119 -86109 -224426
34203b24426L45964P08205L89123j78374l13498j17934j26427l00279j27767L76227
$$ -224426 121538 829743 1218866 1040492 726994 609060 482633 182354 54587 430814
34193D30814N44221R6156l72483l08496m0103j47754m21572j96201M43301O38620
$$ 430814 975035 1071191 698708 390212 350109 202355 -219217 -415418 27883 666503
34183F66503P5822m75751l14179K04622L70204K13535J91188K28521p5387n45660
$$ 666503 742325 266574 -47605 157017 527221 740756 931944 1160465 1085078 539418
34173E39418o28912l91998m05820o18051l45965L98903O46764K0173m62113R1053
$$ 539418 -89494 -481492 -887312 -1505363 -1851328 -1452425 -805661 -785488 -1247601 -1156548
34163a156548R56816Q54484q5546n75163j38541L68410K72880j7650N578O4267
$$ -1156548 -199732 654752 569206 -5957 -144498 223912 496792 479142 484720 548987
34153E48987k01519l92975M82N85446N38212j04593m48475o8007M23772L74414
$$ 548987 347468 -45507 -45025 540421 1078633 974040 525565 457558 881330 1255744
34143A255744M515j17443j3698j06892l60175k88222J78343M70709K17480k15844
$$ 1255744 1260259 1142816 1129118 1022226 662051 373829 552172 1022881 1240361 1024517
34133A024517l27283j93112j85256k97880k34913R492J47563J17966J51456K86507
$$ 1024517 697234 504122 318866 20986 -213927 -204435 -56872 61094 212550 499057
34123D99057K40885j17039n06832n89461l31616P7021M18126M79209J82882j91700
$$ 499057 739942 622903 116071 -473390 -805006 -727985 -309859 169350 352232 160532
34113A60532j96616K01717M75964J88973m05349o55276k89338L19110O08074L74638
$$ 160532 -36084 165633 641597 830570 425221 -230055 -519393 -200283 407791 782429
34103G82429j02087l54976j64872K13718L00005p5976n43909n81307q8584M99374
$$ 782429 680342 325366 160494 374212 674217 598241 54332 -526975 -615559 -116185
34093a16185O56614K70307k81853n14599k85420J25457L46490K61297K8646j26458
$$ -116185 540429 810736 528883 14284 -271136 -145679 200811 462108 490754 364296
34083C64296p4611J56987L74731L45955N0129k59850l52581k94073k99268l87653
$$ 364296 289685 446672 821403 1167358 1217487 957637 605056 310983 11715 -375938
34073c75938l61645j09767K24805M06262L42699J43260n058j2542M5608N4015
$$ -375938 -737583 -847350 -622545 -216283 126416 269676 264618 252076 297684 351699
34063C51699J0606k8169r6189k47425l69748k84447l8241J34425J58417J77291
$$ 351699 362305 334136 237947 -9478 -379226 -663673 -701914 -567489 -409072 -231781
34053b31781K49679K68177J97577Q4614j52507n53480p69615m13120K24545M39408
$$ -231781 17898 286075 483652 568266 415759 -137721 -907336 -1320456 -1095911 -656503
34043f56503J97443J88055N74826O00331q5167o28539k65844L93747L32135k56614
$$ -656503 -459060 -271005 303821 904152 818985 190446 -75398 318349 650484 393870
34033C93870l95289M1168K59590n7995l65729k62039K6455K26050L16923K35464
$$ 393870 -1419 39749 299339 241344 -124385 -386424 -359969 -133919 183004 418468
34023D18468n5716k65436j51959P732l7938R4376O58727R05670J02712r72453
$$ 418468 362752 97316 -54643 -46911 -84849 9527 668254 1573924 1676636 704183
34013G04183r24686P6898N12208q9810n65249j95176K42962N5462k27497m0539
$$ 704183 -220503 -143605 368603 278793 -286456 -481632 -238670 -183208 -410705 -451244
34003d51244J93553M6530p1605J33442J50640k44723l20793K87384O90001K02229
$$ -451244 -257691 -211161 -282766 -149324 1316 -243407 -564200 -276816 413185 615414
33993F15414l70392p4212N28584L48754l71430n82606k15196l7163j47724P33
$$ 615414 245022 170810 699394 1048148 676718 94112 -121084 -158247 -305971 -305238
33983c05238L33340K36504k00349k56107J34706K99256M4164j22512m1297j22966
$$ -305238 28102 264606 64257 -191850 -57144 242112 286276 163764 122467 -499
33973d99l92161l17356J75997M36001J27690k42822j73530J32497K37916R6712
$$ -499 -392660 -710016 -534019 -98018 29672 -213150 -386680 -254183 -16267 80445
33963H0445q5183j86681j55420k462Q4427n1812k17502j10845J78991L09998K26083
$$ 80445 -4738 -191419 -346839 -349301 -264874 -316686 -534188 -645033 -466042 -156044 70039
33952G0039J28022L1963j66477l17232k22686r5636k52952m62052k12986L96258
$$ 70039 198061 230024 63547 -253685 -476371 -572007 -824959 -1287011 -1499997 -1103739
33942a103739O88521L82464n3656j49086r964K3325j15809k41917j86865M5048
$$ -1103739 -415218 -32754 -86410 -235496 -245460 -222135 -337944 -579861 -766726 -721678
33932g21678K34929J34829j47285j63872K46221O45490N96551K13627k07375o37523
$$ -721678 -486749 -351920 -499205 -663077 -416856 228634 825185 1038812 831437 193914
33922A93914r59016p23248J14927P56669N88605J32301J35187K88372q7160n95016
$$ 193914 -765102 -1488350 -1373423 -616754 -28149 104152 239339 527711 440551 -154465
33912a54465l37625L63050L19000m71839p00987N6070O06081J83896k76915J61332
$$ -154465 -492090 -129040 189960 -281879 -982866 -926796 -320715 -136819 -413734 -252402
33902b52402P79442M45360m40516o02059P1154M72732N8153n15968n74193k50120
$$ -252402 527040 972400 531884 -70175 979 473711 531864 15896 -558297 -808417
33892h08417O7332L12872M66336L08899j68695n16851l48634J23410L78213K73722
$$ -808417 -741085 -428213 38123 347022 178327 -338524 -687158 -563748 -185535 88187
33882H8187J44338K36569L47314J79704j43284k16999L0271J99893J0151l04406
$$ 88187 232525 469094 816408 996112 852828 635829 666100 865993 876144 571738
33872E71738l91197k70043j31684N8627L54834M65857J01968m23409m66416M2766
$$ 571738 180541 -89502 -221186 -162559 192275 658132 760100 336691 -129725 -86959
33862h6959M39618J99254l96410o48860k78285K94518M33270j496m73331m28311
$$ -86959 352659 551913 155503 -493357 -771642 -477124 -43854 -45350 -518681 -946992
33852i46992l8063P5655j66380j72585K78865N84084L27962M1519K88145O26120
$$ -946992 -985055 -909400 -1075780 -1248365 -969500 -385416 -57454 -15935 272210 898330
33842H98330L24880l65640n94755k31481J28996K30109K76909J86591k89577p81716
$$ 898330 1223210 857570 262815 31334 160330 390439 667348 853939 564362 -217354
33832b17354o22679M4367M02186K10769J0154O5854N8524j10542j33923j1156
$$ -217354 -840033 -795666 -393480 -182711 -172557 -106703 -48179 -158721 -292644 -303800
33822c03800o5979k02416l2701K66414J85384q4481P9900M88584L70254j67119
$$ -303800 -369779 -572195 -604896 -338482 -153098 -237579 -157679 330905 701159 534040
33812E34040k54506J02236P573n23703m23265L81368N60319l06590q17847r3841
$$ 534040 279534 381770 389343 -134360 -557625 -176257 384062 77472 -740375 -834216
33802h34216P26376N21827L5888K44517M60626k03025q44762k19228Q79500P65156
$$ -834216 -107840 413987 449875 694392 1155018 951993 107231 -111997 767503 1532659
33792A532659l46523p94419k47939P9692k20131k61021K20206L95079M5967m1553
$$ 1532659 1186136 391717 143778 223470 3339 -257682 -37476 357603 403570 362017
33782C62017K76829J74702m05150l84799M60169P93414j40037j141183q92257
$$ 362017 638846 813548 408398 23599 483768 1277182 1137145 -4038 -896295
33773h96295O7083L96608L0348q4951L02526N51619L45703N0306o5701j49264
$$ -896295 -829212 -432604 -402256 -487207 -184681 366938 712641 762947 697246 547982
33763E47982l04020m18665m51721m42851l06163J3182K90168K85171J42274J83118
$$ 547982 243962 -174703 -626424 -1069275 -1375438 -1362256 -1072088 -786917 -644643 -461525
33753d61525M00266M76165K54584p6412k59173k31887j15502m0305P781J52754
$$ -461525 -61259 414906 669490 593078 333905 102018 -13484 -53789 -46008 106746
33743A06746L80062M31077J37177k47224l28814j17747M7412M6018K8601m0239
$$ 106746 486808 917885 1055062 807838 479024 361277 408689 454707 483308 443069
33733D43069l62700p41078o06031J28919P55316O80719K20784M2990J85999J81378
$$ 443069 80369 -660709 -1266740 -1137821 -382505 298214 518998 561988 747987 929365
33723I29365p4003j93272l7105J0917l02832o28418n06641m2091K84440L16087
$$ 929365 855362 662090 624985 635902 333070 -295348 -801989 -844080 -559640 -243553
33713b43553L28729M60888M60893J59673j69011k05376o8498n7582j28944n4131
$$ -243553 85176 546064 1006957 1166630 997619 792243 723745 666163 537219 483088
33703D83088O5817m4389k48790j51313J64683J96410q1983j14933K06182K16367
$$ 483088 548905 504516 255726 104413 269096 465506 383523 268590 474772 691139
33693F91139l71105p83975l46894L64695L88009j28089k68739J28508L45244O3914
$$ 691139 320034 -463941 -810835 -446140 -58131 -186220 -454959 -326451 18793 82707
33683H2707k37280k37706j85965j81665P8267N45453O03452M961o12882n68006
$$ 82707 -154573 -392279 -578244 -759909 -681642 -136189 467263 472224 -140658 -708664
33673g08664J3615N41693P00276N12585R8981k92467l66758j59779q917j962J01649
$$ -708664 -695049 -153356 546920 1059505 1158486 866019 499261 339482 330565 328603 430252
33662D30252K69210J14799l20738l83524J57550N41240J08868n80415n20293K24352
$$ 430252 699462 814261 493523 109999 267549 808789 917657 337242 -183051 41301
33652D1301O55849L52085p4751j13378p3350l26744n51788k87752K17623L44278
$$ 41301 697150 1049235 974484 861106 787756 461012 -90776 -378528 -160905 183373
33642A83373P2980O297L99038P06393L32713n14807j035585p52765M0572O85523
$$ 183373 256353 262650 661688 1368081 1700794 1185987 150402 -602363 -561791 123732
33632A23732P74798L80083j16604l53265k81137j73805k70407m57214m38609j55018
$$ 123732 898530 1278613 1162009 808744 527607 353802 83395 -373819 -812428 -967446
$$ [...]
##END NTUPLES=NMR SPECTRUM
##END=
