##TITLE=31Pdec_3d1411A
 aceton-d6, 24 sc
 15.11.2022
##JCAMPDX= 6.0         $$ Bruker NMR JCAMP-DX V2.0
##DATA TYPE= NMR SPECTRUM
##DATA CLASS= NTUPLES
##ORIGIN= UXNMR, Bruker Analytische Messtechnik GmbH
##OWNER= root
$$ XWIN-NMR		Version 3.5
$$ Tue Nov 15 14:46:11 2022 Russian Standard Time (UT+4h)  she@DPX200
##.OBSERVE FREQUENCY= 81.013821
##.OBSERVE NUCLEUS= ^31P
##.ACQUISITION MODE= SIMULTANEOUS
##.ACQUISITION SCHEME= undefined
##.AVERAGES= 24
##.DIGITISER RES= 16
##SPECTROMETER/DATA SYSTEM= spect
##.PULSE SEQUENCE= zgpg30
##.SOLVENT NAME= Acetone
##.SHIFT REFERENCE= (INTERNAL, Acetone, 0, 248.564)
##AUDIT TRAIL= $$ (NUMBER, WHEN, WHO, WHERE, WHAT)
$$ ##TITLE= Audit trail, XWIN-NMR		Version 3.5
$$ ##JCAMPDX= 5.01
$$ ##ORIGIN= Bruker BioSpin GmbH
$$ ##OWNER= she
$$ F:/spectra/data/she/nmr/P31/1/pdata/1/auditp.txt
$$ ##AUDIT TRAIL=  $$ (NUMBER, WHEN, WHO, WHERE, WHAT)
(   1,<2022-11-15 14:43:48.39 +0400>,<she>,<DPX200>,
      <created by zg, POWCHK disabled, PULCHK disabled
       configuration hash MD5:
       00 E9 B6 7A A2 85 ED C7 34 08 36 98 17 FE 4E 26
       data hash MD5: 32K
       AC A4 06 64 D1 CA 54 4C E3 E8 EA DD A3 C4 25 C2>)
(   2,<2022-11-15 14:45:32.06 +0400>,<she>,<DPX200>,
      <Start of raw data processing
       efp BC_mod = 2 LB = 1 FT_mod = 6 PKNL = 1 PHC0 = -10234.3 PHC1 = 26.45589 SI = 64K 
       data hash MD5: 64K
       63 98 54 44 7C 9F 78 4C C0 70 E5 92 1E A3 24 3C>)
(   3,<2022-11-15 14:45:43.50 +0400>,<she>,<DPX200>,
      <pk PHC0 = 2.006662 PHC1 = 0 
       data hash MD5: 64K
       38 C2 BF A5 EB C3 A1 D6 BD 7A 62 2E 89 0F 03 9C>)
(   4,<2022-11-15 14:45:51.25 +0400>,<she>,<DPX200>,
      <abs ABSG = 5 
       data hash MD5: 64K
       6D B0 D8 E7 8D 5B 29 F3 09 FC 7E 91 F9 23 3A 3A>)
$$ ##END=
$$ 
$$ hash MD5
$$ C7 09 94 D2 E1 CA BE 34 37 B7 E2 C8 9B 30 6B 40
##$RELAX= 
##$RELAX= 
##$RELAX= 
##$RELAX= 
##$RELAX= 
##$RELAX= 
##$RELAX= 
##$RELAX= 
##$RELAX= 
$$ Bruker specific parameters
$$ --------------------------
##$DU= <F:/spectra>
##$EXPNO= 1
##$NAME= <P31>
##$PROCNO= 1
##$TYPE= <nmr>
##$USER= <she>
##$AMP= (0..31)
100 100 100 100 100 100 100 100 100 100 100 100 100 100 100 100 100 100 
100 100 100 100 100 100 100 100 100 100 100 100 100 100 
##$AQSEQ= 0
##$AQ_mod= 1
##$AUNM= <au_zg>
##$AUTOPOS= <>
##$BF1= 81.014009
##$BF2= 200.13
##$BF3= 200.13
##$BF4= 200.13
##$BF5= 200.13
##$BF6= 200.13
##$BF7= 200.13
##$BF8= 200.13
##$BYTORDA= 1
##$CFDGTYP= 0
##$CFRGTYP= 5
##$CHEMSTR= <none>
##$CNST= (0..31)
1 1 145 1 1 1 1 1 1 1 1 1 1 1 1 1 1 1 1 1 1 1 1 1 1 1 1 1 1 1 1 1 
##$CPDPRG= <waltz16>
##$CPDPRG1= <>
##$CPDPRG2= <waltz16>
##$CPDPRG3= <>
##$CPDPRG4= <mlev>
##$CPDPRG5= <mlev>
##$CPDPRG6= <mlev>
##$CPDPRG7= <mlev>
##$CPDPRG8= <mlev>
##$CPDPRGB= <>
##$CPDPRGT= <>
##$D= (0..31)
0 1 0 0 0 0 0 0 0 0 0 0.03 2e-05 3e-06 0 0 0 0 0 0 0 0 0 0 0 0 0 0 0 0 
0 0 
##$DATE= 1668509027
##$DBL= (0..7)
120 120 120 11 120 120 24 19 
##$DBP= (0..7)
150 150 150 150 150 150 150 150 
##$DBP07= 0
##$DBPNAM0= <>
##$DBPNAM1= <>
$$ [...]
##$SUBNAM3= <"">
##$SUBNAM4= <"">
##$SUBNAM5= <"">
##$SUBNAM6= <"">
##$SUBNAM7= <"">
##$SUBNAM8= <"">
##$SUBNAM9= <"">
##$SW= 501.771253377433
##$SWIBOX= (0..15)
0 1 3 0 0 0 0 0 0 0 0 0 0 0 0 0 
##$SW_h= 40650.406504065
##$TD= 32768
##$TD0= 1
##$TE= 0
##$TE2= 300
##$TE3= 300
##$TEG= 300
##$TL= (0..7)
0 120 53 12 22 120 120 120 
##$TP= (0..7)
150 150 150 150 150 150 150 150 
##$TP07= 0
##$TPNAME0= <>
##$TPNAME1= <>
##$TPNAME2= <>
##$TPNAME3= <>
##$TPNAME4= <>
##$TPNAME5= <>
##$TPNAME6= <>
##$TPNAME7= <>
##$TPOAL= (0..7)
0.5 0.5 0.5 0.5 0.5 0.5 0.5 0.5 
##$TPOFFS= (0..7)
0 0 0 0 0 0 0 0 
##$TUNHIN= 0
##$TUNHOUT= 0
##$TUNXOUT= 0
##$USERA1= <user>
##$USERA2= <user>
##$USERA3= <user>
##$USERA4= <user>
##$USERA5= <user>
##$V9= 5
##$VALIST= <valist>
##$VCLIST= <CCCCCCCCCCCCCCC>
##$VD= 0
##$VDLIST= <DDDDDDDDDDDDDDD>
##$VPLIST= <PPPPPPPPPPPPPPP>
##$VTLIST= <TTTTTTTTTTTTTTT>
##$WBST= 1024
##$WBSW= 4
##$XGAIN= (0..3)
0 0 0 0 
##$XL= 0
##$YL= 0
##$YMAX_a= 5747
##$YMIN_a= -5977
##$ZGOPTNS= <>
##$ZL1= 120
##$ZL2= 120
##$ZL3= 120
##$ZL4= 120
##$ABSF1= 248.5645
##$ABSF2= -253.2056
##$ABSG= 5
##$ABSL= 3
##$ALPHA= 0
##$AQORDER= 0
##$ASSFAC= 0
##$ASSFACI= 0
##$ASSFACX= 0
##$ASSWID= 0
##$AUNMP= <proc_1d>
##$AZFE= 0.1
##$AZFW= 0.5
##$BCFW= 0
##$BC_mod= 2
##$BYTORDP= 0
##$COROFFS= 0
##$CY= -3
##$DATMOD= 1
##$DC= 0
##$DFILT= <>
##$DTYPP= 0
##$F1P= 0
##$F2P= 0
##$FCOR= 1
##$FTSIZE= 65536
##$FT_mod= 6
##$GAMMA= 0
##$GB= 0
##$INTBC= 1
##$INTSCL= 6.047779e-11
##$ISEN= 30
##$LB= 1
##$LEV0= 0
##$LPBIN= 0
##$MAXI= 10000
##$MC2= 0
##$MEAN= 0
##$ME_mod= 0
##$MI= 50
##$NCOEF= 0
##$NC_proc= -5
##$NLEV= 6
##$NOISF1= 182.463
##$NOISF2= 159.3651
##$NSP= 0
##$NTH_PI= 0
##$NZP= 0
##$OFFSET= 248.5645
##$PC= 4
##$PHC0= -10232.29
##$PHC1= 26.45589
##$PH_mod= 1
##$PKNL= yes
##$PPARMOD= 0
##$PSCAL= 0
##$PSIGN= 0
##$REVERSE= no
##$SF= 81.0140089999694
##$SI= 65536
##$SIGF1= 159.3651
##$SIGF2= -187.1042
##$SINO= 113.3802
##$SIOLD= 16384
##$SREGLST= <1H.CDCl3>
##$SSB= 0
##$STSI= 65536
##$STSR= 0
##$SW_p= 40650.406504065
##$SYMM= 0
##$S_DEV= 0
##$TDeff= 32768
##$TDoff= 0
##$TI= <>
##$TILT= no
##$TM1= 0
##$TM2= 0
##$TOPLEV= 0
##$USERP1= <user>
##$USERP2= <user>
##$USERP3= <user>
##$USERP4= <user>
##$USERP5= <user>
##$WDW= 1
##$XDIM= 65536
##$YMAX_p= 343649571
##$YMIN_p= -16796429
$$ End of Bruker specific parameters
$$ ---------------------------------
##NTUPLES= NMR SPECTRUM
##VAR_NAME=  FREQUENCY,     SPECTRUM/REAL,   SPECTRUM/IMAG
##SYMBOL=    X,             R,               I
##VAR_TYPE=  INDEPENDENT,   DEPENDENT,       DEPENDENT
##VAR_FORM=  AFFN,          ASDF,            ASDF
##VAR_DIM=   65536,         65536,           65536
##UNITS=     HZ,            ARBITRARY UNITS, ARBITRARY UNITS
##FACTOR=    0.620285442955139, 1,           1
##FIRST=     20137.2065510682, 0,            0
##LAST=      -20513.1999529968, 0,           0
##MIN=       -20513.1999529968, -16796429,   0
##MAX=       20137.2065510682, 343649571,    0
$$ Real data points
##PAGE= N=1
##DATA TABLE= (X++(R..R)), XYDATA
$$ [...]
39890I98150J95879j79609j89889o1713j16894l60468n74405o31629m85702o7780
$$ 998150 1194029 1014420 824531 762818 645924 285456 -288949 -920578 -1406280 -1474060
39880a474060M60784N90141Q9025m41417k59221L95992O15851K32406J9603L13665
$$ -1474060 -1013276 -423135 -334110 -775527 -1034748 -638756 -22905 209501 229104 542769
39870E42769M30712n7771m19822O5190P54250M77893o45307j270084o58468M35323
$$ 542769 973481 915710 495888 561078 1315328 1793221 1147914 -122170 -780638 -345315
39860c45315Q68132L95576l82608q13333o29322L839N66560N56077L5807l51481
$$ -345315 522817 918393 535785 -277548 -906870 -903031 -336471 219606 255413 -96068
39850i6068j32397L73936M33416j37746o65210m35176L53558P75357L44821l71437
$$ -96068 -228465 145471 578887 441141 -224069 -659245 -305687 469670 814491 443054
39840D43054n54926k11516J1713j16040j62367J13357L02568L6970l67327l67367
$$ 443054 -111872 -323388 -311675 -427715 -590082 -476725 -174157 -137187 -504514 -871881
39830h71881K5294L21884K19415j43601m44510m23467k3351M82560O53947L76987
$$ -871881 -846587 -524703 -305288 -448889 -893399 -1316866 -1340217 -857657 -203710 173277
39820A73277K3756n8619J1207o3036k73183l93290l45679j94701M2001K85750
$$ 173277 197033 138414 149621 86585 -186598 -579888 -925567 -1120268 -1078267 -792517
39810g92517K84174n9957l83059k37238K91190O62491N58042J80116j25298k58695
$$ -792517 -508343 -568300 -951359 -1188597 -897407 -234916 323126 503242 377944 119249
39800A19249l01387k75401j13310J90064M76987N20150K57117j06036l22644l90099
$$ 119249 -182138 -457539 -570849 -380785 96202 616352 873469 767433 444789 54690
39790E4690m50009m62550k39919J76489M57894L99093J45265p4640j95578k19533
$$ 54690 -395319 -857869 -1097788 -921299 -463405 -64312 80953 6313 -189265 -408798
39780d08798j32110o064N2399J01400K37707L00308Q2811j84051p4477K69699
$$ -408798 -540908 -546972 -494573 -393173 -155466 144842 227653 43602 -30875 238824
39770B38824K43007k11770m14604p6396J54843k06719n71728j97602N55843P60674
$$ 238824 481831 270061 -144543 -220939 -66096 -272815 -844543 -1042145 -486302 274372
39760B74372L25313l8622k6375k006j19549p7293J45473J03013l34818o56057
$$ 274372 599685 561063 534688 532682 413133 335840 481313 584326 249508 -406549
39750d06549m27558J46254N88397O48069L05320k73307o47502m21332J86477M98203
$$ -406549 -834107 -687853 -99456 548613 853933 580626 -66876 -488208 -301731 196472
39740A96472K47751j18670j61434k0081l2559j74945j82804K9646L27324N47652
$$ 196472 444223 325553 164119 144038 111479 -63466 -246270 -216624 110700 658352
39730F58352N61378L11927p2638l45633l80820k23172L8197K40900J17733l68952
$$ 658352 1219730 1531657 1459019 1113386 732566 509394 547591 788491 906224 537272
39720E37272p50310n20375J46437N75049M71365J56974o7450k33789l08093r1311
$$ 537272 -213038 -733413 -586976 -11927 459438 616412 548962 315173 7080 -84231
39710h4231K89003L69700Q2808q0864P3951O0829l98458p26747l41735L43267
$$ -84231 204772 574472 657280 576416 650367 711196 312738 -414009 -755744 -412477
39700d12477M79495J2659l76988l59754k37706k05843o1952K46150M11365L00089
$$ -412477 67018 79677 -297311 -657065 -894771 -1100614 -1162566 -916416 -505051 -204962
39690b04962J89126K53870K54070j5786l17613l01036m693K38132K43219J06002
$$ -204962 -15836 238034 492104 476318 158705 -142331 -147024 91108 334327 440329
39680D40329j8969q9650j42842j78160j07603J22771L39750K42353j55984l84327
$$ 440329 421360 331710 188868 10708 -96895 25876 365626 607979 451995 67668
39670F7668r5602L72920M08181q306l16312k56481j67784k57062j77864K94494
$$ 67668 -27934 344986 753167 744861 428549 172068 4284 -252778 -430642 -136148
39660a36148O89031M82191l4069j42612K18239L94003J5165n35947p73743o98338
$$ -136148 552883 1035074 1001005 858393 1076632 1470635 1485800 949853 176110 -522228
39650e22228n22727k59619J14417M02965M23016K93123K18626J65990J9410r6193
$$ -522228 -1044955 -1304574 -1190157 -787192 -364176 -71053 147573 313563 332973 236780
39640B36780K8887K67200K11591k63644p26453o44928n0533M36661L31732r7592
$$ 236780 265667 532867 744458 480814 -245639 -890567 -941100 -504439 -172707 -270299
39630b70299j87009J57526K62730k78886q19700m95312M12534P73551K72267j63484
$$ -270299 -457308 -299782 -37052 -315938 -1135638 -1630950 -1218416 -444865 -172598 -336082
39620c36082J01334M14286K8571n58305m23346K07677L45801q5139j73937L48358
$$ -336082 -234748 179538 208109 -350196 -773542 -565865 -220064 -305203 -479140 -130782
39610a30782O01085K9008o44811n27629J48203N04051K60359j43714l29118k83286
$$ -130782 470303 499311 -145500 -673129 -524926 -20875 239484 95770 -233348 -516634
39600e16634p9651K18477M39823M04764J01864l47440p32474p35081k06134M58547
$$ -516634 -596285 -377808 62015 466779 568643 221203 -511271 -1246352 -1452486 -993939
39590i93939O32020K79836J6382J77293L69312K02256r3533j50388m2239L5575
$$ -993939 -361919 -82083 -65701 111592 480904 683160 589627 439239 397000 432575
39580D32575J62739L22483J58923l65579n99571j32578L89909J46046n57305p23331
$$ 432575 595314 917797 1076720 711141 111570 -21008 368901 514947 -42358 -765689
39570g65689j66878L32927L04516J07534R6567R3668o9472j75375p9502J0248
$$ -765689 -932567 -599640 -295124 -187590 -91023 2645 -66827 -242202 -321704 -311456
39560c11456j6102O0977K98402L35267m0087m51856m33459r0007J07868L2818
$$ -311456 -327558 -266581 31821 367088 327001 -124855 -558314 -648321 -540453 -507635
39550e07635K7855L17548N99910M24891j26876m32173j31384L13468K23809k90438
$$ -507635 -479780 -162232 437678 862569 735693 303520 172136 485604 709413 418975
39540D18975m67621n2949L15854J05608l53732m83694k70435j8828J83355K79430
$$ 418975 -48646 -101595 214259 319867 -33865 -517559 -787994 -806822 -623467 -344037
39530c44037N6770l35712k63151M01599P92886K99914l50204j70958N19698O89128
$$ -344037 -287267 -622979 -886130 -484531 308355 608269 258065 87107 606805 1295933
39520A295933K47044q0641j44414l40154m61374K0191O58085M76563k85858m02341
$$ 1295933 1542977 1462336 1317922 977768 516394 536585 1194670 1671233 1385375 983034
39510I83034K38612L78934m07111r23343l90611L11568K82597J1964J51185K27492
$$ 983034 1221646 1600580 1193469 270126 -120485 191083 473680 485644 636829 864321
39500H64321k46574n63759j3850O94211N28145j61334l56678j00547j45525m25832
$$ 864321 617747 53988 40138 734349 1262494 1101160 744482 643935 498410 72578
39490G2578k62760K48869L57057m2253l47288l10774j42186J89274P32636R32941
$$ 72578 -190182 58687 415744 373491 26203 -284571 -426757 -237483 495153 1428094
39480A428094L12389m88804m67439J73896L64898j16446m89617m35482m31823
$$ 1428094 1740483 1251679 784240 958136 1323034 1206588 716971 281489 -150334
39471a50334n69626l07715L60404O57475K69661j65717j39408P8913J51979J61951
$$ -150334 -719960 -1027675 -667271 -9796 259865 94148 -45260 33653 185632 347583
39461C47583J25242j41647m47857l37200P1234J94425J4900M7478K30412k6705
$$ 347583 472825 331178 -116679 -453879 -382645 -188220 -173320 -125842 104570 77865
39451G7865n64382n14623J17669K96724j93330k38813N75431R82793J23377q26062
$$ 77865 -486517 -1001140 -883471 -586747 -780077 -1018890 -443459 539334 662711 -163351
39441a63351m76887N20520O43412o397j31573M08147M97048j63010n98961l09584
$$ -163351 -640238 -119718 523694 517297 385724 793871 1290919 1127909 528948 219364
39431B19364N6619M5504N4821K62199J51606l85188o13751k25860Q98m66381q73664
$$ 219364 275983 321487 376308 638507 790113 404925 -208826 -434686 -433788 -900169 -1773833
39420a773833l68149N27544O81723J16378j15743L48827O94621L42435j10824
$$ -1773833 -2141982 -1614438 -932715 -816337 -932080 -583253 111368 453803 342979
39411C42979J13454O98100O67185j52415q24020n70638J96151M70298l7732o47699
$$ 342979 456433 1154533 1821718 1669303 845283 274645 470796 941094 903362 255663
39401B55663o94386k95336R678Q949q2919o6997J1762J9361j00807k92432l88697
$$ 255663 -438723 -734059 -724381 -715432 -798351 -865348 -853586 -834225 -935032 -1227464 -1616161
39390a616161k14976K01922O06359P68503O54929L29528q8243l20665j23496K73973
$$ -1616161 -1831137 -1629215 -1022856 -254353 400576 730104 641861 321196 197700 471673
39380D71673K99534j55382m76071k18811J81521J14570j99759j16313K78290K56262
$$ 471673 771207 615825 139754 -79057 102464 217034 17275 -99038 179252 435514
39370D35514l22120p18467m51871L9315K05273J77522K96913M10183K00252j63517
$$ 435514 113394 -605073 -1056944 -1017629 -812356 -634834 -337921 72262 272514 108997
39360A08997k71347j32014p6239j66845j77115m7729P2228J67024L25909M28784
$$ 108997 -162350 -294364 -370603 -537448 -714563 -762292 -690064 -523040 -197131 231653
39350B31653K76247J4604P78K01607J71363k32825n35607l05463J91963L48193
$$ 231653 507900 522504 523282 724889 896252 663427 127820 -177643 14320 362513
39340C62513L8291k68453j85710J23244K43954N4489j85836j96925J9460K33269
$$ 362513 400804 132351 -53359 69885 313839 368328 182492 -14433 5027 238296
39330B38296K43314M4870k02658l21247k46036o3690O7343N3362p6015k39817
$$ 238296 481610 526480 323822 2575 -243461 -307151 -239808 -186446 -262461 -502278
39320e02278l79466m20241k41957J82246O36694Q04466O02470K52079l1407k67043
$$ -502278 -881744 -1301985 -1543942 -1361696 -725002 79464 681934 934013 902606 635563
39310F35563n23338o63733m84755n8511K76058L11684K05735K23810L57855L41197
$$ 635563 112225 -551508 -1036263 -1094774 -818716 -507032 -301297 -77487 280368 621565
39300F21565L8611l09587l38730k0303K71689K21272l6830j44720m9160m8949
$$ 621565 660176 350589 11859 -8444 263245 484517 447687 302967 253807 204858
39290B04858k96871n27128m14984l799L84893M98373K70440j88505n18892k83270
$$ 204858 -92013 -619141 -1034125 -1037924 -653031 -154658 115782 -72723 -591615 -874885
39280h74885M59161R42054M89478n42283j076307o12348K29958N93462L71516
$$ -874885 -415724 526330 1015808 473525 -602782 -1215130 -985172 -391710 -20194
39271b0194O1725j813R7249J78609J87997J32890J4029j66316l79916m82955k10803
$$ -20194 41531 39718 136967 315576 503573 636463 650492 484176 104260 -378695 -589498
39260e89498M63933R74768O10728m86089j233455q79316M2670M97570L26939K00370
$$ -589498 -125565 849203 1459931 973842 -259613 -1138929 -1096259 -598689 -271750 -71380
39250g1380M01123M48055K7528m10136l31756Q4505K53675J3752k41501j66489
$$ -71380 329743 777798 805326 395190 63434 147939 401614 415366 173865 7376
39240G376J10135K22563P5831l7787J00569K04587j63463p86792q44924o6341
$$ 7376 117511 340074 415905 378118 478687 683274 519811 -266981 -1111905 -1178246
39230a178246O92671N71580m5725j68677K56742M18149J07399j0144K71973K75099
$$ -1178246 -485575 86005 40280 -128397 128345 546494 653893 643749 915722 1190821
39220A190821k57997n60651j62405K45089M8757j90851J22398L40124k93183r88625
$$ 1190821 932824 372173 209768 454857 503614 312763 435161 775285 482102 -506523
39210e06523m56724Q18662J052587j09086j018086n45069L92864N10392k172k61575
$$ -506523 -963247 -144585 908002 798916 -219170 -764239 -371375 139017 136845 -124730
39200a24730k34783l74405m59652J6040P01033P24511M6456m48706k21861K98542
$$ -124730 -359513 -733918 -1193570 -1177530 -476497 248014 294470 -154236 -376097 -77555
39190g7555M47809R7383m02227o09507k73859M03208P93357M65705k55860o71114
$$ -77555 370254 467637 65410 -544097 -817956 -414748 378609 844314 588454 -82660
39180h2660n28994j25645K57707N39488N51177J23955m63239o20454k03582K58692
$$ -82660 -611654 -737299 -479592 59896 611073 735028 271789 -348665 -552247 -293555
39170b93555K72656l4199k32064j77794l5886N9200J00952R2728K6684q3567k35018
$$ -293555 -20899 -55098 -287162 -464956 -500842 -441642 -340690 -247962 -221278 -304845 -539863
39159e39863l91043l78802m5772M08928N45491K96661J55916M43975O78361J79370
$$ -539863 -930906 -1309708 -1355480 -946552 -401061 -104400 51516 495491 1173852 1353222
39149A353222q14643j257501o59075K43741N15079K06765j169O6013L0594j44982
$$ 1353222 538579 -718922 -1377997 -1134256 -619177 -412412 -413581 -347568 -316974 -461956
39139d61956o0813K59821K57417j48261k61257K16375N34969J03024m23193j90423
$$ -461956 -522769 -262948 -5531 -153792 -415049 -198674 336295 439319 16126 -174297
39129a74297L42322J32105o04736o55719J56701O57617K71812j52881K00O0602
$$ -174297 168025 300130 -304606 -960325 -803624 -146007 125805 -27076 -26876 33726
39119C3726m76340p46025L7103R62413O82824m07564p74854j25267L72209J33631
$$ 33726 -442614 -1188639 -1151536 -189123 493701 86137 -688717 -813984 -441775 -308144
39109c08144j20548J01635K58561j3392j34796K95162O32143K23275m67782n68432
$$ -308144 -428692 -327057 -68496 -81888 -216684 78478 710621 933896 466114 -102318
39099a02318o3288L74938L78650O1948l99499p49613n79102J10921N99340L24581
$$ -102318 -165606 209332 587982 649930 250431 -499182 -1078284 -967363 -368023 -43442
39089d3442k30861k18018K70028L68756j47131m72928j3748O84658O79923j02035
$$ -43442 -274303 -492321 -222293 146463 -668 -473596 -487344 197314 877237 775202
39079G75202q05438p03914K3374N90832M89464k6259l12674j02793K41455K51032
$$ 775202 -30236 -734150 -710776 -119944 369520 343261 30587 -72206 169249 420281
39069D20281q0965l79622l66717q3604K32596L20591O8009l09610l92148l9945
$$ 420281 339316 -40306 -407023 -490627 -258031 62560 130569 -179041 -571189 -611134
39059f11134L84822M69510K47799J8872j16855k20905k04252L5281K64906J51671
$$ -611134 -226312 243198 490997 509869 393014 172109 -32143 3138 268044 419715
39049D19715j78519k70116n7081L1597j94708l51335j27939J76356J41314r2685
$$ 419715 241196 -28920 -86001 -54404 -249112 -600447 -728386 -552030 -410716 -503401
39039e03401p6989K17761L87687K36601N571p4611j02101k46426m13472l35269
$$ -503401 -580390 -362629 25058 261659 267230 192619 90518 -155908 -569380 -904649
39029i04649Q2577N77880P06315K86727k90668m00862K7076L18753n6131o64414
$$ -904649 -822072 -244192 462123 748850 458182 57320 84396 403149 347018 -317396
39019c17396o53117L9329O14190N61988K24595M2786o7169k30557j73069J97195
$$ -317396 -970513 -931184 -316994 244994 469589 512375 445206 214649 41580 238775
39009B38775L44648p7287m55062p7561O19874O48187O5942j39573K34665K57706
$$ 238775 583423 506136 51074 -26487 593387 1241574 1307516 1167943 1402608 1660314
38999A660314m53397r29936l89194M70842N89452J22326r4667j5410k07393o08906
$$ 1660314 1206917 276981 -112213 358629 948081 1070407 975740 960330 752937 144031
38989A44031n94853j30167J69508J02392Q1979K50185K59673K1617j31543j20108
$$ 144031 -450822 -580989 -411481 -309089 -227110 23075 282748 304365 172822 52714
38979E2714j98850l09839j26957K14862K57040J06970K63287N06201P0384q57869
$$ 52714 -146136 -455975 -582932 -368070 -111030 -4060 259227 765428 835812 -22057
38969b2057j042859q3670P93799N32947k54810m47533p8033J71446K83819N66650
$$ -22057 -1064916 -1148586 -354787 178160 -76650 -524183 -602216 -430770 -146951 419699
38959D19699O62488J14107n44325m53131J42396K80285j45537l56594q7006J41378
$$ 419699 1082187 1196294 651969 198838 341234 621519 475982 119388 32382 173760
38949A73760J07992J53444L05047J89796j03508r7805O3798k39092q30903p86049
$$ 173760 281752 435196 740243 930039 826531 728726 792524 553432 -277471 -1063520
38939a063520k6360L47477j81645o26890p2375Q41379R24286J86721l80826k99857
$$ -1063520 -1089880 -742403 -924048 -1550938 -1623313 -781934 142352 329073 -51753 -351610
38929c51610K4841J61099J08105P214l7111R1038L72157N64020M92643K36061
$$ -351610 -326769 -165670 -57565 -50351 -87462 3576 375733 939753 1432396 1668457
38919A668457j01741m60451n84025k16348L18895L37134j89910n04534k28982
$$ 1668457 1566716 1106265 522240 305892 624787 961921 772011 267477 38495
38910C8495R7048L4575k5634K86672N43043K85570j50392l28517n05303r02326
$$ 38495 135543 170118 144484 431156 974199 1259769 1109377 780860 275557 -626769
38900f26769r26232j16093P90166Q55493M28246L98953N13429j07353j090131
$$ -626769 -1553001 -1669094 -878928 -23435 404811 803764 1317193 1209840 119709
38891A19709j099130l5966O64195K52749l21900j46085L16853L47262K00504L21060
$$ 119709 -979421 -1015387 -351192 -98443 -420343 -566428 -249575 97687 298191 619251
38881F19251L38001j66584o62666m42421J80253L77567R9289j8120K43417M51283
$$ 619251 957252 790668 128002 -314419 -134166 243401 342690 324570 567987 1019270
38871A019270K54431k40084o86991p00816j13605O14162O70044j8567n11691j88175
$$ 1019270 1273701 1033617 346626 -354190 -467795 146367 816411 797844 286153 97978
38861I7978K91610Q1179m29919k96154L19571L60897l48995p54882k11562N65941
$$ 97978 389588 470767 40848 -255306 64265 425162 76167 -678715 -890277 -324336
38851c24336O30618O8329l89687m17461k14647J5928K05818K64728J67984O2358
$$ -324336 306282 374611 -15076 -432537 -647184 -631256 -425438 -160710 7274 69632
38841F9632N6807P3621N8719J09391K31207K18601k8105k93245l52009k73789
$$ 69632 126439 200060 258779 368170 599377 817978 789873 496628 144619 -129170
38831a29170k10354r0548K03735M94994M50907O3408k60157j77045J62474L03483
$$ -129170 -339524 -430072 -226337 268657 719564 782972 522815 345770 508244 811727
38821H11727O9739k02412j22226J88596K49680n2846k52241j1946K92347Q9938
$$ 811727 881466 679054 556828 745424 995104 942258 690017 678071 970418 1060356
38811A060356n03827q12093n34976o0437K04535K98061L40759K24499k8281m5569
$$ 1060356 556529 -255564 -790540 -850977 -646442 -348381 -7622 216877 188596 143027
38801A43027L13212N06550L410p70980q41566n8754O08820M17349j37971j63993
$$ 143027 456239 962789 966199 195219 -646347 -705101 -96281 321068 183097 19104
38791A9104K51792K67324k85448n82299j17645M71495L87238j47498l59259j33311
$$ 19104 270896 538220 252772 -329527 -447172 24323 411561 264063 -95196 -228507
38781b28507L5172L3606J99647M66278L50665q6001j72374K10792L08338k32100
$$ -228507 -193335 -159729 39918 506196 856861 770860 598486 809278 1117616 885516
38771H85516o55148l14098K23159J29041k95102j99640L11880L93097m0307j66350
$$ 885516 230368 -83730 139429 268470 -26632 -226272 85608 478705 438398 272048
38761B72048L17324O79446L54364k15009l39980l6596K01692J12251j98592m83411
$$ 272048 589372 1268818 1623182 1408173 1068193 1031597 1233289 1345540 1146948 663537
38751F63537n00909k25061K0021m1303j62003M3623L42855J51878m40973o55615
$$ 663537 162628 -62433 -42412 -83715 -245718 -202095 140760 292638 -148335 -803950
38741h03950j73187M10039N17858K93464P3668j54941m02055l95766p0715J98150
$$ -803950 -977137 -567098 -49240 244224 317892 162951 -239104 -634870 -705585 -507435
38731e07435K06843K28640L96706M01311J53024N4628J83306l4645p62377j149004
$$ -507435 -300592 -71952 324754 726065 879089 933717 1117023 1082378 320001 -829003
38721h29003n44779L74296N79592J98371P0434K81511K37379r2929j42635J37084
$$ -829003 -1373782 -999486 -419894 -221523 -151089 130422 367801 274872 132237 269321
38711B69321J94480o6586j53590K614j00633m85590m78180J25988N86781L50412
$$ 269321 463801 397215 243625 246239 145606 -339984 -818164 -692176 -105395 245017
38701B45017j45642k94903k17359k56083k26467J47392N28728M17022j2138j89471
$$ 245017 99375 -195528 -412887 -668970 -895437 -748045 -219317 197705 185567 -3904
38691c904n9355m3534k07276j30295L20160O62220M59182r2809m73651m64052
$$ -3904 -63259 -106793 -314069 -444364 -124204 538016 997198 904389 430738 -33314
38681c3314k41211n1089j2217j26421k74320k57724k3328K01948J80931K3448
$$ -33314 -274525 -325614 -337831 -464252 -738572 -996296 -1019624 -817676 -636745 -613297
38671f13297K8657J83125J66709l5565K6537M93986P13467J19375p08183o80067
$$ -613297 -584640 -401515 -234806 -270371 -243834 250152 963619 1082994 374811 -305256
38661c05256J70415O22950O2687o12520m19636K12034K07578m43923p17258r0263
$$ -305256 -134841 488109 550796 -61724 -481360 -269326 -61748 -505671 -1222929 -1313192
38651a313192Q07252J110657O47066j09446n34069l10048K35605L76958r6823
$$ -1313192 -505940 604717 1251783 1142337 608268 298220 533825 910783 813960
38642H13960n09677k72440K00909J93999j26803r4945K02707Q9461m01663m97861
$$ 813960 304283 31843 232752 426751 299948 205003 407710 497171 95508 -402353
38632d02353m6800J86386j50557m06839q6267L43501L20117M6547p8499j59585
$$ -402353 -449153 -262767 -413324 -820163 -906430 -562929 -242812 -196265 -274764 -434349
38622d34349l46302l30617Q6848M87646M61785K16923N2430j72710m83945l79524
$$ -434349 -780651 -1111268 -1024420 -536774 -74989 141934 194364 21654 -462291 -841815
38612h41815K91690O71261K5334r29585q60071K66071J125444Q78763J04206k70707
$$ -841815 -550125 121136 146470 -783115 -1643186 -1377115 -251671 627092 731298 460591
38602D60591j27765Q4201J16662L5183n9229r1441KJ54019K21404J69256Q1873
$$ 460591 332826 417027 533689 568872 509643 418202 418204 572223 793627 962883 1044756
38591A044756k3525j59634j89941K8610L22523L23463j7871l09749k37963Q284
$$ 1044756 1021231 861597 671656 700266 1022789 1346252 1328381 1018632 780669 788953
38581G88953J9909k33333l31924j0606L67450K25507l62416o32472j74192M08740
$$ 788953 808862 575529 243605 232999 600449 825956 463540 -168932 -343124 65616
38571F5616L33140k15388m20566j11376J05584l1122p2315J83306K42106j70914
$$ 65616 398756 183368 -237198 -348574 -242990 -274112 -346427 -163121 78985 -91929
38561i1929n19244k83118K54554N48612N28685L22614j30224o62814p10537j40628
$$ -91929 -611173 -894291 -639737 -91125 437560 760174 629950 -32864 -743401 -884029
38551h84029L62998L34238K61106O09950Q64527M12100k95317m70146k87358l71253
$$ -884029 -521031 -186793 74313 684263 1548790 1960890 1665573 1195427 908069 536816
38541E36816n30445k20445J78632r8919o69389m41392M99812R18079M21706m4562
$$ 536816 6371 -214074 -35442 -134361 -803750 -1245142 -745330 172749 594455 549893
38531E49893L8260L305n01563o82000k8190O36604M34986k14075m28651k21887
$$ 549893 588153 591458 89895 -592105 -620295 16309 451295 237220 -191431 -413318
38521d13318j15281r5152J18242L08617J49019r3579l0162J08213l1457j46103
$$ -413318 -528599 -623751 -505509 -196892 -47873 -141452 -171614 -63401 -94858 -240961
38511b40961J52639M16190o392o91376n91532K68623O58104l3096q29826n96270
$$ -240961 -88322 327868 321476 -369900 -961432 -692809 -34705 -67801 -897627 -1493897
38501a493897L23007O64297O3444n34348l04553L61807N65793J93338j15062p9068
$$ -1493897 -1170890 -506593 -443149 -977497 -1282050 -920243 -354450 -161112 -276174 -355242
38491c55242j10117l92301l96278K00786P30160M10122l76030n41110J26014P21663
$$ -355242 -465359 -857660 -1253938 -1053152 -322992 87130 -288900 -830010 -703996 17667
38481A7667N88197O1651k92617l86911l03060j5432K71352J74348j82282j94437
$$ 17667 605864 667515 374898 -12013 -315073 -330505 -59153 115195 -67087 -261524
38471b61524K27101M17144O0629k51027n2928J86980n9881m02854k10143K65659
$$ -261524 -34423 382721 443350 192323 139395 326375 266494 -136360 -346503 -80844
38461h0844K86588j77890m57763k15197K03606L68058J97967j16837k57498k421
$$ -80844 205744 27854 -429909 -645106 -441500 -73442 124525 7688 -249810 -252231
38451b52231M03226M02370p1979l80210j11559K77628K20429j00530k08696j30562
$$ -252231 150995 553365 481386 101176 -10383 267245 487674 387144 178448 47886
38441D7886j04416L773K90477L15531j89321n75143j51821N70628N34994k13848
$$ 47886 -56530 -52757 237720 553251 363930 -211213 -363034 207594 742588 528740
38431E28740o15212k49764J82120J37776n4972l2666k2775k41557m03410k45049
$$ 528740 -86472 -336236 -154116 -16340 -71312 -103978 -126753 -368310 -771720 -1016769
38421a016769L4907K02908L42135M76166L39200j42771n47853m63222r944L64249
$$ -1016769 -981862 -778954 -436819 39347 378547 235776 -312077 -775299 -785243 -420994
38411d20994L73608M0597l91952n94008m16503o4397J80348L09413M19440L94353
$$ -420994 -47386 -6789 -398741 -992749 -1409252 -1473649 -1293301 -983888 -564448 -170095
38401a70095J29878j15398l7202K09156K75068J94887J94206J56005j21822l55353
$$ -170095 -40217 -155615 -192817 16339 291407 486294 680500 836505 714683 359330
38391C59330j51284K15328J46635k78858m43782k36539j05785j19264R4850M18562
$$ 359330 208046 423374 570009 291151 -152631 -389170 -494955 -614219 -519369 -100807
38381a00807K51596l66200o16338j72865L13153L28840J81584J83477P6543k49738
$$ -100807 150789 -215411 -831749 -1004614 -691461 -362621 -181037 2440 78983 -170755
38371a70755l35271K7549L47263L09930K76520M02690J89367m60055p05798j01733
$$ -170755 -506026 -478477 -131214 178716 455236 857926 1047293 587238 -118560 -220293
38361b20293M70145J59003m22644k58775L25958L01398k24617k52139K64639L05495
$$ -220293 249852 408855 -13789 -272564 53394 354792 130175 -121964 142675 448170
38351D48170l93521p95190k30567N45713N55989j4903k95271n472L76693M18432
$$ 448170 54649 -740541 -971108 -425395 130594 115691 -179580 -185052 191641 610073
38341F10073J87548O418N0945J90678J59958q3263k77918k54949j94083k63845
$$ 610073 797621 804039 854984 1045662 1205620 1122357 844439 589490 395407 131562
38331A31562k81348o4185J61898J20544k9790l4202n0355k49948k50009L06824
$$ 131562 -149786 -213971 -52073 68471 38681 4479 -45876 -295824 -545833 -239009
38321b39009Q57002N20692m56267q53142k26396M64168L44879j70654k53294K6872
$$ -239009 617993 1138685 682418 -170724 -397120 67048 411927 241273 -12021 14851
38311A4851K6431l18273m78537k64171l8613j7421M5052L38119O08698N11223
$$ 14851 41282 -276991 -755528 -1019699 -1058312 -1075733 -1030681 -692562 -83864 427359
38301D27359Q8037l10040m58925m31311l55076j81035J85061O02038P51615N20267
$$ 427359 515396 205356 -253569 -684880 -1039956 -1220991 -1035930 -433892 317723 837990
38291H37990J35588j50143k99277l25039j84752n865o9161l01938j92121L86356
$$ 837990 973578 823435 524158 199119 14367 8502 -60659 -362597 -554718 -168362
38281a68362O99554J29397p20441p13183J66403P50733L68624l14714m36916r9401
$$ -168362 531192 660589 -59852 -773035 -606632 144101 512725 198011 -238905 -338306
38271c38306R3672M885r9226j17135p1258J57611N60175P45005M11082j52864
$$ -338306 -244634 -239749 -338975 -456110 -527368 -369757 190418 935423 1346505 1193641
38261A193641m30500l11877k8759K54747M10905K13977l13943o68116m30198J25746
$$ 1193641 763141 451264 422505 677252 1088157 1302134 988191 320075 -110123 15623
38251A5623M20803L36033J31052j39675n38253p40493l04775N31659R39769N20148
$$ 15623 436426 772459 903511 763836 225583 -514910 -819685 -288026 651743 1171891
38241A171891k48836o99712o50834k80128J86406M67374L46363K8348n477K94649
$$ 1171891 923055 223343 -427491 -707619 -521213 -53839 292524 320872 315395 610044
38231F10044L95108r914m69871m37426q7329L74k71459m64766l28199o0628J48138
$$ 610044 1005152 995238 525367 87941 612 986 -270473 -735239 -1063438 -1124066 -975928
38220i75928L59994N65308N44076K54027J9160P2376J68930l9820m24795n24073
$$ -975928 -615934 -50626 493450 747477 766637 839013 1007943 968123 543328 19255
38210A9255k12719J23368J42188l7898j25259r2115q2462o8570Q5579K84867K54982
$$ 19255 -193464 -70096 72092 34194 -91065 -183180 -265642 -334212 -248633 36234 291216
38199B91216l1246k81048l22701l10563l35230j65654L23063P41492O21169J05304
$$ 291216 259970 -21078 -343779 -654342 -989572 -1155226 -832163 -90671 530498 635802
38189F35802k45759k62553k69516l62037j86423L22219N60642P7036o38697p44586
$$ 635802 390043 127490 -142026 -504063 -690486 -368267 192375 269411 -369286 -1113872
38179a113872j90460L05685L11760J13349O5323R8108N8264N6076J91868K87036
$$ -1113872 -1304332 -998647 -686887 -573538 -508215 -410107 -351843 -295767 -103899 183137
38169A83137J73997m392l9195J3713k6107j70861k94828k88087o3075L60815O82086
$$ 183137 357134 352742 313547 327260 301153 130292 -164536 -452623 -515698 -154883 527203
38158E27203N48664J00083j22784n845q7956o04391q80513l05881N43379N88158
$$ 527203 1075867 1175950 1053166 1047321 959365 354974 -525539 -831420 -288041 300117
38148C00117j68260o35119k23117M38306N88588L51211K59760L73397L53522N9327
$$ 300117 131857 -503262 -726379 -288073 300515 651726 911486 1284883 1638405 1697732
38138A697732l37413o15058o39928m44867k69961k69960k10226J50114M71996
$$ 1697732 1360319 745261 105333 -339534 -609495 -879455 -1089681 -939567 -467571
38129d67571K49036k34284j74813M02216N33552j05880n61624j42911M20486K38359
$$ -467571 -218535 -452819 -627632 -225416 308136 202256 -359368 -502279 -81793 156566
38119A56566k55305j88620J63631R189l32863M3827P82565N90500n32370j045013
$$ 156566 -98739 -287359 -123728 -114539 -447402 -403575 378990 969490 437120 -607893
38109f07893k43748O57671N08454j10664j37302K28767J82969j54446j11372J94759
$$ -607893 -851641 -193970 314484 203820 66518 295285 478254 323808 212436 407195
38099D07195J12894k60338k19948K40688L51634j30430n17331l21754L8618K8292
$$ 407195 520089 259751 39803 280491 632125 501695 -15636 -337390 -298772 -270480
38089b70480j79025j13737J99166L33580J27727j21603q1096K20070M35997K93671
$$ -270480 -449505 -563242 -364076 -30496 97231 -24372 -105468 114602 550599 844270
38079H44270q2796l14780k57569j47801j44639j8546L95167O93441L44505m52348
$$ 844270 761474 446694 189125 41324 -103315 -121861 273306 966747 1311252 858904
38069H58904q70313n14021P8467J94017j60652m05553j89115K73190N74044N56203
$$ 858904 -11409 -525430 -446963 -252946 -413598 -819151 -1008266 -735076 -161032 395171
38059C95171L44674J17244l6618p7209J8819J62595J28529j78863m70057l56624
$$ 395171 739845 857089 820471 743262 762081 924676 1053205 874342 404285 47661
38049D7661N8915K14714j28574n02107m13066n6645Q2842L3524J60760L78424
$$ 47661 106576 321290 192716 -309391 -722457 -779102 -696260 -662736 -501976 -123552
38039a23552K34698k03514k79007K27353O61525M61678j3951j19024Q9463J07992
$$ -123552 111146 -92368 -371375 -144022 517503 979181 965230 846206 935669 1043661
38029A043661q0172l7823K54297K62623k31126p10384o39817j74745J51269J34608
$$ 1043661 963489 925666 1179963 1442586 1211460 501076 -138741 -313486 -162217 -27609
38019b7609k1004j09620q2066O2551K55568L23668K22037J82961L54039M29519
$$ -27609 -48613 -158233 -240299 -177748 77820 401488 623525 806486 1160525 1590044
38009A590044L4696n85522p50370l04419J15969K4426k07018j7292L82112L50362
$$ 1590044 1624740 1039218 288848 -15571 100398 124824 -82194 -99486 282626 632988
37999F32988q8741k35878J52860M43622J09475m74140o52794m33029k53527j57188
$$ 632988 544247 308369 461229 904851 1014326 540186 -112608 -545637 -799164 -956352
37989i56352J54466N69551N48067k6730n32323l96234J89601O14439N96868K88687
$$ -956352 -801886 -232335 315732 289002 -243321 -639555 -449954 164485 761353 1050040
37979A050040j11328m73636n99616l59974J7553J30333n0563j12736J73656M57165
$$ 1050040 938712 465076 -134540 -494514 -476961 -346628 -397191 -509927 -336271 120894
37969A20894L00820j37446l08178q5514P4174j00438k30304Q5521N33883M82085
$$ 120894 421714 284268 -23910 -109424 -35250 -135688 -365992 -280471 253412 735497
37959G35497m8010l57708o8654L72934L80555j5105l75214m83012m30757l07962
$$ 735497 687487 329779 261125 634059 1014614 999509 624295 141283 -289474 -597436
37949e97436j40067p442M3740J02289K07587K27064J06499J7230L2079n3960k79903
$$ -597436 -737503 -744945 -701205 -598916 -391329 -164265 -57766 -40536 -8457 -62417 -342320
37938c42320k50996K27914N90919K25236m73489n38924J18554N61026K75587j16729
$$ -342320 -593316 -365402 225517 450753 -22736 -561660 -443106 117920 393507 276778
37928B76778j618K33900J3741l12009n0210N49932N65157j59336p45288n71334
$$ 276778 275160 509060 522801 210792 160582 710514 1275671 1116335 371047 -200287
37918b00287l8814K04189J30905O0922M8406j5276m7115O0755J59248Q0715m0145
$$ -200287 -239101 -34912 95993 156915 205321 190045 142930 203685 362933 443648 403503
37907D03503o770N9272q8597l78139m89119k97182K1023K61765L36646K16464
$$ 403503 396733 456005 367408 -10731 -499850 -797032 -776009 -514244 -177598 38866
37897C8866l4294k27177k43675j61535l0138K62005O37847O31244j9842p69717
$$ 38866 4572 -222605 -466280 -627815 -657953 -395948 241899 873143 853301 83584
37887H3584q09527j60743L57032K88117M1831O4488J63847J8781j93038j54068
$$ 83584 -725943 -886686 -529654 -241537 -199706 -135218 28629 47410 -145628 -299696
37877b99696K1656O4520N3583J49798J46658j57609m15009j92238K05869R1923
$$ -299696 -278040 -213520 -159937 -10139 136519 -21090 -436099 -628337 -422468 -330545
37867c30545m66263o12338M0705P97238Q34917K44582k61403k94815n6776R9599
$$ -330545 -796808 -1409146 -1368441 -571203 263714 508296 246893 -47922 -104698 -5099
37857e099K9643j61143k25010j9356K68204L09225Q1118j23656j57176j52038
$$ -5099 24544 -136599 -361609 -380965 -112761 196464 277582 153926 -3250 -155288
37847a55288j51102k4552J20974n4330m64149m63285K13831Q54896O80572J64
$$ -155288 -306390 -330942 -209968 -264298 -728447 -1191732 -977901 -123005 557567 557731
37837E57731k41975J05166K29386k87311p33133l30722N20973P39554J02403m14820
$$ 557731 315756 420922 650308 362997 -370136 -700858 -179885 559669 662072 247252
37827B47252l6991O55561N21355m49268r88573k96423P69116Q46495l6962n89049
$$ 247252 210261 865822 1387177 937909 -50664 -347087 422029 1268524 1231562 642513
37817F42513j65068M04956J95022m60681o03058p3708M19089L79783L920l19265
$$ 642513 477445 882401 1077423 616742 13684 -60024 359065 738848 742768 423503
37807D23503m20648k74875M4497L02778L07838J46171j4174j88669l61164k65732
$$ 423503 2855 -272020 -227523 75255 383093 529264 515090 326421 -34743 -300475
37797c00475J89399N16575K13876m09489n81561j93704Q2869j05637k64208R1869
$$ -300475 -111076 405499 619375 209886 -371675 -565379 -482510 -588147 -852355 -760486
37787g60486O14067O08090J3342n48234n76811k20698P471j12968k03631K55484
$$ -760486 -146419 461671 475013 -73221 -650032 -870730 -863259 -976227 -1179858 -924374
37777i24374J084617J314619L43991j017014j307266k68099P76199O82976o2349
$$ -924374 160243 1474862 1818853 801839 -505427 -773526 2673 685649 623300
37768F23300k39557L08414O11953J37689m67688m31102K6044J15667l23935o35242
$$ 623300 383743 692157 1304110 1441799 974111 543009 569053 684720 360785 -274457
37758b74457l11969L22199O09242M10630J26162L991j42576m48018o23204l63019
$$ -274457 -586426 -264227 345015 755645 881807 885798 743222 295204 -328000 -691019
37748f91019J10518K73509n073l10810k33886J76826N35692N10118R9499l12875
$$ -691019 -580501 -306992 -312065 -622875 -856761 -679935 -144243 365875 465374 152499
37738A52499k67814K06352M82516J03434m82687m31549K74932P01871K54911m62239
$$ 152499 -115315 91037 573553 676987 194300 -237249 37683 739554 994465 532226
37728E32226n04359J10974N18935K46752k52572l65727j15727O2861K0097o005
$$ 532226 27867 138841 657776 904528 651956 286229 170502 233363 253460 247455
37718B47455J13052J59139m9200k83141j71258K36489M55108J79439l21595n57615
$$ 247455 360507 519646 470446 187305 16047 252536 707644 887083 565488 7873
37708G873l73421N734L05130L72401J72810j40700k54392l4629K34607J88301
$$ 7873 -365548 -359814 -54684 317717 490527 349827 95435 60806 295413 483714
37698D83714j26185l40171k69969n8246J31948K67852L12977K34792J52111K01190
$$ 483714 357529 17358 -252611 -310857 -178909 88943 401920 636712 788823 990013
37688I90013K52935N1014l46633n63753m11892j29454j4558m8698j8582J33370
$$ 990013 1242948 1293962 947329 383576 -28316 -157770 -172328 -221026 -239608 -106238
37678a06238K10218o28l99777n49009j56339M27660N48237J75038J800L51179
$$ -106238 103980 103352 -296425 -845434 -1001773 -574113 -25876 149162 150962 502141
37668E02141N77042R4107n70907n59626q4173n1951n09956n83508O37M69047L40980
$$ 502141 1079183 1173290 602383 42757 -41416 -93367 -603323 -1186831 -1186194 -717147 -376167
37657c76167J27097K43389K38972k60348p03127m61611J35972L74600K17545R0096
$$ -376167 -249070 -5681 233291 -27057 -730184 -1191795 -1055823 -681223 -463678 -373582
37647c73582P8159M3294R9315K79757J64384m24118p77040k06619P23056Q10913
$$ -373582 -295423 -252129 -152814 126943 291327 -132791 -909831 -1116450 -393394 417519
37637D17519p1764q13816o36621K6081L92942L21668J25633j7871j14194j54397
$$ 417519 345755 -468061 -1104682 -1078601 -685659 -363991 -238358 -256229 -370423 -524820
37627e24820j40980j09054k2863J46200K42027P8008k48746m45792l83299j41051
$$ -524820 -665800 -774854 -797717 -651517 -409490 -331482 -580228 -1026020 -1409319 -1550370
37617a550370J77266M19808L63682M1990j18068J25198L53373J02327k70321j1652
$$ -1550370 -1373104 -953296 -589614 -547624 -665692 -540494 -187121 -84794 -355115 -366767
37607c66767P78036J068289K81433q61609j236894o41881J61196M72934L30051
$$ -366767 411269 1479558 1760991 899382 -337512 -979393 -818197 -345263 -15212
37598a5212J78975J75138L0166m17711p38678m01390L21819N24339l1988m29048
$$ -15212 163763 338901 369067 -48644 -787322 -1188712 -866893 -342554 -374542 -803590
37588h03590Q2570Q72740Q32887N8141l58060m0364K28732r2654m92109l76315
$$ -803590 -721020 151720 984607 1042748 684688 644324 873056 780402 288293 -88022
37578h8022j0624N4501j32588j84702p4826m3012j08966j20599n7857M7637K50780
$$ -88022 -98646 -44145 -176733 -361435 -436261 -479273 -588239 -708838 -766695 -719058 -468278
37567d68278M67596M03076P800k91421j58661J27018R7368j75404k04754J47961
$$ -468278 -682 402394 410194 118773 -39888 87130 184498 9094 -195660 -47699
37557d7699M39509K30626l38884o68672l50953L11092N37325j7420p17149o59163
$$ -47699 391810 622436 283552 -385120 -736073 -424981 112344 94924 -622225 -1281388
37547a281388J27517P03753N26251J22482J46926L69717J92582k53528k91087
$$ -1281388 -1153871 -450118 76133 198615 345541 715258 907840 654312 363225
37538C63225J57940L75835n8657o14084n68162R636M42544L71232P7334n5508
$$ 363225 521165 897000 838343 224259 -343903 -334267 108277 479509 556843 501335
37528E01335k9624p2670k33517l35121k46360l3964J51322K22459J86244J33721
$$ 501335 471711 399041 165524 -169597 -415957 -449921 -298599 -76140 110104 243825
37518B43825J96675L79367M38296J32870l53485n04151j40172K59017J71838k44176
$$ 243825 440500 819867 1258163 1391033 1037548 533397 393225 652242 824080 579904
37508E79904m11622j83786J0196j08294k46131m0440L54398M82238K26892n4498
$$ 579904 168282 -15504 -5308 -113602 -359733 -400173 -45775 436463 663355 608857
37498F08857l1231J82555K07722r4412m42550n04319l10338j37323o6009P0230
$$ 608857 577626 760181 967903 873491 430941 -73378 -383716 -521039 -587048 -516818
37488e16818K86197L39140J63029O5211K40098L94650J96145j54350k00641O7453
$$ -516818 -230621 108519 271548 336759 576857 971507 1167652 1013302 812661 880114
37478H80114K09870j0960l34527l84281r5828K47581K68710j26386n34100m36489
$$ 880114 1089984 1079024 744497 360216 264388 511969 780679 654293 120193 -316296
37468c16296R3377M22440K68964Q9358K24617K47753k60908q17803o90057o9658
$$ -316296 -222919 199521 468485 557843 782460 1030213 769305 -48498 -738555 -808213
37458h08213K56111J52777J62875M33808N43373L53019J45136o8135m60006o50603
$$ -808213 -552102 -399325 -236450 197358 740731 1093750 1238886 1170751 710745 60142
37448F0142j05161O65761M89417o13788j185889m52735M98748M22501k61585l34860
$$ 60142 -45019 620742 1110159 496371 -689518 -1142253 -643505 -221004 -482589 -817449
37438h17449L11005P28746M40784q3176k85767r8028K33085L60075N1701m23383
$$ -817449 -506444 222302 663086 579910 294143 196115 429200 789275 840976 417593
37428D17593m47523O7664M27924J94916j06198J14241M97122L61570j36096l08167
$$ 417593 -29930 37734 465658 660574 554376 668617 1165739 1527309 1391213 1083046
37418A083046p9789J4246j93130l03541q6763K15241K94873L3316n04577r24283
$$ 1083046 1003257 1017503 824373 520832 434069 649310 944183 977499 472922 -451361
37408d51361o54261K59306Q72487M65231m06037o65126j95742K30381K52685K45916
$$ -451361 -1105622 -846316 26171 491402 85365 -579761 -775503 -545122 -292437 -46521
37398d6521M10794M29469J56616p8404n0585M7641K1733o3837j28937j90261k23841
$$ -46521 364273 793742 950358 871954 821369 869010 890743 826906 697969 507708 283867
37387B83867k45275l92524n86921m12391J98705N61858J78908l33856j13984M98887
$$ 283867 38592 -353932 -940853 -1353244 -1154539 -592681 -413773 -747629 -861613 -362726
37377c62726M48011k77431n72880r243N25063L30406q1122m0388J65370k9065
$$ -362726 85285 -192146 -765026 -774269 -249206 81200 78 -40310 125060 95995
37367I5995l98130l30116J51879M76955L65138L5958k19485k68301j24018J0281
$$ 95995 -302135 -632251 -480372 -3417 361721 397679 178194 -90107 -214125 -203844
37357b03844r5888l13641k43101J49926L86879J77657j51757j83805M2995K63413
$$ -203844 -299732 -613373 -856474 -706548 -319669 -142012 -293769 -477574 -434579 -171166
37347a71166L61890K83871l729k40962n0660L73802L38496k57238n58916j9140
$$ -171166 190724 474595 470866 229904 179244 553046 891542 634304 75388 56248
37337E6248O14491L33013n68593q64646j61879O04485N32870j28195m96281j71908
$$ 56248 670739 1003752 435159 -429487 -591366 13119 545989 417794 -78487 -250395
37327b50395M72317Q11815N34890j26388n78819m19119J24490M37609K29496j76407
$$ -250395 221922 1033737 1568627 1442239 863420 444301 568791 1006400 1235896 1059489
37317A059489l02767q0565J57836J24685j23440l10890k67197p5606P0056Q0050
$$ 1059489 756722 676157 833993 958678 835238 524348 257151 181545 251601 331651
37307C31651J0302m3659l7811j5638q2485k46313k70554R8492O54959P77926K09417
$$ 331651 341953 298294 260483 244845 162360 -83953 -354507 -256015 398944 1176870 1386287
37296A386287m81917n83791j63737J45287R9163R030L2634l5083j78344m6466
$$ 1386287 904370 320579 156842 302129 401292 410322 442956 407873 229529 183063
37286A83063L35435L83804j32018n60017k55170M38653O81976L22480l8830l1470
$$ 183063 518498 902302 770284 210267 -44903 393750 1075726 1398206 1359376 1327906
37276A327906N8562r4043l39430l67899j88325l8771j7316l3428k9125l9535n0787
$$ 1327906 1386468 1292425 952995 585096 396771 358000 340684 307256 278131 238596 187809
37265A87809J4905J19916R0166r8394j77093L9093K63641Q4352l49597m54256
$$ 187809 202714 322630 412796 314402 137309 176402 440043 524395 174798 -279458
37255b79458j00358J76338P7790L7208L85863O43743K83215l11459m20820j17776
$$ -279458 -379816 -203478 -125688 -88480 297383 941126 1224341 912882 492062 374286
37245C74286L2354L6123K52445M00156n4917o52356l80035N53742P92793Q792
$$ 374286 406640 442763 695208 1095364 1040447 388091 8056 561798 1354591 1363383
37235A363383m64249J75290Q11258K55240p60503p87111L2150L69670o9770k85518
$$ 1363383 899134 1074424 1885682 2140922 1380419 593308 625458 995128 925358 639840
37225F39840J52527L94309k27552j098635j182610l41998O11491Q55174L39587
$$ 639840 792367 1186676 959124 -139511 -1322121 -1664119 -1052628 -197454 142133
37216A42133k00432o0387N15450N91333o3909m69863J16166R07674O68500l78338
$$ 142133 -58299 -118686 396764 988097 924188 454325 570491 1478165 2146665 1768327
37206A768327q55438k76913L94290L51142k1086r0623l379j83606m83296m44269
$$ 1768327 912889 635976 1030266 1381408 1360322 1269699 1266320 1082714 599418 155149
37196A55149k9327L80242M92498L22486Q8644K5641J10870J4123l90107o30724
$$ 155149 125822 506064 998562 1321048 1409692 1435333 1546203 1560326 1170219 539495
37186E39495k56291L27195L36448j31445j81107M12211P59356K62084m40474n26284
$$ 539495 283204 610399 946847 815402 634295 1046506 1805862 2067946 1627472 1101188
37176A101188k06414j26907j98574N7246M13483J92280n16343q27055l38450L46077
$$ 1101188 894774 767867 569293 626539 1040022 1232302 715959 -111096 -449546 -103469
37166a03469N61267L67233J44602K076q3928l0391R6167J115l05292l16883J87435
$$ -103469 457798 825031 969633 971709 887781 857390 953557 954672 649380 332497 519932
37155E19932N82911K26403m51607m51435K80439P03589K46629l43956k14590K80279
$$ 519932 1102843 1329246 877639 426204 706643 1410232 1656861 1312905 1098315 1378594
37145A378594K44585k86163m81929j17900J44195o2732k68089o9900K22445K42151
$$ 1378594 1623179 1337016 855087 737187 881382 818650 550561 480661 703106 945257
37135I45257J63173J96785J35304r4891n8280L94148N57252j23138r70585r16553
$$ 945257 1108430 1305215 1440519 1345628 1287348 1681496 2238748 2115610 1145025 228472
37125B28472r1915M10553K01307m5412N6607J4173m27483o01397j1114O64705
$$ 228472 136557 547110 748417 703005 759612 773785 346302 -255095 -266209 398496
37115C98496M84825l06237o10192p3132M81051L16370k15722k95593J87903N60878
$$ 398496 883321 577084 -33108 -106240 374811 691181 475459 179866 367769 928647
37105I28647L35388j82616l78092j28456J45218J20008m7942o0118O3014O9033
$$ 928647 1264035 1081419 703327 574871 720089 840097 792155 732037 795051 864084
37095H64084r2038j58146P4815M13321M34088K3206l79608k90044R4365O7688
$$ 864084 772046 613900 688715 1102036 1536124 1559330 1179722 889678 984043 1051731
37085A051731n00089p62062r4096P69028O60446k01344m49351K87325P52370R1600
$$ 1051731 551642 -210420 -304516 464512 1124958 923614 474263 761588 1513958 1605558
37075A605558p34131n10361K81493L37785l31497n65846l7845L65600J69286k1294
$$ 1605558 871427 361066 642559 980344 648847 83001 45156 410756 580042 558748
37065E58748K28320M22153J13236k83703k26413J00610K11093Q3173K5951J54960
$$ 558748 787068 1209221 1322457 1038754 812341 912951 1124044 1207217 1233168 1388128
37055A388128L56436M78199L58275j1510k72739p7179K88194J96353l35570o02556
$$ 1388128 1744564 2222763 2581038 2569528 2296789 2219610 2507804 2704157 2368587 1766031
37045A766031l03092L5701N584l0890L13263O71125M65502j87920o65170o47891
$$ 1766031 1462939 1498640 1504224 1473334 1786597 2457722 2923224 2735304 2070134 1422243
37035A422243l20294O479J04280j13569m43133n11343k47249M8484K35328M92879
$$ 1422243 1101949 1108428 1212708 1099139 656006 144663 -102586 -54102 181226 674105
37025F74105P51211N39060j97791o91110l59450K24628J16232n33054o50085J27492
$$ 674105 1425316 1964376 1766585 1075475 716025 940653 1056885 523831 -126254 1238
37015A238Q72299P31919J34038L4730M38197M64996j90151o99457l29567M19199
$$ 1238 873537 1605456 1739494 1774224 2212421 2677417 2487266 1787809 1458242 1877441
37005A877441N17026j21019o08072m23970o920J08015J3630J6596J24074K66290
$$ 1877441 2394467 2273448 1665376 1241406 1234486 1342501 1356131 1372727 1496801 1763091
36995A763091M70676N33922J44467l89267k95325M07092P07013J94740j47493
$$ 1763091 2233767 2767689 2912156 2522889 2227564 2634656 3341669 3536409 3388916
36986C388916M59194J205183R55843K3804n25076n73232o51895o24265r5279M17511
$$ 3388916 3848110 5053293 6009136 6032940 5507864 4934632 4282737 3658472 3563193 3980704
36976C980704J85038l45784l19671o9416l55071o29730O3507R89783O53785m90030
$$ 3980704 4165742 3819958 3500287 3430871 3075800 2446070 2509577 3499360 4153145 3663115
36966C663115n75433N15479R69336J80539m23439q9241K32147J26036M53939J132449
$$ 3663115 3087682 3603161 4572497 4753036 4329597 4240356 4472503 4598539 5052478 6184927
36956F184927P68467n64361q29635N45190J413743M75577n59214m1771R33343
$$ 6184927 6953394 6389033 5559398 6104588 7518331 7993908 7434694 7392923 8326266
36947H326266Q43342L92062P97138J509310J621176J619228J994731K143673K139517
$$ 8326266 9169608 9561670 10358808 11868118 13489294 15108522 17103253 19246926 21386443
36938B1386443L202973N042913N688918N368373O820610J0072782J1627328J1241557
$$ 21386443 24589416 29632329 35321247 40689620 47510230 57583012 69210340 80451897
36930H0451897J3694789K0215755K5267870K7569369L5622362N1688193N7441607
$$ 80451897 94146686 114362441 139630311 167199680 202822042 254510235 311951842
36923C11951842L1697729j8001008n7325299o3157043m6546860l1878228k6594949
$$ 311951842 343649571 325648563 268323264 205166221 158619361 126741133 100146184
36916A00146184k2194589j4737183r528525q878289q235279n203261k958780l266071
$$ 100146184 77951595 63214412 53685887 44807598 36572319 31369058 28410278 25144207
36908B5144207l501114k206325j487264k296671k523489j265990m87941j085622
$$ 25144207 21643093 19436768 17949504 15652833 13129344 11863354 11375413 10289791
36900A0289791j374981o65793n12406j292546j213143J22468O62459l73113j056963
$$ 10289791 8914810 8249017 7736611 6444065 5230922 5353390 6015849 5642736 4585773
36891D585773l04290L33253k25647p22943k38832J04643m08488o25520J4909J76882
$$ 4585773 4281483 4614736 4389089 3666146 3427314 3531957 3123469 2497949 2512858 2689740
36881B689740o95201r77963J90639J083948L43008o18198j98687N94944J85385
$$ 2689740 1994539 1016576 1207215 2291163 2634171 2015973 1817286 2412230 2597615
36872B597615o59666l58695N75801O01208o1511p9541M16911K13177n96286p53628
$$ 2597615 1937949 1579254 2155055 2756263 2694752 2615211 3032122 3245299 2649013 1895385
36862A895385j08402K02921j97265m14786L6100M78325L03189j33089j97072J59559
$$ 1895385 1786983 1989904 1792639 1377853 1413953 1892278 2195467 2062378 1865306 2024865
36852B024865N00772M62871R3572k07610j72418m8291j68934l13483j08429J52887
$$ 2024865 2525637 2988508 3082080 2874470 2702052 2653761 2484827 2171344 2062915 2215802
36842B215802j6791k26707K17255Q26732M96609m35152m24617P15538J369571
$$ 2215802 2199011 1972304 2189559 3016291 3512900 3077748 2653131 3368669 4738240
36833D738240P62841R7666K82742N41134K98343M29460J362663J926300J514184
$$ 4738240 5501081 5598747 5881489 6422623 6720966 7150426 8513089 10439389 11953573
36824A1953573J409993K400527L204302L080605L647738N828923P533462P409513
$$ 11953573 13363566 15764093 18968395 22049000 25696738 31525661 39059123 46468636
36816D6468636Q300451J2621772J6055151J1341264j435759j3411117j7187250
$$ 46468636 54769087 67390859 83446010 94787274 93351515 79940398 62753148
36809F2753148j4273957j0500350q216048o168792m012669k924391k875053k523963
$$ 62753148 48479191 37978841 29762793 23594001 19581332 16656941 13781888 11257925
36801A1257925j589691j050912j156143j098924o16498l66024o54119r89034r46921
$$ 11257925 9668234 8617322 7461179 6362255 5745757 5379733 4725614 3736580 2789659
36792B789659n86739p3021L86373M25184o521l43658j81057N1004j94823o55588
$$ 2789659 2202920 2129899 2516272 2941456 2934935 2591277 2410220 2461224 2266401 1610813
36782A610813p34092m41935j52906J22625M60283M85028m6824n37190l21201J85193
$$ 1610813 876721 434786 281880 404505 864788 1349816 1302992 765802 444601 629794
36772F29794Q4622m92970n43518J82270P64850N39931J739j12843R4353L3279
$$ 629794 714416 221446 -322072 -139802 625048 1164979 1166718 1053875 1148228 1181507
36762A181507m16809q10371p75957l88405O071J34494L4003J7737K96572O34938
$$ 1181507 764698 -45673 -821630 -1210035 -1203964 -1069470 -1035467 -1017730 -721158 -86220
36752h6220N81723Q2955l66605l09940J05813L29108J00150k40241j93260K71985
$$ -86220 495503 578458 211853 -98087 7726 336834 436984 196743 3483 275468
36742B75468O85763O50646K59262j38438l79970n07927n07814l22113p5869k702
$$ 275468 961231 1611877 1871139 1732701 1352731 844804 336990 14877 -60992 -63694
36732f3694j19419j93808o2304J90330L58076K84273j8264k90860k40773J8231
$$ -63694 -183113 -376921 -439225 -248895 109181 393454 375190 84330 -156443 -138212
36722a38212K0296l19283m26702N5596N61120M10462n2101J6940N36950O08865
$$ -138212 -117916 -437199 -863901 -808305 -247185 163277 111176 128116 665066 1273931
36712A273931J6433m45398l26127j46533l08463l93323p6638J84559K3851j07526
$$ 1273931 1290364 844966 518839 372306 63843 -329480 -406118 -221559 -197708 -305234
36702c05234J88019M13499K6799n27476n31353j93082j83093m06548k55407J93557
$$ -305234 -117215 296284 323083 -204393 -735746 -928828 -1111921 -1518469 -1773876 -1580319
36692a580319K75378o2714j49890K51110N64751L65211l6360k04892j50342l2001
$$ -1580319 -1304941 -1367655 -1517545 -1266435 -701684 -336473 -372833 -577725 -728067 -760068
36682g60068J67233L99435M11249J02767k81231m89850n19669m15821j12427L70046
$$ -760068 -592835 -193400 217849 320616 39385 -450465 -970134 -1385955 -1498382 -1128336
36672a128336P70111P81309L55694j93069l93343q4080K97773K00564k06157j69663
$$ -1128336 -358225 423084 778778 585709 192366 108286 406059 606623 400466 230803
36662B30803M42686P16980R020r00267p94431J91266P40622K35444n04719n47121
$$ 230803 673489 1390469 1399489 499222 -295209 -103943 636679 872123 367404 -179717
36652a79717n7604K14765M9545j42464j6569K93068L73981K3972m04222k82190
$$ -179717 -237321 -22556 26989 -115475 -132044 161024 535005 558977 154755 -127435
36642a27435M52157R78686N49535m41878r09564m88526J31943K89334R1233p2071
$$ -127435 324722 1303408 1852943 1411065 501501 12975 144918 434252 525485 453414
36632D53414j43552k54269m08164n50407o20508m35878J07529O76024P76912M41116
$$ 453414 309862 55593 -352571 -902978 -1523486 -1959364 -1851835 -1175811 -398899 42217
36622D2217J59228J12526J3460k35174l43293k29582j82712k45399q9268K69636
$$ 42217 201445 313971 327431 92257 -251036 -480618 -663330 -908729 -997997 -728361
36612g28361L28847j4722j59780J99261M93025K41976j06984o282J74997j57548
$$ -728361 -399514 -414236 -574016 -374755 118270 360246 253262 246980 421977 264429
36602B64429o07496l19735M90031O61243j40425q18284m31810M47194O17680n2620
$$ 264429 -343067 -662802 -172771 488472 348047 -470237 -902047 -454853 162827 110207
36592A10207n85926l52974J87315L38736J36901O8346J99672J37160k28825m77128
$$ 110207 -475719 -828693 -641378 -302642 -165741 -97395 102277 239437 10612 -466516
36582d66516k91283Q9326K83490K76528K49371K27835J89894J92861J10347l30813
$$ -466516 -757799 -668473 -384983 -108455 140916 368751 558645 751506 861853 531040
36572E31040q94461p82163J85423R32680N18564l57837l33196N03104P96053J36169
$$ 531040 -363421 -1145584 -960161 -27481 491083 133246 -199950 303154 1099207 1235376
36562A235376l90985j24402J74701j57733n03511j55806L93628L36718j31359
$$ 1235376 844391 719989 894690 736957 233446 77640 471268 807986 676627
36553F76627l31601k35248j78229r0238J25461Q2125l60068n23411K1209N27020
$$ 676627 345026 109778 -68451 -158689 -33228 48897 -311171 -834582 -813373 -286353
36543b86353K28823k92530r2370M46937K86583l97438n30253o4166j5431n79364
$$ -286353 -57530 -350060 -442430 4507 291090 -106348 -636601 -700767 -716198 -1295562
36533a295562p45161m0901P09950P53670L47175k9647l08027l37596J62003Q02149
$$ -1295562 -2040723 -2081624 -1371674 -618004 -270829 -300476 -608503 -946099 -784096 18053
36523A8053P37967L1056k92655Q7557K61512k62593o47250k06764L82244K86016
$$ 18053 756020 787076 494421 581978 843490 580897 -66353 -273117 109127 395143
36513C95143r7636j2277K58141J6358m75280m25828J11985L94637K18624J1026
$$ 395143 297507 285230 543371 559729 84449 -341379 -229394 165243 383867 394893
36503C94893o7955j82576j86574J61472M97161K49011l49827n02886p1601K72196
$$ 394893 326938 144362 -42212 119260 616421 865432 515605 12719 -58882 213314
36493B13314J46253q9045r3112k3199n1633l2798J10338J62534r121k35140l21388
$$ 213314 359567 270522 177410 154211 102578 69780 180118 342652 333531 98391 -222997
36482b22997k28579L0854L38569M02263J41019k5546K16622L99267p7986p59881
$$ -222997 -451576 -420722 -82153 320110 461129 435583 652205 1051472 973486 213605
36472B13605n52208N37206J116192L67601o41308m44036O81505J114824K04805
$$ 213605 -338603 198603 1314795 1682396 1041088 597052 1278557 2393381 2598186
36463B598186r03550r52749j83747K63390k8126m39691m14557j42647q893N4768
$$ 2598186 1694636 741887 558140 821530 793404 353713 -60844 -203491 -212384 -157616
36453a57616K71306M42201K00203k92932m54856j47087R8826o9085k43806Q0804
$$ -157616 113690 555891 756094 463162 8306 -138781 -39955 -109040 -352846 -272042
36443b72042O43069P22357J45601n16711p32167n36576k24076P8705L38212M01546
$$ -272042 371027 1093384 1238985 722274 -9893 -546469 -770545 -691840 -353628 47918
36433D7918J30972l24495n79773l81851J20003N16127N60054L89908K68812K18902
$$ 47918 178890 -145605 -725378 -1107229 -987226 -471099 88955 478863 747675 966577
36423I66577R0264j04712k11223k53152l90993n36065m01174k2743J98534J21554
$$ 966577 1056841 952129 740906 487754 96761 -439304 -840478 -863221 -664687 -543133
36413e43133N9272J49832P0327l01523m95751j79585K26629K11103j0235L9479
$$ -543133 -483861 -334029 -263702 -565225 -1060976 -1240561 -1013932 -802829 -813064 -773585
36403g73585K31473J51771n5951L3668K55331J03555k92263l19306M1924J79229
$$ -773585 -542112 -390341 -446292 -412624 -157293 -53738 -346001 -665307 -623383 -444154
36393d44154p4283k16712n2552O932j69036j41637J88213K70496p4137j93304
$$ -444154 -518437 -735149 -787701 -780769 -949805 -1091442 -903229 -632733 -706870 -900174
36383i00174K88955P13043M15893j78920k87310j1285J123k72080l01636k6834
$$ -900174 -611219 101824 517717 338797 51487 40202 41325 -230755 -532391 -559225
36373e59225Q4970n3012Q784M07864O66248M45336N1354q2848k0780j31112m93560
$$ -559225 -474255 -527267 -518483 -110619 555629 1000965 1052319 969471 948691 817579 324019
36362C24019p45154m87353K23403Q09273P06159J8888n45749n03635r5575J94079
$$ 324019 -421135 -908488 -685085 124188 830347 849235 303486 -200149 -295724 -101645
36352a01645K75945L07364K45140L288j74528j7223K29495R6357l24397m47980
$$ -101645 174300 481664 726804 730092 555564 538341 767836 864193 539796 91816
36342I1816j01028K06415Q5732j73355j43918O8687R1541o7692p2155J66401L60022
$$ 91816 -9212 197203 282935 109580 -34338 34349 125890 58198 -13957 152444 512466
36331E12466K98224J00809o5881k52636n31115p10886n06522K6369M43354M01345
$$ 512466 810690 911499 845618 592982 61867 -649019 -1155541 -1129172 -685818 -284473
36321b84473O5129j04992J01977M43845N26659K01929k99055n44409k97859J68956
$$ -284473 -219344 -324336 -222359 221486 748145 950074 651019 106610 -191249 -22293
36311b2293L03848l5831l21713m7162N22893O91665K85855k12219m35234m80763
$$ -22293 281555 245724 -75989 -123151 399742 1091407 1377262 1165043 729809 249046
36301B49046m44176k06012J35592K07202m610l6851K18266J98242l55812p53058
$$ 249046 -195130 -401142 -265550 -58348 -62958 -99809 118457 316699 -39113 -792171
36291g92171l48762L39089L39298k74274n00739O4574O96841O48988O1347m56652
$$ -792171 -1140933 -801844 -462546 -736820 -1237559 -1172985 -476144 172844 234191 -222461
36281b22461n73906l18524J35352N20886O30291N40772M32155K29666j82974m91182
$$ -222461 -796367 -1114891 -979539 -458653 171638 712410 1144565 1374231 1191257 700075
36271G00075k59316K72174L52534j53425m75213r3314M45945L61980k21856n80922
$$ 700075 440759 712933 1065467 912042 436829 343515 789460 1151440 929584 348662
36261C48662m90108l46316l33937j60556K73927N31856K58359k38410l91758j40235
$$ 348662 -141446 -487762 -821699 -982255 -708328 -176472 81887 -156523 -548281 -688516
36251f88516R9867J20812J33123K30361J39815k09077l35155O3509M16421P3404
$$ -688516 -588649 -467837 -334714 -104353 35462 -173615 -508770 -445261 -28840 44564
36241D4564m56279r5630R23179J040701k62099j375817q45919L93572N12921l30687
$$ 44564 -411715 -507345 415834 1456535 1194436 -181381 -1027300 -633728 -120807 -451494
36231d51494m38789M69615Q14884q4977q32623l17846M98161L39057k84808j65672
$$ -451494 -890283 -420668 394216 309239 -523384 -841230 -343069 -4012 -288820 -454492
36221d54492M82230N59926L3261k23877j02625k28313m72399n6756P99523Q55481
$$ -454492 27738 587664 620925 397048 294423 66110 -406289 -463045 336478 1191959
36211A191959j81926j029219p31819n131P2589k99554k45300K65052N13295K83431
$$ 1191959 1010033 -19186 -751005 -756136 -683547 -983101 -1228401 -963349 -450054 -166623
36201a66623O7467J30473J65343n2369k83593k64422q9247K4954N5079Q2102Q8185
$$ -166623 -99156 31317 196660 144291 -139302 -403724 -492971 -468017 -412938 -330836 -242651
36190b42651O763j19719j45119L1252L39991N51424M46284L2366m23823o21233
$$ -242651 -235888 -355607 -500726 -469474 -129483 421941 868225 900591 476768 -144465
36180a44465m72216j27524J88077L31887K88351J33468j8911o1261M5935J95628
$$ -144465 -616681 -744205 -556128 -224241 64110 197578 178667 117406 163341 358969
36170C58969J71356j10524m12345m01397r0735J58014J45889Q8219J91091K63025
$$ 358969 530325 419801 7456 -393941 -484676 -326662 -180773 -92554 98537 361562
36160C61562N4985k26426j59324K07721L41639j1768m07594k61944L65101P92110
$$ 361562 416547 190121 30797 238518 580157 568389 160795 -101149 263952 1056062
36150A056062N07755k20070o42313m20799l1393q9353m49353m04076K21743P33071
$$ 1056062 1563817 1343747 701434 280635 249242 159889 -289464 -693540 -471797 261274
36140B61274N56071J8595k78962l63162n62729p06628m12976O3258J06328k13315
$$ 261274 817345 835940 556978 193816 -368913 -1075541 -1488517 -1425259 -1318931 -1532246
36130a532246k15901K16454M27214J56828M4882N28910R99862O60780k90818r38890
$$ -1532246 -1748147 -1531693 -1104479 -947651 -902769 -373859 626003 1286783 995965 57075
36120E7075p78934r5114N12117N85061P9183m88438m59339J26218M95566K15808
$$ 57075 -721859 -816973 -304856 280205 359388 -129050 -588389 -462171 33395 249203
36110B49203k17765k41057p5260j60836k92115m5994L45072L52123R5265J13528
$$ 249203 31438 -209619 -284879 -445715 -737830 -783824 -438752 -86629 8636 122164
36100A22164L80813L77702M2797j69478j48824k30864m16162l14744L2754J00064
$$ 122164 502977 880679 923476 753998 605174 374310 -41852 -356596 -323842 -223778
36090b23778k00223l47137j54765l8500r7853J36439O63298P09175M2586l91562
$$ -223778 -424001 -771138 -925903 -964403 -1062256 -925817 -262519 446656 489242 97680
36080I7680M2787M74357j07927j031835q45428L41476R07707J63005o85536m57834
$$ 97680 140467 614824 506897 -524938 -1370366 -1028890 -121183 41822 -643714 -1101548
36070a101548L25265M59826j28375n21120k65895K10496M57830M82031L57522
$$ -1101548 -776283 -316457 -444832 -965952 -1231847 -1021351 -563521 -81490 276032
36061B76032K4264l60901l84773M1833M18230K71678j92992l89126j56714J00625
$$ 276032 300296 -60605 -445378 -403545 14685 286363 93371 -295755 -452469 -351844
36051c51844Q4056k66J10430K38981O8349k79201l93120k17980q6000r5782M4092
$$ -351844 -267788 -268054 -157624 81357 149706 -129495 -522615 -740595 -826595 -922377 -878285
36040h78285M17103O33460M10602J384k25639k35916j05874J77212L85229Q6678
$$ -878285 -461182 172278 582880 584264 358625 122709 16835 194047 579276 665954
36030F65954n48804o22159J94630Q98388N57568j68379p8924N02254K22747q90805
$$ 665954 117150 -505009 -310379 588009 1145577 977198 898274 1400528 1623275 732470
36020G32470j248264k57333O37170K54726n23337l95163K31438K00804k63802
$$ 732470 -515794 -773127 -135957 118769 -404568 -799731 -568293 -367489 -631291
36011f31291n5795P24717Q64158R4359m99334k94880K3676j81475m88984l00054
$$ -631291 -687086 37631 901789 996148 496814 201934 225610 44135 -444849 -744903
36001g44903J81182M22641L53098J94305K9167r9292j12984j46533l91572n88900
$$ -744903 -563721 -141080 212018 406323 435490 336198 223214 76681 -314891 -903791
35991i03791k83708L09433M30111n2471l87594j52472J35729L3960p0170J95838
$$ -903791 -1187499 -878066 -447955 -500426 -888020 -1040492 -904763 -870803 -940973 -745135
35981g45135M05912J52378o3638L36691Q28580M60020n63493r95606k67846P65486
$$ -745135 -339223 -186845 -250483 86208 914788 1374808 811315 -184291 -452137 313349
35971C13349R97707L55567l52326m75958j43457L9664k05801m41168j43070L89455
$$ 313349 1311056 1666623 1314297 838339 694882 734546 528745 87577 -55493 333962
35961C33962L26112l96124q10090l35152L16838K85181j16114r0899K14230N4451
$$ 333962 660074 263950 -546140 -881292 -564454 -279273 -395387 -486286 -272056 -217605
35951b17605m91854n95377p3638L69960L52100K34283K14255j264l76585l67760
$$ -217605 -709459 -1304836 -1378474 -1008514 -656414 -422131 -207876 -209140 -585725 -953485
35941i53485Q7568L00526k8866k61835P6738M62303K81153j31427j24189J41008
$$ -953485 -865917 -565391 -594257 -856092 -779354 -317051 -35898 -167325 -291514 -150506
35931a50506K3753m56360o23105j79335M20638O33465L67366j31699n24242n20541
$$ -150506 -126753 -583113 -1206218 -1385553 -964915 -331450 35916 -95783 -620025 -1140566
35921a140566j29957K47844K62839P4021P1787K36226J58323k74253n97391l69650
$$ -1140566 -1270523 -1022679 -759840 -685819 -614032 -377806 -219483 -493736 -1091127 -1460777
35911a460777J96991M97338L58286K59307N48954P59535K09255p88431j047001
$$ -1460777 -1263786 -766448 -408162 -148855 400099 1159634 1368889 580458 -466543
35902d66543j52098P52093M98106l95734n43245J65095M87723j12256o81720m36120
$$ -466543 -618641 133452 631558 235824 -307421 -142326 345397 233141 -448579 -884699
35892h84699M7841J920k33443p69M07972L18720o8965n6587K96533L22597o6985
$$ -884699 -836858 -834938 -1068381 -1069150 -661178 -342458 -411423 -468010 -171477 151120 84135
35881H4135l20889k66187k58997l42949j58987K33249L07552J2494m9370L56055
$$ 84135 -236754 -502941 -761938 -1104887 -1263874 -1030625 -723073 -710579 -759949 -403894
35871d03894O41539L36661j63270k44099K1548J12380j15094l09629j87565J52710
$$ -403894 237645 574306 411036 166937 188485 300865 185771 -123858 -311423 -158713
35861a58713M31393M64792K58222l2778k24418k39083j35823n1914j13507k82377
$$ -158713 272680 737472 995694 962916 738498 499415 363592 311678 198171 -84206
35851h4206k88906M9609M08410K32783m01874o87058j86022M54459M33096j8218
$$ -84206 -373112 -323503 84907 317690 -84184 -771242 -957264 -502805 -69709 -87927
35841h7927j01847K21577K64787j42171l71715q0127K81331K90146J39211Q0241
$$ -87927 -189774 31803 296590 154419 -217296 -297423 -16092 274054 413265 493506
35831D93506m0250l01039l56412p322L51419K78493j01590l88377m39888l03121
$$ 493506 453256 152217 -204195 -211517 139902 418395 316805 -71572 -511460 -814581
35821h14581N889L39027M09581K39000K08804L94843L38494j66621n87992m32363
$$ -814581 -808692 -469665 -60084 178916 387720 782563 1121057 954436 366444 -65919
35811f5919l2395P708k51498l22747j47207n6697r6118k2503J54019K15082K00960
$$ -65919 -98314 -90606 -342104 -664851 -812058 -868755 -964873 -987376 -833357 -618275 -417315
35800d17315K70815K39836j24293m55679j47801O26508R63477M50699k93232n27482
$$ -417315 -146500 93336 -30957 -486636 -634437 -7929 955548 1406247 1113015 585533
35790E85533k78550m5602q8850l07476m63222l01174K12113O35145M60781q7837
$$ 585533 306983 261381 172531 -134945 -598167 -899341 -687228 -52083 408698 320861
35780C20861k06496L19711P06791L22231l57202n02124j36079J10087O9809P9664
$$ 320861 114365 434076 1140867 1463098 1105896 603772 467693 577780 647589 727253
35770G27253J67578K5718k69288l07972j44196k34610m88551k60693M53898P46531
$$ 727253 894831 920549 651261 343289 199093 -35517 -524068 -784761 -330863 415668
35760D15668J94289l57274j09101L90092J78388n11617o88506k57073k2872j81177
$$ 415668 609957 252683 143582 533674 712062 200445 -488061 -745134 -768006 -949183
35750i49183o8873M51947O22477J73173j11190K04285L59283k32289p79998l42471
$$ -949183 -1018056 -566109 56368 229541 118351 322636 681919 449630 -330368 -672839
35740f72839N32323O08160j23334n94443m14563j74598j22525J35347N16099L61909
$$ -672839 -140516 467644 344310 -250133 -664696 -839294 -961819 -826472 -310373 51536
35730E1536k37670k99736L88483P03742l801p17470l61628M12157L09879m58267
$$ 51536 -186134 -485870 -97387 606355 602554 -114916 -476544 -64387 245492 -212775
35720b12775n72630J90833O52673J96051l53639k17462J62605Q3282k34967k24340
$$ -212775 -785405 -594572 58101 254152 -99487 -316949 -154344 -71062 -306029 -530369
35710e30369l8913j64043m03261j69549M16859O03982J79403k43523k50478j65647
$$ -530369 -569282 -733325 -1136586 -1306135 -889276 -285294 -105891 -349414 -599892 -765539
35700g65539k66113j92074L31971P76800N17674j06319k32876J90426L50365j12826
$$ -765539 -1031652 -1223726 -891755 -114955 402719 296400 63524 253950 604315 491489
35690D91489n71941m60773q6121M1526J8477J25942J68374q4689k40539J62577
$$ 491489 -80452 -541225 -627346 -585820 -567343 -441401 -273027 -357716 -598255 -435678
35680d35678P41513P14950R7019l59663l27676j80542j10024J36061M79095L71068
$$ -435678 305835 1020785 1117804 758141 430465 249923 139899 275960 755055 1126123
35670A126123k33950n76921k08772K95527K42688j85155m02780l39402k65537
$$ 1126123 892173 315252 106480 402007 644695 459540 56760 -282642 -548179
35661e48179j46542J78058M74177L79056j2170l13729l87244k91946Q276M23941
$$ -548179 -694721 -516663 -42486 336570 324400 10671 -376573 -668519 -660243 -236302
35651b36302N38844J53454k52684j49599K24923K72201L967p4748J10791J35928
$$ -236302 302542 455996 203312 53713 278636 550837 554804 480056 590847 726775
35641G26775r3481j59876J04140K93779O4487m00324p33201p92863n89093j63412
$$ 726775 633294 473418 577558 871337 935824 535500 -197701 -990564 -1579657 -1743069
35631a743069L11976N96999O28080M89093K03789j60172l14157p0256K63966K50122
$$ -1743069 -1431093 -834094 -206014 283079 486868 326696 12539 -57717 206249 456371
35621D56371j2139o4535J36929J82897o0633k68809k78060l10735m34099l49806
$$ 456371 444232 379697 516626 699523 638890 370081 92021 -218714 -652813 -1002619
35611a002619N7389M42888N08164L66194K02229j2159k59083l34672j90207m8195
$$ -1002619 -945230 -502342 5822 372016 574245 562086 303003 -31669 -221876 -270071
35601b70071R88J31453L44183L34864K1463k25167j39251N2052O8536J0660N8961
$$ -270071 -269083 -137630 206553 541417 562880 337713 198462 250514 319050 329710 388671
35590C88671J12540L8905n6359j04567k65251n37701n61647j73112K02844J44954
$$ 388671 501211 540116 483757 379190 113939 -423762 -985409 -1158521 -955677 -810723
35580h10723q9970K9977M57258O25704K77989k17212l86662j68046J19738J14843
$$ -810723 -900693 -870716 -413458 212246 490235 273023 -113639 -281685 -161947 -47104
35570d7104k51537o23401n33455L3435N69192O64545M58268K86485J70635o1551
$$ -47104 -298641 -922042 -1455497 -1422062 -852870 -188325 269943 556428 727063 665512
35560F65512l67129n20613m39290k34660l8416N8567K7533j6783P5545K33196
$$ 665512 298383 -222230 -661520 -896180 -934596 -876029 -848496 -865279 -789734 -556538
35550e56538K54922J84546K41752L39597J51374k26973k64109J20235K87611j27129
$$ -556538 -301616 -117070 124682 464279 615653 388680 124571 244806 532417 405288
35540D05288n81559m69597p563K81382L83420M54838K61241k74249n21027l8873
$$ 405288 -176271 -645868 -653431 -372049 11371 466209 727450 453201 -67826 -106699
35530a06699M69875J31567n96902n82199J10302L36636j77722m34309N3612M68515
$$ -106699 363176 494743 -102159 -684358 -574056 -237420 -415142 -849451 -795839 -327324
35520c27324J91943j77452k8938J69061j20761l61641J28546Q19248O92125j03644
$$ -327324 -135381 -312833 -341771 -172710 -293471 -655112 -526566 292682 984807 881163
35510H81163m64221l4722L70246J33217l08432k89772P3940J70345j59302m02999
$$ 881163 416942 382220 752466 885683 577251 287479 361419 531764 372462 -30537
35500c0537j05641M58095N65913J0370n34537m04964P9672J01332l45095m09688
$$ -30537 -136178 321917 887830 898200 363663 -41301 38371 139703 -205392 -615080
35490f15080K31305Q01472N99773k3135l71285l85082l18603r1922L30424M86969
$$ -615080 -383775 417697 1017470 994335 623050 237968 -80635 -172557 157867 644836
35480F44836J07265k52626m8143K82885O1414m01245l25472J58590K65455n7405
$$ 644836 752101 499475 451332 734217 795631 394386 68914 227504 492959 435554
35470D35554j62818m502j81257o51039o47197p4860K24565p7744k75696J7226
$$ 435554 272736 268234 86977 -564062 -1211259 -1286119 -1061554 -1139298 -1414994 -1397768
35460a397768J84294j32789k42930L40148Q77825N62810j59004l97862k18677
$$ -1397768 -1213474 -1346263 -1589193 -1249045 -371220 191590 32586 -365276 -583953
35451e83953j98034k03896K49674Q37846P51757J2087n35919m51753o7090K65670
$$ -583953 -781987 -985883 -736209 101637 853394 865481 329562 -122191 -189281 76389
35441G6389M60563L32730k20538p22558n97026r5842N0616j62157o4491M12681
$$ 76389 536952 869682 649144 -73414 -670440 -766282 -715666 -877823 -942314 -529633
35431e29633N18748k3858m61701j74626M02585N43396K60468M850j44262l68481
$$ -529633 -10885 -34743 -496444 -671070 -268485 274911 535379 540229 395967 27486
35421B7486n26970k99744K01232M50028J76655k67923l17341J21394M83747J98986
$$ 27486 -499484 -799228 -597996 -147968 28687 -239236 -556577 -435183 48564 247550
35411B47550m74120o28921L8117O40673L20565l80826k40829P51183J273599N81078
$$ 247550 -226570 -855491 -817374 -176701 143864 -236962 -477791 273392 1546991 2128069
35401B128069n06870r27409p45589n91573n05424j38319L78709N53912L02057
$$ 2128069 1621199 693790 -51799 -643372 -1148796 -1287115 -908406 -354494 -52437
35392e2437j0905j50602j90368k36556l09309l52340j83646K84290O72278M67492
$$ -52437 -63342 -213944 -404312 -640868 -950177 -1302517 -1486163 -1201873 -529595 -62103
35382f2103j01844j78336M07259O82538l6749r84212r98190j72571M46784M09279
$$ -62103 -163947 -342283 64976 747514 710765 -273447 -1271637 -1444208 -997424 -588145
35372e88145J55819K5032p9403j30894K2430J32598j55487n20926l16082L09829
$$ -588145 -432326 -407294 -486697 -617591 -595161 -462563 -618050 -1138976 -1455058 -1145229
35362a145229N33236J74746n1691J93059L29685l5802l85598k19664Q8069L7422
$$ -1145229 -611993 -437247 -488938 -295879 33806 -1996 -387594 -607258 -519189 -481767
35352d81767o7613K60215O30802K60077o72007j040644k87578P70288R68612K22607
$$ -481767 -549380 -289165 341637 601714 -70293 -1110937 -1398515 -628227 340385 562992
35342E62992m58493k47646N49180R35944M45376l63605o85231m26884r8115J8413
$$ 562992 104499 -143147 406033 1341977 1787353 1423748 738517 311633 213518 231931
35332B31931R8790K30972J82322j28355l84624l42375j75838r9777l377K25294
$$ 231931 330721 561693 744015 615660 231036 -111339 -287177 -386954 -390331 -165037
35322a65037L33335O4144l25894l34656Q8363M79617M69491J37402k31459m36052
$$ -165037 168298 232442 -93452 -428108 -339745 139872 609363 746765 515306 79254
35312G9254l70888m9051K79553K90908J9792j01383J52005L75015O6776n40517
$$ 79254 -291634 -340685 -61132 229776 249568 148185 300190 675205 741981 201464
35302B01464o85634j96285J68914j42537n42126j83451N78498N68100l75228r90758
$$ 201464 -484170 -680455 -511541 -654078 -1196204 -1379655 -801157 -233057 -608285 -1599043
35292a599043m03490O19767Q83184M29543J18224J44318L0328k41908j99567R0856
$$ -1599043 -2002533 -1382766 -499582 -70039 48185 192503 222831 -19077 -218644 -127788
35282a27788P728m90625o63671j69886L95541M76104L08104K90085K65643n8544
$$ -127788 -120060 -610685 -1274356 -1444242 -1048701 -572597 -264493 25592 291235 232691
35272B32691m67869n15661j41757L48285O71474O89626M12823O7196j03277j83624
$$ 232691 -235178 -750839 -892596 -544311 127163 816789 1229612 1296808 1193531 1009907
35262A009907m01643n91577l43928K27548M50888M1640m59896m71970j02988J92595
$$ 1009907 608264 16687 -327241 -99693 351195 392835 -67061 -539031 -642019 -449424
35252d49424K46394J67080P6471R3581K38711K32870j83103o70803n92669K2259
$$ -449424 -203030 -35950 40521 134102 372813 605683 422580 -248223 -840892 -818633
35242h18633M56765L76790J86573J30999r6550n17777n44225J7692M94010M41805
$$ -818633 -361868 14922 201495 332494 235944 -281833 -826058 -808366 -314356 127449
35232A27449L47306N59306M55502m18328j206356q60082J91690O56053K65721
$$ 127449 474755 1034061 1489563 1071235 -135121 -995203 -803513 -147460 118261
35223A18261r8867N4435K93635K11103p0116l59044n56743m07684J51477N44241
$$ 118261 19394 73829 367464 578567 508451 149407 -407336 -815020 -663543 -119302
35213a19302K64624j71396P4350O84770N24487n22333j223761p87848R0445M15348
$$ -119302 145322 -26074 48276 733046 1257533 735200 -488561 -1276409 -1185964 -770616
35203g70616J96626J0399J2035K0038M6994J59224J78095n768j30646L0697K51185
$$ -770616 -573990 -563591 -551556 -531518 -484524 -325300 -147205 -152973 -283619 -252922 -1737
35192a737J97059n3619j82037j20605m4458O587J74816M32286M25920j24242q87440
$$ -1737 195322 141703 -40334 -160939 -205397 -198810 -23994 408292 834212 709970 -177470
35181a77470j054961k83078O86085Q33429K20519j38255J65664L98584N8211k34345
$$ -177470 -1232431 -1515509 -829424 4005 224524 86269 251933 650517 708728 474383
35171D74383P2018L48899j01648o65315m08635K16468J26741m11231k09174O43688
$$ 474383 546401 895300 793652 128337 -280298 -63830 62911 -348320 -557494 86194
35161H6194P87639q3548o75297k70759K34020R4094r0092K29366M35960L4867
$$ 86194 873833 790285 114988 -155771 78249 172343 82251 311617 747577 782444
35151G82444k78481N1432K56254l68714r85513n22338M32853N55151o7564k68543
$$ 782444 503963 555395 811649 442935 -542578 -1064916 -632063 -76912 -144476 -413019
35141d13019J54615L21300J2867j9078M13909N16024n3742n25931k62029L16711
$$ -413019 -258404 62896 75763 56685 470594 986618 932876 406945 144916 461627
35131D61627N21777L22945J1026l74076p64576p63895j83856M55872M78827m5302
$$ 461627 983404 1306349 1317375 943299 178723 -585172 -769028 -313156 165671 120369
35121A20369l63370j6454N41390M97860k17378p13976k89143M97814N13765k70037
$$ 120369 -243001 -259455 281935 779795 562417 -151559 -440702 57112 570877 300840
35111C00840o65437q7094N03247J22655o70771p31260j46722J11638o3668J18997
$$ 300840 -364597 -451691 51556 174211 -496560 -1227820 -1374542 -1262904 -1326572 -1207575
35101a207575P36182Q72622J93659m26321k87845J44843J60025j66756m05224
$$ -1207575 -471393 401229 594888 168567 -119278 25565 185590 18834 -386390
35092c86390m79764l90975P5256P76212R91108L98944k89776l22233J0328k1870
$$ -386390 -866154 -1257129 -1181873 -405661 585447 984391 694615 372382 382710 360840
35082C60840l82715m81984k45171j18775j91421j30500P9316J17838M7019K68611
$$ 360840 -21875 -503859 -749030 -867805 -1059226 -1189726 -1110410 -992572 -945553 -676942
35072f76942O74638O23557l881m60488k15333K54934K32750j99276m36871k96397
$$ -676942 -2304 621253 617372 156884 -58449 196485 429235 229959 -206912 -503309
35062e03309q6778L1120J74515L20380K73547M4624j61025l07277m74919m94654
$$ -503309 -590087 -558967 -384452 -64072 209475 254099 93074 -214203 -689122 -1183776
35052a183776j07091M89683P47028N15775K10174J01986k1584k89577l99761j82256
$$ -1183776 -1290867 -801184 -54156 461619 671793 773779 752195 462618 62857 -119399
35042a19399R012r2378j39126K09506N65099L60043j86280l64687n6498K11608
$$ -119399 -110387 -202765 -341891 -132385 432714 792757 606477 241790 185292 396900
35032C96900J99333J82845K37292N7582l47892m88916j62615K19763L17902K82324
$$ 396900 596233 779078 1016370 1073952 726060 237144 74529 294292 612194 894518
35022H94518K40070n672m18018m89932k2837L96019K11110k60888l56912m9751
$$ 894518 1134588 1128916 710898 220966 198129 594148 805258 544370 187458 137707
35012A37707J82127J72217J41133J31637l6612k99719l50072j33437N3403J0805
$$ 137707 319834 492051 633184 764821 728209 428490 78418 -55019 -1616 9189
35002I189j19877j07271P4306K07146j437n87948j089017q90390p818P61265P40178
$$ 9189 -110688 -217959 -143653 63493 62056 -525892 -1614909 -2505299 -2513117 -1751852 -1011674
34991a011674J81431j45624L1735K67068J04677l27245m94505q4110N92802Q69679
$$ -1011674 -830243 -975867 -944132 -677064 -572387 -899632 -1394137 -1478247 -885445 -15766
34981a5766M81244r9832l18058k78939l66199l82171J32424Q01269O65960k43649
$$ -15766 465478 365646 47588 -231351 -597550 -979721 -847297 -46028 619932 376283
34971C76283o99403j34088M14922J6948n75808k08002O79330P35036j20442o76513
$$ 376283 -323120 -457208 -42286 -25338 -601146 -809148 -129818 605218 484776 -191737
34961a91737m11950n6422r8177q0654K97203N50542L31252K3293l6197q7189k57992
$$ -191737 -603687 -660109 -758286 -838940 -541737 8805 340057 363350 327153 239964 -18028
34950a8028j49180L90668P73799M85553j87888o95233r03832q09973k17171O99990
$$ -18028 -167208 223460 997259 1482812 1294924 599691 -304141 -1114114 -1331285 -631295
34940f31295J083493L94210o25590p54636R4267P78670M75669l08682n30261K0194
$$ -631295 452198 846408 220818 -533818 -439551 339119 814788 506106 -24155 -3961
34930c961N39580L09076l99317p13005k87697L05871L88634p374l79081m80355
$$ -3961 535619 844695 445378 -267627 -555324 -249453 139181 131807 -247274 -727629
34920g27629m11932k21423J01124L33772J97623j95275m40680l36855L1626N23081
$$ -727629 -1139561 -1360984 -1259860 -926088 -728465 -923740 -1364420 -1701275 -1669649 -1146568
34910a146568Q64711O19758k22058q60859n63252K48391N33201J37303j13783
$$ -1146568 -281857 337901 115843 -745016 -1308268 -1059877 -526676 -389373 -503156
34901e03156J60698L59144L9697l20015j69905K29659K93232m4336m07991m94498
$$ -503156 -342458 16686 56383 -263632 -433537 -203878 89354 45018 -362973 -857471
34891h57471k08033K89782M91838N1333m87778j84506Q34411J248062L41971q81387
$$ -857471 -1065504 -775722 -283884 -232551 -720329 -904835 -70424 1177638 1519609 638222
34881F38222j057420k50636L95062L12700k0175m2118J95340K78128o3330o59793
$$ 638222 -419198 -669834 -274772 37928 17753 -24365 170975 449103 385773 -274020
34871b74020r25267m21380M63293Q34763M69893Q1638J45956K11624j41389m39541
$$ -274020 -1199287 -1620667 -1157374 -322611 147282 228920 374876 586500 445111 5570
34861E570j45680K98547J39863m37629o32944k82221P9114J77028J74361N7172
$$ 5570 -140110 158437 298300 -139329 -772273 -1054494 -975380 -798352 -623991 -566819
34851e66819l08323n94333l05213L56643O64494M10224O3375r8701k57639l88274
$$ -566819 -875142 -1469475 -1774688 -1418045 -753551 -343327 -279952 -378653 -636292 -1024566
34841a024566j12390N59578J002194P73176J38630m00780o37398n47623j47239
$$ -1024566 -1136956 -577378 424816 1197992 1336622 935842 298444 -249179 -396418
34832c96418L23933M82108K73543M3908J3299K1725j06974k98216m19811m22022
$$ -396418 -72485 409623 683166 727074 740373 762098 655124 356908 -62903 -484925
34822d84925k36581J29472L85811K24987j74499l02762j6169L08578L52898J92026
$$ -484925 -721506 -592034 -206223 18764 -155735 -458497 -474666 -166088 186810 378836
34812C78836J8237p1738J0813K42184L03625n4512n04711n13383j72860l9580
$$ 378836 397073 325335 336148 578332 881957 827445 322734 -190649 -363509 -403089
34802d03089j53714J2200M98693O13593P9922m03753k62996N7546m7220k82303
$$ -403089 -556803 -544603 -45910 567683 647605 243852 -19144 38402 -8818 -291121
34792b91121p0226L22387K30701j89749k10017J62978J74445l25615n55073j03458
$$ -291121 -361347 -38960 191741 1992 -208025 -45047 129398 -196217 -751290 -854748
34782h54748L92061L36543R1281J71712K70069j07588n74012l84282K67151M66084
$$ -854748 -462687 -126144 -34863 136849 406918 299330 -274682 -658964 -391813 74271
34772G4271K5653k81114o6105R8131j76425l18378J86346P74532O42729O2205
$$ 74271 99924 -181190 -247295 -149164 -325589 -643967 -457621 316911 959640 1021845
34762A021845p8676K80748L69933q7067n17453n42904m50354m03999p3969N62474
$$ 1021845 943169 1223917 1593850 1506783 989330 446426 -3928 -407927 -481896 80578
34752H0578Q32539L07166m66082o97470l54543L8495J57702q424l63553n81739
$$ 80578 913117 1220283 754201 56731 -297812 -259317 -101615 -110039 -473592 -1055331
34742a055331k39262M84649P54307K38650k53489L5613N73635L79533l52476n51383
$$ -1055331 -1294593 -809944 -55637 183013 -70476 -34863 538772 918305 565829 14446
34732A4446K879L86093N4898l89901k90724R1904J58364j18357l35328k75676
$$ 14446 17325 403418 458316 68415 -222309 -130405 27959 -90398 -425726 -701402
34722g01402o163L07157M31089K35227k6674J6295K27386J12381k92179l28228
$$ -701402 -707565 -400408 30681 265908 239234 255529 482915 595296 303117 -25111
34712b5111J99800N31454O1123o17586m82299M19560R88752N33437m33345r57583
$$ -25111 174689 706143 767266 149680 -332619 86941 1075693 1609130 1175785 218202
34702B18202o91658P902O11057P58587L61036k92190o30911l47606J45738J25365
$$ 218202 -473456 -465554 145503 904090 1265126 972936 342025 -5581 140157 265522
34692B65522m69008q17771k78202O45279Q98084L01489k75139k37614j0109j08859
$$ 265522 -203486 -1021257 -1299459 -654180 243904 545393 270254 32640 22531 -86328
34682h6328k17151J52415O25889M59442k11864n01600j00269L40634K49825j62477
$$ -86328 -303479 -151064 474825 934267 722403 220803 120534 461168 710993 548516
34672E48516m28432m25460k39355M5899K27410J24150l8505J15960M08331K72467
$$ 548516 120084 -305376 -544731 -498832 -271422 -147272 -185777 -69817 338514 610981
34662F10981k44314l80539J52067O18351L51646k66408m92795l23701k31968k45731
$$ 610981 366667 -13872 138195 756546 1108192 841784 348989 25288 -206680 -452411
34652d52411n4906K14740J07150l41054n64596l15453L7967J73706K42451M18883
$$ -452411 -507317 -292577 -185427 -526481 -1091077 -1406530 -1368563 -1194857 -952406 -533523
34642e33523M93146K47649o9911m7488K56310L72387J23069j22529o3294K2467
$$ -533523 -40377 207272 137361 89873 346183 718570 841639 719110 655816 678283
34632F78283k43600n91772m12252K04493M21225r2696n47632k01880M51247M34298
$$ 678283 434683 -157089 -569341 -364848 56377 -36319 -583951 -785831 -334584 99714
34622I9714j84850m47511l0501L58019J97638j33824j34192R8120K40212K27427
$$ 99714 -85136 -532647 -563148 -205129 -7491 -141315 -275507 -177387 62825 290252
34612B90252P9923j93240l23060j4490M12847L27110j39001j82739K70416K91842
$$ 290252 370175 176935 -146125 -160615 252232 579342 440341 257602 528018 819860
34602H19860m85594j116015q39724k82689k56817l47967J55082P53271N18962
$$ 819860 334266 -781749 -1621473 -1904162 -2160979 -2508946 -2353864 -1600593 -1081631
34593a081631j87772k45596L04122L70708k09511l44927L95706R61548M89574
$$ -1081631 -1269403 -1514999 -1210877 -840169 -1049680 -1394607 -998901 -37353 452221
34584D52221l60618m83769J08154N62613M44124K3029l20542m20618k77047n6890
$$ 452221 91603 -392166 -284012 278601 722725 745754 425212 4594 -272453 -329343
34574c29343K1361l8646q9734j82669m15073m91594l9599O14670P17311K62726
$$ -329343 -307982 -346628 -436362 -619031 -1034104 -1525698 -1565297 -950627 -233316 29410
34564B9410P3468M40870N93532K401o73075o37580j84691l7604j25985K0990J94395
$$ 29410 102878 543748 1137280 1139681 466606 -170974 -355665 -393269 -519254 -498264 -303869
34553c03869q2432m02715N8342J004043J157825J49100q48914p76779k4638M33256
$$ -303869 -386301 -789016 -730674 273369 1431194 1580294 731380 -45399 -70037 363219
34543C63219M01505K63195O9795l50948p51790o96035k58136J12800K73734L82144
$$ 363219 764724 1027919 1097714 746766 -5024 -701059 -959195 -846395 -572661 -190517
34533a90517L88835J37200j47755r3907J41862O4798k89929l62330l2636J47822
$$ -190517 198318 335518 187763 93856 235718 300516 10587 -351743 -384379 -236557
34523b36557p5011j91617J69420N48513M12245L6195j8081J47523O8381j72559
$$ -236557 -311568 -503185 -333765 214748 626993 663188 645107 792630 861011 688452
34513F88452j27704J22210P3902k67004l64825j01354M4358j10165j57790P7588
$$ 688452 560748 682958 756860 489856 125031 23677 68035 -42130 -199920 -122332
34503a22332J92422r721j25206N0870O8146k99982m24496K02672R11620O51109
$$ -122332 70090 60369 -64837 -13967 54179 -245803 -670299 -467627 443993 1095102
34493A095102m47224j166771q05492P1510N44575L78647q354j51562O7442L61006
$$ 1095102 647878 -518893 -1324385 -1252875 -708300 -329653 -338007 -489569 -422127 -61121
34483f1121L10120j11568l98940j50615L56186N72334M30950K49189R7961j67032
$$ -61121 248999 137431 -261509 -412124 -55938 516396 947346 1196535 1294496 1127464
34473A127464l91501k82689m3366j75458n97665o52201j48290L06596K95034K04109
$$ 1127464 735963 453274 409908 234450 -363215 -1015416 -1163706 -857110 -562076 -357967
34463c57967M10780N04788j9679p43550p68256k0927O07752M87593N951j12257
$$ -357967 52813 557601 537922 -205628 -973884 -994811 -387059 100534 106485 -5772
34453e772K13817M54250K49043j82553l87247k07349J06211K06609j1254l56190
$$ -5772 208045 662295 911338 728785 341538 134189 240400 447009 435755 79565
34443G9565n32732l65354P2714M72982N09265J63822k06007k56973p0436K921
$$ 79565 -453167 -818521 -745807 -272825 236440 400262 194255 -62718 -133154 -130233
34433a30233j17665j23402J63228M14175K11980k87749m60586m9438M21469L15326
$$ -130233 -247898 -371300 -208072 206103 418083 130334 -330252 -379690 41779 357105
34423C57105k42190n41360l01157k6313j63247l80623j44462L38656L99116j9314
$$ 357105 114915 -426445 -727602 -753915 -917162 -1297785 -1442247 -1103591 -704475 -723789
34413g23789k95140j85607j47141l41938j66291O70128J323466Q91520j72798
$$ -723789 -1018929 -1204536 -1351677 -1693615 -1859906 -1189778 133688 1025208 852410
34404H52410o46446k77554K6265k83209o55939m51422J35757N39618N85380L88756
$$ 852410 205964 -71590 -45325 -328534 -984473 -1435895 -1300138 -760520 -175140 213616
34394B13616K803m26690n58355k87599M6712J81537K75714M36320L63775q4202
$$ 213616 216419 -210271 -768626 -1056225 -1009513 -827976 -552262 -115942 247833 163631
34384A63631m07492j40724K94742J22628n41803p50476j21910N65856N14168O989
$$ 163631 -243861 -384585 -89843 32785 -509018 -1259494 -1381404 -815548 -301380 -294391
34374b94391j56406J12624K23050j9530j18071K05577M63625J38201m95614p57375
$$ -294391 -450797 -338173 -115123 -134653 -252724 -47147 416478 554679 59065 -698310
34364f98310m91055j15770Q4164K05884L15380K85322J00770p6929j88902k50869
$$ -698310 -1189365 -1305135 -1220971 -1015087 -699707 -414385 -313615 -390544 -579446 -830315
34354h30315r7593L66800P14856M07322l02876n73228k02792J13716k1783j54574
$$ -830315 -927908 -561108 153748 561070 258194 -315034 -517826 -404110 -425893 -580467
34344e80467K685k9668m53933n28882J74644P49365K91953m89520l21223N43943
$$ -580467 -577782 -607450 -1061383 -1590265 -1415621 -666256 -374303 -863823 -1185046 -641103
34334f41103P51286N1820m67307l08713j52116l11252j36957N61892Q85907L02542
$$ -641103 110183 162003 -305304 -614017 -766133 -1077385 -1214342 -652450 233457 535999
34324E35999m28325m97874j95955r4564l4362K84806N19652K92539q2852j85234
$$ 535999 107674 -390200 -586155 -680719 -715081 -430275 89377 381916 299064 113830
34314A13830j56926j83639j9309L45378L24858k46085n49282l7556N61544M11706
$$ 113830 -43096 -226735 -246044 99334 424192 178107 -371175 -408731 152813 564519
34304E64519o5646n8718J45501k04077p76192o35953O8868L18827m114L0132O68875
$$ 564519 498873 440155 585656 381579 -394613 -1030566 -961698 -642871 -646985 -616853 52022
34293E2022R65639L73940l32152l05363J23292J05978m21782p44475l76638L71462
$$ 52022 1017661 1391601 1059449 754086 877378 983356 561574 -182901 -559539 -188077
34283a88077P46836L37711m11903n97572L9818P05055O08208L2477k28138r6906
$$ -188077 558759 896470 484567 -113005 -73187 631868 1240076 1272553 1044415 947509
34273I47509j00443l11027k96698l617J88283K22712L17428K57044k96230q47082
$$ 947509 847066 536039 239341 235724 424007 646719 964147 1221191 924961 77879
34263G7879n35607L59878N90726j37510o60146k31882L50845K17662j63143o344
$$ 77879 -457728 -97850 492876 355366 -304780 -536662 -185817 31845 -131298 -137642
34253a37642L36919R8918m38152m11220J26303L56552J07730j5798J59991J26890
$$ -137642 199277 298195 -139957 -551177 -424874 -68322 39408 23610 183601 310491
34243C10491k40781l68249j4893K36453m6129l84589j56841L84325M90460N1138
$$ 310491 69710 -298539 -313432 -76979 -123108 -507697 -664538 -280213 210247 261385
34233B61385k88606j23922J65783P2166k76182l88794k10720j40639k78979k23111
$$ 261385 -27221 -151143 14640 86806 -189376 -578170 -788890 -929529 -1208508 -1431619
34223a431619J75938M05597Q6997k83959l7381N40501N76914j413l36485k821
$$ -1431619 -1255681 -850084 -763087 -1047046 -1084427 -543926 32988 31575 -304910 -307731
34213c07731L90399K82911J499j0315n4064n42217j044526q12098J3206N22071
$$ -307731 82668 365579 367078 356763 302699 -239518 -1284044 -2096142 -2082936 -1560865
34203a560865L15425m7483K7438L88975N21857L10719J16533K36049N12884N28665
$$ -1560865 -1245440 -1292923 -1265485 -876510 -354653 -43934 72599 308648 821532 1350197
34193A350197J20305m00298o22393n08445l02566j10372J06562K29794J21940
$$ 1350197 1470502 1070204 447811 -60634 -363200 -473572 -367010 -137216 -15276
34184a5276J8944K54368N80534L97904k31518n29117k04591P2062j80172m41916
$$ -15276 3668 258036 838570 1236474 1004956 475839 271248 343310 163138 -278778
34174b78778j56379K45565J10605k45440p8447M51760N21102L1074k51200L9682
$$ -278778 -435157 -189592 -78987 -324427 -402874 48886 569988 601062 349862 389544
34164C89544L74323K71041l3453j10188M0601J35863j0732l59275n92743k95033
$$ 389544 763867 1034908 1001455 891267 931868 1067731 1056999 697724 104981 -190052
34154a90052M42906Q19771K57476o88316r88790n05492L4096K28018K97363K90878
$$ -190052 252854 1072625 1330101 641785 -347005 -852497 -818401 -590383 -293020 -2142
34144b142k7295m21267k90843K76576N00825J76572l4340J45602J52618j82631
$$ -2142 -29437 -450704 -741547 -464971 35854 212426 178086 323688 476306 293675
34134B93675j02824O60314J036799J73673j044927j174806k69026M27397L89490
$$ 293675 190851 851165 1887964 2061637 1016710 -158096 -427122 275 389765
34125C89765J87822J80767O0192k56931l55389j26829K7105k0973P1819L49546
$$ 389765 577587 758354 818546 561615 206226 79397 106502 85529 157348 506894
34115E06894L60502l4184l61568l09145j35462l8958K07401O29657P00114R2675
$$ 506894 867396 833212 471644 162499 27037 -11921 195480 825137 1525251 1617926
34105A617926o99626r84723p21667l17875L4945L36610M19276J58586j48714j22162
$$ 1617926 918300 -66423 -788090 -1105965 -1071020 -734410 -315134 -156548 -305262 -427424
34095d27424J11631J34473n0637k1119L34497N63872K83820k82970o05999m61874
$$ -427424 -315793 -181320 -231957 -253076 81421 645293 929113 646143 40144 -421730
34085d21730p5210K08892K40307J27395Q1677J63344J79355o5558m26099n04519
$$ -421730 -496940 -288048 -47741 79654 161331 324675 504030 438472 12373 -492146
34075d92146j57421K59717L10352J9886j99526j10419R7969J45116J0722j54179
$$ -492146 -649567 -389850 -79498 -59612 -259138 -369557 -271588 -126472 -115750 -269929
34065b69929k54167k26419P759L43885M35102J33841j72987o2630K28776J42774
$$ -269929 -524096 -750515 -742756 -398871 36231 170072 -2915 -65545 163231 306005
34055C06005k21778j71383L76881N62548p3920o83955l30974M78346N14692k44725
$$ 306005 84227 -87156 289725 852273 778353 94398 -236576 241770 756462 511737
34045E11737n93317k2648N32553K53104l34686l47124P4690J91419q8200k41826
$$ 511737 -81580 -104228 428325 681429 346743 -381 74309 265728 177528 -64298
34035f4298r4828M5007O0969J42371K83224K60621J00006M9958J06515L4981j49263
$$ -64298 -159126 -114119 -53150 89221 372445 633066 733072 783030 889545 924526 775263
34024G75263j82487l7677L2079m8487r2201l6827q548N946J22180J84278r4070
$$ 775263 592776 555099 587178 538691 446490 409663 401115 407061 529241 713519 619449
34013F19449n46739o12162j37327L30659K90454n8299j77675Q3413M07211M68152
$$ 619449 72710 -539452 -676779 -346120 -55666 -113965 -291640 -208227 198984 667136
34003F67136K46978l1508j60294j81971l00612m85397m05128r537J69705j98013
$$ 667136 914114 882606 722312 540341 239729 -245668 -650796 -660333 -490628 -688641
33993f88641m87395P3090J000954R80257j69700j021585n20263N42289P77009
$$ -688641 -1176036 -1102946 -101992 878265 708565 -313020 -833283 -290994 486015
33984D86015J19020m34828m31042k53740j22841J49266M47975L40867j07916k82623
$$ 486015 605035 170207 -260835 -514575 -637416 -488150 -40175 300692 192776 -89847
33974h9847M3653L58276J93687k77503o04783n54952j39959L91745N39024L7339
$$ -89847 -46194 312082 505769 228266 -376517 -931469 -1071428 -679683 -140659 -103320
$$ [...]
##END NTUPLES=NMR SPECTRUM
##END=
