##TITLE=31Pdec_3d 1311
 CDCl3, 24 sc
 14.11.2022
##JCAMPDX= 6.0         $$ Bruker NMR JCAMP-DX V2.0
##DATA TYPE= NMR SPECTRUM
##DATA CLASS= NTUPLES
##ORIGIN= UXNMR, Bruker Analytische Messtechnik GmbH
##OWNER= root
$$ XWIN-NMR		Version 3.5
$$ Mon Nov 14 14:13:54 2022 Russian Standard Time (UT+4h)  she@DPX200
##.OBSERVE FREQUENCY= 81.013821
##.OBSERVE NUCLEUS= ^31P
##.ACQUISITION MODE= SIMULTANEOUS
##.ACQUISITION SCHEME= undefined
##.AVERAGES= 24
##.DIGITISER RES= 16
##SPECTROMETER/DATA SYSTEM= spect
##.PULSE SEQUENCE= zgpg30
##.SOLVENT NAME= CDCl3
##.SHIFT REFERENCE= (INTERNAL, CDCl3, 0, 248.564)
##AUDIT TRAIL= $$ (NUMBER, WHEN, WHO, WHERE, WHAT)
$$ ##TITLE= Audit trail, XWIN-NMR		Version 3.5
$$ ##JCAMPDX= 5.01
$$ ##ORIGIN= Bruker BioSpin GmbH
$$ ##OWNER= she
$$ F:/spectra/data/she/nmr/P31/1/pdata/1/auditp.txt
$$ ##AUDIT TRAIL=  $$ (NUMBER, WHEN, WHO, WHERE, WHAT)
(   1,<2022-11-14 14:13:05.84 +0400>,<she>,<DPX200>,
      <created by zg, POWCHK disabled, PULCHK disabled
       configuration hash MD5:
       00 E9 B6 7A A2 85 ED C7 34 08 36 98 17 FE 4E 26
       data hash MD5: 32K
       D7 B6 2D 03 43 64 C6 1F 7B E8 3C 50 2C 86 6E 44>)
(   2,<2022-11-14 14:13:08.68 +0400>,<she>,<DPX200>,
      <Start of raw data processing
       efp BC_mod = 2 LB = 1 FT_mod = 6 PKNL = 1 PHC0 = -10331.12 PHC1 = 263.2559 SI = 64K 
       data hash MD5: 64K
       DF 58 6B 2A 98 0C 6D 4D D2 28 4F DC 14 8A D0 3E>)
(   3,<2022-11-14 14:13:25.53 +0400>,<she>,<DPX200>,
      <pk PHC0 = -7.135602 PHC1 = 0 
       data hash MD5: 64K
       9D AB 3D EA 20 32 01 99 AD F4 86 5E FA 64 B8 F6>)
(   4,<2022-11-14 14:13:28.42 +0400>,<she>,<DPX200>,
      <abs ABSG = 5 
       data hash MD5: 64K
       A9 0E 2F 6D 3A 89 76 D8 0E 32 2F 15 62 DF 11 6E>)
$$ ##END=
$$ 
$$ hash MD5
$$ 82 FA 09 B0 73 35 18 88 F2 E3 05 1A 70 A8 45 37
##$RELAX= 
##$RELAX= 
##$RELAX= 
##$RELAX= 
##$RELAX= 
##$RELAX= 
##$RELAX= 
##$RELAX= 
##$RELAX= 
$$ Bruker specific parameters
$$ --------------------------
##$DU= <F:/spectra>
##$EXPNO= 1
##$NAME= <P31>
##$PROCNO= 1
##$TYPE= <nmr>
##$USER= <she>
##$AMP= (0..31)
100 100 100 100 100 100 100 100 100 100 100 100 100 100 100 100 100 100 
100 100 100 100 100 100 100 100 100 100 100 100 100 100 
##$AQSEQ= 0
##$AQ_mod= 1
##$AUNM= <au_zg>
##$AUTOPOS= <>
##$BF1= 81.014009
##$BF2= 200.13
##$BF3= 200.13
##$BF4= 200.13
##$BF5= 200.13
##$BF6= 200.13
##$BF7= 200.13
##$BF8= 200.13
##$BYTORDA= 1
##$CFDGTYP= 0
##$CFRGTYP= 5
##$CHEMSTR= <none>
##$CNST= (0..31)
1 1 145 1 1 1 1 1 1 1 1 1 1 1 1 1 1 1 1 1 1 1 1 1 1 1 1 1 1 1 1 1 
##$CPDPRG= <waltz16>
##$CPDPRG1= <>
##$CPDPRG2= <waltz16>
##$CPDPRG3= <>
##$CPDPRG4= <mlev>
##$CPDPRG5= <mlev>
##$CPDPRG6= <mlev>
##$CPDPRG7= <mlev>
##$CPDPRG8= <mlev>
##$CPDPRGB= <>
##$CPDPRGT= <>
##$D= (0..31)
0 1 0 0 0 0 0 0 0 0 0 0.03 2e-05 3e-06 0 0 0 0 0 0 0 0 0 0 0 0 0 0 0 0 
0 0 
##$DATE= 1668420785
##$DBL= (0..7)
120 120 120 11 120 120 24 19 
##$DBP= (0..7)
150 150 150 150 150 150 150 150 
##$DBP07= 0
##$DBPNAM0= <>
##$DBPNAM1= <>
$$ [...]
##$SUBNAM3= <"">
##$SUBNAM4= <"">
##$SUBNAM5= <"">
##$SUBNAM6= <"">
##$SUBNAM7= <"">
##$SUBNAM8= <"">
##$SUBNAM9= <"">
##$SW= 501.771253377433
##$SWIBOX= (0..15)
0 1 3 0 0 0 0 0 0 0 0 0 0 0 0 0 
##$SW_h= 40650.406504065
##$TD= 32768
##$TD0= 1
##$TE= 0
##$TE2= 300
##$TE3= 300
##$TEG= 300
##$TL= (0..7)
0 120 53 12 22 120 120 120 
##$TP= (0..7)
150 150 150 150 150 150 150 150 
##$TP07= 0
##$TPNAME0= <>
##$TPNAME1= <>
##$TPNAME2= <>
##$TPNAME3= <>
##$TPNAME4= <>
##$TPNAME5= <>
##$TPNAME6= <>
##$TPNAME7= <>
##$TPOAL= (0..7)
0.5 0.5 0.5 0.5 0.5 0.5 0.5 0.5 
##$TPOFFS= (0..7)
0 0 0 0 0 0 0 0 
##$TUNHIN= 0
##$TUNHOUT= 0
##$TUNXOUT= 0
##$USERA1= <user>
##$USERA2= <user>
##$USERA3= <user>
##$USERA4= <user>
##$USERA5= <user>
##$V9= 5
##$VALIST= <valist>
##$VCLIST= <CCCCCCCCCCCCCCC>
##$VD= 0
##$VDLIST= <DDDDDDDDDDDDDDD>
##$VPLIST= <PPPPPPPPPPPPPPP>
##$VTLIST= <TTTTTTTTTTTTTTT>
##$WBST= 1024
##$WBSW= 4
##$XGAIN= (0..3)
0 0 0 0 
##$XL= 0
##$YL= 0
##$YMAX_a= 9809
##$YMIN_a= -9990
##$ZGOPTNS= <>
##$ZL1= 120
##$ZL2= 120
##$ZL3= 120
##$ZL4= 120
##$ABSF1= 248.5645
##$ABSF2= -253.2056
##$ABSG= 5
##$ABSL= 3
##$ALPHA= 0
##$AQORDER= 0
##$ASSFAC= 0
##$ASSFACI= 0
##$ASSFACX= 0
##$ASSWID= 0
##$AUNMP= <proc_1d>
##$AZFE= 0.1
##$AZFW= 0.5
##$BCFW= 0
##$BC_mod= 2
##$BYTORDP= 0
##$COROFFS= 0
##$CY= -3
##$DATMOD= 1
##$DC= 0
##$DFILT= <>
##$DTYPP= 0
##$F1P= 0
##$F2P= 0
##$FCOR= 1
##$FTSIZE= 65536
##$FT_mod= 6
##$GAMMA= 0
##$GB= 0
##$INTBC= 1
##$INTSCL= 6.047779e-11
##$ISEN= 30
##$LB= 1
##$LEV0= 0
##$LPBIN= 0
##$MAXI= 10000
##$MC2= 0
##$MEAN= 0
##$ME_mod= 0
##$MI= 50
##$NCOEF= 0
##$NC_proc= -6
##$NLEV= 6
##$NOISF1= 182.463
##$NOISF2= 159.3651
##$NSP= 0
##$NTH_PI= 0
##$NZP= 0
##$OFFSET= 248.5645
##$PC= 4
##$PHC0= -10338.26
##$PHC1= 263.2559
##$PH_mod= 1
##$PKNL= yes
##$PPARMOD= 0
##$PSCAL= 0
##$PSIGN= 0
##$REVERSE= no
##$SF= 81.0140089999694
##$SI= 65536
##$SIGF1= 159.3651
##$SIGF2= -187.1042
##$SINO= 113.3802
##$SIOLD= 16384
##$SREGLST= <1H.CDCl3>
##$SSB= 0
##$STSI= 65536
##$STSR= 0
##$SW_p= 40650.406504065
##$SYMM= 0
##$S_DEV= 0
##$TDeff= 32768
##$TDoff= 0
##$TI= <>
##$TILT= no
##$TM1= 0
##$TM2= 0
##$TOPLEV= 0
##$USERP1= <user>
##$USERP2= <user>
##$USERP3= <user>
##$USERP4= <user>
##$USERP5= <user>
##$WDW= 1
##$XDIM= 65536
##$YMAX_p= 375713196
##$YMIN_p= -81167049
$$ End of Bruker specific parameters
$$ ---------------------------------
##NTUPLES= NMR SPECTRUM
##VAR_NAME=  FREQUENCY,     SPECTRUM/REAL,   SPECTRUM/IMAG
##SYMBOL=    X,             R,               I
##VAR_TYPE=  INDEPENDENT,   DEPENDENT,       DEPENDENT
##VAR_FORM=  AFFN,          ASDF,            ASDF
##VAR_DIM=   65536,         65536,           65536
##UNITS=     HZ,            ARBITRARY UNITS, ARBITRARY UNITS
##FACTOR=    0.620285442955139, 1,           1
##FIRST=     20137.2065510682, 0,            0
##LAST=      -20513.1999529968, 0,           0
##MIN=       -20513.1999529968, -81167049,   0
##MAX=       20137.2065510682, 375713196,    0
$$ Real data points
##PAGE= N=1
##DATA TABLE= (X++(R..R)), XYDATA
$$ [...]
42007 -502349 -961342 -516097 -7668 -149468 -411947 -140559 366868 640358 875468 1211350
41997 1211350 1100029 233014 -703771 -1020631 -1050789 -1427453 -2053293 -2513970 -2737945 -2508203
41987 -2508203 -1240576 817376 2092892 1534427 140222 -585206 -863585 -1795522 -2937106
41978 -2937106 -2622076 -629851 1260838 1710282 1285107 1010799 871078 511253 295142
41969 295142 673023 1188737 1051122 335376 -165558 -124918 -44416 -385114 -870218 -945120
41959 -945120 -652597 -580448 -873521 -839891 -7284 899603 912129 509897 1127996 2789074
41949 2789074 3631341 2487795 610722 -251763 -324448 -924419 -2028877 -2460400 -2051993
41940 -2051993 -1859767 -2245273 -2335367 -1606934 -646800 -26492 406213 797117 887133 650344
41930 650344 442400 317435 17950 -329098 -408988 -538631 -1247224 -2131613 -2325940 -2050896
41920 -2050896 -2313326 -2992911 -2776593 -1336819 -33103 124631 -216633 -157428 105541
41911 105541 155786 357150 1037509 1630449 1479461 747775 -20517 -423404 -11521 1259564
41901 1259564 2126317 1100379 -1065147 -1779147 -281206 1031580 133057 -1767914 -2538501
41892 -2538501 -2403810 -2767398 -3291907 -2667794 -1299996 -716763 -941423 -861927 -665675
41883 -665675 -1344745 -2114017 -1120091 1142076 1938025 445286 -859903 -21060 1599190
41874 1599190 1788221 734304 56106 57643 -213981 -1049651 -1810647 -2088253 -1940410 -1389699
41864 -1389699 -603542 -133229 -241567 -493987 -578279 -825262 -1326062 -1391060 -650019 122226
41854 122226 104079 -412815 -775571 -1052977 -1444337 -1459013 -799132 -315682 -834647 -1618657
41844 -1618657 -1325553 -74939 802489 795657 594546 570442 339996 -6036 357657 1584376
41834 1584376 2635193 2683446 2087530 1463240 718038 -325109 -1111859 -992791 -265745
41825 -265745 122464 -289419 -1157064 -1961009 -2472773 -2654884 -2494041 -2019953 -1333474 -593588
41815 -593588 -18154 179347 -69010 -607177 -1093629 -1148890 -655001 18285 321562 169010
41805 169010 -41436 -188979 -713764 -1777114 -2647180 -2499550 -1463190 -295585 572975
41796 572975 1009551 701171 -349079 -1217109 -1042100 -387203 -442014 -1059392 -1003019 -137655
41786 -137655 296612 -78744 -84078 739449 1014928 -60430 -912382 50493 1641359 1569850
41776 1569850 -19217 -1015869 -861119 -1052890 -2035987 -2153154 -513041 1286858 1520679
41767 1520679 663714 21402 -428104 -1233390 -1767370 -1181928 -286891 -572645 -1705107
41758 -1705107 -1839952 -459727 833897 739800 -54541 -277715 74155 196646 -65124
41749 -65124 -195151 -6065 168627 110389 -60043 -228801 -441375 -730688 -1035030 -1249449
41739 -1249449 -1292878 -1282252 -1593074 -2370830 -2985747 -2557963 -1235328 -322380 -717314 -1779761
41729 -1779761 -2306612 -2115934 -1913199 -1963280 -1835243 -1378598 -999883 -805200 -347182 438184
41719 438184 868138 613657 426394 1020850 1799821 1650940 728664 370422 1164986 2132712
41709 2132712 2220039 1726921 1597084 1956116 2208741 2223088 2469091 2976137 2997508 2012984
41699 2012984 509478 -575825 -840685 -598649 -387042 -526324 -905122 -1009878 -432649
41690 -432649 486917 859554 332420 -341521 -152974 966583 2116168 2420312 1770567
41681 1770567 758437 170253 394563 1051070 1350390 1019904 576617 399997 -1988
41672 -1988 -1181920 -2528922 -2745673 -1634167 -584898 -902032 -2237635 -3193463 -3066273
41663 -3066273 -2381505 -1837984 -1367095 -502582 645310 1218623 536332 -1005744 -2212713
41654 -2212713 -2281667 -1508575 -763180 -519808 -545465 -299212 538260 1696712 2341701 1846285
41644 1846285 779675 639994 2129625 4096156 4757339 3650042 1786078 301158
41636 301158 -260413 271432 1525044 2328043 1764206 561564 290213 1057295 1344224
41627 1344224 518164 -28778 844567 2008798 1736918 458794 172959 1474536 2795956
41618 2795956 2738111 1781963 1206895 1310412 1350208 716620 -367529 -1114757 -937569 -121448
41608 -121448 296040 -368298 -1510982 -1801344 -680395 1032848 2023979 1692416 560525
41599 560525 -236756 22514 893085 1243302 695869 135585 370974 879560 658458 -126206
41589 -126206 -373158 224077 764829 579602 79095 -133738 -117129 -153646 -225666 -370529
41579 -370529 -861569 -1550935 -1713461 -1157647 -895563 -1925872 -3701758 -4612701 -3894970
41570 -3894970 -2382312 -1320148 -1025639 -917725 -446283 320244 870043 787058 147366
41561 147366 -510014 -619335 -81665 648742 1031410 1022266 1068110 1413420 1626723 1159598
41551 1159598 243035 -312450 -252393 -170504 -452607 -672183 -505700 -500699 -1178023 -1965559
41541 -1965559 -1944832 -1239362 -679932 -404731 128759 897961 1207481 861243 430810 302547
41531 302547 411802 869086 1742754 2270138 1613861 497878 580833 1883993 2505699
41522 2505699 1542437 570489 1145814 2410890 2639013 1873160 1338350 1174364 594715
41513 594715 -230127 -273203 501415 992701 733781 434230 614745 943244 1145728 1448892
41503 1448892 1801204 1616512 692195 -301470 -565524 2039 741149 653966 -765131
41494 -765131 -2610386 -3036344 -1443792 429758 665464 -234245 -302249 848136 1706581
41485 1706581 1456210 940133 722091 77686 -1324055 -2349751 -2009945 -919737 -245104
41476 -245104 -234163 -554205 -996009 -1083510 -141181 1410589 2021546 1191781 397351 733402
41466 733402 1050268 -7448 -1378121 -1036261 710198 1603371 893206 229430 812544
41457 812544 1625203 1256728 -14580 -888019 -775127 -64257 615332 752352 156369
41448 156369 -702621 -1014541 -550669 236158 1077139 2076637 2927100 2926995 2142940 1556540
41438 1556540 1506882 990248 -670315 -2336385 -2344154 -762362 796091 1391175 1625667
41429 1625667 2215335 2786185 2595968 1732005 948420 645432 576779 466777 414880 548053
41419 548053 603738 170936 -697655 -1358175 -1160899 -78019 1241298 1873996 1157738
41410 1157738 -712966 -2418977 -2381198 -453685 1586635 1929124 878204 275525 909703
41401 909703 1664334 1536158 1208288 1702662 2475483 2223013 1099122 584107 1059949
41392 1059949 1017708 -652965 -2750534 -3203012 -1779186 -198675 275265 221819 794757
41383 794757 2000114 2865479 2834769 2316302 1975864 2020339 2211892 2187056 1657013 591402
41373 591402 -652632 -1557016 -1872339 -1698135 -1202005 -529716 38908 228019 149336 176592
41363 176592 322360 177612 -334847 -665839 -453803 -111529 -87818 -64041 361573 591166
41353 591166 -354214 -2186561 -3354787 -2958130 -1783656 -1053789 -947338 -910217 -725916
41344 -725916 -520643 -141016 672881 1630818 2048665 1674965 950881 478742 531267 964789
41334 964789 1327695 1224559 850752 894497 1533887 1854259 844201 -1183237 -2788466
41325 -2788466 -3040334 -2401457 -1898613 -1955654 -2278723 -2453636 -2293642 -1812563 -1192043 -763922
41315 -763922 -827053 -1363559 -1907944 -1798966 -802760 449534 944678 415213 -299759 -308310
41305 -308310 234277 523208 334784 206916 400747 359931 -486589 -1795849 -2557048 -2136539
41295 -2136539 -885124 216625 434433 -119358 -719061 -858724 -725754 -793343 -1208503
41286 -1208503 -1780718 -2287922 -2503335 -2226177 -1656867 -1397738 -1603267 -1530899 -619352 365494
41276 365494 217181 -856587 -1401758 -854238 -303737 -674988 -1297755 -1103849 -369439
41267 -369439 -249811 -1087636 -2138609 -2688183 -2610929 -2054979 -1378560 -1235678 -1914656 -2653513
41257 -2653513 -2390632 -1204278 -239455 -130146 -306804 -109140 227370 194524 -12386
41248 -12386 175439 725916 1062951 1036173 1199648 1939308 2808240 3110792 2885970 2819786
41238 2819786 3182366 3366346 2774956 1786540 1331297 1664771 2124316 2118389 1757201 1301392
41228 1301392 591460 -503964 -1472102 -1588885 -888078 -241649 -396236 -1171083 -1686280
41219 -1686280 -1309008 -362990 173795 -190700 -806251 -735686 -95958 111118 -461058 -959859
41209 -959859 -666155 -64467 14434 -338930 -432196 -66067 439696 922843 1339473 1402902
41199 1402902 1018754 740298 989451 1173384 509360 -531087 -643704 525873 2027480
41190 2027480 3017373 3486463 3485808 2693356 1087068 -751071 -2232991 -2983222 -2539183
41181 -2539183 -859543 836779 989909 -233719 -1022684 -492609 145759 -341743 -1316928
41172 -1316928 -1469785 -800900 -188063 196628 767964 1379025 1461173 955302 201954 -606921
41162 -606921 -1046620 -318029 1398073 2281189 1053387 -815815 -824085 1021856 2306102
41153 2306102 1767675 641964 56023 -718241 -2383623 -3880319 -3993590 -3298501 -2932363
41144 -2932363 -2556488 -1304955 35770 -198988 -1798741 -2590828 -1404245 437663 1104270
41135 1104270 434969 -524633 -1051398 -993436 -353923 465704 592790 -273596 -1148094 -890116
41125 -890116 270429 1130702 1167389 914896 824986 709039 439470 312693 385521 191289
41115 191289 -455743 -964074 -721967 109722 930338 1351140 1184929 385418 -535201 -655508
41105 -655508 152440 724634 35112 -1381823 -2225964 -2109836 -1510962 -643225 353668
41096 353668 557062 -754099 -2296143 -1766932 913435 3060090 2723459 1140270 559771
41087 559771 1071066 1151191 346022 -377775 -494714 -508556 -793121 -1171667 -1591619 -2056164
41077 -2056164 -2007219 -974700 244082 313650 -706381 -1438436 -1315121 -1256535 -1875354
41068 -1875354 -2395454 -2045162 -1362394 -1243977 -1580602 -1730745 -1669973 -1770629 -1917504 -1681047
41058 -1681047 -1061633 -359893 414744 1328258 1917954 1488934 34970 -1585929 -2431960
41049 -2431960 -2200241 -1298704 -457498 -161043 -282832 -396930 -455911 -792007 -1350755 -1459980
41039 -1459980 -714284 346236 894381 821896 579432 253255 -557896 -1871735 -2855908
41030 -2855908 -2616716 -1346176 -329906 -577971 -1592726 -1912886 -942770 320081 695510
41021 695510 299145 -42867 -216292 -598250 -816979 -94878 1149003 1424696 250189
41012 250189 -1146273 -1655073 -1550521 -1342063 -735476 326484 848703 216954 -587121
41003 -587121 -508510 -216228 -876811 -1907925 -1706669 -213314 1027391 1255948 1216339
40994 1216339 1359666 1044992 -1107 -919160 -1059534 -873713 -836725 -604404 76399
40985 76399 653264 707500 687319 946176 938640 250741 -354402 48895 1013858 1224228
40975 1224228 253920 -1060493 -1825271 -1854790 -1318908 -425549 378419 454367 -448662 -1780853
40965 -1780853 -2484740 -1849399 -323273 631263 -9859 -1505770 -2108709 -1269474 -276183
40956 -276183 -348034 -1007548 -1044419 -311930 379459 615844 597099 328020 -352193 -1034866
40946 -1034866 -1027339 -455225 -246067 -881734 -1885210 -2651779 -3066012 -3133397 -2713523 -1901091
40936 -1901091 -1108444 -521814 28922 489581 447085 -153473 -687034 -612856 -187130 -72400
40926 -72400 -486712 -994590 -986928 -283533 568351 691268 -99856 -849480 -575195 310641
40916 310641 449205 -553344 -1532894 -1387226 -471980 127142 50457 -226419 -288407 -199786
40906 -199786 -274736 -774471 -1538213 -1782817 -859771 582357 1017278 62387 -836735 -441938
40896 -441938 496602 517061 -304648 -702535 -303211 105088 198915 529109 1171109 1346736
40886 1346736 791245 346088 693667 1432991 1852377 1766334 1204406 161915 -890666
40877 -890666 -1095194 -284935 754365 1418784 1809896 1865900 1153120 52775 -143741
40868 -143741 812530 1320378 200939 -1359415 -1533062 -560350 -95157 -528805 -798152
40859 -798152 -549773 -599037 -1118248 -1124905 -217761 662582 775406 615424 796494 1015313
40849 1015313 786871 278019 -196192 -670847 -1027085 -868424 -381661 -360617 -822670 -652495
40839 -652495 653538 1955938 2118619 1669547 1628367 1555589 292395 -1811935 -3029940
40830 -3029940 -2643440 -1780767 -1560415 -1651571 -1286437 -713157 -738735 -1301684 -1400016 -477840
40820 -477840 724353 1034368 328412 -288055 98010 1027658 1378014 950506 554616
40811 554616 520780 168101 -797715 -1376054 -668189 542594 760335 -38657 -421369 300762
40801 300762 1063624 626748 -726994 -1643511 -1354837 -382492 191840 -158215 -938340
40792 -938340 -1202091 -645367 42843 150533 -43727 274660 1189726 1881825 1701516 811861
40782 811861 -272065 -1147680 -1413035 -778758 373479 1070373 792790 108618 -64265
40773 -64265 462127 1106611 1303691 989110 436732 -74793 -403376 -511011 -409038 -226484
40763 -226484 -304098 -942579 -1863982 -2202887 -1398375 67452 1178079 1452508 1118638
40754 1118638 487829 -221745 -577475 -230789 346186 156695 -960341 -1872447 -1511154
40745 -1511154 -259081 510453 22481 -1221057 -2195238 -2329829 -1714585 -715946 351544
40736 351544 1244871 1723045 1652243 1174962 614236 178324 -95270 -159624 -29901 -13132
40726 -13132 -403464 -867276 -715594 8280 417279 126130 -102646 331754 778588 486609
40716 486609 56679 477092 1248515 981239 -290266 -931380 -71809 1204434 1456101
40707 1456101 558304 -656300 -1446709 -1427516 -675612 10528 -275914 -1383390 -2262363
40698 -2262363 -2368121 -2039079 -1524482 -767080 -166142 -234408 -399235 355997 1484183
40689 1484183 1285836 -245236 -960940 260020 1857717 2185789 1727222 1340639 400196
40680 400196 -1434274 -2517110 -1581916 -197947 -353931 -1048090 -203513 1188203 309693
40671 309693 -2521532 -3795608 -2168807 -465024 -1178339 -2934654 -3074820 -1423495 336044
40662 336044 1290313 1558383 1261480 769959 906759 1647452 1695133 458370 -784146
40653 -784146 -903164 -772272 -1604734 -2643922 -2325957 -929760 -176679 -603891 -1118773
40644 -1118773 -1021095 -781654 -680122 -217477 666339 1029042 237739 -957324 -1291830
40635 -1291830 -495973 520928 765235 135557 -635774 -872602 -658620 -518704 -594877
40626 -594877 -601190 -507730 -574261 -628134 -161389 594570 673022 -47127 -295009 767209
40616 767209 2118399 2281957 1326923 299351 -579731 -1671962 -2386442 -1665697 -62253
40607 -62253 391886 -1034626 -2524254 -2118344 -326014 762742 338637 -386909 -245192
40598 -245192 218313 -287193 -1773004 -2813053 -2463575 -1517011 -1273153 -1639352 -1402509
40589 -1402509 -196549 916623 1019356 413510 -270496 -927842 -1305371 -622888 1113831
40580 1113831 2364711 1866490 506550 54811 547902 440978 -842345 -2065363 -2075509
40571 -2075509 -1225941 -505163 -290029 -419388 -724524 -1067322 -1350409 -1644863 -1884484
40562 -1884484 -1594972 -542155 608999 1055413 983353 1051690 1136087 724541 217238 432218
40552 432218 987755 736679 -189270 -483828 -18051 -204728 -1463228 -2239568 -1481701
40543 -1481701 -280299 174000 558091 1777217 2836076 2260335 653327 -113896 344150
40534 344150 837143 875102 1189574 2024317 2554401 2221511 1381536 514437 -104868 -40440
40524 -40440 776700 1262456 288774 -1407128 -1867465 -647896 551179 319720 -863761
40515 -863761 -1968797 -2838445 -3462385 -3199873 -1864366 -585361 -419091 -821297 -599540
40506 -599540 218909 603056 191261 -358546 -499491 -311319 26952 448739 734969 758909
40496 758909 914610 1601773 2379053 2378370 1548041 745263 524293 529389 220928 -446257
40486 -446257 -1255986 -2066318 -2699677 -2960074 -2888261 -2579869 -1818503 -540867 400469 -86518
40476 -86518 -1635870 -2437836 -1538107 -184364 -44564 -909860 -1295950 -753217 -204632
40467 -204632 -128834 184729 1222436 2205858 2063497 755719 -837642 -1818199 -1752179
40458 -1752179 -847120 36417 124951 -251875 -35648 933043 1525038 1009480 194257 148588
40448 148588 607458 562414 -197996 -1078551 -1640822 -1629640 -665286 957739 1759422 738703
40438 738703 -876584 -1088230 -67131 144882 -1104960 -2117614 -1667397 -813583 -838770
40429 -838770 -1106212 -459794 518174 351926 -966460 -2055684 -2179442 -1794498 -1341424
40420 -1341424 -844407 -624658 -1129835 -1937700 -2042303 -1355336 -951613 -1496445 -2242807
40411 -2242807 -2027519 -719914 708914 1232333 632256 -460338 -1219172 -1361965 -1189290
40402 -1189290 -939355 -510280 19886 149020 -342182 -861757 -644077 418857 1890939
40393 1890939 3212867 3672452 2715689 900709 -192325 235118 1160707 1279390 779352
40384 779352 610310 825388 895524 932018 1174909 937375 -292439 -1233397 -187768 2209001
40374 2209001 3567958 3024606 1920571 1150349 121945 -1149455 -1274451 181683 1681647
40365 1681647 2181409 2610389 3554821 3562052 1649468 -290793 74571 1934647 2624484
40356 2624484 1648618 834788 855028 329493 -1214561 -1969284 -551460 1646946 2163696
40347 2163696 558605 -1349278 -1829552 -911042 141893 407422 193075 409409 1178364
40338 1178364 1511386 698712 -487462 -673117 311352 1288256 1336500 815875 669759
40329 669759 1224448 1873162 1772937 865226 133780 422791 1085352 712351 -629330
40320 -629330 -1186605 -178420 843166 521093 91054 1327848 3213526 3147258 1062562
40311 1062562 -330561 317568 1205730 595352 -532132 -460035 466991 765747 279644
40302 279644 -14870 130823 181754 149810 509381 965827 563686 -912628 -2534605 -3276530
40292 -3276530 -2854085 -1640207 -335558 400959 489375 458796 630029 646029 192616 -342776
40282 -342776 -486301 -439256 -565950 -607628 -205601 153867 -395104 -1822441 -3154203 -3624771
40272 -3624771 -3216410 -2179696 -766578 534206 1174828 1117840 791222 479892 208931
40263 208931 128342 409649 730631 472428 -398369 -1146374 -1188697 -795595 -624876 -889587
40253 -889587 -1300873 -1644040 -2047681 -2622750 -3078915 -2958189 -2251286 -1489336 -1040008 -626706
40243 -626706 80449 725558 760367 459461 556130 869309 381160 -985655 -1810179 -1089474
40233 -1089474 291135 927044 854920 999454 1365386 1163094 386567 -114030 -35524 184655
40223 184655 535835 1414981 2274665 1753630 -279488 -2066727 -2130540 -1116984 -623865
40214 -623865 -1023830 -1452298 -1399474 -1229385 -1257164 -1186889 -607788 424714 1392964 1701208
40204 1701208 1181230 373883 48605 278386 363439 -115983 -666487 -679629 -388860 -494341
40194 -494341 -1151390 -1865338 -2169651 -1928131 -1181339 -193537 506285 605682 420962 440609
40184 440609 638909 654427 423414 148939 -146137 -485844 -549486 -40392 659160 848601
40174 848601 473700 66031 -243213 -860256 -1758397 -2187621 -1683985 -708138 46063 345021
40164 345021 139748 -590032 -1222529 -593722 1449628 3252372 3123599 1502361 293317
40155 293317 310456 610306 397083 244420 872553 1794516 2071010 1778100 1794136 2401279
40145 2401279 2946693 2909738 2613941 2601296 2698447 2131161 600193 -1056652 -1665408 -1213371
40135 -1213371 -994521 -1834681 -2758978 -2351558 -1096856 -1001630 -2678039 -4273771 -4077844
40126 -4077844 -2864405 -2409139 -2735889 -2505689 -1573097 -1253836 -1979356 -2471463 -1840829
40117 -1840829 -1045491 -1349466 -2388658 -2823383 -2277637 -1617219 -1571440 -1896701 -1883555 -1171974
40107 -1171974 -24475 962244 1431850 1564517 1625061 1400162 593378 -350294 -596079
40098 -596079 -182916 -54212 -537540 -727752 72535 1152722 1374712 686901 -112763
40089 -112763 -544138 -551692 23940 1105473 1823517 1293423 -127012 -1194864 -1381880
40080 -1381880 -1348039 -1765015 -2400416 -2594963 -2124979 -1331119 -683093 -393918 -367614 -505955
40070 -505955 -974654 -1849329 -2559814 -2332745 -1365894 -783010 -1030297 -1191226 -520605 283173
40060 283173 284434 -89142 74415 363419 -323702 -1630679 -1914406 -746799 275065
40051 275065 -260233 -1770202 -2725306 -2561273 -1851384 -1232767 -823756 -383486 334229
40042 334229 1202337 1681370 1480327 1072655 1044957 1195248 943253 324598 -234230 -760839
40032 -760839 -1351696 -1346957 -185503 1183254 1234926 117848 -642279 -655750 -1006772 -1878129
40022 -1878129 -2006412 -1172389 -984519 -2007775 -2267661 -286198 2250226 2865487 1825636
40013 1825636 1071109 823277 -216124 -1928921 -2627382 -1791580 -683035 -8006 935185
40004 935185 2302670 2827302 1730282 69089 -665194 -234440 693566 1579523 2069089
39995 2069089 1857290 1114334 485629 345534 600932 1265642 2389042 3323722 3079630
39986 3079630 1738654 617505 620258 1193231 1287620 669673 -73236 -262992 332144 1162596
39976 1162596 1120871 -245272 -1888525 -2425037 -1853522 -1075294 -135875 1476930 2964931
39967 2964931 2661626 728605 -606969 -279427 140956 -696867 -1607136 -1036349 187671
39958 187671 305978 -477334 -735412 -482308 -783058 -1342878 -916310 135252 162602 -778913
39948 -778913 -715013 957977 2364402 2264123 2011987 2976686 3952441 3066160 940245
39939 940245 -134190 492361 1273306 977540 38305 -675713 -944460 -736767 102584
39930 102584 1207622 1627084 926801 -220474 -897218 -914848 -697890 -670976 -975097 -1403224
39920 -1403224 -1517774 -1215572 -1085936 -1592493 -1996004 -1036312 1089127 2460813 1765207
39911 1765207 39318 -730278 -83796 818292 1110786 1069352 1126141 1151681 983066 839574
39901 839574 867210 869491 759550 746005 850707 766449 389017 -44270 -501274 -1200367
39891 -1200367 -1885158 -1779879 -677730 556394 1017487 728489 192317 -338035 -652040
39882 -652040 -394918 257533 459968 -13284 -102688 956745 2123119 1840967 322782
39873 322782 -817068 -875391 -556670 -303434 300178 1280238 1922346 2068476 2416258 3051677
39863 3051677 3026472 2058582 1393188 2079740 3365249 3692550 2572813 774240 -647305
39854 -647305 -975518 -300270 217009 -461959 -1444963 -717673 1610687 2645204 567532
39845 567532 -2507818 -3350886 -1949912 -859306 -1168060 -1601864 -1312382 -1079614 -1459344
39836 -1459344 -1845167 -1887936 -2064875 -2313504 -1771112 -471840 273290 -122355 -598640
39827 -598640 -259534 285733 217158 -141750 -157724 54131 261019 722012 1336826 1284883
39817 1284883 396204 -226509 79327 326696 -488349 -1594296 -1582291 -478857 637967
39808 637967 1332631 1752345 1565732 481511 -619188 -566893 342958 858615 755398
39799 755398 850741 1229600 1065934 316692 26141 585129 1111153 1068484 1177240 1991369
39789 1991369 2697620 2228644 808726 -424531 -794728 -425380 287147 894509 980103
39780 980103 607267 417061 850518 1568082 1994729 2045238 1864599 1257324 23317 -1302159
39770 -1302159 -1714842 -897227 326936 930382 803803 638158 822839 912033 384331
39761 384331 -461835 -867190 -683697 -456376 -439977 -284381 90898 121112 -448173 -969716
39751 -969716 -847069 -392448 -76604 344347 1121079 1650803 1366466 893023 1161829 1850596
39741 1850596 1918343 1261573 545643 -157853 -1057239 -1365554 -159323 1608076 1941753
39732 1941753 848896 472714 1671872 2613682 1741739 133155 -454763 -160527 -57951
39723 -57951 -48283 540708 1287730 1300279 743484 267147 -314253 -1289054 -1799999 -967696
39713 -967696 374122 738348 256433 178636 560934 357881 -337746 -118870 1418305
39704 1418305 2894346 3105895 2312836 1185506 -108416 -1260291 -1583609 -1065493 -584171
39695 -584171 -513944 -145019 900205 1661107 1041827 -641189 -2023702 -2194494 -1341260
39686 -1341260 -242157 486630 774820 856227 663930 -105651 -1073795 -1136943 -104070
39677 -104070 496289 -541881 -2052002 -2118344 -1119609 -1064721 -2132274 -2322984 -944884
39668 -944884 73738 -617899 -1569894 -1026874 252865 503731 -171487 -393098 39830
39659 39830 227853 80070 345626 1058150 1471932 1329411 931821 282281 -629406 -1123194
39649 -1123194 -710319 -247875 -807308 -1758557 -1524643 -43369 1146457 1273654 1120075
39640 1120075 1192241 800311 -373930 -1218949 -666629 717228 1511996 1184787 319988
39631 319988 -412427 -848805 -1126673 -1320993 -1210101 -405020 965944 1860486 1265142
39622 1265142 -451345 -1833942 -2084153 -1774968 -1707760 -1916966 -2117832 -2279819 -2248466
39613 -2248466 -1553928 -239833 728458 615735 27092 68702 663966 586401 -757759
39604 -757759 -2350285 -2742544 -1733567 -354460 581852 1219439 1762458 1569813 -30835
39595 -30835 -2247819 -3174602 -1962491 181559 1635893 2138931 2203175 1695651 299912
39586 299912 -1101089 -1045105 411629 1532830 1161078 -4915 -807965 -1184567 -1647427
39577 -1647427 -2134945 -2228984 -1964903 -1694158 -1526192 -1459452 -1643302 -1968704 -1832190 -914005
39567 -914005 146834 460421 27363 -389535 -351714 -148470 -172301 -360822 -350003 30623
39557 30623 457907 347498 -400738 -988625 -559955 503162 826368 -126745 -1221353
39548 -1221353 -1185572 -280864 324596 279633 159294 169942 -126515 -731632 -892681 -241680
39538 -241680 532180 638651 238244 9266 104933 165127 140716 435607 1149806 1706713
39528 1706713 1515036 723232 36094 -62296 357882 974525 1480385 1554684 1001084 119092
39518 119092 -392048 -177176 377228 744674 936094 1198116 1357314 1010549 185233 -736392
39508 -736392 -1571908 -2208437 -2148419 -1045439 355338 802817 239438 -104054 362814
39499 362814 707898 161958 -463614 -112201 652575 465837 -657647 -1387161 -1153434
39490 -1153434 -752440 -757342 -705947 -307746 -210827 -814279 -1290261 -731541 362934 729334
39480 729334 133347 -395659 -49715 812451 1300922 993820 158356 -580070 -629674 164186
39470 164186 1323771 2122504 2219483 1776090 1053343 201511 -592928 -1114098 -1333407 -1343910
39460 -1343910 -1086361 -478895 193215 446752 213344 -164418 -572694 -1149578 -1570340
39451 -1570340 -1161082 -130057 239630 -612783 -1387654 -675968 826695 1244795 260452
39442 260452 -673522 -760967 -713207 -871560 -377335 957664 1703354 966001 14494 310612
39432 310612 1198368 1196447 471809 156912 125579 -452606 -1028611 -483139 361132 -395918
39422 -395918 -2307663 -2727476 -933649 608861 196383 -519149 443035 2056069 2154155
39413 2154155 926221 177163 301575 383203 487492 1423396 2622110 2596153 1461708
39404 1461708 846475 1171145 1140632 276395 -171370 460064 987125 465253 -179386 118362
39394 118362 639810 223211 -533904 -135403 1283286 1958417 986851 -600466 -1486154
39385 -1486154 -1603392 -1562950 -1487317 -1118966 -550701 -131959 145863 576030 1083530 1165349
39375 1165349 606383 -170567 -695133 -1011237 -1295059 -1249544 -463357 727947 1389861
39366 1389861 1147045 656316 705169 1330932 2090979 2692843 2990723 2817761 2259717 1747851
39356 1747851 1524008 1395213 1303831 1553426 2018071 1817457 516123 -909344 -1165832
39347 -1165832 -286357 712930 1386763 1960389 2140903 1174878 -705032 -2060887 -1946373
39338 -1946373 -983541 -335081 -353995 -672899 -932988 -928960 -587296 -259468 -539220 -1347688
39328 -1347688 -1690506 -855077 516480 1118805 565704 -226959 -215389 617863 1401747
39319 1401747 1435045 886039 429988 411725 619892 769815 771606 506804 -72468 -455996
39309 -455996 83383 1288104 1876420 1303597 660736 921315 1236503 317254 -1220318
39300 -1220318 -1591366 -596656 153251 -223279 -895064 -1102700 -1127009 -1017082 -177301 1042273
39290 1042273 1130190 -215303 -1201987 -652420 63214 -650080 -1889430 -1812305 -741042
39281 -741042 -448141 -998823 -673387 1031403 2511884 2538827 1799718 1420750 1515212 1826627
39271 1826627 2405276 2889248 2332955 624242 -881102 -982599 -132076 410959 148455
39262 148455 -682381 -1890803 -3092953 -3306981 -1971422 -136208 474454 -381007 -1227302
39253 -1227302 -977698 -301229 -387584 -1144986 -1471148 -972651 -514930 -954203 -2013726
39244 -2013726 -2771597 -2830365 -2574803 -2485217 -2583634 -2494372 -1823971 -610634 445101 518498
39234 518498 -269933 -737142 -93625 916264 1072515 492918 350003 946169 1327685
39225 1327685 970474 530211 476076 316270 -93911 201825 1642150 2931619 2750848
39216 2750848 1731617 1259495 1134023 185658 -1275123 -1593140 -365672 903810 1041499
39207 1041499 477516 -93149 -713318 -1233124 -910796 212599 840089 227606 -680703
39198 -680703 -820535 -551702 -605461 -628388 -56057 503728 188926 -525595 -615660 -304992
39188 -304992 -506032 -903313 -385220 700074 631425 -930780 -2046874 -1202970 531781
39179 531781 1160167 466715 -205204 -162309 18391 -177806 -465303 -459718 -233675 34486
39169 34486 346237 648070 791425 838807 994522 1171083 1041495 578628 120850 -161353
39159 -161353 -414399 -615650 -424601 266416 1057878 1568543 1834714 1909586 1517627 561163
39149 561163 -381473 -652130 -454985 -607291 -1322865 -1792556 -1197702 208341 1282688
39140 1282688 1105624 -202794 -1637919 -2206438 -1758438 -931864 -269638 325262 1025529
39131 1025529 1374239 771224 -483336 -1391443 -1597488 -1730405 -2102090 -1921011 -505550
39122 -505550 1331981 2052843 1320487 276483 -111261 -127941 -493524 -1189015 -1597060
39113 -1597060 -1411785 -902331 -415940 -19021 351510 630412 621315 202334 -494578 -1132712
39103 -1132712 -1429797 -1334740 -940173 -375765 98917 102496 -487302 -1252577 -1616297 -1433839
39093 -1433839 -912933 -90054 1091344 2151778 2194775 1050680 -195884 -400534 214561
39084 214561 489568 27501 -374145 -172835 -70533 -885003 -2029658 -2104801 -892278
39075 -892278 217696 56433 -885716 -1337032 -894699 -143600 370732 481546 -8877
39066 -8877 -1200857 -2552111 -3198805 -2931359 -2277642 -1631671 -974499 -438613 -298190 -255926
39056 -255926 353939 1365054 1717116 1013663 168031 -75033 -208568 -720030 -847616
39047 -847616 189034 1541401 1799806 1192552 1110066 1683044 1603583 512100 -240109
39038 -240109 163430 599760 -176338 -1603984 -2370877 -2383277 -2383751 -2347751 -1695907 -721512
39028 -721512 -371400 -643203 -522075 280089 752782 234334 -432079 -156354 733095 1009326
39018 1009326 360703 -256865 -89159 395526 282537 -482751 -1015883 -581437 563637
39009 563637 1445063 1349155 502809 -176082 -26842 659081 984100 475820 -421861 -952194
38999 -952194 -871938 -477285 -81684 169396 139320 -193924 -523412 -538874 -439494 -653767
38989 -653767 -1077142 -1175911 -893843 -740786 -793582 -434548 497805 1132979 795865 50216
38979 50216 -329446 -743768 -2010771 -3648432 -4183508 -3129352 -1525906 -416558 150723
38970 150723 422206 331293 22008 75233 675389 1217272 1194734 898960 858502 1149378
38960 1149378 1574231 1933426 1850506 1014632 -99696 -516608 -129256 52550 -508346
38951 -508346 -990658 -633119 -110550 -486272 -1496218 -2014205 -1735786 -1195242 -413171
38942 -413171 1152231 3248114 4611561 4445002 3239557 1855891 619609 -324435 -585532
38933 -585532 -62301 593888 628262 56259 -487697 -547757 -176899 311839 584595 398609
38923 398609 -194628 -726245 -606425 311966 1485719 2118777 1952772 1527581 1452999 1545219
38913 1545219 1123252 170982 -447322 -243865 96872 -203317 -708290 -415064 633415
38904 633415 1417408 1549112 1712576 2274362 2527600 1864781 827878 257910 50795
38895 50795 -409838 -1029184 -1121799 -571514 -1591 245717 525544 1091440 1531866 1334271
38885 1334271 554565 -385967 -1187679 -1653449 -1573483 -1050924 -676999 -932168 -1557256 -1896773
38875 -1896773 -1679619 -1032054 14652 1326922 2080486 1303504 -677695 -2165534 -2015866
38866 -2015866 -947327 -275362 -65769 457851 1224230 1384300 955368 945075 1492437
38857 1492437 1267615 -483673 -2401662 -2613446 -1189181 134571 304242 -111721 -247340
38848 -247340 -119045 -171129 -359852 -155753 735715 1810590 1946801 480034 -1695719
38839 -1695719 -2672296 -1741292 -508659 -903868 -2496721 -3040804 -1652881 -28218 39502
38830 39502 -900270 -987613 277752 1590240 1778893 1109028 552038 586490 1003084 1336206
38820 1336206 1190022 530163 -92236 43417 903824 1518086 1104680 146304 -173613
38811 -173613 451478 1034362 656695 -314504 -842974 -651204 -361458 -371565 -360533 -47078
38801 -47078 267249 254651 106631 136403 330680 710857 1600213 2950495 3886085 3677858
38791 3677858 2862308 2580252 2996535 3261783 2972722 2651090 2559861 2064084 731682
38782 731682 -711998 -1268957 -1018483 -846584 -1140681 -1511066 -1676914 -1832001 -1987535
38773 -1987535 -1665861 -679417 244237 192806 -727151 -1466952 -1348641 -746507 -243630 267597
38763 267597 1057298 1613923 1187480 196052 6545 985320 1804409 1335684 280524
38754 280524 -47547 255645 196453 -104266 461863 1841149 2463844 1600821 633318 1007089
38744 1007089 2013175 1844111 230529 -1273452 -1471220 -848717 -542631 -864549 -1273761
38735 -1273761 -1324459 -1188935 -1337852 -1902896 -2408725 -2229315 -1358968 -522702 -346666 -629394
38725 -629394 -698067 -320220 66484 -23149 -554332 -1034764 -955001 -206675 734461 1073296
38715 1073296 388455 -849285 -1600757 -1238325 -185849 510133 282578 -373771 -539502
38706 -539502 10744 614777 658673 285348 -34542 -172561 -167645 189168 974365 1626569
38696 1626569 1546888 1051078 965786 1370786 1585870 1382891 1226856 1185181 719811 -40405
38686 -40405 15473 1285126 2449223 2154793 959320 499013 1216225 2038693 2044775 1355514
38676 1355514 460171 -315404 -585719 -68172 800076 1107231 553431 -233988 -562539
38667 -562539 -318812 285024 1004795 1483647 1430748 1052961 891841 1165066 1658597 2181815
38657 2181815 2593884 2495663 1617532 523755 130298 376072 216317 -764158 -1600515
38648 -1600515 -1334608 -388920 161127 114657 100860 323408 237563 -488630 -1383948 -1767265
38638 -1767265 -1521527 -1065640 -786808 -671915 -427538 110623 728873 1073078 1070584 889806
38628 889806 505203 -323496 -1500452 -2387581 -2402440 -1582919 -419052 525215 700445
38619 700445 -116071 -1192255 -1156260 338090 1731436 1289533 -525717 -1518127 -643056
38610 -643056 755199 998541 202261 -454813 -595387 -605212 -378444 478758 1383752 1174564
38600 1174564 -8285 -593018 165291 1087046 1039342 785558 1608163 2976445 3185370
38591 3185370 1965176 844876 853154 1343580 1425184 1154909 751731 -43757 -1004009 -998659
38581 -998659 374840 1672781 1327261 -191880 -1175940 -1093682 -843319 -906737 -720260
38572 -720260 71139 1061506 1996170 3019603 3727055 3218019 1624952 459179 713887
38563 713887 1552631 1652482 994606 410856 88913 -349736 -713295 -371330 518376 928833
38553 928833 322946 -627564 -917362 -260478 918136 2033340 2606839 2365187 1424682
38544 1424682 275468 -575472 -899913 -738390 -322245 -36690 -196799 -683918 -938316
38535 -938316 -522448 296478 706424 259932 -460610 -408685 577620 1383026 946606 -353190
38525 -353190 -1259794 -1373824 -1464774 -1972859 -2203725 -1528963 -545706 -248661 -617343 -892299
38515 -892299 -858708 -904320 -997754 -621886 186867 644168 365990 5597 357525 1320784
38505 1320784 2092590 2015031 986781 -557856 -1784286 -1920835 -947358 309358 932104
38496 932104 652396 -108506 -606379 -218103 989238 2019369 1768945 298953 -1133291
38487 -1133291 -1467585 -771775 361823 1613397 2659638 2790467 1609229 -188658 -1452362
38478 -1452362 -1815344 -1688404 -1277067 -435711 526501 777872 8388 -1092534 -1759379
38469 -1759379 -2052204 -2447809 -2946931 -3086254 -2656503 -1974281 -1451304 -1172907 -934833
38460 -934833 -527083 71622 712955 1225983 1475970 1302274 647972 -72541 -45603 1041238
38450 1041238 2303715 2441835 1285946 3963 -410872 -270051 -465823 -1183261 -1901227
38441 -1901227 -2294632 -2439561 -2236826 -1316315 304285 1900763 2642721 2361132 1622962
38432 1622962 1155194 1231765 1561368 1753091 1779069 1769620 1498983 618498 -501059 -856379
38422 -856379 -155880 578933 393686 -225529 -234707 232798 210169 -246824 38642 1358010
38412 1358010 2359468 1942303 820415 355176 675416 908430 667827 313581 99491
38403 99491 -11673 103494 548390 926261 763830 253744 -91180 -251458 -381131 -858
38393 -858 1389519 2939826 2918584 922724 -1388498 -2263943 -1683304 -660658 312984
38384 312984 1186527 1409214 364795 -1324197 -2056443 -1176470 114825 230370 -947195
38375 -947195 -2184091 -2481775 -1900598 -940209 158129 1236810 1927624 2034788 1908361
38366 1908361 1927413 1838149 1205683 360567 99426 390068 290841 -497647 -927486 -94060
38356 -94060 1376671 2293000 2566743 2839310 2952244 2133982 597881 -401816 -350175 -122504
38346 -122504 -460035 -892307 -767782 -408893 -476508 -869172 -1018026 -786914 -398796 111546
38336 111546 703565 934456 439826 -374538 -712231 -375822 76309 97514 -290271 -681067
38326 -681067 -775105 -668111 -684927 -855093 -744623 -134863 404359 243575 -220594 -90884
38316 -90884 512199 590618 47069 -35903 650829 889227 -6400 -841275 -541650 -190819
38306 -190819 -1334289 -3195692 -3605268 -2259694 -1000722 -898654 -1095099 -866633 -854564
38297 -854564 -1471651 -1802841 -1192537 -596549 -1104187 -2070654 -2032008 -930932 -208286 -838307
38287 -838307 -2201850 -2945447 -2370316 -954927 127803 51545 -896923 -1693006 -1719901
38278 -1719901 -1216356 -626040 -80842 341460 475030 444468 632348 1030326 1191425 1035980
38268 1035980 1038697 1349936 1464982 1121065 770254 744070 729357 544558 580868 890509
38258 890509 779507 99395 -22568 1159292 2430089 2051704 303133 -839796 -415195
38249 -415195 474148 420973 -642780 -1813590 -2289617 -1823574 -849051 -278102 -502562
38240 -502562 -697828 41214 1087284 992325 -219622 -921740 -392481 64407 -709230
38231 -709230 -1820129 -1774800 -783538 -190497 -262585 -73700 643617 1013793 549415 -90115
38221 -90115 -280529 -369709 -890074 -1599872 -1917696 -1773465 -1436050 -887709 24142 1014896
38211 1014896 1475959 1120097 190574 -838208 -1441885 -1140959 73185 1438583 2065366
38202 2065366 1987952 2097576 2825541 3416611 2977432 1878599 1422566 2138430 3086404
38193 3086404 3133253 2363375 1700160 1472654 1104349 273938 -368957 -134407 540009 600773
38183 600773 -28750 -189514 839425 2108560 2166025 1085834 388651 893874 1616507
38174 1616507 1279456 150551 -412381 194574 1309979 2173019 2699207 2964210 2720029
38165 2720029 1826459 660994 -281375 -856056 -1059891 -722014 228455 1394160 2117843
38156 2117843 1995174 1120741 51190 -429879 134625 1380475 2436361 2815746 2699185
38147 2699185 2362673 1864982 1408182 1352303 1563326 1378097 647491 190347 623372 1300175
38137 1300175 1166448 273747 -388047 -351909 -133663 -263034 -597150 -694003 -294794 619527
38127 619527 1731417 2352830 2060176 1385805 1271259 1764827 1933866 1270672 488652
38118 488652 492775 1115156 1474800 1274601 1048191 1124984 1025151 269515 -628282 -652970
38108 -652970 217661 748740 135693 -672503 -204130 1316613 2122365 1335993 34398
38099 34398 -526414 -517531 -595027 -477906 393312 1563316 2136996 2100268 1942489 1538185
38089 1538185 662914 88375 690542 1791595 1928994 1086376 530227 504228 -66544
38080 -66544 -1321719 -1831338 -870452 409128 941824 1259637 1979888 2322914 1533141
38071 1533141 553155 703035 1520237 1478385 350968 -605673 -585427 -57029 289504 339209
38061 339209 216046 -34250 -313383 -526862 -722972 -855984 -698667 -293651 -31725 45184
38051 45184 406774 1114625 1484676 1161872 710658 555085 255105 -440406 -816553 -372451
38041 -372451 206518 279824 429706 1198340 1689666 931661 -232015 -263652 735225 1494804
38031 1494804 1750196 2118963 2339713 1657020 675389 733293 1492319 1248169 -265590
38022 -265590 -1503516 -1739397 -1863078 -2180183 -1769050 -716660 -598313 -1676630 -1945399
38013 -1945399 -359549 1164834 699605 -708009 -1002226 -382067 -321525 -656868 -160646
38004 -160646 783324 598350 -685605 -1347593 -717028 44188 90813 -61568 -6578 -217800
37994 -217800 -760977 -733687 251186 1183044 1023787 111193 -461304 -230265 360184 543261
37984 543261 -218873 -1761021 -3107420 -3357597 -2745012 -2219045 -2002558 -1360997 82992
37975 82992 1624219 2309838 1832526 467147 -1127086 -1925641 -1275289 83869 606871
37966 606871 -79445 -704717 -343242 148860 -465552 -1802691 -2399607 -1819119 -1028527
37957 -1028527 -763346 -644073 -182364 295262 305829 171710 615140 1639360 2464281
37948 2464281 2575879 2278089 2031394 1751932 1153784 416438 -52330 -358215 -985549
37939 -985549 -1887868 -2389103 -2227913 -2033883 -2307924 -2495892 -1720417 -80367 1437511
37930 1437511 2118328 1963100 1184433 3127 -1071108 -1475554 -1274251 -1059790 -1051244
37921 -1051244 -840755 -238971 170131 -279622 -1367575 -2090788 -1737477 -713761 -214486
37912 -214486 -953417 -2252339 -2725729 -1976705 -1101765 -1168870 -1790934 -1864879 -1212966 -571902
37902 -571902 -273396 -32070 30117 -644129 -1799365 -2233245 -1434063 -396196 -164052
37893 -164052 -414688 -273713 179193 186434 -346917 -773883 -784607 -668904 -538071 -146927
37883 -146927 357724 308095 -478263 -1158963 -875695 30885 402202 -235451 -1132627 -1411822
37873 -1411822 -1124563 -798917 -435528 244372 742192 70711 -1542148 -2297161 -1032056
37864 -1032056 972305 1517270 365682 -678877 -417121 408760 654152 326060 16617
37855 16617 -138209 -188575 109944 736975 1016624 511391 -246504 -577549 -644438 -933175
37845 -933175 -1304901 -1324274 -1044737 -705325 -142121 670378 1003908 296882 -709879 -860714
37835 -860714 -334206 -283216 -820028 -724579 554657 1874415 1963394 1017437 42778 -554272
37825 -554272 -911548 -908130 -389091 125538 -93287 -791027 -766793 646554 2602853 3528137
37815 3528137 2691593 862459 -437123 -244673 1105418 2375112 2559476 1751939 986554
37806 986554 1245983 2538846 3852274 4036243 2846284 1155133 109916 103512 586497
37797 586497 755834 278033 -584024 -1317084 -1538724 -1173408 -424798 349478 777544 653360
37787 653360 131096 -338133 -469700 -501878 -833092 -1347194 -1490917 -1095281 -658994 -587791
37777 -587791 -597200 -216537 514817 1273851 1979818 2545764 2455633 1335963 -164437 -831132
37767 -831132 -322253 500458 837483 890028 1200561 1619029 1465576 496158 -714881 -1295030
37757 -1295030 -776206 563726 1845444 2224357 1636307 870939 757007 1343252 2012304
37748 2012304 2283259 2234218 2065200 1516018 134074 -1730856 -2605712 -1193328 1937504
37739 1937504 4560630 5038214 3899712 2779841 2341071 1999217 1333741 713315 419530
37730 419530 109496 -438729 -786645 -595149 -389368 -914097 -1985010 -2570201 -1976082
37721 -1976082 -563876 687549 1034343 419648 -614124 -1345504 -1343717 -699614 58270
37712 58270 258595 -439464 -1602378 -2229350 -1760710 -759120 -198236 -249628 -333168 -219068
37702 -219068 -267610 -488892 -286835 474389 1005500 784225 446466 718031 1125415 772765
37692 772765 -30665 -86722 815556 1462709 920600 -234379 -834062 -604813 -221304 -298014
37682 -298014 -825347 -1432989 -1861979 -2175370 -2558829 -2857643 -2513827 -1316914 -45667
37673 -45667 226854 -490724 -1034563 -562169 498334 1259073 1517050 1601333 1558610 1135064
37663 1135064 384284 -243791 -402045 -130283 260509 373830 15179 -484648 -552215 -239321
37653 -239321 -339109 -1177617 -1812580 -1196591 213603 948650 511737 -131465 -157740 55282
37643 55282 -122054 -473336 -405254 144873 878141 1647515 2203589 1985151 860845 -378185
37633 -378185 -965538 -1140902 -1432677 -1500867 -741182 317701 480380 -272820 -651554 2595
37623 2595 789864 672299 -222966 -1212695 -1961273 -2168458 -1362587 165631 1100322 747043
37613 747043 195974 730656 1716712 1456680 -141475 -1246686 -642789 724000 1239898
37604 1239898 620365 -307125 -1074241 -1914497 -2853132 -3214113 -2276756 -190532 1950149
37595 1950149 2988395 2640294 1499847 264659 -686882 -1010754 -389384 834439 1649934
37586 1649934 1563886 1236393 1298291 1200492 200141 -1064855 -1251047 -319037 452709 443439
37576 443439 329722 583487 726339 500711 441673 656604 301611 -904186 -1797222 -1421165
37566 -1421165 -608988 -774705 -1824023 -2413902 -1818553 -493318 850030 1769006 1998070
37557 1998070 1709676 1607681 2029311 2342407 1964644 1419535 1448655 1658165 1233904 567884
37547 567884 793562 1851169 2406502 1792208 730143 -106525 -968611 -2023727 -2629096
37538 -2629096 -2285892 -1511336 -1146907 -1379933 -1863090 -2215079 -2071661 -1259108 -223136
37529 -223136 326109 405272 666824 1143712 1055227 261019 -161443 479623 1239607 838824
37519 838824 -484295 -1451734 -1561688 -1317303 -949103 -109005 1102390 1866159 1751179
37510 1751179 1329047 1267262 1352741 887281 -229995 -1221260 -1192018 -33537 1362463
37501 1362463 1778413 772528 -780961 -1428221 -587761 815565 1333441 546881 -626465
37492 -626465 -1214336 -1322175 -1537466 -1598170 -650273 1014603 1672764 471335 -931501
37483 -931501 -376036 1679664 2696563 1668386 394290 595354 1488611 1383571 361548
37474 361548 -155152 277980 784505 787260 572986 336634 -104444 -585900 -638376 -330454
37464 -330454 -122338 134045 1018162 2277022 2843726 2377561 1708702 1391766 964214
37455 964214 230219 102032 1160251 2272981 1910739 363087 -624176 -258066 496309
37446 496309 636046 435818 547123 773257 543845 2289 -241470 -115764 8194 256384
37436 256384 1132535 2297703 2450645 1028135 -689197 -1017422 -20107 719540 331832
37427 331832 -384055 -447107 -99462 -97664 -369962 -251635 344362 872179 1115701 1368447
37417 1368447 1612295 1326808 407827 -379265 -340670 161893 198139 -457254 -1089378 -1123275
37407 -1123275 -923616 -1171172 -1741852 -1774509 -922508 36488 245979 -4572 243295 1112814
37397 1112814 1666899 1275764 420813 -155667 -358402 -356525 -3529 731298 1310417 1293792
37387 1293792 1008365 888211 644265 -98271 -790989 -592645 249236 692632 470927
37378 470927 303194 514203 560461 167472 -116151 92927 396690 464524 645590 1160231
37368 1160231 1429059 876904 -158191 -940338 -1277864 -1376466 -1228321 -780142 -340833
37359 -340833 -208760 -176029 60594 303611 232930 89631 346753 861811 970181 371229
37349 371229 -595576 -1511514 -2206108 -2518088 -2243074 -1479915 -669684 -106699 344924 876107
37339 876107 1269902 1075908 243486 -671452 -1137074 -1321669 -1742384 -2265265 -2098151 -1091501
37329 -1091501 -327037 -709546 -1575364 -1688539 -1160023 -1094108 -1542022 -1359041 -298576
37320 -298576 364192 -100455 -691383 -419098 177031 336533 532983 1209134 1276664 -313509
37310 -313509 -2304653 -2417271 -578062 1009200 970651 138631 -340676 -469844 -452865
37301 -452865 75312 1020848 1311399 382094 -723511 -654798 494794 1545223 1841108
37292 1841108 1751523 1843885 2182529 2407887 2218741 1775177 1566603 1726402 1766775 1363736
37282 1363736 961063 967319 899997 289986 -102239 677238 1874173 1826001 630651 152400
37272 152400 1027860 1647589 906991 34895 445033 1459802 1704525 1357259 1302097 1206326
37262 1206326 317886 -677714 -547974 282692 322175 -530810 -995932 -730347 -748507 -1411499
37252 -1411499 -1805384 -1486866 -1223435 -1493747 -1688968 -1359153 -967775 -870697 -762753 -644641
37242 -644641 -1074879 -1865956 -1817556 -517222 772394 874294 261476 -2986 224882
37233 224882 722768 1812660 3387016 3972725 2392074 -148802 -1248679 -408743 589649
37224 589649 447670 -49798 362772 1548862 2476870 2732629 2682708 2621817 2508850 2355672
37214 2355672 2331571 2525837 2915742 3484832 4129459 4524395 4302020 3391248 2127499
37205 2127499 1069087 685194 1049420 1720355 2006205 1512456 521144 -218855 -234097
37196 -234097 107429 39542 -413806 -135581 1590662 3591004 3833590 2115461 607874
37187 607874 1111512 2778539 3541227 2968123 2339658 2335466 2247600 1619600 1197172 1684746
37177 1684746 2652943 3321263 3547752 3423639 2739744 1623035 996556 1530680 2605136
37168 2605136 3111828 2901961 2674308 2793559 3034191 3217030 3260813 2792722 1562308
37159 1562308 150980 -565401 -624223 -798119 -1199230 -1021469 75694 1236843 1562285
37150 1562285 1322085 1445137 2210783 2982397 3078799 2580056 2293834 2927007 4168972
37141 4168972 4850667 4376258 3599728 3601396 4041848 3845955 3255642 3660525 5176704 6080415
37131 6080415 5361401 4231328 4014758 4079123 3369159 2658573 3312756 4692499 4951008
37122 4951008 3993075 3459636 3859613 3950432 3252855 2945222 3538247 3745590 2763516 1845450
37112 1845450 2239763 3101650 3014838 2327717 2242262 2513145 1935190 658971 214733 1250519
37102 1250519 2742324 3622601 3951755 4180233 4252635 3879690 3126579 2450032 2374837 2994687
37092 2994687 3579685 3169938 1954072 1360597 2155083 3268663 3410903 2954499 2958420
37083 2958420 3131226 2446509 1333082 1354532 2680874 3702124 3522076 3174053 3761386
37074 3761386 4862179 5543344 5725804 5734249 5511203 5043821 4711014 4564911 4087811 3195881
37064 3195881 2624113 2848891 3569873 4655172 6404292 8297809 8841695 7590353 6134622
37055 6134622 6026786 6823756 7318091 7577867 8344707 9321007 9643511 9485843 9712569
37046 9712569 10384527 10987829 11698245 13000653 14459297 15321761 15942470 17031149 17885422
37037 17885422 17259648 15887825 16065299 18360164 20728559 21609996 22056349 23733655 26411912
37028 26411912 28831189 30948829 33891782 38316888 44026303 50812028 58737613 67898578
37020 67898578 78587992 91295827 106017115 122138933 139458649 158364980 178245388
37013 178245388 196825346 212436476 226245760 240765369 256550431 271861291 285341644
37006 285341644 297307454 308169661 317275805 324066912 329140829 333372827 337057217 340790107
36998 340790107 346114252 353943678 362856108 370175871 374461479 375713196 373271752 364977841
36990 364977841 348979033 325528964 296666257 265083039 233780514 205595692 181724199
36983 181724199 161068673 142078530 124948020 110954032 99939063 89959917 79761416
36976 79761416 70234995 62692553 56821587 51366759 45995541 41282544 37358411 33841976
36968 33841976 30885776 29006026 27800524 26029462 23299863 20673217 19178016 18591921
36960 18591921 18169108 17708754 17231482 16326953 14711480 13048802 12354569 12672871 13008191
36951 13008191 12582233 11623328 10823952 10450479 10210351 9804767 9371243 9259720 9407858
36942 9407858 9252110 8551817 7990454 8339866 9163819 9203670 8201294 7393279 7731912
36933 7731912 8531263 8636148 8139417 7903907 7940511 7517132 6697108 6486196 7232768 7949220
36923 7949220 7643886 6531614 5523902 5202642 5650514 6578683 7190417 6649977 5270445
36914 5270445 4574055 5461890 6904537 7302943 6662532 6343751 6906556 7472208 7389879
36905 7389879 7270799 7763138 8369331 8440009 8583479 9848423 11815090 12845287 12446073
36896 12446073 12187583 13632464 16243061 18256799 19139291 20139635 22470587 25879766
36888 25879766 29380575 32805526 37105555 43243083 51110374 59610365 67756918 75625399
36880 75625399 84036389 93247962 102318878 110103950 116583593 122668718 128828172 134565378
36872 134565378 139346239 143422130 147440754 151676221 155923619 159792019 162845202 164813243
36864 164813243 165984564 167157459 168991320 171632846 175043409 179217252 183807745 187971659
36856 187971659 190930470 192314226 191609667 187700606 179497566 166897508 150908241 133218472
36848 133218472 115919004 100963018 89066634 79314827 70445985 62314117 55524243
36841 55524243 49999626 44830104 39529795 34613626 30749469 27984530 25966389 24317025
36833 24317025 22611434 20582134 18565509 17181658 16331436 15103062 13038547 10965045
36825 10965045 10064370 10431782 11028372 10892496 9998225 8973018 8291051 7855626 7307587
36816 7307587 6630654 6219045 6218490 6127346 5434366 4395126 3668904 3410088 3350658 3563194
36806 3563194 4275444 4981791 4770399 3739807 3053953 3218288 3377003 2879465 2397022
36797 2397022 2604362 2829835 2242772 1546871 2021760 3375182 4105101 3814524 3605200
36788 3605200 4081238 4492928 4223511 3698914 3259885 2461749 1249361 610214 1110394
36779 1110394 1827765 1802791 1597807 2157785 2932984 2674065 1637050 1325149 2077213
36770 2077213 2553882 1948385 1165463 1122896 1255150 756996 271969 996867 2614049
36761 2614049 3450677 2667626 1224175 503295 857860 1806683 2897451 3858852 4371901
36752 4371901 4268487 3844599 3629881 3864091 4335302 4626429 4427530 3780515 3141314
36743 3141314 3014514 3375098 3643975 3427515 3079380 3231186 3875558 4281695 3889507
36734 3889507 2990578 2333226 2220892 2242407 1876840 1139850 490282 216986 186210 284828
36724 284828 820101 2076482 3499152 3831529 2437626 234861 -1154412 -1135848 -585071
36715 -585071 -518046 -872226 -945316 -581337 -283376 -278189 -164199 314915 736109 668565
36705 668565 472387 830634 1647379 2075835 1753353 1387315 1738817 2480162 2638329 2002872
36695 2002872 1471585 1853031 2800112 3275911 2829763 1991949 1417108 1063235 504942
36686 504942 -185322 -382604 150110 762713 790202 579215 965293 1835908 2097488 1348340
36676 1348340 682429 1142999 2096177 2137688 1185933 483050 607446 776749 425650 207625
36666 207625 693224 1108008 443895 -789759 -1102862 -115361 952260 975262 238141
36657 238141 -234446 -23014 398220 384604 -165369 -715609 -648098 29404 694767 960488
36647 960488 1143152 1538179 1681532 1000584 -89821 -566056 -192434 294154 435339
36638 435339 612714 1167415 1819030 2278689 2617365 2649798 1852782 466223 -222003 502225
36628 502225 1651632 1995734 1925384 2592672 3676441 3612943 2143471 1047983 1679870
36619 1679870 2998076 3023050 1454801 -202910 -682815 -101484 767309 1401794 1562204
36610 1562204 1158548 443315 -64587 -112571 69289 186537 219160 245513 264534 349101
36600 349101 648968 1045722 1149146 911046 879222 1409378 1926291 1592378 615297 168676
36590 168676 827830 1751324 1825985 1072526 320846 -102469 -560944 -1097453 -1123952 -428025
36580 -428025 184284 -188369 -1299467 -1983118 -1546670 -484713 265183 416793 450324
36571 450324 794414 1210388 1147234 571388 130754 354389 931365 1094915 645731 254301
36561 254301 654542 1737459 2544745 2130918 561829 -832519 -529249 1453451 3174159
36552 3174159 2784279 828265 -300042 653765 2297573 2584257 1443335 513418 769638
36543 769638 1542763 1882097 1856283 2041232 2344840 2023785 838322 -269664 -39403
36534 -39403 1512552 2764911 2255004 562698 -350807 262026 1040410 699436 -16388
36525 -16388 369529 1641375 2214446 1556930 791993 821086 1273006 1669211 2276240 3110786
36515 3110786 3219864 1904420 -16841 -1021330 -559119 678226 1731006 2081587 1826840
36506 1826840 1636012 2133577 2972102 3081864 2182021 1244806 934119 562899 -500995
36497 -500995 -1355429 -838263 355173 451777 -662110 -1147125 22931 1502231 1518109
36488 1518109 232083 -800123 -790220 -329235 -179311 -371849 -542843 -535794 -446480 -346837
36478 -346837 -171101 130761 407951 437749 316008 468634 1034815 1527504 1513732 1348606
36468 1348606 1640374 2192377 2257067 1828048 1798581 2579770 3374828 3285065 2483635 1754259
36458 1754259 1395718 1186160 1043732 1076102 1159114 1027666 751896 729420 1181457 1848638
36448 1848638 2152109 1661239 659028 197681 1061768 2556386 3006093 1818734 355962
36439 355962 163706 983644 1362183 764071 26271 -152199 -83766 -231333 -376554 -109177
36429 -109177 452805 907207 1142468 1258092 1190562 793228 126787 -603590 -1250807 -1628723
36419 -1628723 -1381337 -285192 1287803 2435396 2413488 1301992 -1899 -493837 130642
36410 130642 1301079 2169625 2347024 2076663 1846597 1966646 2445587 3092574 3661867
36401 3661867 3940771 3771429 3115271 2213819 1592768 1663434 2269242 2798012 2773140 2190067
36391 2190067 1351947 655822 470439 810872 1104327 725399 -165863 -815973 -979608
36382 -979608 -1169060 -1593388 -1660921 -1050727 -503758 -746922 -1210256 -786408 446926 1244757
36372 1244757 837365 -319862 -1402862 -1966966 -1807890 -974000 -141449 -202132 -1165848
36363 -1165848 -2083652 -2290499 -2072391 -1833876 -1339728 -312212 750994 1010854 351961
36354 351961 -475924 -756773 -538370 -400708 -635661 -827359 -418157 421293 976105 1144429
36344 1144429 1647119 2574664 2611359 800104 -1529097 -2065314 -592107 795740 712346
36335 712346 65889 49591 198607 -411769 -1288583 -1267077 -394798 266939 265087 -27834
36325 -27834 -459758 -1148681 -1662740 -1326394 -383332 152565 -85742 -423134 -248406 342832
36315 342832 1116888 2000858 2568324 2137535 841673 -155399 -66656 527635 714128 659743
36305 659743 1094446 1727145 1317689 -466728 -2269488 -2715723 -2118678 -1680538 -1567472
36296 -1567472 -1002522 -109016 -143551 -1392040 -2257008 -1473884 -80344 200032 -384529
36287 -384529 -300667 518531 653155 -172138 -593409 -123604 -30066 -896102 -1351117 -441975
36277 -441975 594533 483481 199551 1218300 2766582 2940126 1736008 822483 727810
36268 727810 344548 -842451 -1916758 -2106545 -1693887 -1207562 -967740 -1349645 -2226914
36259 -2226914 -2423743 -1177373 204385 -104281 -1496113 -1598625 56995 1296105 729475
36250 729475 -304927 -152382 806103 1403265 1564474 1614395 1189810 245959 -106399 820611
36240 820611 1938504 1940237 1198891 782256 616009 143460 -107048 665608 1770710 1792432
36230 1792432 753420 -124056 -554130 -1371271 -2586749 -2990736 -2082942 -924105 -471696
36221 -471696 -299050 306391 998879 1043044 659952 736666 1439975 1955840 1697700 1158799
36211 1158799 1198274 1763474 1844473 841890 -467022 -805119 -18239 802116 805748 323268
36201 323268 170813 663733 1545299 2258310 2070005 701027 -810580 -730083 1278087
36192 1278087 3396877 3691968 2283120 787262 236147 410648 750445 949691 830795
36183 830795 403049 -13329 -187974 -267053 -310659 -25022 605846 1009225 862880 596270
36173 596270 512443 218810 -394164 -576468 -49903 110503 -837784 -1716096 -1095027 225234
36163 225234 259649 -1083447 -1957259 -1511850 -857838 -854428 -911469 -614170 -756668 -1821131
36153 -1821131 -2840326 -2781803 -1977662 -1279285 -753757 -91949 515805 737632 673279 466652
36143 466652 73877 -112628 614580 1900393 2160384 723088 -829826 -611228 1035646
36134 1035646 2202379 2067500 1502534 1260009 1001874 406068 68219 651132 1764249
36125 1764249 2312199 1734054 491589 -582871 -1079640 -1046659 -508271 600435 1909459
36116 1909459 2544773 2091885 1314726 1287730 2032141 2727367 3040212 3272098 3273546 2442431
36106 2442431 1076281 482181 1152451 1940389 1783558 1175174 982259 813440 -167575
36097 -167575 -1487333 -1811046 -851566 398063 1181271 1574064 1639036 1168096 439568
36088 439568 209965 668000 1223838 1554408 2011067 2703051 3031464 2585884 1777733 1071725
36078 1071725 259602 -843192 -1516705 -813162 1030307 2596005 2810489 1971231 1143313
36069 1143313 981622 1359946 1790242 1849983 1363483 520610 -183710 -380644 -208871 -49865
36059 -49865 53064 337202 661033 451551 -378512 -964163 -492698 645902 1359589 1328950
36049 1328950 1264886 1699805 2258484 2335431 1887004 1263654 725956 386764 235303 23150
36039 23150 -481508 -1004454 -1000723 -487903 -58606 115791 582250 1526975 2118375 1590177
36029 1590177 499254 131851 831692 1607106 1457309 565068 -81459 -7310 172793
36020 172793 -324043 -1177846 -1204824 -48486 1130700 1313170 1231378 2177190 3675014
36011 3675014 3876015 2273891 420280 -447794 -900222 -1713456 -2290447 -1790044 -678494
36002 -678494 41631 289324 516523 669604 579591 597132 807085 446100 -794772 -1754667
35992 -1754667 -1323846 -159949 428030 487635 851817 1339429 1191369 718185 792127 1136408
35982 1136408 831362 112588 -112232 -117694 -762107 -1376112 -482657 1428293 2184894 1219289
35972 1219289 215117 60285 -357834 -1545728 -2107353 -1270998 -436615 -745856 -1173923
35963 -1173923 -633707 1393 -207357 -223629 986598 2077745 1333640 -233188 -389065
35954 -389065 614296 583871 -785201 -1401193 -261799 1075209 1113272 395567 46932
35945 46932 70663 16860 -1945 165537 214904 115991 430560 1335383 2172452 2439536 2401324
35934 2401324 2321265 1965374 1308020 875004 896706 883572 489829 58193 -105756 -216778
35924 -216778 -307741 148975 1319535 2393763 2545317 1980922 1443281 1155465 872730
35915 872730 589192 541421 688912 701932 411624 -30917 -383351 -534038 -545823 -477485
35905 -477485 -128189 725890 1605267 1425314 -4263 -1168819 -650754 638452 471919
35896 471919 -1491414 -3153908 -2965953 -1761644 -886614 -212104 763168 1326545 713524
35887 713524 -176924 11257 832484 757800 -232830 -587315 312703 1288249 1300865 793544
35877 793544 642417 983577 1565647 2227384 2573392 2141965 1334205 1238455 2074634 2741723
35867 2741723 2408113 1601428 1118659 831078 405222 357768 1297395 2579447 2785305
35858 2785305 1457771 -381961 -1393335 -1073403 61067 924616 661709 -532991 -1536380
35849 -1536380 -1566257 -1019062 -693034 -668545 -524428 -180464 232134 949197 2109674 2932020
35839 2932020 2366532 616226 -912903 -1341479 -1145715 -1057316 -1058200 -902543 -809118 -997463
35829 -997463 -1128233 -840519 -371275 -26164 487649 1455269 2264950 2036566 1005380
35820 1005380 339872 487163 639036 188936 -195472 328500 1260018 1328903 394094 -223986
35810 -223986 476653 1861565 2578300 2239873 1613577 1447484 1727917 2031696 2082705 1864810
35800 1864810 1526061 1234451 899577 148276 -1064728 -1983092 -1774785 -748456 -167154
35791 -167154 -613800 -1188153 -743909 623239 1851889 2258107 2026830 1658489 1488841
35782 1488841 1561943 1523091 905163 -41997 -264727 678019 1582031 968648 -765862 -1730402
35772 -1730402 -1073748 111630 697898 988922 1557761 1830041 1021775 -238143 -536386
35763 -536386 339183 1205089 1229459 806852 552231 430770 275473 337081 734928 923661
35753 923661 362969 -555823 -848620 -167529 743609 925794 307690 -207898 241090 1408969
35743 1408969 2063714 1399445 168009 -108328 871831 1649715 907027 -698555 -1436469
35734 -1436469 -925290 -536657 -1231453 -2170331 -2157712 -1493338 -1289382 -1558666 -1350497 -639215
35724 -639215 -625149 -1799998 -2978499 -2920446 -1905263 -933386 -280266 236278 363092
35715 363092 -93152 -462952 -80117 474181 195614 -606601 -684208 236816 1251654 1860381
35705 1860381 2282878 2183084 781189 -1368330 -2397329 -1645231 -638784 -702135 -1113669
35696 -1113669 -762053 -174557 -413306 -1101681 -1170593 -701255 -414099 -108868 646277 970395
35686 970395 -155260 -1549588 -909719 1658280 3393408 2709323 1189269 823553 1194054
35677 1194054 857056 6800 -106724 389508 29025 -1626675 -3189552 -3320289 -2308432
35668 -2308432 -1317110 -814591 -370529 334676 930397 928879 533499 452958 870179 1067547
35658 1067547 440167 -519108 -859191 -539489 -366473 -620264 -661530 -137947 296955 -37039
35648 -37039 -819043 -1250729 -1124272 -804653 -496389 -74989 525688 1160672 1615047 1704005
35638 1704005 1402794 963781 660575 443693 215914 275877 807924 1050490 1684
35629 1684 -1839633 -2579514 -1321439 622102 1651987 1910165 2303338 2517498 1565673
35620 1565673 -195268 -1247525 -1062342 -578872 -391264 56838 1005960 1491119 755009
35611 755009 -458296 -955950 -731407 -627154 -897722 -1078233 -987486 -908842 -839720 -440502
35601 -440502 134018 129001 -733727 -1631775 -1568694 -642163 60353 -227749 -1075087 -1361611
35591 -1361611 -509149 882626 1607795 1053087 -180765 -893724 -504538 427682 877435
35582 877435 381586 -661965 -1507308 -1648991 -1010066 125817 1229002 1732881 1343566
35573 1343566 245840 -961475 -1593363 -1350131 -612379 -141799 -334788 -919094 -1526637
35564 -1526637 -2211306 -2982523 -3197384 -2227038 -699902 -179621 -1297889 -2972404 -3871396
35555 -3871396 -3867047 -3492867 -2816689 -1761031 -922468 -969089 -1481901 -1389025 -443091 589833
35545 589833 1081024 1040198 643843 170577 226151 1019493 1575159 834246 -549710 -883402
35535 -883402 12007 492501 -243701 -856341 -115997 1066413 1156104 358143 -58141 -4070
35525 -4070 -504958 -1713595 -2500072 -2086991 -927386 187103 938432 1245662 1043928
35516 1043928 540165 124484 -87564 -191044 -68972 428316 989225 1110408 797797
35507 797797 461106 223894 -77367 -332061 -278086 -165754 -578635 -1442485 -1862534 -1264560
35497 -1264560 -235572 179171 -184431 -373636 439358 1682275 1816236 323924 -1241287
35488 -1241287 -1004048 667766 1509757 442974 -1039075 -1203672 -427741 -51157 -27771
35479 -27771 661146 1882455 2363542 1676907 678301 -77858 -922938 -1868064 -2174838 -1563594
35469 -1563594 -742164 -287048 46454 510467 801832 758052 767559 1013755 1040337 506535
35459 506535 -259587 -803474 -1028851 -910147 -407391 120628 165801 -53785 227130 1055607
35449 1055607 1592467 1493920 1428008 1760306 1812528 1122249 424549 469953 718369 288971
35439 288971 -406492 -173644 1080652 2069505 1771393 520742 -676850 -1253562 -1255484
35430 -1255484 -855274 -68909 1030380 1968012 2038889 1094043 -72393 -589405 -568876
35421 -568876 -661178 -755094 -105761 1154627 1765760 1065321 -16091 -314362 53846 223493
35411 223493 -125178 -734908 -1355318 -1623078 -1021189 257134 1039540 617810 -122172
35402 -122172 93373 1120988 1732888 1279256 76961 -1373903 -2514863 -2510464 -1110100
35393 -1110100 478900 723550 -322321 -1261134 -1320716 -927228 -443072 312854 1100588
35384 1100588 1113345 259460 -438273 -202743 595039 1267651 1641874 1621867 856463 -503829
35374 -503829 -1437362 -1142703 -47538 791424 889446 548424 320757 607893 1353075 1883145
35364 1883145 1577052 867833 867471 1748986 2393560 2086332 1559323 1605853 1626233 636231
35354 636231 -981626 -1969983 -2010813 -1802070 -1590657 -975068 -174781 -123797 -931005 -1405455
35344 -1405455 -661626 716481 1643005 1810569 1443915 651641 -213625 -299825 712473
35335 712473 1849259 2039854 1627494 1670484 2100457 1820777 613826 -326421 -115030
35326 -115030 642365 906441 554569 84014 -254225 -341528 133617 1139092 1944004 2011028
35316 2011028 1762034 1732824 1513424 461310 -953766 -1594358 -1241029 -693601 -433368
35307 -433368 -283137 -312739 -820083 -1299677 -798402 331200 444175 -950506 -2107668
35298 -2107668 -1410463 362269 1398261 1506507 1828117 2447755 2063717 165364 -1884003
35289 -1884003 -2395920 -1080045 1064158 2760420 3116668 2087938 660678 9624 242624
35280 242624 505616 360265 264733 490423 460707 -318665 -1362735 -1845469 -1646800 -1211144
35270 -1211144 -794220 -436810 -343506 -649846 -988882 -866993 -400489 -182353 -434748 -732536
35260 -732536 -604134 -57560 504419 579274 -160534 -1435074 -2165400 -1299335 826765
35251 826765 2403055 1979851 173261 -1089134 -979147 -635338 -1314692 -2506683 -2734591
35242 -2734591 -1776835 -950845 -1115472 -1499652 -1029077 65426 754400 759518 714576 1027864
35232 1027864 1395277 1420324 1083227 548728 -31278 -524150 -945693 -1416845 -1718507 -1337959
35222 -1337959 -428919 -82500 -810670 -1427509 -706543 356543 -315628 -2518869 -3577477
35213 -3577477 -2131007 -105374 297390 -279719 -49055 610314 -13590 -1584289 -1885657
35204 -1885657 -459269 511679 -307796 -1371212 -998737 -151922 -638545 -1996702 -2305765
35195 -2305765 -1287230 -410814 -214049 311671 1466232 2022148 1328227 484772 487755
35186 487755 712707 386823 204280 996751 1851616 1324921 -52336 -334234 897296
35177 897296 1947863 1653554 945753 1091127 1738797 1691277 680734 -604102 -1627172
35168 -1627172 -2246063 -2299075 -1786374 -1217932 -1141146 -1503172 -1891864 -2069091 -1889661 -1205367
35158 -1205367 -357562 -192366 -908262 -1429897 -776125 385681 559503 -434918 -1221201
35149 -1221201 -816967 180733 622564 179546 -673963 -1348999 -1376220 -517180 835833
35140 835833 1714227 1505806 658710 90510 44761 -56381 -611065 -1115828 -778419 313059
35130 313059 1137527 1029672 500298 297627 181578 -460402 -1108826 -571190 881682
35121 881682 1337701 -73948 -1711357 -1770510 -892478 -892549 -1812173 -2125533 -1456892 -1084407
35111 -1084407 -1620695 -2045527 -1568741 -908156 -985686 -1558431 -1874181 -1713512 -1145432 -149021
35101 -149021 890987 1120418 295575 -672872 -726382 290623 1736977 2627385 1977806
35092 1977806 -254281 -2418973 -2547842 -779158 802345 1014768 774915 1001415 1139306
35083 1139306 745530 755777 1715370 2275093 1201007 -358718 -560310 163932 -25466
35074 -25466 -1153728 -1385763 -99468 1183758 1260114 724455 440776 187542 -427098
35065 -427098 -1015144 -1153729 -1095785 -1115716 -995342 -652334 -471868 -590521 -621391 -437820
35055 -437820 -448325 -785947 -1023155 -965150 -890170 -763303 -155693 757849 1149248 893155
35045 893155 916305 1669196 2325932 2182338 1784495 1794559 1714243 829694 -308484 -514860
35035 -514860 382673 1562147 2475488 3080880 3162262 2512603 1638649 1267770 1219351 710822
35025 710822 -261588 -822655 -556882 -12715 252538 220253 -134656 -926965 -1614644 -1252923
35015 -1252923 -38807 434562 -727120 -2272415 -2487512 -1590268 -1137345 -1485785 -1415424
35006 -1415424 -368113 493984 83307 -1014694 -1625028 -1701538 -1927569 -2329321 -2449781
34997 -2449781 -2422411 -2646365 -2678419 -1762319 -419927 -157843 -1343479 -2634776 -2908659
34988 -2908659 -2498535 -1975594 -1065863 269414 882223 -101119 -1633996 -1935071 -874103
34979 -874103 121112 262675 193869 587400 1148294 1281479 898630 307254 -118744 -98495
34969 -98495 218794 206495 -410891 -963780 -719231 13059 435553 502187 657714 751686
34959 751686 337826 -259293 -402843 -422439 -1113389 -2144921 -2412576 -1881023 -1506183 -1329156
34949 -1329156 -421575 1037859 1523991 561195 -433450 -414703 -72345 -123783 -58731 377076
34939 377076 249698 -739239 -1223557 -421468 275546 -351909 -1062783 -240079 1183231
34930 1183231 1235927 256841 188583 1204517 1651260 1105909 950450 1757921 2430126 2329439
34920 2329439 2195405 2423194 2282120 1415947 477920 -225086 -1143948 -2099206 -2092423 -1035091
34910 -1035091 -143727 -96971 -283775 -302598 -554506 -843139 -205187 1120854 1398871 37456
34900 37456 -1274851 -1253611 -1055606 -2133887 -3658514 -3891139 -2922484 -2154630 -1937951
34891 -1937951 -1596018 -1198754 -1472227 -2215009 -2412196 -1813767 -1063829 -437460 279983
34882 279983 850798 805916 505364 783755 1611331 2212789 2371896 2447774 2235237 1140513
34872 1140513 -416748 -1086380 -415150 493599 535639 -131189 -803649 -1337375 -1951649
34863 -1951649 -2525827 -2678106 -2295208 -1647354 -1095909 -783187 -535043 -193268 -89321
34854 -89321 -726319 -1746607 -1911484 -708968 692392 944635 380968 321711 999654
34845 999654 1458707 1319933 1302105 1874295 2585126 2957042 2982843 2513816 1247218 -320320
34835 -320320 -942364 -112418 1279014 2131970 2202295 1698037 723697 -408638 -1105065
34826 -1105065 -1225092 -1240156 -1309967 -986154 -266425 -70929 -979922 -2181777 -2459178 -1763072
34816 -1763072 -1062309 -933577 -1019822 -809256 -387181 -290221 -830519 -1630263 -1875868 -1172386
34806 -1172386 -25293 782075 1093333 1282739 1534298 1795682 2191316 2724133 2751275
34797 2751275 1681914 181074 -312811 556139 1612872 1800191 1361415 1012921 776283
34788 776283 171227 -918403 -1931182 -1966770 -611717 1165975 1522377 7276 -1374126
34779 -1374126 -727135 798129 579907 -1388432 -2472552 -1601001 -700223 -1110404 -1448378
34770 -1448378 -598014 -114203 -1381217 -2643708 -1659375 338887 393719 -1467543 -2417596
34761 -2417596 -1386406 -407685 -1082180 -2307641 -2343407 -1184545 86 452435 246909
34752 246909 111115 962638 2646378 3405423 1905979 -575060 -1578294 -774879 -14415
34743 -14415 -234426 -463683 -140971 -217359 -1215390 -2087396 -1922041 -1210268 -573584 231605
34733 231605 1125281 1012539 -564083 -2221721 -2316273 -933285 532853 1057992 624496
34724 624496 -86800 -204531 396346 567496 -660917 -2186994 -1959208 -105893 997787
34715 997787 281899 -548627 -43420 711204 351050 -227305 416062 1537901 1404482
34706 1404482 177986 -548686 -408871 -366353 -574210 -149026 966179 1662595 1361288
34697 1361288 693284 360746 418254 688835 939629 768028 146158 -255156 -95361 -105776
34687 -105776 -812678 -1318561 -701599 113534 -452691 -2071969 -2944132 -2541429 -2042589
34678 -2042589 -2045828 -1780359 -903658 -260423 -300823 -379925 -271686 -783551 -2000939 -2398377
34668 -2398377 -886116 1322822 2122265 1111890 -297973 -902975 -796092 -631328 -662369
34659 -662369 -659500 -380617 16805 49025 -461640 -951940 -690192 286431 1219282 1499546
34649 1499546 1046200 60752 -959021 -1208824 -396223 574825 596863 -102281 -369729
34640 -369729 80337 471076 546366 952759 1730471 1834623 794322 -382371 -713558
34631 -713558 -531760 -441638 -117889 781237 1474277 1137863 453628 678733 1549558 1555743
34621 1555743 292703 -819579 -532579 602999 1199752 848391 239644 -72883 -190399
34612 -190399 -156696 508517 2075086 3735629 4121226 2781575 661770 -1053647 -1977377
34603 -1977377 -2072225 -986399 1227304 3186348 3198566 1315185 -600765 -1064372 -390395
34594 -390395 238398 183937 -495064 -1393464 -1795147 -1165238 -100237 1435 -1233890
34585 -1233890 -2452194 -2351154 -1382451 -850803 -999470 -1032334 -635698 -358254 -493787
34576 -493787 -522699 71910 1009855 1537916 1314648 802479 754619 1239125 1349647 307903
34566 307903 -1261487 -1859640 -993713 314151 1130666 1692136 2339284 2480464 1618835
34557 1618835 584517 542039 1282699 1680317 1457993 1268716 1262944 898857 190111 -128874
34547 -128874 105564 181835 -197319 -423896 -202826 -188033 -791049 -1306820 -1017457 -428981
34537 -428981 -530062 -1318779 -1928260 -1896753 -1495315 -980201 -311355 401830 842304 924714
34527 924714 756601 200277 -877337 -1885789 -1864008 -911520 -501041 -1654664 -3302549
34518 -3302549 -3389378 -1522521 421118 605994 -639708 -1564345 -1276613 -512174 -347188
34509 -347188 -955784 -1775184 -2279968 -2278899 -1830705 -1208942 -778097 -667718 -644344 -407451
34499 -407451 74265 542039 644973 205783 -529282 -980289 -822739 -410963 -309251 -501006
34489 -501006 -501498 -232395 -227513 -797608 -1513196 -1842573 -1886582 -2049558 -2241880 -1897509 -775237
34478 -775237 599051 1408281 1331542 774955 372144 389044 717709 1263350 1919267 2166217
34468 2166217 1360008 -204931 -1142865 -546974 747656 1233358 657804 -20484 -237367
34459 -237367 -226607 20922 852161 1817315 1766962 558676 -506030 -544401 -289787 -686160
34449 -686160 -1301594 -1104048 -102958 738228 786440 184220 -624840 -1245173 -1541518 -1815677
34439 -1815677 -2283092 -2308819 -1099524 669165 1219896 174689 -748848 -333205 412617
34430 412617 285060 18785 700471 1453453 826715 -481826 -604501 372370 654105
34421 654105 -113591 -373871 483826 1142624 765991 226609 170395 -127055 -966252 -1132455
34411 -1132455 123968 1531364 1618338 910488 911212 1803448 2536702 2545025 2085077 1290575
34401 1290575 72677 -1206846 -1891328 -1846798 -1572659 -1594944 -2039661 -2532710 -2390790
34392 -2390790 -1402130 -454883 -615570 -1509304 -1673211 -757811 -83855 -489296 -1052720
34383 -1052720 -855826 -613177 -1264765 -2136943 -2056104 -1397666 -1341181 -1700700 -1262928 11470
34373 11470 846804 671171 185151 -168098 -735963 -1389882 -1226604 -52751 1070512
34364 1070512 1282777 820289 40366 -1202252 -2589594 -3009565 -2110044 -1164911 -1373536
34355 -1373536 -2160565 -2287053 -1897627 -2085853 -2826373 -2848965 -1700387 -636614 -949062
34346 -949062 -2282537 -3214382 -2960086 -1970871 -1182476 -1131217 -1633090 -2002173 -1677024 -798933
34336 -798933 -31136 258200 332541 469459 420888 -128506 -849929 -1034508 -510458 172056
34326 172056 533289 706118 992865 1240271 1016155 299937 -327821 -296190 275543 659276
34316 659276 345281 -313071 -487920 105270 911242 1358121 1484018 1388915 665078 -814597
34306 -814597 -1928417 -1293064 703304 2028027 1562538 421561 90588 371328 189121
34297 189121 -479238 -803606 -688877 -811986 -1307132 -1663382 -1812790 -2103802 -2251297 -1596861
34287 -1596861 -494907 -118522 -635000 -878983 -226283 506330 548534 248562 -33015
34278 -33015 -770475 -2033787 -2600422 -1566535 20295 427166 -496455 -1519303 -1889524
34269 -1889524 -1703461 -945136 352181 1230358 636954 -782452 -1153946 37519 1100974
34260 1100974 379939 -1730653 -3584800 -4175752 -3575180 -2294763 -1025825 -517303 -943412
34251 -943412 -1620507 -1871010 -1885772 -2212345 -2668948 -2433485 -1229806 104595 470764
34242 470764 -285121 -1212260 -1291993 -529608 135806 42157 -368913 -255640 322517 398010
34232 398010 -531077 -1700388 -1979288 -1173641 -52399 634035 735806 479605 131134
34223 131134 -87909 -85605 -24248 -192729 -692879 -1350053 -1913804 -2223000 -2220565 -1985107
34213 -1985107 -1742515 -1653488 -1554277 -1106882 -290183 463107 778704 806825 923548 1091223
34203 1091223 900126 321429 30488 660033 1899221 2689537 2352770 1299232 543051
34194 543051 664729 1338097 1782554 1551451 841492 122095 -331995 -439314 -113830 545755
34184 545755 978144 607587 -319294 -871826 -615140 -78984 240803 616074 1243997 1426945
34174 1426945 564287 -533152 -483550 710005 1730534 1944622 2039876 2432667 2396414
34165 2396414 1436333 398188 277517 713144 648085 -15997 -384084 32223 671796
34156 671796 680501 -150581 -1173350 -1427354 -640525 244271 44667 -1054187 -1606376 -882906
34146 -882906 168221 471084 377887 820710 1688236 2093785 1745205 1027238 123721 -923541
34136 -923541 -1613982 -1510683 -1156451 -1417423 -2025179 -1822942 -467920 1121848 2110674
34127 2110674 2563328 2743708 2546786 1986672 1483776 1255010 986409 454866 -6722
34118 -6722 3908 358404 581017 476640 428288 1017231 2145835 2630535 1363910 -874500
34108 -874500 -1751691 -284450 1543611 1258887 -790457 -2154468 -1803751 -1037284 -900772
34099 -900772 -750002 4859 552273 148485 -439552 -154094 705362 1220478 1418574 1885329
34089 1885329 2393488 2142845 1103572 72788 -500069 -864362 -1180168 -1162345 -631609
34080 -631609 119126 629098 620981 76349 -732937 -1314448 -1296215 -723381 1125 346523
34070 346523 -67599 -1064531 -1830955 -1701740 -1000395 -567550 -531390 -299372 216549 349812
34060 349812 -64922 -213052 369841 914955 589511 -235638 -675915 -593564 -330428 154338
34050 154338 904790 1263243 616556 -493447 -1039422 -1019191 -1225643 -1693394 -1580370 -697389
34040 -697389 13 -190132 -796096 -1143031 -1409787 -2037055 -2658290 -2428019 -1246125
34031 -1246125 -4103 459460 217507 -73662 -25908 260356 676643 1352164 2221559
34022 2221559 2716022 2343502 1436499 823682 775243 773084 334658 -507325 -1579036 -2695347
34012 -2695347 -3252067 -2553932 -997751 -125100 -841322 -2226532 -2814984 -2438919 -1967592
34003 -1967592 -1751290 -1360273 -638599 -30547 154067 48444 -186235 -435182 -365508 247304
33993 247304 983336 1218136 1060773 1214298 1899384 2516805 2443596 1722144 986238 1010951
33983 1010951 2043623 3200626 3075298 1582154 514775 1274252 2715120 2680012 1233270
33974 1233270 522789 1359340 1969259 892468 -724566 -1015300 -158640 318816 62882
33965 62882 940 383315 406486 -169153 -481527 -14495 551436 452279 -60467 -332481
33955 -332481 -383008 -677203 -1142792 -1086004 -135485 1128576 1683218 1130085 169003 -72284
33945 -72284 755977 1779484 1821909 720724 -514117 -886395 -476657 -140982 -390862
33936 -390862 -941973 -1336239 -1549789 -1714062 -1585311 -816725 312593 1011052 974426 747560
33926 747560 792725 739899 102860 -695543 -799251 -271780 -122517 -821588 -1551316 -1350080
33916 -1350080 -441728 129477 -115341 -647074 -828834 -770900 -1075678 -1946401 -2823910 -2980263
33906 -2980263 -2328488 -1440567 -783879 -236548 497049 1302827 1817228 1988569 2092971
33897 2092971 2210986 1987693 993823 -730897 -2402677 -2822380 -1415822 883520 2295310
33888 2295310 2053070 1085540 516036 281960 -82598 -201721 414125 1043248 641818
33879 641818 -272094 -269347 511147 378963 -1040048 -1860635 -762233 945343 1366268
33870 1366268 732151 517636 892511 816062 104046 -328760 -145628 -13539 -287086 -532490
33860 -532490 -525915 -646854 -1078802 -1528550 -1879384 -2269674 -2437572 -1895490 -928635 -548242
33850 -548242 -1189102 -2194339 -2791695 -2813445 -2236575 -884392 942500 2231907 2272123
33841 2272123 1558276 1241479 1850406 2801938 3053191 2176701 894204 361979 719562
33832 719562 781272 -330103 -1766602 -2038123 -1116813 -302856 -134595 195323 1084606
33823 1084606 1571899 861960 -256755 -429882 473081 1371432 1338084 356873 -892983
33814 -892983 -1552391 -1266928 -654051 -623233 -1109643 -1220880 -762604 -539684 -777903 -553342
33804 -553342 449805 954972 46908 -1073757 -825376 172455 71053 -1162453 -1649465
33795 -1649465 -546285 792120 1000207 424624 23248 -59426 -4495 449730 1361122
33786 1361122 1997374 1762374 1082744 636443 312162 -297744 -927207 -1035209 -817007
33777 -817007 -938426 -1405691 -1511835 -961790 -358433 -325900 -640074 -613767 -134592 109797
33767 109797 -435720 -1350394 -1724573 -1375565 -950208 -649486 301618 2224445 3779477
33758 3779477 3384268 1545045 456232 1195326 2594551 3194497 2989334 2611817 2045731
33749 2045731 1146690 519758 754088 1352029 1416078 949064 552936 279799 -230386 -800520
33739 -800520 -924165 -743749 -852341 -1192349 -1073390 -320664 431294 693250 637690 547172
33729 547172 409193 201438 23663 -158481 -435138 -635609 -578065 -519979 -755014 -873200
33719 -873200 -163213 1216337 2203792 2130993 1438859 961711 1069622 1615990 2132354 1968264
33709 1968264 875996 -375520 -581186 501895 1870716 2506062 2281480 1556148 638856
33700 638856 -54415 -69864 384614 399222 -503966 -1698019 -2351047 -2478758 -2567437 -2601472
33690 -2601472 -2124976 -1059863 104511 860857 1012347 557515 -324277 -1152501 -1363744
33681 -1363744 -834462 -89567 166971 -169089 -364382 347609 1679908 2428726 1924192
33672 1924192 831664 92902 -297197 -735398 -902404 -369701 125413 -493632 -1591976
33663 -1591976 -1260397 798873 2478299 2186611 1050970 978026 1776951 1824389 829497
33654 829497 175131 676262 1551046 1821719 1485438 918336 141273 -772336 -1276310 -965683
33644 -965683 -264562 -5884 -437420 -968430 -914627 -296285 240237 238451 -98165 -407555
33634 -407555 -792687 -1488567 -2159388 -2192789 -1612338 -979762 -440116 263644 802258 403876
33624 403876 -689448 -1060418 -27422 1294100 1561964 894187 175453 -393027 -1042114
33615 -1042114 -1468739 -1179279 -306558 744984 1888767 2846599 2849751 1771889 747135
33606 747135 640310 768370 287073 -139081 469353 1422810 1326216 397454 -41709 57526
33596 57526 -394561 -1327885 -1456953 -634259 -194219 -578390 -601128 326585 1125517 1001575
33586 1001575 737201 1042204 1150337 213470 -1144949 -1835425 -1878292 -1891783 -1822580 -1220221
33576 -1220221 -185022 805094 1551293 2035734 2175652 2077949 1952004 1547601 482448
33567 482448 -687488 -779575 273831 1085880 702180 -203486 -514645 -52574 686478
33558 686478 1183240 935187 -79788 -758714 13324 1446434 1667320 686403 504046
33549 504046 1711506 2359013 1269108 -8781 -129678 -350224 -1839208 -2904447 -1678835
33540 -1678835 264519 148391 -1440402 -1579778 124401 1149510 380426 -527742 -485711
33531 -485711 -559249 -1424550 -1968185 -1451770 -744604 -418380 209949 1180740 1232008 137932
33521 137932 -435028 320138 835627 -89869 -1045140 -366934 966341 951080 -180993
33512 -180993 -550512 292051 997749 741488 27009 -662684 -1361841 -1820631 -1661693 -1301527
33502 -1301527 -1391003 -1458587 -546656 840748 1053263 -127643 -830937 260840 1996061
33493 1996061 2528468 1915160 1575815 1799870 1420568 51700 -878931 -125090 1379256
33484 1379256 1705393 657694 -29623 676547 1629385 1329384 127571 -496565 -148775
33475 -148775 280202 271789 151808 -80160 -991467 -2407285 -3052707 -2114948 -314649 1081914
33465 1081914 1544784 1179303 249104 -649363 -770372 -182524 199041 56826 237107
33456 237107 1222791 2062707 1784439 980877 825980 1229592 1295662 1121304 1673832 2992955
33446 2992955 3874610 3510547 2350053 1158452 241637 -157883 303542 1399163 2256006
33437 2256006 2403039 2347893 2768050 3598825 4191626 3972676 2805251 1152900 -32877
33428 -32877 -118182 428017 627754 426265 759635 1956118 2949158 2676927 1581372 920533
33418 920533 996662 940683 179607 -678682 -669438 306475 1396512 1725506 1200001 473377
33408 473377 247323 623285 1131108 1345156 1310951 1276068 1201239 836917 273883 75277
33398 75277 619137 1476903 1786931 1283944 642622 629529 1199009 1718610 1834793 1679414
33388 1679414 1403480 1108729 1207466 2106727 3318546 3637333 2644370 1364011 878110
33379 878110 998693 1068562 1306895 2156990 2815951 2002461 211873 -430748 915112
33370 915112 2517731 2541396 1458431 815184 760601 419904 -5027 593767 2065867
33361 2065867 2795439 2008197 789087 303467 384686 515811 837030 1301033 1123471
33352 1123471 183320 -237767 537719 1002777 -341477 -2143990 -1799058 491699 1730849
33343 1730849 481559 -1231583 -1251058 -253160 30161 -344286 -283551 146554 241164 399422
33333 399422 1403526 2644903 2965984 2725333 3085659 3686588 3145971 1684823 999657
33324 999657 1403492 1412549 605056 487711 1652110 2411997 1591340 553258 795775 1406053
33314 1406053 894925 -13606 255988 1111926 675374 -868720 -1335584 6773 1337192
33305 1337192 1108450 69401 -255616 380819 1186679 1496116 1027357 -140679 -1323975
33296 -1323975 -1684868 -1238393 -726396 -443353 -93427 184341 -168423 -878875 -862294 78202
33286 78202 769137 449683 -105465 55437 638138 859644 704750 534540 217910 -431434
33276 -431434 -970146 -916619 -491985 -78079 418124 958503 918872 114618 -505732 -220349
33266 -220349 183603 -293033 -1006191 -624274 539958 869410 -11744 -791436 -751928 -722904
33256 -722904 -1217991 -1340596 -503508 236573 -170265 -922889 -620851 459356 931476
33247 931476 675104 913956 1885477 2131432 746752 -991404 -1259542 -149288 635881
33238 635881 219572 -428843 -91269 974150 1514695 1081576 592167 963668 1771692
33229 1771692 1805144 753995 -323966 -403958 234940 613596 489232 467231 825406 1064048
33219 1064048 865195 780569 1418953 2361810 2524143 1513705 140387 -493358 -88396
33210 -88396 728609 1107982 674689 -303559 -1245578 -1696303 -1511853 -818393 18337 514647
33200 514647 503015 434930 853251 1506271 1484705 438362 -870552 -1541794 -1516912 -1181558
33190 -1181558 -640507 -37420 46571 -553661 -842201 73694 1314698 1229626 4674
33181 4674 -362151 898469 1994388 1248814 -326623 -562084 723845 1716973 1292692
33172 1292692 153232 -656125 -974219 -1024241 -807489 -412440 -179294 -246684 -465087 -802640
33162 -802640 -1210543 -1153225 -114171 1359031 2010053 1486516 736106 525911 501851 183932
33152 183932 -35380 345582 843902 552346 -532230 -1517780 -1808417 -1633895 -1432505
33143 -1432505 -1286915 -1109093 -1009410 -1233192 -1752721 -2017819 -1352855 127009 1200616
33134 1200616 709685 -924754 -1997119 -1551082 -473686 -173430 -796974 -1371732 -1266169
33125 -1266169 -764667 -365179 -181156 -87558 2410 110764 211312 272767 386259 678748
33115 678748 1009729 1066814 885857 830078 870274 515272 -168785 -238946 706915 1491911
33105 1491911 795973 -794433 -1396649 -380790 940110 1307642 944877 565074 166977
33096 166977 -416146 -734626 -453888 -197542 -662656 -1361629 -1271711 -445072 96640 -17451
33086 -17451 -84818 306631 522174 -51057 -944425 -1169026 -342065 1155969 2645390 3364329
33076 3364329 2781362 1244803 -110806 -622409 -792896 -1198240 -1391715 -825937 -260869
33067 -260869 -874436 -2130659 -2067821 -52812 2144322 2648230 1602460 233501 -914327
33058 -914327 -1676316 -1382610 137851 1407028 869924 -747031 -1343304 -504601 196133
33049 196133 19200 89132 980803 1339745 192303 -1020987 -397293 1549562 2718762
33040 2718762 2430140 1812220 1523192 943714 -130999 -619235 287993 1703724 1977015
33031 1977015 609919 -1236980 -1944876 -990859 506053 882561 -194860 -1310369 -1189212
33022 -1189212 -448337 -583984 -1629135 -2061758 -1080475 259235 578354 -148530 -966163
33013 -966163 -1197670 -795855 -78560 389928 198059 -236412 23606 1073387 1808608
33004 1808608 1431225 604786 433386 915244 1242257 1169193 1136348 1254773 1122105 680060
32994 680060 424810 553569 562676 22095 -705131 -886830 -344252 342749 508093 124401
32984 124401 -197272 55454 641694 844542 400875 -154842 -203629 231232 692786 886514
32974 886514 729341 101681 -970174 -2000146 -2380607 -2091682 -1744703 -1811714 -2014169
32965 -2014169 -1613873 -300266 1255968 1898776 1232742 193090 -54334 346883 196769
32956 196769 -888095 -1762847 -1396805 -369289 92085 -105376 -152969 69275 -115681
32947 -115681 -734115 -839161 1846 878035 758737 -112219 -612797 -126585 921715
32938 921715 1644662 1481980 601689 -307631 -776300 -1010199 -1329374 -1416647 -773269 190856
32928 190856 373436 -546429 -1630350 -1925513 -1429646 -549776 522321 1441404 1595441
32919 1595441 1008764 601134 855072 994513 322190 -401365 -27028 1088830 1513432
32910 1513432 787854 -194343 -771884 -1228283 -1781438 -2053129 -1925094 -1923334 -2257646 -2280609
32900 -2280609 -1416438 -8651 1185649 1799437 1826536 1389710 903270 901547 1340331 1592248
32890 1592248 1420650 1330935 1625594 1825167 1490857 924336 505301 32040 -634725 -971875
32880 -971875 -632358 -253008 -502715 -869576 -469981 332482 339297 -594054 -1330127 -1226449
32870 -1226449 -950164 -1168443 -1497549 -1331979 -890488 -767383 -1003092 -1211181 -1249497 -1270441
32860 -1270441 -1379327 -1576757 -1756326 -1575257 -764922 238039 548186 26734 -416323
32851 -416323 -159914 169743 -239604 -943987 -777061 448434 1691761 2107989 1906301
32842 1906301 1665813 1504934 1205948 676127 15020 -581004 -863230 -750440 -502269
32833 -502269 -348417 -32476 798115 1780889 2014294 1183083 -36816 -879982 -1229742
32824 -1229742 -1190744 -565269 682038 1834845 1969584 1059614 116698 170409 1254406
32815 1254406 2327806 2165886 597338 -1089168 -1402209 -437969 198132 -437223 -1339366
32806 -1339366 -1160396 -346131 -457042 -1665199 -2338739 -1379513 242501 877406 198144
32797 198144 -870508 -1504887 -1508004 -1007596 -404758 -316930 -931004 -1658706 -1920802 -1879075
32787 -1879075 -1852699 -1558795 -746362 -100372 -426979 -1168193 -951423 302801 1066477
32778 1066477 402472 -657513 -637220 378313 1150724 1091665 682667 388515 101543
32769 101543 -296551 -559593 -478475 -201437 28641 143537 123994 -124352 -579510 -925942
32759 -925942 -785058 -192935 262382 3156 -778888 -1222849 -883648 -346582 -289042 -306165
32749 -306165 500967 1890531 2465528 1544787 76726 -777695 -1044954 -1264873 -1318732
32740 -1318732 -900237 -516032 -896950 -1713851 -1909638 -1183757 -242663 333254 588270
32731 588270 598756 281381 -108564 -88546 280861 419448 150187 -47972 158205 489499
32721 489499 496674 -25893 -1011928 -1955390 -2007833 -1057045 -463719 -1569690 -3476165 -3699471
32711 -3699471 -1474381 958947 1213915 -231413 -1042245 -275861 735726 518337 -760454
32702 -760454 -1855337 -1943971 -1183930 -246096 320145 392707 205667 96247 318504 906276
32692 906276 1520856 1636530 1194771 823690 948433 1025768 407705 -343511 -98001 947863
32682 947863 1346960 651893 152265 684960 1139327 289912 -1077202 -1376383 -750542
32673 -750542 -687290 -1476170 -1798531 -970922 -14412 5750 -586168 -1009613 -1366605 -2113371
32663 -2113371 -2807410 -2407668 -774068 856383 1134558 23661 -1261494 -1603597 -1014892
32654 -1014892 -282477 77401 130355 -28170 -517778 -1225035 -1665570 -1575585 -1197320 -749984
32644 -749984 -153820 437378 478658 -127612 -649007 -547440 -312455 -618641 -1190355 -1265876
32634 -1265876 -762363 -207091 127738 288590 246161 206214 835251 2243044 3186291 2419402
32624 2419402 584161 -438753 24080 834197 907635 431752 -30220 -422440 -660119
32615 -660119 -234550 940190 1984006 2024727 1267022 570197 324542 221520 -69816
32606 -69816 -382002 -212579 671350 1818752 2488881 2525267 2405623 2242804 1472641 68526
32596 68526 -785114 -207026 861752 850487 -205392 -920541 -692257 -168639 163532 338816
32586 338816 9131 -1162103 -2208433 -1750643 -325252 115297 -652544 -677891 759272
32577 759272 1680519 675699 -607525 -154220 1092834 933808 -393838 -805257 69153
32568 69153 527841 -117742 -568621 -76172 171149 -932554 -2579141 -3230480 -2568152
32559 -2568152 -1380496 -292972 554252 1052113 1075650 729872 237349 -319894 -945518
32550 -945518 -1505907 -1672267 -1142345 -73513 769063 714486 78775 -236241 -144960 -514564
32540 -514564 -1560041 -2183893 -1655619 -875498 -888549 -1138482 -626581 8651 -637939 -2189894
32530 -2189894 -2747112 -1753930 -748813 -838427 -1160010 -607049 407717 899837 866059
32521 866059 837754 737370 207781 -494964 -814588 -687768 -383237 -11381 268737 133956
32511 133956 -230949 6724 1103811 2033132 1852625 1205001 1417426 2479850 3058717
32502 3058717 2429767 1290171 499645 36502 -402373 -607669 -268952 315909 498841
32493 498841 2687 -952425 -1947760 -2489188 -2219449 -1455576 -1175326 -1871863 -2644463 -2181556
32483 -2181556 -641354 314329 -322811 -1569915 -1934542 -1507623 -1522737 -2202192 -2376373
32474 -2376373 -1436109 -380445 -251358 -561187 -268428 427038 520737 90284 335960
32465 335960 1543955 2308975 1475289 -94365 -664391 -21522 366525 -480805 -1777563
32456 -1777563 -2228220 -1742768 -1212052 -1062407 -882535 -358849 258929 758440 1267677
32447 1267677 1690109 1595822 1083365 947243 1379631 1358986 242509 -852081 -543125
32438 -543125 548192 635744 -410044 -925573 -293389 25680 -1028785 -2383716 -2613600
32429 -2613600 -1949279 -1313047 -683349 221139 783172 502189 210093 740902 1255251
32420 1255251 569430 -575319 -463264 785542 1309954 370695 -724017 -788460 -194227
32411 -194227 290770 655270 1067977 1276769 1122888 835992 539564 208421 124031 491477
32401 491477 719305 123737 -798642 -983971 -509487 -315471 -367175 268800 1457630 1919413
32391 1919413 1465783 1458435 2400965 2891483 1899991 429958 -199351 -241871 -478904 -632268
32381 -632268 -177102 368513 313305 18425 18816 -110964 -717690 -898316 107215 1184247
32371 1184247 717000 -812583 -1327559 -86332 1474456 1893813 1294561 601608 303333
32362 303333 349110 470226 314719 -228155 -800954 -1047862 -1026411 -725512 223085 1625749
32352 1625749 2227143 1234776 -191425 -289683 788031 1276759 552067 -7419 710369
32343 710369 1858678 1968796 942004 -129644 -431212 36325 848112 1360069 875752
32334 875752 -705658 -2521798 -3490428 -3345641 -2639583 -1901004 -1181246 -359338 508682
32325 508682 1262992 1798934 1960765 1444371 126292 -1466756 -2354161 -2035706 -1038625
32316 -1038625 -255917 34519 102428 -11430 -538854 -1278208 -1547458 -1045079 -242346 228660
32306 228660 115321 -524889 -1325606 -1565460 -887669 -95504 -322826 -1303535 -1534894 -431811
32296 -431811 864844 1302021 1291100 1541084 1708597 1205546 401726 -5359 -54805 -72142
32286 -72142 30104 181677 -133955 -703846 -308951 1226062 2014334 703160 -1102640
32277 -1102640 -953137 810745 1714767 911692 -15514 97140 575479 619329 479283
32268 479283 471329 449187 606335 1279056 1771010 1046890 -206272 -71744 1654795 2947424
32258 2947424 2578159 1698800 1519835 1337645 130599 -1492397 -2346361 -2422871 -2296036
32249 -2296036 -1896449 -1117485 -604607 -717035 -663908 152760 919546 767660 379853 893817
32239 893817 2043601 2776426 2967742 3108801 2988579 2207359 1451102 1694878 2532594
32230 2532594 2814573 2560544 2593081 2563231 1266438 -929913 -1910331 -726054 899286
32221 899286 890402 -559707 -1656642 -1362766 -97124 1248090 1995831 1777582 826657
32212 826657 22277 -20466 243225 -24094 -724941 -903880 -166947 697385 829049 455109
32202 455109 392174 730599 755847 214955 -96867 559488 1727474 2357060 2221063 1983362
32192 1983362 1972783 1719895 887456 -57645 -451273 -219721 206559 322435 -270853 -1539878
32182 -1539878 -2646356 -2562079 -1434636 -691637 -1277748 -2389261 -2592318 -1679252 -652291
32173 -652291 -233238 -272944 -550843 -1275631 -2473309 -3412369 -3140460 -1594903 65603
32164 65603 487499 -452046 -1535836 -1749773 -1472940 -1540254 -1637541 -788459 689956 1194786
32154 1194786 258833 -427654 667293 2657995 3406005 2194537 170983 -1276791 -1547121
32145 -1547121 -750535 368243 866178 828277 1523199 3354320 4520631 3180714 291279
32136 291279 -1482416 -1350240 -949868 -1333333 -1559818 -902058 -442053 -1261241 -2508220
32127 -2508220 -2649497 -1680134 -819589 -715331 -1111818 -1716537 -2226630 -1924866 -444363
32118 -444363 1239249 1646449 598973 -711736 -1403046 -1676255 -1828304 -1553625 -723074
32109 -723074 -47373 -219526 -802811 -718454 246809 1085657 911230 144720 -66153 641440
32099 641440 1485230 1722768 1561168 1483243 1213592 167034 -1235594 -1680620 -714228
32090 -714228 444462 464186 -349386 -698865 -272964 2361 -333952 -507157 74571 632363
32080 632363 146377 -965054 -1398272 -916348 -538688 -708073 -560578 434829 1288758
32071 1288758 928431 -45179 -293443 101840 -114043 -1084057 -1393655 -344844 745743
32062 745743 429925 -702610 -878413 355340 1588423 1423224 51691 -1171704 -1199937
32053 -1199937 -150669 1059969 1769059 2109623 2355258 2080969 685299 -1330462 -2559149
32044 -2559149 -2439254 -1901873 -1873673 -2111108 -2084406 -1941768 -1738532 -765518 1171094 2675248
32034 2675248 2381912 1048275 534002 1115409 1416686 811047 165115 47628 -120924
32025 -120924 -653209 -818883 -189045 435085 173421 -809181 -1934696 -3006097 -3761671
32016 -3761671 -3634253 -2703378 -1996346 -2059861 -2092769 -1354472 -555505 -743733 -1505400 -1582067
32006 -1582067 -921591 -771710 -1711574 -2783026 -2886638 -2115903 -1293115 -912177 -1024662
31997 -1024662 -1583661 -2283997 -2414815 -1548529 -290835 289692 75246 92578 960773
31988 960773 1834230 1659504 988502 1333562 2741404 3429484 2380767 913478 612186
31979 612186 908485 258359 -1123825 -1596520 -813682 -140926 -249086 -243550 320594 438185
$$ [...]
##END NTUPLES=NMR SPECTRUM
##END=
