##TITLE=31Pdec_3PEPPA0607-3
 CD3CN+D2O, 24 sc
 7.07.2021
##JCAMPDX= 6.0         $$ Bruker NMR JCAMP-DX V2.0
##DATA TYPE= NMR SPECTRUM
##DATA CLASS= NTUPLES
##ORIGIN= UXNMR, Bruker Analytische Messtechnik GmbH
##OWNER= root
$$ XWIN-NMR		Version 3.5
$$ Wed Jul  7 10:08:48 2021 Russian Standard Time (UT+4h)  she@DPX200
##.OBSERVE FREQUENCY= 81.013821
##.OBSERVE NUCLEUS= ^31P
##.ACQUISITION MODE= SIMULTANEOUS
##.ACQUISITION SCHEME= undefined
##.AVERAGES= 24
##.DIGITISER RES= 16
##SPECTROMETER/DATA SYSTEM= spect
##.PULSE SEQUENCE= zgpg30
##.SOLVENT NAME= CD3CN
##.SHIFT REFERENCE= (INTERNAL, CD3CN, 0, 248.564)
##AUDIT TRAIL= $$ (NUMBER, WHEN, WHO, WHERE, WHAT)
$$ ##TITLE= Audit trail, XWIN-NMR		Version 3.5
$$ ##JCAMPDX= 5.01
$$ ##ORIGIN= Bruker BioSpin GmbH
$$ ##OWNER= she
$$ F:/spectra/data/she/nmr/P31/1/pdata/1/auditp.txt
$$ ##AUDIT TRAIL=  $$ (NUMBER, WHEN, WHO, WHERE, WHAT)
(   1,<2021-07-07 10:07:31.51 +0400>,<she>,<DPX200>,
      <created by zg, POWCHK disabled, PULCHK disabled
       configuration hash MD5:
       00 E9 B6 7A A2 85 ED C7 34 08 36 98 17 FE 4E 26
       data hash MD5: 32K
       0C DE 98 8B C0 E1 A0 3D E6 00 26 44 07 99 3F 63>)
(   2,<2021-07-07 10:07:34.95 +0400>,<she>,<DPX200>,
      <Start of raw data processing
       efp BC_mod = 2 LB = 1 FT_mod = 6 PKNL = 1 PHC0 = -7493.08 PHC1 = 162.6859 SI = 64K 
       data hash MD5: 64K
       21 0E 26 0F DE B6 D6 D8 34 E1 3E F1 39 66 95 D4>)
(   3,<2021-07-07 10:08:00.82 +0400>,<she>,<DPX200>,
      <pk PHC0 = 115.0899 PHC1 = -137.8 
       data hash MD5: 64K
       84 40 F4 82 C8 6A FD 62 FA 7E CC 1D 82 E3 0D 8B>)
(   4,<2021-07-07 10:08:04.89 +0400>,<she>,<DPX200>,
      <abs ABSG = 5 
       data hash MD5: 64K
       E0 F4 41 56 8F A6 8F C0 BA 4F 12 08 29 4B 61 82>)
$$ ##END=
$$ 
$$ hash MD5
$$ 3B 4B 5F 3E 1E CC 7D E4 30 D4 5C E8 6B EE F1 44
##$RELAX= 
##$RELAX= 
##$RELAX= 
##$RELAX= 
##$RELAX= 
##$RELAX= 
##$RELAX= 
##$RELAX= 
$$ Bruker specific parameters
$$ --------------------------
##$DU= <F:/spectra>
##$EXPNO= 1
##$NAME= <P31>
##$PROCNO= 1
##$TYPE= <nmr>
##$USER= <she>
##$AMP= (0..31)
100 100 100 100 100 100 100 100 100 100 100 100 100 100 100 100 100 100 
100 100 100 100 100 100 100 100 100 100 100 100 100 100 
##$AQSEQ= 0
##$AQ_mod= 1
##$AUNM= <au_zg>
##$AUTOPOS= <>
##$BF1= 81.014009
##$BF2= 200.13
##$BF3= 200.13
##$BF4= 200.13
##$BF5= 200.13
##$BF6= 200.13
##$BF7= 200.13
##$BF8= 200.13
##$BYTORDA= 1
##$CFDGTYP= 0
##$CFRGTYP= 5
##$CHEMSTR= <none>
##$CNST= (0..31)
1 1 145 1 1 1 1 1 1 1 1 1 1 1 1 1 1 1 1 1 1 1 1 1 1 1 1 1 1 1 1 1 
##$CPDPRG= <waltz16>
##$CPDPRG1= <>
##$CPDPRG2= <waltz16>
##$CPDPRG3= <>
##$CPDPRG4= <mlev>
##$CPDPRG5= <mlev>
##$CPDPRG6= <mlev>
##$CPDPRG7= <mlev>
##$CPDPRG8= <mlev>
##$CPDPRGB= <>
##$CPDPRGT= <>
##$D= (0..31)
0 1 0 0 0 0 0 0 0 0 0 0.03 2e-05 3e-06 0 0 0 0 0 0 0 0 0 0 0 0 0 0 0 0 
0 0 
##$DATE= 1625638050
##$DBL= (0..7)
120 120 120 11 120 120 24 19 
##$DBP= (0..7)
150 150 150 150 150 150 150 150 
##$DBP07= 0
##$DBPNAM0= <>
##$DBPNAM1= <>
$$ [...]
##$SUBNAM3= <"">
##$SUBNAM4= <"">
##$SUBNAM5= <"">
##$SUBNAM6= <"">
##$SUBNAM7= <"">
##$SUBNAM8= <"">
##$SUBNAM9= <"">
##$SW= 501.771253377433
##$SWIBOX= (0..15)
0 1 3 0 0 0 0 0 0 0 0 0 0 0 0 0 
##$SW_h= 40650.406504065
##$TD= 32768
##$TD0= 1
##$TE= 0
##$TE2= 300
##$TE3= 300
##$TEG= 300
##$TL= (0..7)
0 120 53 12 22 120 120 120 
##$TP= (0..7)
150 150 150 150 150 150 150 150 
##$TP07= 0
##$TPNAME0= <>
##$TPNAME1= <>
##$TPNAME2= <>
##$TPNAME3= <>
##$TPNAME4= <>
##$TPNAME5= <>
##$TPNAME6= <>
##$TPNAME7= <>
##$TPOAL= (0..7)
0.5 0.5 0.5 0.5 0.5 0.5 0.5 0.5 
##$TPOFFS= (0..7)
0 0 0 0 0 0 0 0 
##$TUNHIN= 0
##$TUNHOUT= 0
##$TUNXOUT= 0
##$USERA1= <user>
##$USERA2= <user>
##$USERA3= <user>
##$USERA4= <user>
##$USERA5= <user>
##$V9= 5
##$VALIST= <valist>
##$VCLIST= <CCCCCCCCCCCCCCC>
##$VD= 0
##$VDLIST= <DDDDDDDDDDDDDDD>
##$VPLIST= <PPPPPPPPPPPPPPP>
##$VTLIST= <TTTTTTTTTTTTTTT>
##$WBST= 1024
##$WBSW= 4
##$XGAIN= (0..3)
0 0 0 0 
##$XL= 0
##$YL= 0
##$YMAX_a= 1906
##$YMIN_a= -1846
##$ZGOPTNS= <>
##$ZL1= 120
##$ZL2= 120
##$ZL3= 120
##$ZL4= 120
##$ABSF1= 248.5645
##$ABSF2= -253.2056
##$ABSG= 5
##$ABSL= 3
##$ALPHA= 0
##$AQORDER= 0
##$ASSFAC= 0
##$ASSFACI= 0
##$ASSFACX= 0
##$ASSWID= 0
##$AUNMP= <proc_1d>
##$AZFE= 0.1
##$AZFW= 0.5
##$BCFW= 0
##$BC_mod= 2
##$BYTORDP= 0
##$COROFFS= 0
##$CY= -3
##$DATMOD= 1
##$DC= 0
##$DFILT= <>
##$DTYPP= 0
##$F1P= 0
##$F2P= 0
##$FCOR= 1
##$FTSIZE= 65536
##$FT_mod= 6
##$GAMMA= 0
##$GB= 0
##$INTBC= 1
##$INTSCL= 5.30512e-09
##$ISEN= 30
##$LB= 1
##$LEV0= 0
##$LPBIN= 0
##$MAXI= 10000
##$MC2= 0
##$MEAN= 0
##$ME_mod= 0
##$MI= 50
##$NCOEF= 0
##$NC_proc= -7
##$NLEV= 6
##$NOISF1= 182.463
##$NOISF2= 159.3651
##$NSP= 0
##$NTH_PI= 0
##$NZP= 0
##$OFFSET= 248.5645
##$PC= 4
##$PHC0= -7377.99
##$PHC1= 24.88589
##$PH_mod= 1
##$PKNL= yes
##$PPARMOD= 0
##$PSCAL= 0
##$PSIGN= 0
##$REVERSE= no
##$SF= 81.014009
##$SI= 65536
##$SIGF1= 159.3651
##$SIGF2= -187.1042
##$SINO= 113.3802
##$SIOLD= 16384
##$SREGLST= <1H.CDCl3>
##$SSB= 0
##$STSI= 65536
##$STSR= 0
##$SW_p= 40650.406504065
##$SYMM= 0
##$S_DEV= 0
##$TDeff= 32768
##$TDoff= 0
##$TI= <>
##$TILT= no
##$TM1= 0
##$TM2= 0
##$TOPLEV= 0
##$USERP1= <user>
##$USERP2= <user>
##$USERP3= <user>
##$USERP4= <user>
##$USERP5= <user>
##$WDW= 1
##$XDIM= 65536
##$YMAX_p= 320771194
##$YMIN_p= -32327760
$$ End of Bruker specific parameters
$$ ---------------------------------
##NTUPLES= NMR SPECTRUM
##VAR_NAME=  FREQUENCY,     SPECTRUM/REAL,   SPECTRUM/IMAG
##SYMBOL=    X,             R,               I
##VAR_TYPE=  INDEPENDENT,   DEPENDENT,       DEPENDENT
##VAR_FORM=  AFFN,          ASDF,            ASDF
##VAR_DIM=   65536,         65536,           65536
##UNITS=     HZ,            ARBITRARY UNITS, ARBITRARY UNITS
##FACTOR=    0.620285442955139, 1,           1
##FIRST=     20137.2065510759, 0,            0
##LAST=      -20513.1999529892, 0,           0
##MIN=       -20513.1999529892, -32327760,   0
##MAX=       20137.2065510759, 320771194,    0
$$ Real data points
##PAGE= N=1
##DATA TABLE= (X++(R..R)), XYDATA
$$ [...]
$$ plain form
13141 4281194 4076620 3503744 3561757 3557675 2399446 19854 -2805184 -5200189 -6567383
13132 -6567383 -6962142 -7109784 -7303014 -6563806 -4085783 -1268712 -543373 -1852170 -2315981
13123 -2315981 -406257 1531734 615814 -2376379 -4383466 -4396838 -3735259 -2754024 -523650
13114 -523650 2070380 2303081 -183744 -2165280 -1482859 -115910 -426926 -1018442 594815
13105 594815 3210551 3533650 1464023 -21873 83411 -243800 -1740873 -2329165 -1009463
13096 -1009463 274308 327913 930911 3084768 4042870 1168388 -3363394 -5070498 -3127087
13087 -3127087 -642619 223685 200184 158994 -366114 -1291386 -1227701 335914 1963866
13078 1963866 2307987 1686349 896379 -35567 -1059982 -1429970 -859517 -331204 -759804
$$ packed form
13141D281194k04574n72876N8013m082j158229k379592k825038k395005j367194
13132f567383l94759j47642j93230P39208K478023K817071P25339j308797m63811
13123b315981J909724J937991r15920k992193k007087j3372O61579R81235K230374
13114e23650K594030K32701k486825j981536O82421J366949l11016n91516J613257
13105E94815K615736L23099k069627j485896J05284l27211j497073n88292J319702
13096a009463J283771N3605O02998K153857R58102k874482m531782j707104J943411
13087c127087K484468Q66304k3501m1190n25108r25272O3685J563615J627952
13078A963866L44121o21638p89970r31946j024415l69988N70453N28313m28600
$$ plain form
13069 -759804 -1652415 -2019970 -1954376 -2327683 -3286817 -3912633 -3345990 -1767206 -263849
13060 -263849 72547 -956683 -2538138 -3687926 -4048570 -3639146 -2298203 -146784 1641946
13051 1641946 1645702 66468 -1116332 -436547 1267021 2041941 1397090 833681 1721603
13042 1721603 3382854 3935049 2855667 1819411 2432447 3807731 3550759 1067855 -1415028
13033 -1415028 -1546978 616156 3375321 5416850 6099135 4941029 2337559 84816
13025 84816 -342812 300216 160077 -1037005 -1819474 -1276508 -138582 481919 296993
13016 296993 -237138 -345762 466606 1454908 944219 -1338190 -3199548 -2782378 -1416091
13007 -1416091 -1608025 -3044350 -3210219 -1608123 -436489 -894896 -1752029 -2116182 -2603829
$$ packed form
13069g59804q92611l67555O5594l73307r59134o25816N66643J578784J503357
13060b63849L36396j029230j581455j149788l60644M09424J340943K151419J788730
13051A641946L756j579234j182800O79785J703568P74920o44851n63409Q87922
13042A721603J661251N52195j079382j036256O13036J375284k56972k482904k482883
13033a415028j31950K163134K759165K041529O82285j158106k603470k252743
13025H4816m27628O43028j40139j197082p82469N42966J137926O20501j84926
13016B96993n34131j08624Q12368R88302n10689k282409j861358M17170J366287
13007a416091j91934j436325j65869J602096J171634m58407q57133l64153m87647
$$ plain form
12998 -2603829 -2864497 -1172479 1978816 3063148 572341 -1940250 -750558 2373145
12990 2373145 2780323 -288022 -3171616 -3453274 -2597323 -2560326 -2788389 -1725092 669999
12981 669999 3026321 4012414 3075606 743568 -1420097 -2022612 -1221684 -231621 356797
12972 356797 867007 1410340 1578759 1233584 693524 223457 55287 528903 1401256 1629688
12962 1629688 868503 426533 1405131 2670923 2409635 1096222 859774 2144325 3229625
12953 3229625 3186410 2965839 2992694 2047993 -286329 -2133559 -1909832 -881565 -1302938
12944 -1302938 -2994512 -3693627 -2425255 -766612 -565994 -1690155 -2510583 -1875264 -150902
12935 -150902 1306416 1394169 181807 -1117742 -1102897 562308 2503183 2465119 -410883
$$ packed form
12998b603829k60668J692018L151295J084332k490807k512591J189692L123703
12990B373145M07178l068345k883594k81658Q55951L6997k28063J063297K395091
12981F69999K356322R86093r36808k332038k163665o02515Q00928R90063N88418
12972C56797N10210N43333J68419l45175n40060m70067j68170M73616Q72353K28432
12962A629688p61185m41970R78598J265792k61288j313413k36448J284551J085300
12953C229625m3215k20571K6855r44701k334322j847230K23727J028267m21373
12944a302938j691574o99115J268372J658643K00618j124161q20428O35319J724362
12935a50902J457318Q7753j212362j299549J4845J665205J940875l8064k876002
$$ plain form
12926 -410883 -3920297 -4421058 -942422 3199193 4065917 1627812 -954016 -1979813 -2845970
12917 -2845970 -4713519 -5969353 -4521902 -1161444 1107987 539093 -1766724 -3355110
12909 -3355110 -2648068 -148428 1844797 1284546 -1180457 -2544235 -1001783 1759122
12901 1759122 2918019 2174591 1393375 1282082 616061 -1073784 -2236107 -1735303 -905513
12892 -905513 -1719541 -3899358 -5353562 -4951424 -3399939 -1639367 42926 1141430 797292
12883 797292 -728070 -1733532 -1236885 -397715 -581808 -989912 108348 2380249 3694576
12874 3694576 3315445 2683069 2585197 1818035 -271172 -2046149 -2035567 -1352556 -1699322
12865 -1699322 -2478753 -2195020 -1458220 -1869927 -2765144 -2128344 -437077 -281317 -1824701
$$ packed form
12926d10883l509414n00761L478636M141615Q66724k438105k581828j025797q66157
12917b845970j867549j255834J447451L360458K269431n68894k305817j588386
12909c355110P07042K499640J993225n60251k465003j363778J542452K760905
12901A759122J158897p43428p81216j11293o66021j689845j162323N00804Q29790
12892i05513q14028k179817j454204M02138J551485J760572J682293J098504l44138
12883G97292j525362j005462M96647Q39170j84093m08104J098260K271901J314327
12874C694576l79131o32376r7872p67162k089207j774977J0582O83011l46766
12865a699322p79431K83733P36800m11707q95217O36800J691267J55760j543384
$$ plain form
12856 -1824701 -2053783 368053 2722121 2435502 793395 199439 151540 -1289017 -3693751
12847 -3693751 -4803484 -3920550 -2242346 -529652 1183435 2148859 1582300 489946 597778
12838 597778 1653987 1907082 1035220 366160 314637 5245 -444096 214797 1774775
12829 1774775 2359509 1520605 1048571 1668484 1507330 -529952 -2193696 -893905 2400529
12820 2400529 4545739 4320525 2951726 1529715 253597 -294201 508804 1719211 1566097
12811 1566097 -75620 -1679395 -2538186 -3371271 -4324919 -4443904 -3716178 -3640390 -4783425
12802 -4783425 -5578928 -4832133 -3807378 -4202790 -5356751 -5421920 -4463935 -4196548 -4865386
12793 -4865386 -4606900 -2396646 166287 910499 -316111 -1958233 -2644558 -1915181 24035
$$ packed form
12856a824701k29082K421836K354068k86619j642107n93956m7899j440557k404734
12847c693751j109733Q82934J678204J712694J713087R65424n66559j092354J07832
12838E97778J056209K53095q71862o69060n1523l09392m49341O58893J559978
12829A774775N84734q38904m72034O19913j61154k037282j663744J299791L294434
12820B400529K145210k25214j368799j422011j276118n47798Q03005J210407j53114
12811A566097j641717j603775q58791q33085r53648j18985P27726P5788j143035
12802d783425p95503P46795J024755l95412j153961o5169R57985K67387o68838
12793d865386K58486K210254K562933P44212j226610j642122o86325P29377J939216
$$ plain form
12784 24035 2231836 3295124 2634259 1207711 224126 -310318 -961058 -1438661 -965682
12775 -965682 286890 1324919 1712386 1680575 1092915 -282905 -1497284 -1055651 786462
12766 786462 1955673 1399795 390995 151946 -68847 -1175637 -2087546 -1336960 334424
12757 334424 1098388 971968 1345948 2094080 1744046 544883 596706 2217854 2824796
12748 2824796 775062 -1929929 -2501480 -1049045 539862 1777781 3278952 4399407
12740 4399407 3791283 1933508 727914 596500 149805 -1163319 -2303784 -2879392 -3797401
12731 -3797401 -4891222 -4224500 -1175953 1753242 2056834 659868 188644 907787 736739
12722 736739 -1113278 -2855011 -2718539 -950534 1177045 2695663 2815424 1167090 -1049994
$$ packed form
12784B4035K207801J063288o60865j426548r83585n34444o50740m77603M72979
12775i65682J252572J038029L87467l1811n87660j375820j214379M41633J842113
12766G86462J169211n55878j008800k39049k20793j106790r11909P50586J671384
12757C34424P63964j26420L73980P48132l50034j199163N1823J621148O06942
12748B824796k049734k704991n71551J452435J588907J237919J501171J120455
12740D399407o08124j857775j205594j31414m46695j313124j140465n75608r18009
12731c797401j093821O66722L048547K929195L03592j396966m71224P19143j71048
12722G36739j850017j741733J36472J768005K127579J518618J19761j648334k217084
$$ plain form
12713 -1049994 -1713846 -604901 -163000 -2092287 -4475845 -4074845 -766773 2286074 2721361
12704 2721361 1314296 -498 -544367 -530728 113360 1307846 2256658 2605382 3347380
12695 3347380 5151809 6388071 4601961 29972 -4029102 -4910958 -3282098 -1438670
12687 -1438670 -399892 -47680 -919698 -3643051 -6729739 -7211600 -4365625 -1117293 -420785
12678 -420785 -1512154 -1412854 727003 2843112 3278252 2723674 2393972 2246850 1952109
12669 1952109 1902894 2036168 1245033 -483763 -901475 1395927 3898907 2944452 -953100
12660 -953100 -3495314 -2538817 -615324 -590100 -1790903 -2254152 -2227630 -2843419 -3107658
12651 -3107658 -1249711 1718764 2720869 929266 -1069406 -873108 920414 2120665
$$ packed form
12713a049994o63852J108945M41901j929287k383558M01000L308072L052847M35287
12704B721361j407065j314794n43869J3639O44088J194486R48812L48724P41998
12695C347380J804429J236262j786110m571989m059074q81856J628860J843428
12687a438670J038778L52212q72018k723353l086688m81861K845975L248332O96508
12678d20785j091369R9300K139857K116109M35140n54578l29702j47122k94741
12669A952109m9215J33274p91135j728796m17712K297402K502980r54455l897552
12660i53100k542214R56497J923493K5224j200803m63249K6522o15789k64239
12651c107658J857947K968475J002105j791603j998672J96298J793522J200251
$$ plain form
12643 2120665 1654635 203786 -833139 -596687 304093 243559 -1210096 -2177909 -1012728
12634 -1012728 728049 25526 -3067820 -5166904 -4289073 -2316815 -1748675 -2462805 -3255345
12625 -3255345 -4329552 -6068471 -6992384 -5454290 -2516077 -856679 -1266395 -2240120 -2705452
12616 -2705452 -3073500 -3548991 -3378660 -2279726 -1083898 -328420 627968 2381137 4128619
12607 4128619 4228888 1983398 -1272115 -2947429 -1660744 855112 1329441 -882194
12599 -882194 -2486560 -429754 3820640 6144284 5121745 3100439 2155853 1752875 1044124
12590 1044124 784541 1386859 1131049 -1561361 -5196454 -6644243 -5101919 -2847387 -2037525
12581 -2037525 -2305863 -2000765 -640811 757840 1366039 1656456 2546744 3911771 4647448
$$ packed form
12643B120665m66030j450849j036925K36452R00780o0534j453655r67813J165181
12634a012728J740777p02523l093346k099084Q77831J972258N68140p14130p92540
12625c255345j074207j738919r23913J538094K938213J659398m09716r73725m65332
12616b705452l68048m75491J70331J098934J195828P55478R56388J753169J747482
12607D128619J00269k245490l255513j675314J286685K515856M74329k211635
12599h82194j604366K056806M250394K323644j022539k021306r44586m02978p08751
12590A044124k59583O02318k55810k692410l635093j447789J542324K254532Q09862
12581b037525k68338L05098J359954J398651O08199K90417Q90288J365027P35677
$$ plain form
12572 4647448 4265304 3609435 3460402 3196011 1815525 -219378 -1396789 -1191493 -402344
12563 -402344 470959 1718168 3068661 3401548 2425516 1329124 1026745 952748 376257
12554 376257 -280191 -367683 -162428 -84777 192824 772545 721853 -456925 -1495593 -1042523
12544 -1042523 20978 -349205 -2295771 -3719044 -3000387 -646473 1857440 3489708
12536 3489708 3784771 2739676 1069224 -271167 -1031133 -1491924 -1586495 -1181941 -926187
12527 -926187 -1434870 -1785747 -549574 1488445 1679675 -571668 -2275223 -847885 1950577
12518 1950577 2264178 -532191 -3155494 -2964765 -836492 1080191 2280244 3230388 3463156
12509 3463156 2293401 652953 252432 1057339 1355945 492600 -246983 -7494 241424
$$ packed form
12572D647448l82144o55869j49033k64391j380486k034903j177411K05296P89149
12563d02344Q73303J247209J350493L32887r76032j096392l02379p3997n76491
12554C76257o56448q7492K05255P7651K77601N79721n0692j178778j038668M53070
12544a042523J063501l70183j946566j423273P18657K353914K503913J632268
12536C489708K95063j045095j670452j340391p59966m60791r4571M04554K55754
12527i26187n08683l50877J236173K038019J91230k251343j703555J427338K798462
12518A950577L13601k796369k623303J90729K128273J916683J200053R50144K32768
12509C463156j169755j640448m00521Q04907K98606q63345p39583K39489K48918
$$ plain form
12500 241424 -186445 59016 2136475 4283505 3759483 1044961 -548587 278709 1082072
12491 1082072 -177918 -1876746 -1608602 -287401 -658343 -2815270 -4141174 -3506475 -2635669
12482 -2635669 -2687116 -2131006 497737 3698289 4803157 3586722 2163672 1809222 1761491
12473 1761491 1232615 829495 1215979 1601210 714909 -1223611 -2582460 -2325366 -1112189
12464 -1112189 -239712 -206944 -655167 -1049019 -843914 450727 2516497 3821238 2958990
12455 2958990 454099 -1638698 -2079671 -1527711 -1096285 -870425 -393431 278672 736272
12446 736272 778059 215610 -1170470 -2853744 -3562462 -2861326 -1925741 -1797584 -1729418 -543830
12436 -543830 1025231 936671 -1342481 -4017523 -5118005 -4437955 -3225344 -2784892 -3421556
$$ packed form
12500B41424m27869K45461K077459K147030n24022k714522j593548Q27296Q03363
12491A082072j259990j698828K68144J321201l70942k156927j325904O34699Q70806
12482b635669n1447N56110K628743L200552J104868j216435j423050l54450m7731
12473A761491n28876m03120L86484L85231q86301j938520j358849K57094J213177
12464a112189Q72477L2768m48223l93852K05105J294641K065770J304741q62248
12455B958990k504891k092797m40973N51960M31426K25860M76994O72103M57600
12446G36272M1787n62449j386080j683274p08718P01136R35585J28157O8166J185588
12436e43830J569061q8560k279152k675042j100482O80050J212611M40452o36664
$$ plain form
12427 -3421556 -4145168 -3656674 -2122623 -1191746 -1451570 -1141875 1015106 2978908 1859675
12418 1859675 -1458232 -3120469 -1773500 -80759 -29672 -4257 1731640 3525623 2896558
12409 2896558 618291 -560439 -81199 231626 -522000 -1334908 -1365962 -752270 576091
12400 576091 2748795 4486824 3919073 1449400 -27202 1331619 3941198 4905603 3432006
12391 3432006 1105892 -499246 -1307028 -1907063 -2142190 -1111549 1439319 4227513 5525128
12382 5525128 5055235 4063819 3513088 3313488 3566194 4919122 6724042 6567371 3407488
12373 3407488 -177273 -1147419 -448355 -1530601 -4774101 -6583044 -4744353 -1688417
12365 -1688417 -795715 -1826943 -2191277 -1167350 -434931 -1026374 -1853120 -1370863 591913
$$ packed form
12427c421556p23612M88494J534051R30877k59824L09695K156981J963802j119233
12418A859675l317907j662237J346969J692741N1087K5415J735897J793983o29065
12409B896558k278267j178730M79240L12825p53626q12908l1054O13692J328361
12400E76091K172704J738029n67751k469673j476602J358821K609579R64405j473597
12391C432006k326114j605138q07782o00035k35127J030641K550868K788194J297615
12382E525128m69893r91416n50731j99600K52706J352928J804920j56671l159883
12373C407488l584761r70146O99064j082246l243500j808943J838691L055936
12365a688417Q92702j031228l64334J023927P32419n91443q26746M82257J962776
$$ plain form
12356 591913 2745178 3280937 1197498 -2485993 -5181539 -5227077 -3578724 -2246328 -1597363
12347 -1597363 -347972 2022170 4109618 4159711 2074441 -479136 -1672740 -1164677 -264055
12338 -264055 -292545 -889518 -634530 583763 997223 -570101 -2781371 -3475668 -2471798
12329 -2471798 -1381426 -1178655 -1382732 -1439396 -1542594 -1966097 -2559962 -2923663 -2365621
12320 -2365621 -171884 2999392 4592321 2664060 -1235466 -3412055 -2399068 -275855
12312 -275855 692033 812537 1469268 2537862 2732204 1633913 127292 -780630 -826036
12303 -826036 -581136 -1058240 -2580721 -3835434 -3030506 -330115 2016194 2436183 1647730
12294 1647730 928339 279238 -692292 -1460263 -1420808 -934323 -365808 723096 2208039
$$ packed form
12356E91913K153265N35759k083439l683491k695546m5538J648353J332396O48965
12347a597363J249391K370142K087448N0093k085270k553577j193604N08063R00622
12338b64055k8490n96973K54988J218293M13460j567324k211270o94297J003870
12329b471798J090372K02771k04077n6664j03198m23503n93865l63701N58042
12320b365621K193737L171276J592929j928261l899526k176589J012987K123213
12312b75855R67888J20504O56731J068594J94342j098291j506621r07922m5406
12303h26036K44900m77104j522481j254713Q04928K700391K346309M19989p88453
12294A647730p19391o49101r71530p67971L9455M86485N68515J088904J484943
$$ plain form
12285 2208039 2640949 1456397 567637 1757469 3618303 3415122 1205880 -404715 -219479
12276 -219479 402979 310973 -46245 -270209 -683998 -875928 153346 1771104 1891788
12267 1891788 199949 -1002750 -221215 1081216 1062730 247598 51618 213841 -432200
12258 -432200 -1732504 -2496355 -2329539 -1877988 -1867445 -2805675 -4706082 -6259484 -5570484
12249 -5570484 -2864760 -1086972 -2279862 -4554077 -4430843 -1335469 2076101 3521726
12241 3521726 3232028 2690195 2801703 3451258 3889786 3532649 2799983 2603569 2720430
12232 2720430 2004372 889926 1756290 5199382 7814241 6179040 1822117 -630176
12224 -630176 349385 1863727 1499282 464819 824837 2093323 2209860 467051 -1933289
$$ packed form
12285B208039M32910j184552q88760J189832J860834k03181k209242j610595J85236
12276b19479O22458r2006l57218k23964m13789j91930J029274J617758J20684
12267A891788j691839j202699P81535J302431j8486q15132j95980J62223o46041
12258d32200j300304p63851J66816M51551J0543r38230j900407j553402O89000
12249e570484K705724J777788j192890k274215J23234L095374L411570J445625
12241C521726k89698n41833J11508O49555M38528l57137p32666j96414J16861
12232B720430p16058j114446Q66364L443092K614859j635201m356923k452293
12224f30176R79561J514342l64445j034463L60018J268486J16537j742809k400340
$$ plain form
12215 -1933289 -3400211 -3063611 -1054495 1513124 3233155 3574238 3152306 2778265 2540518
12206 2540518 1731186 -525922 -4106379 -7105534 -7209908 -4526289 -1939643 -1695942 -2865884
12197 -2865884 -3415565 -3254267 -3337978 -3152741 -1607799 416338 1047961 450552 236449
12188 236449 244486 -1195981 -3789213 -5087039 -4284230 -3380647 -3776966 -4358904 -3993639
12179 -3993639 -3495623 -3814669 -4216203 -3472748 -1413229 1336067 3652331 3893538 1599108
12170 1599108 -838164 -688882 989343 777335 -1520350 -2539226 -1255810 -770596 -2454221
12161 -2454221 -2875785 455145 4290587 4391315 1876692 650969 1027499 477933 -985236
12152 -985236 -947859 559663 774162 -1120812 -2757335 -2442425 -1131312 -182311 -1569
$$ packed form
12215a933289j466922L36600K009116K567619J720031L41083m21932l74041k37747
12206B540518q09332k257108l580457k999155j04374K683619K586646K43701j169942
12197b865884n49681J61298q3711J85237J544942K024137O31623n97409k14103
12188B36449Q037j440467k593232j297826Q02809R03583l96319n81938L65265
12179c993639M98016l19046m01534P43455K059519K749296K316264K41207k294430
12170A599108k437272J49282J678225k12008k297685j018876J283416M85214j683625
12161b454221m21564L330930L835442J00728k514623j225723L76530n49566j463169
12152i85236L7377J507522K14499j894974j636523L14910J311113R49001J80742
$$ plain form
12143 -1569 -1249494 -4519891 -8148935 -8935573 -6022255 -2074068 183897 822001 1385895
12134 1385895 2393146 3139262 3000760 2174145 1496741 1582619 1884802 1250323 -154353
12125 -154353 -665689 284728 959070 88762 -829403 -19156 1319959 751129 -1542044
12116 -1542044 -3379115 -4272189 -5543501 -7074463 -6950168 -4702948 -2353920 -1559552 -1693212
12107 -1693212 -1366281 -310461 734033 993083 507077 588030 2531079 5149347 5386602
12098 5386602 2741781 678949 1363053 1722294 -1743603 -6653465 -7844911 -5237532
12090 -5237532 -3458049 -4272791 -4783781 -3364620 -1963377 -1483830 -136205 1914674 1284809
12081 1284809 -2824432 -5998437 -4635830 -890174 1194317 1088285 508821 -74475 -671958
$$ packed form
12143a569j247925l270397l629044p86638K913318L948187K257965O38104N63894
12134A385895J007251P46116j38502q26615o77404Q5878L02183o34479j404676
12125a54353n11336R50417O74342q70308r18165Q10247J339115n68830k293173
12116a542044j837071q93074j271312j530962J24295K247220K349028P94368j33660
12107a693212L26931J055820J044494K59050m86006Q0953J943049K618268K37255
12098E386602k644821k062832O84104L59241l465897m909862j191446K607379
12090e237532J779483q14742n10990J419161J401243M79547J347625K050879o29865
12081A284809m109241l174005J362607L745656K084491j06032n79464n83296n97483
$$ plain form
12072 -671958 -212241 1422110 2187216 1121552 192850 588068 198572 -2418198 -4682573
12063 -4682573 -3939997 -1944774 -1714164 -2422106 -1459009 531679 1019902 449159 1259900
12054 1259900 2967122 2659268 182830 -1352633 -607160 190037 -726623 -2017275 -1778236
12045 -1778236 -298151 911359 1207881 1067128 1211813 1774038 1790382 117737 -2530536
12036 -2530536 -3761387 -2686913 -1177431 -630958 179429 2023881 2661151 419198 -2057122
12027 -2057122 -1448085 763073 810770 -794215 -256834 2465241 2997264 -325335 -3631787
12018 -3631787 -3447745 -1189531 284774 846820 1378832 999788 -1204932 -3766950 -4589549
12009 -4589549 -3723554 -2631267 -2004674 -1748396 -1890187 -2315682 -2614219 -2794085 -2959480
$$ packed form
12072f71958M59717J634351P65106j065664r28702L95218l89496k616770k264375
12063d682573P42576J995223K30610p07942R63097J990688M88223n70743Q10741
12054A259900J707222l07854k476438j535463P45473P97197r16660j290652K39039
12045a778236J480085J209510K96522j40753J44685N62225J6344j672645k648273
12036b530536j230851J074474J509482N46473Q10387J844452O37270k241953k476320
12027b057122O09037K211158M7697j604985N37381K722075N32023l322599l306452
12018c631787J84042K258214J474305N62046N32012l79044k204720k562018q22599
12009d589549Q65995J092287O26593K56278j41791m25495k98537j79866j65395
$$ plain form
12000 -2959480 -2217142 283282 3186159 4075751 2946814 1973701 1658671 356356 -1821049
11991 -1821049 -2259200 -252484 1509096 1597284 2194486 4438632 5345363 2744147 -211006
11982 -211006 305468 2361495 1325427 -2426026 -4083188 -2144055 -470458 -1899624
11974 -1899624 -4197562 -3977857 -1392486 851498 938271 -891898 -2883155 -2749948 107934
11965 107934 3003243 2591203 -649795 -2954376 -2626226 -1938801 -2747402 -3410572 -2055052
11956 -2055052 -154180 -168129 -1577465 -2141089 -1717165 -1796117 -2061501 -651420 2180049
11947 2180049 3753801 3011301 2166911 3122422 4561915 4319918 2839510 2194825 2822348
11938 2822348 3450208 3724451 4572569 5788836 5496578 3002643 479073 275139 1563597
$$ packed form
12000b959480P42338K500424K902877Q89592j128937r73113l15030j302315k177405
11991a821049m38151K006716J761580Q8188N97202K244146R06731k601216k955153
11982b11006N16474K056027j036068l751453j657162J939133J673597j429166
11974a899624k297938K19705K585371K243984Q6773j830169j991257J33207K857882
11965A07934K895309m12040l240998k304581L28150O87425q08601o63170J355520
11956b055052J900872j3949j409336n63624M23924p8952k65384J410081K831469
11947B180049J573752p42500q44390R55511J439493k41997j480408o44685O27523
11938B822348O27860K74243Q48118J216267k92258k493935k523570k03934J288458
$$ plain form
11929 1563597 1453803 -806542 -2583698 -1461945 1329328 2507441 1173047 -143610
11921 -143610 595444 1625967 -211084 -4369188 -6356753 -3516440 1024290 2235051
11913 2235051 -164995 -1618544 793073 4611974 5817459 4005896 1843696 903587
11905 903587 325471 -1018925 -3106504 -5408298 -7279622 -7715388 -6268722 -4301756 -3786250
11896 -3786250 -4604775 -4566968 -2561665 -129613 951691 1228725 2355537 4199173 4819903
11887 4819903 3311956 1269826 807604 1945195 2881509 2596567 2065661 2435487 3025307
11878 3025307 2395874 948047 744368 2420464 3978301 3590238 2116252 1471036 1698350
11869 1698350 1355365 -4470 -1485027 -2449892 -2783176 -2021110 -13104 1886449 2146316
$$ packed form
11929A563597j09794k260345j777156J121753K791273J178113j334394j316657
11921a43610P39054J030523j837051m158104j987565K840313M540730J210761
11913B235051k400046j453549K411617L818901J205485j811563k162200r40109
11905I03587n78116j344396k087579k301794j871324m35766J446666J966966N15506
11896c786250q18525L7807K005303K432052J081304K77034J126812J843636O20730
11887D819903j507947k042130m62222J137591R36314k84942n30906L69826N89820
11878C025307o29433j447827k03679J676096J557837l88063j473986o45216K27314
11869A698350l42985j359835j480557r64865l33284P62066K008006J899553K59867
$$ plain form
11860 2146316 1351816 1260579 1828819 1450666 163856 -25086 1352522 2017395 479979
11851 479979 -1525236 -1831359 -1199835 -1894181 -4128776 -5920294 -5849274 -4333430 -2468613
11842 -2468613 -871075 440338 1766792 3132244 3714493 2613465 478635 -699895
11834 -699895 42096 1529943 2183276 1659655 295258 -1573453 -2960041 -2519585 -588222
11825 -588222 556136 -324886 -1648688 -1501897 -357496 269752 383406 836009 1363108
11816 1363108 1330542 1412954 2375562 2990121 1440541 -1622918 -3580071 -3224178 -1810679
11807 -1810679 -962767 -1289901 -2771575 -4674540 -5365095 -4072952 -2554005 -3021879 -4723807
11798 -4723807 -4829005 -2638151 -405856 357165 794719 2006840 2829142 1816658 -252357
$$ packed form
11860B146316p94500r1237N68240l78153j286810j88942J377608O64873j537416
11851D79979k005215l06123O31524o94346k234595j791518P1020J515844J864817
11842b468613J597538J311413J326454J365452N82249j101028k134830j178530
11834f99895P41991J487847O53333n23621j364397j868711j386588M40456J931363
11825e88222J144358q81022j323802J46791J144401O27248J13654M52603N27099
11816A363108l2566Q2412R62608O14559j549580l063459j957153L55893J413499
11807a810679Q47912l27134j481674j902965o90555J292143J518947m67874j701928
11798d723807j05198K190854K232295P63021M37554J212121Q22302j012484k069015
$$ plain form
11789 -252357 -1460696 -1315870 -958272 -1504877 -3063409 -4777699 -5322195 -4088726 -2212442
11780 -2212442 -1506204 -2166373 -2698815 -2302696 -1761636 -1470200 -399800 1862871 3668256
11771 3668256 3458293 2198282 1901166 2449191 1766189 -960473 -3922261 -4961594 -3997918
11762 -3997918 -2602034 -1980736 -2092244 -2321275 -2261165 -1797164 -1010163 -335442 -428204 -1326021
11752 -1326021 -1959032 -1255507 241122 772406 -339714 -1801960 -2267298 -2026665 -1944739
11743 -1944739 -1842794 -1171140 -358250 -85031 -12790 272373 -93269 -1806577 -3296903
11734 -3296903 -2299004 715003 2952572 3240666 3275571 4524220 6097794 6536533 5852818
11725 5852818 4844885 3836045 2895553 2116812 1222641 75798 -389937 701570 2213447
$$ packed form
11789b52357j208339J44826L57598n46605j558532j714290n44496J233469J876284
11780b212442P06238o60169n32442L96119N41060K91436J070400K262671J805385
11771C668256k09963j260011k97116N48025o83002k726662k961788j039333R63676
11762c997918J395884O21298j11508k29031O0110M64001P87001O74721r2762q97817
11752a326021o33011P03525J496629N31284j112120j462246m65338K40633Q1926
11743a944739J01945O71654Q12890K73219P2241K85163l65642j713308j490326
11734c296903R97899L014007K237569K88094L4905J248649J573574M38739o83715
11725E852818j007933j008840r40492p78741q94171j146843m65735J091507J511877
$$ plain form
11716 2213447 2120665 547335 -587467 -942723 -1990803 -3572091 -3456803 -1316725 135074
11707 135074 -576799 -1458356 -833104 -108536 -614391 -949416 -77113 185326 -1163439
11698 -1163439 -1442840 1121318 3053678 561008 -3652448 -3874378 -162740 2073042
11690 2073042 700380 -774363 32614 923571 492 -987053 -449150 31338 -989778
11681 -989778 -1926358 -1116462 212772 347420 -70541 123356 258061 -489456 -1172435
11672 -1172435 -916175 -608442 -732598 288008 3289918 5986341 5952941 4278864 3629972
11663 3629972 4176452 4210115 3650038 4008450 5348948 5833167 4263783 1272254 -1738462
11654 -1738462 -3349734 -2514231 203323 2503428 3017534 3144577 4572565 6252991 6119519
$$ packed form
11716B213447r2782j573330j134802l55256j048080j581288J15288K140078J451799
11707A35074p11873q81557O25252P24568n05855l35025Q72303K62439j348765
11698a163439k79401K564158J932360k492670m213456k21930L711638K235782
11690B073042j372662j474743Q06977Q90957r23079r87545N37903M80488j021116
11681i89778r36580Q09896J329234J34648m17961J93897J34705p47517o82979
11672a172435K56260L07733j24156J020606L001910K696423l3400j674077o48892
11663C629972N46480L3663n60077L58412J340498M84219j569384k991529l010716
11654a738462j611272Q35503K717554K300105N14106J27043J427988J680426j33472
$$ plain form
11645 6119519 4777959 4711831 6196910 6806484 5230159 3087670 2255654 2405971 2098080
11636 2098080 864781 -618155 -1492471 -1350937 -580421 -145591 -416745 -558480 121710
11627 121710 839178 474492 -547608 -824667 64823 1415776 2608986 3190548 2549888
11618 2549888 1011641 319852 1298781 2109511 972750 -545570 228644 2448637 2787993
11609 2787993 863148 -176651 976143 1712608 232623 -1293339 -511369 1227785
11601 1227785 1474732 709606 714686 785523 -1009353 -3718645 -4081001 -1317987 1471194
11592 1471194 1431773 -621789 -1863036 -1048602 675084 1763292 1937982 1827992 1645425
11583 1645425 921321 -281127 -703498 570110 2344403 2485459 837307 -598021 -599202
$$ packed form
11645F119519j341560o6128J485079O09574j576325k142489q32016J50317l07891
11636B098080j233299j482936q74316J41534P70516M34830k71154j41735O80190
11627A21710P17468l64686j022100k77059Q89490J350953J193210N81562o40660
11618B549888j538247o91789R78929Q10730j136761j518320P74214K219993L39356
11609B787993j924845j039799J152794P36465j479985j525962P81970J739154
11601A227785K46947p65126N080P0837j794876k709292l62356K763014K789181
11592A471194l9421k053562j241247Q14434J723686J088208J74690j09990j82567
11583A645425p24104j202448m22371J273608J774293J41056j648152j435328j181
$$ plain form
11574 -599202 -3034 506469 1695436 3538665 3751767 726130 -3366610 -4751645 -2746017
11565 -2746017 -196635 446308 -499828 -1459879 -1583012 -873002 154064 508276 -420435
11556 -420435 -1746810 -1867800 -565970 686670 726281 -32714 -579730 -523373 78699
11547 78699 1165277 2383574 3048142 2931078 2579226 2406061 1996787 860095 -552644
11538 -552644 -1283267 -1196039 -1149795 -1636064 -1910480 -1117642 102945 131733 -1405809 -3033999
11528 -3033999 -3582089 -3760740 -4518537 -4947850 -3566863 -1080552 142795 -751443 -2375233
11519 -2375233 -3513642 -4097590 -3610935 -1160619 2048931 2990765 971128 -979005 -583280
11510 -583280 380141 -414447 -1544140 -328724 2136287 2274085 -325443 -2302414 -1699243
$$ packed form
11574e99202N96168N09503J188967J843229K13102l025637m092740j385035K005628
11565b746017K549382O42943r46136r60051j23133P10010J027066L54212r28711
11556d20435j326375j20990J301830J252640L9611p58995n47016N6357O02072
11547G8699J086578J218297O64568j17064l51852j73165m09274j136692j412739
11538e52644p30623Q7228M6244m86269k74416P92838J220587K8788j537542j628190
11528c033999n48090j78651p57797m29313J380987K486311J223347q94238j623790
11519b375233j138409n83948M86655K450316L209550R41834k019637j950133L95725
11510e83280R63421p94588j129693J215416K465011J37798k599528j976971O03171
$$ plain form
11501 -1699243 -284434 7499 -182491 216176 386859 -760554 -2358891 -2719746 -1771969
11492 -1771969 -1005961 -1435986 -2467694 -2576792 -834845 1955091 3782895 3557173 2300449
11483 2300449 1643800 1944394 2821963 4362182 6146014 6248023 3583100 588364 804442
11474 804442 3829712 5481738 3418549 -105901 -1861234 -1358382 214978 2264694
11466 2264694 4298643 5072998 4004821 2166039 611997 -914529 -2529493 -3126044
11458 -3126044 -2178270 -1153839 -1547926 -2669933 -2849098 -1806444 -483749 483225 859536
11449 859536 398129 -463235 -543775 304337 582107 -448849 -1132003 187707 2319429
11440 2319429 2628023 509950 -2189224 -3573488 -3043402 -1020050 1131668 1608058 104521
$$ packed form
11501a699243J414809K91933j89990L98667J70683j147413j598337l60855R47777
11492a771969P66008m30025j031708j09098J741947K789936J827804k25722j256724
11483B300449o56649L00594Q77569J540219J783832J02009k664923k994736K16078
11474H04442L025270J652026k063189l524450j755333N02852J573360K049716
11466B264694K033949P74355j068177j838782j554042j526526j614964n96551
11458c126044R47774J024431l94087j122007j79165J042654J322695R66974L76311
11449H59536m61407q61364q0540Q48112K77770j030956o83154J319710K131722
11440B319429L08594k118073k699174j384264N30086K023352K151718M76390j503537
$$ plain form
11431 104521 -1427818 -1326651 -561523 -966426 -2275002 -2944673 -2934264 -3228978 -3281048 -1718589
11421 -1718589 499013 551265 -1996296 -4047154 -3265521 -1392452 -1719411 -4667391 -7450962
11412 -7450962 -7439697 -4712139 -1638849 -579414 -1675565 -2732175 -1783413 420783 1518866
11403 1518866 967117 742168 2142224 3577694 2788534 169148 -1601236 -862575 1296342
11394 1296342 2583916 1899405 31024 -1433578 -1569554 -658963 460873 1317906 1917264
11385 1917264 2236925 2094864 1459620 471134 -770421 -1993938 -2489564 -1692543 -73909
11376 -73909 1134965 1223849 558078 -133503 -457895 -289400 394122 1374647 2258603 2775322
11366 2775322 2742158 1913386 391615 -934832 -1046319 11142 1084625 1111664 -53840
$$ packed form
11431A04521j532339J01167P65128m04903j308576o69671J0409k94714n2070J562459
11421a718589K217602N2252k547561k050858P81633J873069l26959k947980k783571
11412g450962J1265K727558L073290J059435j096151j056610R48762K204196J098083
11403A518866n51749k24949J400056J435470p89160k619386j770384P38661K158917
11394A296342J287574o84511j868381j464602j35976R10591J119836Q57033N99358
11385A917264L19661j42061o35244r88486j241555j223517m95626P97021J618634
11376g3909J208874Q8884o65771o91581l24392J68495O83522R80525Q83956N16719
11366B775322l3164q28772j521771j326447j11487J057461J073483K7039j165504
$$ plain form
11357 -53840 -1817987 -3180666 -3033491 -1035371 1580251 2779674 1645943 -849947 -2978545
11348 -2978545 -3636535 -2797637 -1451854 -1081999 -2184115 -3149267 -1790095 1556361 3680722
11339 3680722 2170071 -1530859 -3862303 -3245753 -1112094 705476 1925007 2903790
11331 2903790 3316047 2705330 1519981 605506 61546 -571218 -1267754 -1514298 -1252980
11322 -1252980 -999645 -939482 -662607 46406 900803 1782035 2884262 3890280 3949392
11313 3949392 2970901 1935374 1269143 109416 -1789294 -2754436 -1474897 465260 482155
11304 482155 -1158030 -1773330 -383599 1209933 1777932 2325441 3417363 3472081 1350546
11295 1350546 -1438106 -2859586 -2928849 -2519570 -1435596 421722 1687112 1479803 1201282
$$ packed form
11357e3840j764147j362679J47175J998120K615622J199423j133731k495890k128598
11348b978545o57990Q38898J345783L69855j102116r65152J359172L346456K124361
11339C680722j510651l700930k331444O16550K133659J817570J219531R78783
11331B903790M12257o10717j185349r14475n43960o32764o96536k46544K61318
11322a252980K53335O0163K76875P09013Q54397Q81232J102227J006018N9112
11313C949392r78491j035527o66231j159727j898710r65142J279539J940157J6895
11304D82155j640185o15300J389731J593532N67999N47509J091922N4718k121535
11295A350546k788652j421480o9263M09279J083974J857318J265390k07309k78521
$$ plain form
11286 1201282 2195274 3173500 2425173 1009124 856511 1154542 37583 -1291680 -187706
11277 -187706 2211491 1915881 -1314735 -2945677 -717945 1711437 680850 -1782498
11269 -1782498 -1571474 1078737 2624162 1881454 819126 528500 -2617 -1128114 -1625556
11260 -1625556 -1016557 -390074 -330724 -44731 808684 1177314 317507 -903906 -1181294
11251 -1181294 -264781 1251115 2687427 3295781 2372710 27832 -2592025 -4172745 -3994079
11242 -3994079 -1981346 1128794 3597358 3771616 1930081 180559 -166456 -305647 -2011574
11233 -2011574 -4622898 -5487032 -3630979 -1503044 -1984024 -4552421 -5943221 -4440802
11225 -4440802 -1834219 -541920 -410806 218860 1338819 1162514 -919804 -3141876 -3701871
$$ packed form
11286A201282R93992R78226p48327j416049j52613K98031j116959j329263J103974
11277a87706K399197k95610l230616j630942K227732K429382j030587k463348
11269a782498K11024K650211J545425p42708j062328k90626n31117j125497m97442
11260a625556O08999O26483N9350K85993Q53415L68630q59807j221413k77388
11251a181294R16513J515896J436312O08354r23071k344878k619857j580720J78666
11242c994079K012733L110140K468564J74258j841535j749522l47015j39191j705927
11233b011574k611324q64134J856053K127935m80980k568397j390800J502419
11225d440802K606583J292299J31114O29666J119959j76305k082318k222072n59995
$$ plain form
11216 -3701871 -2926224 -2314215 -2474712 -2904356 -3065527 -2776103 -1986078 -942214 -294317
11207 -294317 -464780 -1160614 -1893414 -2595458 -3314545 -3722001 -3407864 -2392570 -1037701
11198 -1037701 226267 917313 778874 280757 254539 765852 1007367 575891 37013
11189 37013 -155459 -337949 -634632 -274099 1208799 2913429 3683993 3550018 3051530
11180 3051530 1927872 -166237 -2138919 -2155958 154208 3271836 5405011 5557568 3518187
11171 3518187 335503 -1457340 -30571 2987684 3820044 1335248 -1326184 -1145410
11163 -1145410 564019 398118 -1834865 -2742426 -364693 2921675 3624421 1510053 -814429
11154 -814429 -1642083 -1651335 -1897939 -2092411 -1462129 -193254 790509 901470 136660 -1252193
$$ packed form
11216c701871P75647O12009j60497m29644j61171K89424P90025J043864O47897
11207b94317j70463o95834p32800p02044p19087m07456L14137J015294J354869
11198a037701J263968O91046j38439m98117k6218N11313K41515m31476n38878
11189C7013j92472j82490k96683L60533J482898J704630P70564j33975m98488
11180C051530j123658k094109j972682j7039K310166L117628K133175J52557k039381
11171C518187l182684j792843J426769L018255Q32360k484796k661432J80774
11163a145410J709429j65901k232983r07561K377733L286368P02746k114368k324482
11154h14429q27654r252k46604j94472O30282J268875R83763J10961p64810j388853
$$ plain form
11144 -1252193 -2739287 -3580332 -3501809 -3024008 -2541717 -1522049 551742 2725951 3164251
11135 3164251 1389122 -964036 -2055049 -1836782 -1648439 -2303411 -3207661 -3283289 -2329367
11126 -2329367 -1282548 -1151224 -1851092 -2453855 -2648960 -3271355 -4814907 -6103074 -5529017
11117 -5529017 -3337479 -1441706 -950105 -1143332 -1115436 -993690 -919583 -247251 1165254
11108 1165254 2020828 1303141 78172 -18128 442378 -648606 -3335134 -4659036 -2417946
11099 -2417946 1517605 3292845 1931692 268376 643249 1435021 -533867 -4920031
11091 -4920031 -7339213 -4534677 1558406 6171761 7040833 5791749 4667141 3933231
11083 3933231 2849130 1453627 423395 104247 434417 1189230 1873137 2046263 1989522
$$ packed form
11144a252193j487094q41045P8523M77801M82291J019668K073791K174209M38300
11135C164251j775129k353158j091013K18267J88343o54972r04250p5628R53922
11126b329367J046819J31324o99868o02763j95105o22395j543552j288167N74057
11117e529017K191538J895773M91601j93227K7896J21746P4107O72332J412505
11108A165254Q55574p17687j224969r6300M60506j090984k686528j323902K241090
11099b417946L935551J775240j361153j663316L74873P91772j968888m386164
11091d920031k419182K804536O093083M613355Q69072j249084j124608p33910
11083C933231j084101j395503j030232l19148L30170P54813O83907J73126n6741
$$ plain form
11074 1989522 2212046 2237521 1145274 -433405 -506881 1326084 2795194 2087131 555949
11065 555949 636849 2222784 3078259 2140415 399678 -1113322 -2180898 -2323867 -935994
11056 -935994 1161438 2125893 1592653 1104395 1416334 1134597 -842769 -3034390 -3106173
11047 -3106173 -1041777 972471 1435694 875579 382060 169299 -11815 -75409 83536
11038 83536 65785 -479981 -1010857 -558814 815361 1692497 901246 -929169 -2050133
11029 -2050133 -1650165 -475369 620590 1762383 3175219 4098293 3604581 2202055 1581019
11020 1581019 2566400 4002713 4047375 2285629 254963 -189087 1019632 1977724 1140931
11011 1140931 -474810 -410529 1792058 3586323 2667700 16270 -1657736 -1607013 -1374402
$$ packed form
11074A989522K22524K5475j092247j578679p3476J832965J469110p08063j531182
11065E55949Q0900J585935Q55475r37844j740737j513000j067576j42969J387873
11056i35994K097432R64455n33240m88258L11939k81737j977366k191621p1783
11047c106173K064396K014248M63223n60115m93519k12761j81114o3594J58945
11038H3536j7751n45766n30876M52043J374175Q77136p91251j830415j120964
11029b050133L99968J174796J095959J141793J412836R23074m93712j402526o21036
11020A581019R85381J436313M4662j761746k030666m44050J208719R58092q36793
11011A140931j615741O4281K202587J794265r18623k651430j674006N0723K32611
$$ plain form
11002 -1374402 -1789752 -1727955 -332044 1321062 1807041 1375034 1208528 1462522 1268877
10993 1268877 359422 -440967 -425234 106482 493746 795140 1746147 3593486 5286900
10984 5286900 5286454 3314102 872413 -348894 -217820 137851 -83328 -781471 -1572759
10975 -1572759 -2013371 -1410997 443036 2293617 2397548 874913 -20673 1373383 3986655
10966 3986655 5299208 4150977 1678260 -24061 294372 2019606 3069604 1941240
10958 1941240 -331239 -1120288 480770 2375989 2260289 627007 -129256 1176456 3507001
10949 3507001 5120623 4925165 2828297 -6799 -1578123 -892017 843479 1830917 1932571
10940 1932571 2133336 2537919 2654499 3154457 5171497 7826833 8686072 7130677 5140384
$$ packed form
11002a374402m15350O1797J395911J653106M85979m32007j66506K53994j93645
10993A268877r09455q00389J5733N31716L87264L01394R51007J847339J693414
10984E286900m46j972352k441689j221307J31074L55671k21179o98143p91288
10975a572759m40612O02374J854033J850581J03931j522635q95586J394056K613272
10966C986655J312553j148231k472717j702321L18433J725234J049998j128364
10958A941240k272479p89049J601058J895219j15700j633282p56263J305712K330545
10949C507001J613622j95458k096868k835096j571324O86106J735496R87438J01654
10940A932571K00765M04583J16580M99958K017040K655336Q59239j555395j990293
$$ plain form
10931 5140384 4078739 2980388 1103911 -173585 227810 768905 -387257 -2157571
10923 -2157571 -2032721 130262 2156848 2779922 2462735 1379310 -894241 -3488138 -4386179
10914 -4386179 -3102292 -1365436 -575543 -326755 -35941 -203742 -1119211 -1825165 -1396629
10905 -1396629 -123757 1274824 2414888 2705130 1582280 25588 132640 2074245
10897 2074245 3118643 1153038 -2228659 -3799839 -2687429 -539631 1273201 2649078
10889 2649078 3555603 3777909 3616926 3234584 1694730 -1604383 -4880263 -5373973 -2933069
10880 -2933069 -300552 528001 406794 876731 1687353 1632979 604925 -488855 -1130453
10871 -1130453 -1389705 -1199524 -525139 -64683 -731113 -2230774 -3004166 -2146063 -837999
$$ packed form
10931E140384j061645j098351j876477j277496M01395N41095j156162j770314
10923b157571J24850K162983K026586O23074l17187j083425k273551k593897q98041
10914d386179J283887J736856P89893K48788K90814j67801r15469p05954M28536
10905a396629J272872J398581J140064K90242j122850j556692J07052J941605
10897B074245J044398j965605l381697j571180J112410K147798J812832J375877
10889B649078R06525K22306j60983l82342j539854l299113l275880m93710K440904
10880b933069K632517Q28553j21207M69937Q10622n4374j028054j093780o41598
10871a130453k59252J90181O74385M60456o66430j499661p73392Q58103J308064
$$ plain form
10862 -837999 -962990 -2425698 -3118297 -2106021 -1356466 -2703550 -4313107 -2934382 522895
10853 522895 1117068 -3113742 -7544396 -6970401 -2686442 -132687 -1134439 -2509590 -1861998
10844 -1861998 -541522 -120488 278652 1456938 1915973 300328 -2022132 -2929589 -2597980
10835 -2597980 -2636983 -3351341 -3789120 -3724961 -3729861 -3619222 -2469119 -213805 1977380 3058200
10825 3058200 2995227 2238343 1086180 -142597 -828474 -476622 493937 770761 -457910
10816 -457910 -2122544 -2128452 -17756 2131092 2190284 400390 -1673579 -3421642 -4871534
10807 -4871534 -5170918 -3556025 -1318140 -546085 -1107109 -1139132 -402413 -545174 -1825520
10798 -1825520 -2414257 -1715624 -1525292 -2577510 -2652335 -36189 3329070 4353848 2862947
$$ packed form
10862h37999j24991j462708o92599J012276P49555j347084j609557J378725L457277
10853E22895N94173m230810m430654N73995M283959K553755j001752j375151O47592
10844a861998J320476M21034L99140J178286M59035j615645k322460r07457L31609
10835b597980l9003p14358m37779O4159m900J10639J150103K255314K191185J080820
10825C058200o2973p56884j152163j228777o85877L51852R70559K76824j228671
10816d57910j664634n908K110696K148848N9192j789894k073969j748063j449892
10807d871534k99384J614893K237885P72055n61024l2023P36719j42761j280346
10798a825520n88737O98633J90332j052218p4825K616146L365259J024778j490901
$$ plain form
10789 2862947 1040988 88534 -472275 -1056913 -1575729 -2237750 -3202011 -3808439 -3359172
10780 -3359172 -2141510 -706848 1029190 2920650 3866461 3269380 2266356 2059172 1930731
10771 1930731 626287 -981762 -641488 1848893 3747041 2543729 -1009627 -3733559
10763 -3733559 -3433690 -976529 1028155 1277182 941459 1572054 2758806 2966403 2061480
10754 2061480 1360996 1300314 874503 -298799 -1156844 -1069990 -939480 -1612803 -2535985 -2723881
10744 -2723881 -1916524 -270158 1880944 3615924 4139309 4131342 4884728 6016163 5840314
10735 5840314 4088767 2175689 699124 -882715 -1976467 -1200524 527427 477209 -1506701
10726 -1506701 -2553633 -1788522 -1912828 -4028217 -5026826 -2824782 -300946 -587745 -1865264
$$ packed form
10789B862947j821959r52454n60809n84638n18816o62021r64261o06428M49267
10780c359172J217662J434662J736038J891460R45811n97081j003024k07184j28441
10771A930731j304444j608049L40274K490381J898148j203312l553356k723932
10763c733559K99869K457161K004684K49027l35723O30595J186752K07597r04923
10754B061480p00484o0682m25811j173302q58045Q6854J30510o73323r23182j87896
10744b723881Q07357J646366K151102J734980N23385p967P53386J131435j75849
10735E840314j751547j913078j476565j581839j093752P75943J727951n0218j983910
10726a506701j046932P65111j24306k115389r98609K202044K523836k86799j277519
$$ plain form
10717 -1865264 -846289 1373308 1347858 -841944 -2113908 -1472163 -549676 -45299 666604
10708 666604 1166733 653757 212670 1278706 2782750 2889125 2336077 2739905 2957627
10699 2957627 905533 -2146508 -3114976 -2080775 -1636354 -1970420 -953179 1228682 2017364
10690 2017364 1149886 972374 1773225 1284384 -488246 -504554 2013708 3875011 3116511
10681 3116511 1782835 1586944 847848 -1680176 -3517912 -2119726 901855 2297235
10673 2297235 1759092 990429 88694 -1834338 -3581024 -2810474 86091 1924523 1056424
10664 1056424 -487451 -93277 1905133 3127681 2559604 1410023 748367 72963 -958357
10655 -958357 -939886 1362071 4356059 5138894 3505919 2097671 2321145 2720875 2112563
$$ packed form
10717a865264J018975K219597k5450k189802j271964O41745R22487N04377P11903
10708F66604N00129n12976m41087J066036J504044J06375n53048M03828K17722
10699B957627k052094l052041r68468J034201M44421l34066J017241K181861P88682
10690B017364q67478j77512Q00851m88841j772630j6308K518262J861303p58500
10681C116511j333676j95891p39096k528024j837736J398186L021581J395380
10673B297235n38143p68663r01735j923032j746686P70550K896565J838432q68099
10664A056424j543875L94174J998410J222548n68077j149581o61656o75404j031320
10655i58357J8471K301957K993988P82835j632975j408248K23474L99730o08312
$$ plain form
10646 2112563 1566766 1967325 2196780 1379233 527001 281194 -542096 -2410287 -3689289
10637 -3689289 -3655181 -3991082 -5134409 -4388481 -480685 3215782 3392319 1832644 2133664
10628 2133664 4143239 5448507 5739301 5690102 4125239 574902 -1853544 -615208 1702113
10619 1702113 1482639 84709 724320 2082580 793608 -1872292 -1898950 484501 1610482
10610 1610482 765797 61719 -460977 -1727647 -1534052 2095956 5447757 3945089 493070
10601 493070 1387462 5673920 7006385 4719916 3729370 4111327 1106860 -3903616 -3303934
10592 -3303934 3589621 7768228 4489424 111331 547024 2299644 557124 -2182235
10584 -2182235 -1907003 -553398 -1387258 -2706436 -1896227 -629438 -853267 -480070 2170872
$$ packed form
10646B112563n45797M00559K29455q17547q52232k45807q23290j868191j279002
10637c689289L4108l35901j143327P45928L907796L696467J76537j559675L01020
10628B133664K009575J305268K90794m9199j564863l550337k428446J238336K317321
10619A702113k19474j397930O39611J358260j288972k665900k6658K383451J125981
10610A610482q44685p04078n22696j266670J93595L630008L351801j502668l452019
10601D93070Q94392M286458J332465k286469r90546L81957l004467n010476N99682
10592c303934O893555M178607l278804m378093M35693J752620j742520k739359
10584b182235K75232J353605q33860j319178Q10209J266789k23829L73197K650942
$$ plain form
10575 2170872 4398906 3931392 2875398 2863018 1481062 -2251462 -4192773 -1458356 2457844
10566 2457844 3431311 2795693 3324666 3897208 2655810 1104750 866923 524439 -670946
10557 -670946 -403308 1968559 3024238 1023483 -806173 44277 1381106 1051008 481105
10548 481105 650070 -80875 -1638223 -1509530 -307319 -1488441 -3902068 -2423835 2145332
10539 2145332 2849089 -1258669 -2712973 1179856 3456751 326787 -2107794 449053
10531 449053 2959294 1465722 212404 1743140 923158 -4062937 -6005206 -1470373
10523 -1470373 2196421 380401 -513826 3487974 5312353 942770 -1490703 3032369
10515 3032369 6114272 1895612 -1379114 2400793 5030630 940774 -465753 6268229
$$ packed form
10575B170872K228034m67514j055994j2380j381956l732524j941311K734417L916200
10566B457844R73467o35618N28973N72542j241398j551060k37827l42484j195385
10557f70946K67638K371867J055679k000755j829656Q50450J336829l30098n69903
10548D81105J68965p30945j557348J28693J202211j181122k413627J478233M569167
10539B145332P03757m107758j454304L892829K276895l129964k434581K556847
10531D49053K510241j493572j253318J530736q19982m986095j942269M534833
10523a470373L666794j816020q94227M001800J824379m369583k433473M523072
10515C032369L081903m218660l274726L779907K629837m089856j406527O733982
$$ plain form
10507 6268229 9502094 2335236 -2011619 5048658 8796638 -1196845 -7988906 2503445
10499 2503445 12652732 5084582 -2259770 10169163 21603283 7996676 -5859631
10492 -5859631 12265836 33848605 16704602 5159706 88224575 243341463 320771194
10485 320771194 231982892 72237571 -9130295 5862121 25915063 6585625 -10852824
10478 -10852824 1982154 15351102 5834958 -5261807 693870 7265076 22283 -6423498
10470 -6423498 248875 6449752 211482 -6873461 -3399704 1481913 -1861755 -5571006
10462 -5571006 -1981680 925885 -3454397 -6172307 242901 6974173 4690674 -556517
10454 -556517 55472 2938945 1567205 -875257 440431 2025100 225126 -772629 2000328
$$ packed form
10507F268229L233865p166858m346855P060277L747980r993483o792061J0492351
10499B503445J0149287p568150p344352J2428933J1434120j3606607j3856307
10492e859631J8125467K1582769j7144003j1544896Q3064869J55116888P7429731
10485C20771194q8788302j59745321q1367866J4992416K0052942j9329438j7438449
10478a0852824J2834978J3368948r516144j1096765N955677O571206p242793o445781
10470f423498O672373O200877o238270p084943L473757M881617l343668l709251
10462e571006L589326K907565m380282k717910O415208O731272k283499n247191
10454e56517O11989K883473j371740k442462J315688J584669j799974r97755K772957
$$ plain form
10445 2000328 3295534 -40681 -1962711 1510235 4198014 1117905 -2192230 -202353
10437 -202353 2506573 514716 -2170333 -258447 2604939 927335 -2485954 -2300776
10429 -2300776 -321930 -1143758 -3606370 -4012675 -2918898 -2396823 -1566874 -249498 -1452220
10420 -1452220 -5286702 -6712674 -4155393 -3230814 -6649486 -8296666 -3756019 1125920
10412 1125920 -223033 -4093453 -3402571 370407 940847 -1683077 -2444811 -367737 1227516
10403 1227516 1243952 1081944 599114 -830786 -1678154 -1127837 -1391575 -3103025 -2552322
10394 -2552322 2015761 5847838 4388605 167704 -2066415 -2601314 -3778304 -4235790
10386 -4235790 -2067863 77872 -1065351 -3585216 -3819424 -2298766 -1352454 -425569 1250931
$$ packed form
10445B000328J295206l336215j922030L472946K687779l080109l310135J989877
10437b02353K708926j991857k685049J911886K863386j677604l413289J85178
10429b300776J978846q21828k462612m06305J093777N22075Q29949J317376j202722
10420a452220l834482j425972K557281R24579l418672j647180M540647M881939
10412A125920j348953l870420O90882L772978N70440k623924p61734K077074J595253
10403A227516J6436j62008m82830j429900q47368N50317k63738j711450N50703
10394b552322M568083L832077j459233m220901k234119n34899j176990m57486
10386d235790K167927K145735j143223k519865k34208J520658R46312R26885J676500
$$ plain form
10377 1250931 1187357 -2002998 -4643569 -3579692 -1667921 -2363417 -3249028 -962262 1725897
10368 1725897 437724 -2889276 -3449242 -1768340 -1674583 -2940876 -2723329 -1743805 -2339174
10359 -2339174 -2820687 -514510 1968556 444309 -3005196 -2977702 280798 1966705 1207410
10350 1207410 1219225 2177555 1217386 -1192706 -1964147 -1823955 -3870454 -6231555 -3834478
10341 -3834478 2204223 4648571 867653 -3569198 -3730735 -1247047 586263 1546709
10333 1546709 1945653 674252 -1750535 -2608215 -1337246 -422984 -760055 -500011 536006
10324 536006 107254 -1652820 -1730947 30004 -151188 -3425057 -5726623 -4187565 -1460043
10315 -1460043 -925695 -1834816 -2061160 -1835864 -1854209 -1189347 86102 -427603 -3260779
$$ packed form
10377A250931o3574l190355k640571J063877J911771o95496q85611K286766K688159
10368A725897j288173l327000n59966J680902R3757j266293K17547R79524n95369
10359b339174m81513K306177K483066j524247l449505K7494L258500J685907p59295
10350A207410J1815R58330r60169k410092p71441J40192k046499k361101K397077
10341c834478O038701K444348l780918m436851j61537K483688J833310R60446
10333A546709L98944j271401k424787q57680J270969R14262l37071K60044J036017
10324E36006m28752j760074p8127J760951j81192l273869k301566J539058K727522
10315a460043N34348r09121k26344K25296j8345O64862J275449n13705k833176
$$ plain form
10306 -3260779 -4734948 -1935321 2696917 4780263 3587853 1313652 -919866 -3127799
10298 -3127799 -4308060 -3392640 -1358651 49213 740952 1479833 1960103 1719031 1656376
10289 1656376 2465115 2696710 734850 -2081428 -2724408 -696234 1156747 428719 -1851474
10280 -1851474 -2786247 -1282087 800663 1150568 -155967 -1187242 -1247217 -1825638 -3758627
10271 -3758627 -5229230 -4313503 -2138815 -1257616 -1828510 -1958428 -1238746 -1123111 -1921794
10262 -1921794 -2280980 -1910130 -2071064 -2888012 -2883883 -1829469 -1338249 -1804612 -1508165 150593
10252 150593 1303756 940923 863884 2393854 3519807 1729716 -1994095 -4409155 -4199448
10243 -4199448 -2865689 -2159070 -2405427 -2941712 -2855761 -1645714 -31431 480754 -501157
$$ packed form
10306c260779j474169K799627M632238K083346j192410k274201k233518k207933
10298c127799j180261R15420K033989J407864O91739P38881M80270k41072o2655
10289A656376Q08739K31595j961860k816278o42980K028174J852981p28028k280193
10280a851474r34773J504160K082750L49905j306535j031275n9975n78421j932989
10271c758627j470603R15727K174688Q81199n70894j29918P19682J15635p98683
10262a921794l59186L70850j60934q16948M129J054414M91220m66363K96447J658758
10252A50593J153163l62833p7039J529970J125953j790091l723811k415060K09707
10243d199448J333759P06619k46357n36285Q5951J210047J614283N12185r81911
$$ plain form
10234 -501157 -1667831 -1901768 -1548351 -1093292 -88002 1501851 2396478 1908177 1355808
10225 1355808 1813690 1706895 -1049732 -5160456 -6746858 -4284776 -542241 1207355
10217 1207355 1083197 1421278 3011770 4286267 3881310 2294863 590445 -1156896 -3161633
10208 -3161633 -4643813 -4641930 -3751914 -3564219 -4264820 -4291594 -2845207 -1233240 -815382
10199 -815382 -968246 -373549 715322 1003445 335685 -121602 333039 1096331 1119166 -52770
10189 -52770 -1727603 -2184207 -277468 2568751 3404059 1688673 416382 1809984 3812030
10180 3812030 3170209 422585 -1150415 -598920 -72672 -739491 -1172931 -313606 800311
10171 800311 1151143 1246468 1566725 1525082 887085 450840 509758 314342 -224295 5663
$$ packed form
10234e01157j166674k33937L53417M55059J005290J589853Q94627m88301n52369
10225A355808M57882j06795k756627m110724j586402K462082L742535J749596
10217A207355j24158L38081J590492J274497m04957j586447j704418j747341k004737
10208c161633j482180J883Q90016J87695p00601k6774J446387J611967M17858
10199h15382j52864N94697J088871K88123o67760m57287M54641P63292K2835j171936
10189e2770j674833m56604J906739K846219Q35308j715386j272291J393602K002046
10180C812030o41821k747624j573000N51495N26248o66819m33440Q59325J113917
10171H00311L50832R5325L20257m1643o37997m36245N8918j95416n38637K29958
$$ plain form
10161 5663 1395057 2794644 3415244 3963573 5008145 5682535 4990535 3224301 1265555
10152 1265555 -506101 -2028644 -3281800 -4527387 -5737081 -5744474 -3499153 -355458 686043
10143 686043 -1397937 -4372969 -5645393 -4887055 -3285502 -1910516 -1499910 -2184003 -2698864
10134 -2698864 -1538616 467701 665571 -1485959 -3152322 -2171950 -299509 -479849 -2485610
10125 -2485610 -3542589 -2427433 -755688 -389441 -1291150 -2142339 -1975306 -929161 92509
10116 92509 431401 312474 60883 -971265 -3487201 -6292620 -6957905 -5012302 -2840246
10107 -2840246 -2477595 -3052579 -2584836 -903762 679896 1462872 1537364 781067 -690639
10098 -690639 -1631513 -841574 973791 1877524 1142782 -134452 -787739 -816929 -755992 -774383
$$ packed form
10161E663J389394J399587O20600N48329J044572O74390o92000j766234j958746
10152A265555j771656j522543j253156j245587j209694p393K245321L143695J041501
10143F86043k083980k975032j272424P58338J601553J374986M10606o84093n14861
10134b698864J160248K006317J97870k151530j666363R80372J872441j80340k005761
10125b485610j056979J115156J671745L66247r01709q51189J67033J046145J021670
10116I2509L38892j18927k51591j032148k515936k805419o65285J945603K172056
10107b840246L62651n74984M67743J681074J583658P82976P4492p56297j471706
10098f90639r40874P89939J815365R03733p34742j277234o53287k9190O0937j8391
$$ plain form
10088 -774383 -745921 -619599 -414076 -123471 238596 624718 948165 1029565 695248 -35314
10078 -35314 -1038433 -2291893 -3691433 -4736614 -4778986 -3628371 -1770294 -157258 214495
10069 214495 -836655 -2025234 -1750322 -364745 -22037 -1398911 -2184971 -459801 1976301
10060 1976301 2033706 5272 -1055560 -82911 1047366 1365478 2224336 4007779 4635908
10051 4635908 2969298 1086953 1277625 2860034 3914122 4316591 4898213 4988530 3147821
10042 3147821 -227283 -2913375 -3403122 -2342986 -1590757 -2401044 -4133283 -4590764 -2481681
10033 -2481681 435828 956546 -1671103 -4924124 -6239948 -5346651 -3213211 -839070
10025 -839070 416461 -383696 -1847578 -1410511 812612 1902252 839052 332290 2317029
$$ packed form
10088g74383K8462J26322K05523K90605L62067L86122L23447Q1400l34317p30562
10078c5314j003119j253460j399540j045181m2372J150615J858077J613036L71753
10069B14495j051150j188579K74912J385577L42708j376874p86060J725170K436102
10060A976301N7405k028434j060832R72649J130277L18112Q58858J783443O28129
10051D635908j666610j882345J90672J582409J054088M02469N81622R0317j840709
10042C147821l375104k686092m89747J060136P52229q10287j732239m57481K109083
10033b481681K917509N20718k627649l253021j315824Q93297K133440K374141
10025h39070J255531q00157j463882M37067K223123J089640j063200n06762J984739
$$ plain form
10016 2317029 4644142 4566822 2879989 1927130 1738680 992688 -41016 -341480 -371939
10007 -371939 -910960 -1245404 -929907 -1381817 -3078068 -3492232 -1126098 768255 -1383412
9998 -1383412 -5298699 -5884603 -3108058 -1460652 -2098174 -1380742 2012656 4335152 3161575
9989 3161575 1334545 1603908 1818995 -771958 -3953476 -3698702 -753746 407206 -1587948
9980 -1587948 -3290088 -1917438 698376 974439 -1575551 -3944362 -3494719 -1086714 57293
9971 57293 -1639688 -4080925 -4242120 -2261116 -1179355 -2608130 -4545506 -4266393 -1755265
9962 -1755265 910923 2356080 2724696 2513262 1919909 1077126 71982 -1048415 -1904014
9953 -1904014 -2024308 -1872675 -2745367 -4926862 -6726994 -6273435 -3790539 -1287005 -281528
$$ packed form
10016B317029K327113p7320j686833r52859j88450p45992j033704l00464l0459
10007c71939n39021l34444L15497m51910j696251m14164K366134J894353k151667
9998a383412l915287n85904K776545J647406o37522P17432L393398K322496j173577
9989C161575j827030K69363K15087k590953l181518K54774K944956J160952j995154
9980a587948j702140J372650K615814K76063k549990k368811M49643K408005J144007
9971E7293j696981k441237j61195J981004J081761j428775j937376K79113K511128
9962a755265K666188J445157L68616k11434n93353q42783j005144j120397q55599
9953a904014j20294J51633q72692k181495j800132M53559K482896K503534J005477
$$ plain form
9944 -281528 -460223 -334973 1202439 3686660 5186591 4100129 1082468 -1466847 -2124430
9935 -2124430 -1803564 -1911241 -2170682 -1340191 511339 1779121 1447902 411831 211071
9926 211071 1059290 1763978 1451995 718396 733815 1656739 2600083 3004053 3097101 2787108
9916 2787108 1245925 -1587659 -4017144 -4316049 -2986087 -2092529 -2552772 -3216391 -2637202
9907 -2637202 -790926 1093230 1771915 1103323 304415 620499 1388258 524359 -2239539
9898 -2239539 -4107803 -2808567 -43441 881511 -198483 -624244 716918 2406564 3634357
9889 3634357 4970438 5778740 4477115 2182143 2311588 5100285 6333108 3649679 337396
9880 337396 104175 1813892 2844958 3810486 5366303 4179242 -1461637 -4886199 1456852
$$ packed form
9944b81528j78695J25250J537412K484221J499931j086462l017661k549315o57583
9935b124430L20866j07677k59441Q30491J851530J267782l31219j036071k00760
9926B11071Q48219P04688l11983p33599J5419R22924R43344M03970R3048l09993
9916B787108j541183k833584k429485k98905J329962Q93558m60243o63619N79189
9907b637202J846276J884156O78685o68592p98908L16084P67759q63899k763898
9898b239539j868264J299236K765126R24952j079994m25761J341162J689646J227793
9889C634357J336081Q08302j301625k294972J29445K788697J232823k683429l312283
9880C37396k33221J709717J031066R65528J555817j187061n640879l424562O343051
$$ plain form
9871 1456852 11896836 10588423 -7668132 -27869278 -32327760 -21761431 -11240596 -9215048
9863 -9215048 -10076976 -6983320 -2266866 -1385166 -3584186 -4264346 -2757100 -2145952 -3143271
9854 -3143271 -3192590 -1343996 184416 -128347 -1013628 -1130531 -1155878 -1912535 -2552305 -2032547
9844 -2032547 -881815 -196199 -16548 226960 656100 1221654 2028065 2588821 1912067
9835 1912067 242544 -502626 813758 2753673 3187599 1922818 130889 -1714044 -3608501
9826 -3608501 -4609430 -3658340 -1502115 -57407 -65754 -902705 -2250114 -4072665 -5222990
9817 -5222990 -4266341 -1909836 -548391 -929559 -1217004 1838 1685632 2180026 1338085
9808 1338085 -202398 -2217130 -4182480 -4826808 -3730766 -2203826 -1334705 -348549 1751773
$$ packed form
9871A456852J0439984j308413j8256555k0201146m458482J0566329J0520835K025548
9863i215048q61928L093656M716454Q81700k199020o80160J507246O11148r97319
9854c143271m9319J848594J528412l12763q85281j16903k5347p56657o39770N19758
9844b032547J150732O85616J79651K43508M29140N65554Q06411N60756o76754
9835A912067j669523p45170J316384J939915M33926j264781j791929j844933j894457
9826c608501j000929R51090K156225J444708q347q36951j347409j822551j150325
9817e222990R56649K356505J361445l81168k87445J218842J683794M94394q41941
9808A338085j540483k014732j965350o44328J096042J526940Q69121R86156K100322
$$ plain form
9799 1751773 4038991 4732354 3600891 1785720 -48814 -1796967 -2755894 -2173723 -735911
9790 -735911 167300 622854 1983539 4300942 5733549 5224373 4238647 4627458 5796121
9781 5796121 5568487 3589760 2254521 3616292 6447405 7516515 5425610 1977812
9773 1977812 -321749 -772279 76379 1988665 4604180 6378890 5842894 3710865 2107928
9764 2107928 1788692 1724622 1249399 633785 -412458 -2345133 -3546533 -1472301 2723004
9755 2723004 3820666 -822904 -6801932 -7921749 -4164919 -912356 -1253552 -2980930
9747 -2980930 -3351308 -3000491 -3640770 -4658883 -4144639 -1955605 -21307 -21529 -1615672
9738 -1615672 -2753971 -1682805 870168 1973942 -11369 -2850483 -2997152 -306965
$$ packed form
9799A751773K287218O93363j131463j815171j834534j748153r58927N82171J437812
9790g35911R03211M55554J360685K317403J432607n09176r85726L88811J168663
9781E796121k27634j978727j335239J361771K831113J069110k090905l447798
9773A977812k299561m50530Q48658J912286K615515J774710n35996k132029j602937
9764B107928l19236o4070m75223o15614j046243j932675j201400K074232M195305
9755B723004J097662m643570n979028j119817L756830L252563l41196j727378
9747b980930l70378L50817o40279j018113N14244K189034J934298k22j594143
9738a615672j138299J071166K552973J103774j985311k839114j46669K690187
$$ plain form
9730 -306965 1958238 1829909 862296 1012885 1749798 1620701 728172 4076 -492821 -939059
9720 -939059 -664179 639098 1651912 1066033 -299018 -668013 21172 307078 -329761
9711 -329761 -899137 -744724 -399195 -370906 -366634 -117512 -11996 -496130 -1505357 -2730585
9701 -2730585 -3858875 -4394751 -3870858 -2546094 -1454308 -1350891 -1713903 -1139981 968734
9692 968734 3190239 3242687 867010 -1256212 -700967 1170130 791514 -2454133 -5047559
9683 -5047559 -4201895 -1516635 -11816 345285 1565476 3558830 4238667 3201824 2285652
9674 2285652 2293793 1943891 642792 -299633 -197469 -377903 -1756054 -3062722 -2999927 -2414959
9664 -2414959 -2639932 -3116309 -2510686 -1100812 -181902 96867 412558 342945 -1212635
$$ packed form
9730c06965K265203j28329r67613J50589P36913j29097q92529p24096m96897m46238
9720i39059K74880J303277J012814n85879j365051l68995O89185K85906o36839
9711c29761n69376J54413L45529K8289M272K49122J05516m84134j009227j225228
9701b730585j128290n35876N23893J324764J091786J03417l63012N73922K108715
9692I68734K221505N2448k375677k123222N55245J871097l78616l245647k593426
9683e047559Q45664K685260J504819L57101J220191J993354O79837j036843r16172
9674B285652Q141l49902j301099r42425J02164j80434j378151j306668O2795N84968
9664b414959k24973m76377O05623J409874R18910K78769L15691o9613j555580
$$ plain form
9655 -1212635 -3705942 -4895573 -3659165 -1543628 -826640 -1817943 -2724789 -1907262 128014
9646 128014 1163307 -78166 -1986892 -1746012 880098 2867086 1910410 -406354 -1029805
9637 -1029805 169846 672707 -560318 -1800471 -1683376 -1163148 -1341504 -1451297 -539264
9628 -539264 416668 -65080 -1374002 -1582266 -475867 23775 -1302198 -3222292 -3780883
9619 -3780883 -2708502 -1281428 -428557 71748 684770 1328905 1814128 2434447 3464215
9610 3464215 4299445 3892502 2221207 627759 283137 912541 1574084 2050927 2636531
9601 2636531 3065630 2770569 1966689 1328729 685909 -683036 -2376252 -2934071 -1999915
9592 -1999915 -1007108 -1045140 -1449709 -1467008 -1894569 -3602730 -5493639 -5698494 -4237562
$$ packed form
9655a212635k493307j189631J236408K115537P16988r91303r06846Q17527K035276
9646A28014J035293j241473j908726K40880K626110J986988r56676k316764o23451
9637a029805J199651N02861j233025j240153J17095N20228j78356j09793R12033
9628e39264R55932m81748j308922k08264J106399M99642j325973j920094n58591
9619c780883J072381J427074Q52871N00305O13022O44135M85223O20319J029768
9610C464215Q35230m06943j671295j593448l44622O29404O61543M76843N85604
9601B636531M29099k95061q03880o37960o42820j368945j693216n57819R34156
9592a999915R92807l8032m04569j7299m27561j708161j890909k04855J460932
$$ plain form
9583 -4237562 -2755072 -1933389 -1008987 123634 275605 -954110 -2074475 -1620437 1140
9574 1140 1500598 2488175 3219035 3466289 2931287 2202381 1951879 1482103 -462042 -3349738
9564 -3349738 -4842278 -3740803 -1713081 -1055945 -1639714 -1472132 76247 1253593 566471
9555 566471 -920270 -975135 822720 2660044 2833428 1480818 -96194 -915668 -810680
9546 -810680 -148883 526658 976309 1539531 2465585 3045767 2345979 998110 1004818 2944250
9536 2944250 4486368 3063062 -565859 -2900731 -1741270 1691856 4708608 5818567
9528 5818567 5089044 3239385 1285978 230894 181868 220626 -279042 -749661 -385068
9519 -385068 668653 1742024 2552873 2857287 1972578 -121659 -1783160 -1392067 119864
$$ packed form
9583d237562J482490Q21683R24402J132621J51971j229715j120365M54038J621577
9574A140J499458R87577P30860K47254n35002p28906k50502m69776j944145k887696
9564c349738j492540J101475K027722O57136n83769J67582J548379J177346o87122
9555E66471j486741n4865J797855J837324J73384j352610j577012q19474J04988
9546h10680O61797O75541M49651N63222R26054N80182o99788j347869O708J939432
9536B944250J542118j423306l628921k334872J159461L433126L016752J109959
9528E818567p29523j849659j953407j055084m9026L8758m99668m70619L64593
9519c85068J053721J073371Q10849L04414q84709k094237j661501L91093J511931
$$ plain form
9510 119864 180938 -1676401 -2846482 -1359737 1135396 1665096 -9249 -1581868 -1819940
9501 -1819940 -1804994 -2481642 -3066138 -2657621 -1809802 -1485609 -1637129 -1761841 -1776019 -1401700
9491 -1401700 123121 2538006 3935193 3139253 1665350 1489168 1791633 290542 -2594571
9482 -2594571 -3665143 -1473415 1651350 3094197 3080252 2843116 1910090 -558293 -3201613
9473 -3201613 -3695344 -1888667 365559 1966390 3101757 3528618 2693339 1562718 1918442
9464 1918442 3372504 3435291 1379975 -365787 -108319 157903 -2008911 -5016208 -5066270
9455 -5066270 -1918206 389701 -761749 -2948128 -2398235 690138 2744365 1745583 -668599
9446 -668599 -1880151 -1159631 465269 1650793 1475802 -3723 -1295971 -665710 1549517
$$ packed form
9510A19864O1074j857339j170081J486745K495133N29700j674345j572619k38072
9501a819940J4946o76648n84496M08517Q47819L24193j51520j24712j4178L74319
9491a401700J524821K414885J397187p95940j473903j76182L02465j501091k885113
9482b594571j070572K191728L124765J442847j3945k37136r33026k468383k643320
9473c201613m93731J806677K254226J600831J135367M26861q35279j130621L55724
9464A918442J454062O2787k055316j745762K57468K66222k166814l007297n0062
9455e066270L148064K307907j151450k186379N49893L088373K054227r98782k414182
9446f68599j211552P20520J624900J185524j74991j479525j292248O30261K215227
$$ plain form
9437 1549517 2900474 1854132 -293298 -1463053 -1446658 -1125487 -315090 1557523 3354684
9428 3354684 3166054 1271388 -82850 -112700 -438823 -2021772 -3496874 -3694682 -3659893
9419 -3659893 -4522943 -5122010 -3716561 -865934 1342907 2066758 1852320 795845 -1343114
9410 -1343114 -3486049 -3762044 -1978244 -15851 601470 308184 332835 998496 1670973
9401 1670973 1792171 1625793 2106244 3696707 5284792 5044573 2895181 1030230 1108721
9392 1108721 2073576 2037929 1168783 923208 1329418 1182880 493865 457801 1010371 714776
9382 714776 -451382 -331664 2406721 6047208 7658336 6223436 3277048 1194242 1215676
9373 1215676 2456901 2795173 1430764 144567 885897 2787478 3417435 2589892 2531496
$$ packed form
9437A549517J350957j046342k147430j169755J6395L21171Q10397J872613J797161
9428C354684j88630j894666j354238k9850l26123j582949j475102j97808L4789
9419c659893q63050n99067J405449K850627K208841P23851k14438j056475k138959
9410a343114k142935k75995J783800J962393O17321k93286K4651O65661O72477
9401A670973J21198j66378M80451J590463J588085k40219k149392j864951P8491
9392A108721R64855l5647q69146k45575M06210j46538o89015l6064N52570k95595
9382G14776j166158J19718K738385L640487J611128j434900k946388k082806K1434
9373A215676J241225L38272j364409j286197P41330J901581O29957q27543n8396
$$ plain form
9364 2531496 4025543 4950791 3621005 1308085 4899 -492345 -1575047 -3223285 -4180250
9355 -4180250 -3995256 -3394901 -2921016 -2243724 -745803 1635475 3905883 4459435 2773312
9346 2773312 399734 -893695 -1578441 -3204030 -5100097 -4821441 -2339334 -888431 -2233919
9337 -2233919 -3753072 -2340418 949083 2729487 2202200 1428650 1523902 1413510 398097
9328 398097 -420039 101905 1476987 2296490 1757754 171458 -1549569 -2807261 -3818742
9319 -3818742 -4875983 -5330398 -4368912 -2737906 -2090276 -2312695 -1450458 980113 2766123
9310 2766123 2292030 884161 260462 -185483 -1488898 -2547785 -2003508 -1062876 -1705661
9301 -1705661 -3320332 -3854118 -3255122 -3015371 -3234630 -2972477 -2673508 -3294175 -3771253
$$ packed form
9364B531496J494047R25248j329786k312920j303186m97244j082702j648238r56965
9355d180250J84994O00355M73885O77292J497921K381278K270408N53552j686123
9346B773312k373578j293429o84746j625589j896067K78656K482107J450903j345488
9337b233919j519153J412654L289501J780404n27287p73550R5252j10392j015413
9328C98097q18136N21944J375082Q19503n38736j586296j721027j257692j011481
9319c818742j057241m54415R61486J631006O47630k22419Q62237K430571J786010
9310B766123m74093j407869o23699m45945j303415j058887N44277R40632o42785
9301a705661j614671n33786N98996K39751k19259K62153K98969o20667m77078
$$ plain form
9292 -3771253 -2465074 -482944 -290192 -1571252 -2019739 -1753234 -2819594 -4372730 -3085667
9283 -3085667 722986 2271542 -390921 -2847156 -983861 2783784 3638434 1543625
9275 1543625 82908 293511 155972 -773424 -584789 978276 1410267 -718931 -3507936
9266 -3507936 -4437100 -3454574 -2310926 -2136106 -2614516 -2814261 -2207770 -1172569 -546977
9257 -546977 -462595 -77909 1024886 1853262 1262736 -342115 -1493997 -1425282 -496742 641592
9247 641592 1415881 1357554 738551 724033 1901681 3094180 2682243 746601 -1162168
9238 -1162168 -2076058 -2356233 -2619302 -2990914 -3344814 -3388662 -2672595 -1354638 -638149 -1420647
9228 -1420647 -2766865 -2883420 -1490800 -13625 557354 594261 359096 -849598 -3139433
$$ packed form
9292c771253J306179J982130J92752j281060m48487K66505j066360j553136J287063
9283c085667L808653J548556k662463k456235J863295L767645Q54650k094809
9275A543625j460717K10603j37539r29396J88635J563065M31991k129198k789005
9266c507936r29164R82526J143648J74820m78410j99745O06491J035201O25592
9257e46977Q4382L84686J102795Q28376n90526j604851j151882O8715R28540J138334
9247F41592P74289n8327o19003j4518J177648J192499m11937j935642j908769
9238a162168r13890k80175k63069l71612l53900m3848P16067J317957P16489p82498
9228a420647j346218j16555J392620J477175N70979L6907k35165j208694k289835
$$ plain form
9219 -3139433 -4756322 -3790197 -820930 1407890 1153262 -476777 -1301352 -783759 23854
9210 23854 668003 1806687 3267643 3384443 1528845 -119265 704881 2730724 2702847
9201 2702847 318676 -1198378 -66523 1405981 667529 -1164882 -1571097 -860323 -1269983
9192 -1269983 -2886487 -3397475 -1697936 788821 2527470 3394609 3497814 2543729 967585
9183 967585 -5699 -26670 34794 -272330 -503245 -759422 -1884807 -3702589 -4801483 -4796542
9173 -4796542 -5017331 -5955935 -5869980 -3467240 -499330 267590 -1143896 -2043311 -708843
9164 -708843 1721357 3010578 2150772 -222556 -2608968 -3469386 -2061870 1015898 4194714
9155 4194714 5833897 4936223 1830539 -1419156 -2305712 -596371 1016666 214833 -1739063
$$ packed form
9219c139433j616889R66125K969267K228820k54628j630039q24575N17593Q07613
9210B3854O44149J138684J460956J16800j855598j648110Q24146K025843k7877
9201B702847k384171j517054J131855J472504p38452j832411m06215P10774m09660
9192a269983j616504n10988J699539K486757J738649Q67139J03205r54085j576144
9183I67585r73284k0971O1464l07124k30915k56177j125385j817782j098894M941
9173d796542k20789r38604Q5955K402740K967910P66920j411486q99415J334468
9164g08843K430200J289221q59806k373328k386412q60418J407516L077768L178816
9155D194714J639183q97674l105684l249695q86556J709341J613037q01833j953896
$$ plain form
9146 -1739063 -1793105 333020 1624324 191104 -2093155 -2664878 -2081040 -2709974 -4675244
9137 -4675244 -5466963 -3564510 -452785 1492083 1601571 696028 -453641 -1445209 -1811778
9128 -1811778 -1251144 12084 1562965 2991569 3461165 2066857 -625342 -2379347 -1778939
9119 -1778939 -173867 188731 -659281 -757250 601367 2003729 2415182 2508816 2779770
9110 2779770 2245542 264008 -1905250 -2838196 -2985103 -3364588 -3401220 -2119260 -707524
9101 -707524 -1421148 -3923777 -5141280 -3458521 -972130 -358601 -1171860 -931408 1061474
9092 1061474 2792102 2297736 28368 -1846972 -1732875 81363 2017753 2903307 3048415
9083 3048415 3456618 4111951 3821854 2087454 255064 -41576 952811 1501631 668681
$$ packed form
9146a739063n4042K126125J291304j433220k284259n71723N83838o28934j965270
9137d675244p91719J902453L111725J944868J09488r05543j149669r91568l66569
9128a811778N60634J263228J550881J428604M69596j394308k692199j754005O00408
9119a778939J605072L62598q48012r7969J358617J402362M11453R3634K70954
9110B779770n34228j981534k169258r32946j46907l79485l6632J281960J411736
9101g07524p13624k502629j217503J682759K486391O13529q13259K40452J992882
9092A061474J730628m94366k269368j875340J14097J814238J936390Q85554J45108
9083C048415M08203O55333k90097j734400j832390k96640R94387N48820q32950
$$ plain form
9074 668681 -807328 -1893896 -2446166 -2723216 -2658407 -2139664 -1369704 -453438 802868
9065 802868 2193383 2847867 2362871 1664513 1841103 2443290 1997106 169050 -1655165
9056 -1655165 -2168512 -1495923 -398011 729186 1337926 398528 -2057032 -3789239 -2482966
9047 -2482966 1008370 3198578 2148676 -439654 -2058149 -2696321 -3780327 -4967197
9039 -4967197 -4261890 -1332906 1412533 1952968 1263874 1439637 2302079 1738820 -836629
9030 -836629 -3297327 -3682887 -2731801 -2425745 -3125437 -3634536 -3428128 -3011722 -2200116 -91196
9020 -91196 2614275 3250090 609830 -2675403 -3077887 -704862 1128825 534086 -928280
9011 -928280 -1160444 -345549 151746 61908 -10421 -77337 -621953 -1419577 -1651341 -1049637
$$ packed form
9074F68681j476009j086568n52270k77050O4809N18743P69960R16266J256306
9065H02868J390515O54484m84996o98358J76590O02187m46184j828056j824215
9056a655165n13347O72589J097912J127197O08740r39398k455560j732207J306273
9047b482966L491336K190208j049902k588330j618495o38172j084006j186870
9039d967197P05307K928984K745439N40435o89094J75763Q62442n63259k575449
9030h36629k460698l85560R51086L06056o99692n09099K06408M16406Q11606K108920
9020i1196K705471O35815k640260l285233m02484K373025J833687n94739j462366
9011i28280k32164Q14895M97295q9838p2329o6916n44616p97624k31764O01704
$$ plain form
9001 -1049637 -182639 256468 -15396 -736207 -1157574 -698487 218774 685640 861547 1877063
8991 1877063 3663162 4329494 2869471 1138828 1394198 2801851 2536044 7969 -2251258
8982 -2251258 -2199936 -689568 482806 1062602 1622326 1731479 493875 -1558429 -2481041
8973 -2481041 -1012317 1950138 4074865 3670157 1287638 -659211 -298920 1614100 2574176
8964 2574176 1283423 -1106819 -2841327 -3467977 -3297295 -2184941 -111836 1736158 1977710
8955 1977710 1048619 894926 2377204 4053111 4054993 2354264 499243 -317686 -179698
8946 -179698 192673 121442 -911730 -2853050 -4411524 -3695506 -400773 3083224 3842826
8937 3842826 1715463 -664340 -1292729 -971596 -1312920 -1918743 -1173105 806105 1963934
$$ packed form
9001a049637Q66998M39107k71864p20811m21367M59087R17261M66866J75907J015516
8991A877063J786099O66332j460023j730643K55370J407653k65807k528075k259227
8982b251258N1322J510368J172374N79796N59724J09153j237604k052304r22612
8973b481041J468724K962455K124727m04708k382519j946849L60291J913020R60076
8964B574176j290753k390242j734508o26650J70682J112354K073105J847994K41552
8955A977710r29091j53693J482278J675907J882j700729j855021q16929J37988
8946a79698L72371p1231j033172j941320j558474P16018L294733L483997P59602
8937C842826k127363k379803o28389L21133l41324o05823P45638J979210J157829
$$ plain form
8928 1963934 1220236 -152601 -624484 -262960 437170 2008441 4703859 6786199 6130631
8919 6130631 3294065 1125387 1102917 1793936 1534902 905371 1276811 2199246 2028479
8910 2028479 680696 -45590 845090 1990258 1520021 -436057 -1885461 -1208507 1243856
8901 1243856 3496788 3681378 1868939 273012 902237 2908266 3425429 1508759 -290735
8892 -290735 502206 2579009 2719426 482927 -1501596 -1823778 -2123802 -3807555 -5386626
8883 -5386626 -4705762 -2141226 130596 905236 479004 -569739 -1634244 -1974394 -1690800
8874 -1690800 -1845569 -2372384 -1329157 1931439 4443840 3229104 144815 -252866 2527043
8865 2527043 3993528 1345221 -2510705 -3426409 -1476650 553783 1767490 3107459
$$ packed form
8928A963934p43698j372837m71883L61524P00130J571271K695418K082340o55568
8919F130631k836566k168678k2470O91019k59034o29531L71440R22435j70767
8910B028479j347783p26286Q90680J145168m70237j956078j449404O76954K452363
8901A243856K252932J84590j812439j595927O29225K006029N17163j916670j799494
8892b90735P92941K076803J40417k236499j984523l22182l00024j683753j579071
8883e386626O80864K564536K271822P74640m26232j048743j064505l40150K83594
8874a690800j54769n26815J043227L260596K512401j214736l084289l97681K779909
8865B527043J466485k648307l855926r15704J949759K030433J213707J339969
$$ plain form
8857 3107459 4099726 3013587 111982 -2077140 -2187674 -1519111 -1530278 -1778867 -1241250
8848 -1241250 -75234 1048088 2140990 3175797 3045603 693307 -2978948 -5546946
8840 -5546946 -5544904 -3719339 -1778276 -740376 -717846 -1409738 -2169745 -2150068 -1113849 145765
8830 145765 763443 881119 1152250 1530672 1410232 740521 30057 -591520 -1193702 -1143121
8820 -1143121 77703 1170322 186487 -2085747 -2274910 755339 3622211 2990896 264118
8811 264118 -994924 -468652 -433520 -886983 548497 3874056 5900788 5035323 3292390
8802 3292390 2373944 1266744 -611102 -1310461 294679 2015309 1840786 1358810 2819675
8793 2819675 5037973 5399938 4168341 3468857 3368448 2383028 933001 864885 2074812
$$ packed form
8857C107459R92267j086139k901605k189122j10534O68563j1167k48589N37617
8848a241250J166016J123322J092902J034807j30194k352296l672255k567998
8840e546946K042J825565J941063J037900K2530o91892p60007J9677J036219J259614
8830A45765O17678J17676K71131L78422j20440o69711p10464o21577o02182N0581
8820a143121J220824J092619r83835k272234j89163L030249K866872o31315k726778
8811B64118j259042N26272L5132m53463J435480L325559K026732q65465j742933
8802C292390r18446j107200j877846o99359J605140J720630j74523m81976J460865
8793B819675K218298L61965j231597o99484j00409r85420j450027o8116J209927
$$ plain form
8784 2074812 2835132 2994448 3553967 3566653 1314802 -1378505 -298261 4617083 7952735
8775 7952735 6024284 1860799 341198 1336551 1147923 -1075254 -2191380 -70927 3401272
8766 3401272 5048162 4054064 1947352 272958 -556724 -580080 387447 2186314 3552637
8757 3552637 3085120 1403790 1096089 3291355 5387441 4143300 370544 -1969233 -1308966
8748 -1308966 -255711 -1070732 -2310355 -1724800 -102019 155065 -1263974 -2645741 -3023469
8739 -3023469 -2741685 -2029320 -1043567 -732146 -1699696 -2727080 -2342196 -1340910 -1600159
8730 -1600159 -2705913 -2182882 693779 3626285 4460720 3554392 2134441 330250 -1776833
8721 -1776833 -2781638 -1474719 1072532 2578112 2354695 1715712 1823470 2481066 3128350
$$ packed form
8784B074812P60320J59316N59519J2686k251851k693307J080244M915344L335652
8775G952735j928451m163485j519601R95353j88628k223177j116126K120453L472199
8766C401272J646890r94098k106712j674394q29682k3356R67527J798867J366323
8757C552637m67517j681330l07701K195266K096086j244141l772756k339777O60267
8748a308966J053255q15021j239623N85555J622781K57084j419039j381767l77728
8739c023469K81784P12365R85753L11421r67550j027384L84884J001286k59249
8730a600159j105754N23031K876661K932506Q34435r06328j419951j804191k107083
8721a776833j004805J306919K547251J505580k23417o38983J07758O57596O47284
$$ plain form
8712 3128350 3686664 3836612 2540073 -604639 -3919128 -4773210 -2516633 525569 1587215
8703 1587215 417475 -1033508 -1343041 -865646 -439179 -275303 -458005 -1112504 -1411082
8694 -1411082 84536 2939116 4157122 1756226 -2011388 -3194232 -1352771 253532
8686 253532 -276004 -1039786 21953 1620231 1286946 -674909 -1856723 -1491502 -1017560
8677 -1017560 -1043587 -279261 1777620 3250496 2464380 694441 523832 2160357 3294411
8668 3294411 2558291 1209278 736743 530900 -664767 -2121708 -1852126 273584 1950715
8659 1950715 1406419 -499844 -1836081 -2048714 -1914750 -1973458 -2119552 -2233323 -2228588 -1785927
8649 -1785927 -761162 533644 1976091 3756887 5132032 4267831 812855 -2361028
$$ packed form
8712C128350N58314J49948j296539l144712l314489q54082K256577L042202J061646
8703A587215j169740j450983l09533M77395M26467J63876j82702o54499k98578
8694a411082J495618K854580J218006k400896l767614j182844J841461J606303
8686B53532n29536p63782J061739J598278l33285j961855j181814L65221M73942
8677a017560k6027P64326K056881J472876p86116j769939j70609J636525J134054
8668C294411p36120j349013m72535k05843j195667j456941K69582K125710J677131
8659A950715n44296j906263j336237k12633J33964n8708j46094j13771M735M42661
8649a785927J024765J294806J442447J780796J375145q64201l454976l173883
$$ plain form
8641 -2361028 -2049013 1039721 3076792 2129699 94381 -724977 -444985 -2717 814275
8632 814275 2011536 2115387 479452 -691883 796013 3255407 3000393 -142468 -2163383
8623 -2163383 -356882 3075814 4215916 2325544 -21302 -457960 1115922 3287531
8615 3287531 4500180 3918472 2008268 230010 -434954 -394078 -463688 -633506 -557151 -595178
8605 -595178 -1221518 -1753625 -1023165 598865 1186803 -120772 -1513476 -540578 2672303
8596 2672303 5298612 5082656 2950485 1738689 2661685 3955889 3371214 1156075 -487939
8587 -487939 -560440 -344157 -918019 -1199150 210859 2363981 3039697 2030650 1288429
8578 1288429 1659901 1665007 361492 -633506 447738 2626916 3631503 3226616 2946981
$$ packed form
8641b361028L12015L088734K037071r47093k035318q19358K79992M42268Q16992
8632H14275J197261J03851j635935j171335J487896K459394k55014l142861k020915
8623b163383J806501L432696J140102j890372k346846m36658J573882K171609
8615C287531J212649n81708j910204j778258o64964M0876o9610j69818P6355l8027
8605e95178o26340n32107P30460J622030N87938j307575j392704R72898L212881
8596B672303K626309k15956k132171j211796R22996J294204n84675k215139j644014
8587d87939p2501K16283n73862k81131J410009K153122O75716j009047p42221
8578A288429L71472N106j303515r94998J081244K179178J004587m04887k79635
$$ plain form
8569 2946981 3066882 2249144 344370 -850237 -483990 -296179 -2024771 -4641890 -5716619
8560 -5716619 -4582734 -2675411 -1406932 -1182129 -2034225 -3634327 -4735124 -4093632 -2249982
8551 -2249982 -1230846 -2093008 -3685464 -4233787 -3346939 -2037990 -1420557 -1785043 -2458673
8542 -2458673 -2340314 -1085353 192176 171323 -630786 -189351 2113918 4055965 3153949
8533 3153949 -18163 -2387841 -2040447 -95092 1202629 1146732 794205 1243933 2371347
8524 2371347 3040162 2168880 -230103 -2781387 -3756399 -2765711 -1344297 -1394390 -2963465
8515 -2963465 -4018943 -2743517 275892 2644515 2778275 1260067 -477559 -1918527
8507 -1918527 -3293260 -4381493 -4608344 -4186648 -4078632 -4604932 -4977857 -4524624 -3548275
$$ packed form
8569B946981J19901q17738j904774j194607L66247J87811j728592k617119j074729
8560e716619J133885J907323J268479K24803q52096j600102j100797O41492J843650
8551b249982J019136q62162j592456n48323Q86848J308949O17433l64486o73630
8542b458673J18359J254961J277529k0853q02109M41435K303269J942047r02016
8533C153949l172112k369678L47394J945355J297721n5897l52527M49728J127414
8524B371347O68815q71282k398983k551284r75012R90688J421414n0093j569075
8515b963465j055478J275426L019409K368623J33760j518208j737626j440968
8507a918527j374733j088233k26851M21696J08016n26300l72925M53233R76349
$$ plain form
8498 -3548275 -2590901 -1697686 -974529 -1035300 -2041353 -2864615 -2140980 79615 2412050
8489 2412050 3570532 3131610 1350529 -923393 -2452162 -2629215 -2180078 -2151357 -2505829
8480 -2505829 -2549133 -2363742 -2664594 -3332874 -3282152 -1950808 22566 1671938 2308999
8471 2308999 1387569 -939132 -3025796 -2925872 -766421 1356531 2185594 2498944 3006183
8462 3006183 2840323 1225518 -882093 -2123098 -2460317 -2392034 -1829801 -1085584 -1360209
8453 -1360209 -2477436 -1827712 1980848 5823095 5475499 1559032 -1279420 -889414 326190
8444 326190 310272 331259 1466781 1785587 -251283 -2329909 -1453821 1188024 1833055
8435 1833055 -275150 -2028175 -976739 1934951 4331279 4938646 3892325 2296461
$$ packed form
8498c548275R57374Q93215P23157o0771j006053q23262P23635K220595K332435
8489B412050J158482m38922j781081k273922j528769j77053M49137K8721l54472
8480b505829m3304J85391l00852o68280N0722J331344J973374J649372O37061
8471B308999r21430k326701k086664R9924K159451K122952Q29063L13350N07239
8462C006183j65860j614805k107611j241005l37219O8283N62233P44217k74625
8453a360209j117227O49724L808560L842247l47596l916467k838452L90006J215604
8444C26190j5918K0987J135522L18806k036870k078626Q76088K641845O45031
8435A833055k108205j753025J051436K911690K396328O07367j046321j595864
$$ plain form
8427 2296461 1678160 2389050 2665901 862825 -1737969 -2371378 -896117 -90615 -1485869
8418 -1485869 -3286225 -3310034 -1841005 -322022 953194 2359804 3516427 3771734 3164216
8409 3164216 1887530 -72540 -1826763 -1559334 995731 3299069 2842316 359303 -1274982
8400 -1274982 -511932 1938920 4661487 6292739 5593495 2752948 97987 -434025 -7979
8391 -7979 -973593 -2840723 -2964668 -1217165 -648994 -2420049 -3306192 -501795 3602378
8382 3602378 4479169 1873866 -167512 645402 2005945 1019973 -1628195 -3189648 -2812167
8373 -2812167 -1983731 -1759925 -1477105 -357951 1059464 1750998 1657495 1570188 1876872 2047054
8363 2047054 1407715 68691 -1084514 -1212613 -272837 1002370 1845050 2137638 2283192
$$ packed form
8427B296461o18301P10890K76851j803076k600794o33409J475261Q05502j395254
8418a485869j800356k3809J469029J518983J275216J406610J156623K55307o07518
8409C164216j276686j960070j754223K67429K555065K303338m56753k483013j634285
8400a274982P63050K450852K722567J631252o99244k840547k654961n32012M26046
8391g979r65614j867130j23945J747503N68171j771055q86143K804397M104173
8382C602378Q76791k605303k041378Q12914J360543r85972k648168j561453L77481
8373b812167Q28436K23806K82820J119154J417415O91534r3503q7307L06684J70182
8363B047054o39339j339024j153205j28099R39776J275207Q42680K92588J45554
$$ plain form
8354 2283192 2459419 2313984 1582652 705252 413797 813650 1294427 1335670 975714 450629
8344 450629 -176939 -930144 -1884722 -3257756 -4960161 -5992288 -5119841 -2584780 -385206
8335 -385206 -185443 -1510503 -2673928 -2872170 -2488647 -1909299 -1252830 -1049316 -1884269
8326 -1884269 -3210830 -3671445 -2950922 -2252395 -2390403 -2390160 -874161 1736835 3417840
8317 3417840 2887195 1026460 -257981 -153125 435740 246684 -801378 -1738213 -1913087
8308 -1913087 -1571492 -1024269 -83039 1236689 2241815 2505879 2614688 3106940 3299454
8299 3299454 2236931 328306 -1113996 -1549511 -1238662 -168077 1482693 2247085 712540
8290 712540 -2069418 -3514279 -2982726 -2176130 -1832116 -709904 1254969 1717758 -334571
$$ packed form
8354B283192J76227j45435p31332q77400k91455L99853M80777M1243l59956n25085
8344D50629o27568p53205r54578j373034j702405j032127Q72447K535061K199574
8335c85206J99763j325060j163425j98242L83523N79348O56469K03514q34953
8326a884269j326561m60615P20523O98527j38008K43J515999K610996J681005
8317C417840n30645j860735j284441J04856N88865j89056j048062r36835j74874
8308a913087L41595N47223R41230J319728J005126K64064J08809M92252J92514
8299C299454j062523j908625j442302m35515L10849J070585J650770P64392j534545
8290G12540k781958j444861N31553Q06596L44014J122212J964873M62789k052329
$$ plain form
8281 -334571 -2170562 -1064291 1597525 2686128 2078986 1875268 2116526 942157 -1339104
8272 -1339104 -2024348 -402171 910166 58307 -1488828 -1829254 -1503691 -1746728 -2021211
8263 -2021211 -1344815 -501111 -837781 -1922113 -2327348 -1975398 -1845227 -1907552 -1266156 -241032
8253 -241032 -496154 -2629799 -4937663 -5331036 -3859543 -2639402 -3303215 -4894376 -4781131
8244 -4781131 -1956538 1174488 1348076 -1440089 -3851883 -3550073 -1939832 -1617213 -2635722
8235 -2635722 -2890546 -1247147 1377479 3501033 4127382 2766744 -22487 -2313154 -2483319
8226 -2483319 -1145904 -204097 -334899 -856546 -1633488 -3111085 -4484547 -4078903 -2077134
8217 -2077134 -691932 -756207 -400330 1473966 2671516 923645 -2068971 -2701100 -746951
$$ packed form
8281c34571j835991J106271K661816J088603o07142k03718K41258j174369k281261
8272a339104o85244J622177J312337q51859j547135l40426L25563k43037k74483
8263b021211O76396Q43704l36670j084332m05235L51950J30171o2325O41396J025124
8253b41032k55122k133645k307864l93373J471493J220141o63813j591161J13245
8244d781131K824593L131026J73588k788165k411794L01810J610241L22619j018509
8235b635722k54824J643399K624626K123554O26349j360638k789231k290667j70165
8226b483319J337415R41807j30802n21647p76942j477597j373462M05644K001769
8217b077134J385202o4275L55877J874296J197550j747871k992616o32129J954149
$$ plain form
8208 -746951 525058 -448521 -1375481 -210193 1394403 783368 -1412118 -2166430 -448216
8199 -448216 1591034 1741794 110751 -1920609 -3421323 -3950421 -3233911 -1729148 -665118
8190 -665118 -713402 -1226592 -1399172 -1464218 -1990148 -2657743 -2683210 -2033775 -1266242 -430740
8180 -430740 851290 2249298 2637043 1429650 -602482 -2097698 -2309896 -1521077 -623751
8171 -623751 -261729 -128285 577848 1662936 1575864 -609644 -3405812 -4324142 -2839517
8162 -2839517 -647911 910033 2112795 3290904 3678118 2677238 1039812 -118099
8154 -118099 -536336 -386487 240664 666491 -237773 -2137810 -2743360 -719893 1923658
8145 1923658 2085471 -454424 -3064654 -3807588 -3087764 -1931379 -599393 724801 1524853
$$ packed form
8208g46951J272009r73579r26960J165288J604596o11035k195486p54312J718214
8199d48216K039250J50760j631043k031360j500714n29098P16510J504763J064030
8190f65118m8284n13190j72580o5046n25930o67595k5467O49435P67533Q35502
8180d30740J282030J398008L87745j207393k032132j495216k12198P88819Q97326
8171f23751L62022J33444P06133J085088q7072k185508k796168r18330J484625
8162b839517K191606J557944J202762J178109L87214j000880j637426j157911
8154a18099m18237J49849O27151M25827r04264j900037o05550K023467K643551
8145A923658J61813k539895k610230p42934P19824J156385J331986J324194Q00052
$$ plain form
8136 1524853 1809772 2133619 2383505 1833637 756732 508967 1380124 1819261 757374
8127 757374 -585429 -474805 682674 885841 -682471 -2707373 -3516667 -2820093 -1579855
8118 -1579855 -854397 -921445 -1137250 -650623 490062 1191770 700249 -161996 135349 1635579
8108 1635579 2272680 58640 -4230226 -7222062 -6308497 -2571434 396627 665893 -26835
8099 -26835 998193 3756351 6026315 6652950 6577249 6604954 6130301 4783685 3633214
8090 3633214 3535501 3541128 2345966 478500 -441326 -154612 -15953 -874127 -1972743 -2215151
8080 -2215151 -1631368 -1237042 -1885474 -3365120 -4368355 -3582220 -1202719 972379 1457833
8071 1457833 711878 312393 1023818 2471164 4224993 6063870 7289040 6947559 5018533
$$ packed form
8136A524853K84919L23847K49886n49868j076905k47765Q71157M39137j061887
8127G57374j342803J10624J157479K03167j568312k024902q09294O96574J240238
8118a579855P25458o7048k15805M86627J140685P01708m91521q62245K97345J500230
8108A635579O37101k214040m288866k991836R13565L737063K968061K69266o92728
8099b6835J025028K758158K269964O26635p5701K7705m74653j346616j150471
8090C633214r7713N627j195162j867466r19826K86714J38659q58174j098616k42408
8080b215151N83783L94326o48432j479646j003235P86135K379501K175098M85454
8071A457833p45955l99485P11425J447346J753829J838877J225170l41481j929026
$$ plain form
8062 5018533 2618601 874398 219914 678341 1835733 2420122 1063829 -1923746 -4361637
8053 -4361637 -4461005 -2755061 -1183188 -745869 -790336 -365734 502598 1068122 926346 460121
8043 460121 246133 251343 -113297 -1105047 -2161800 -2571800 -2325933 -1873020 -1258527 -82225
8033 -82225 1730724 3642915 5004336 5399884 4623614 2961927 1512493 1438721 2591947
8024 2591947 3472616 2952913 1601690 914486 1529874 2539094 2428618 632127 -1659457
8015 -1659457 -2406124 -925462 1017598 1160119 -284311 -790605 988730 3272211 3652828
8006 3652828 2360240 1509080 1829848 2025462 1284169 480056 325215 105025 -678600
7997 -678600 -921611 253377 1353115 151293 -2985197 -5443351 -6019838 -6039421 -6344491
$$ packed form
8062E018533k399932j744203o54484M58427J157392N84389j356293k987575k437891
8053d361637r9368J705944J571873M37319m4467M24602Q68332N65524j41776m66225
8043D60121k13988N210l64640r91750j056753m10000K45867M52913O14493J176302
8033h2225J812949J912191J361421L95548p76270j661687j449434p3772J153226
8024B591947Q80669n19703j351223o87204O15388J009220j10476j796491k291584
8015a659457p46667J480662J943060J42521j444430n06294J779335K283481L80617
8006C652828j292588q51160L20768J95614p41293q04113j54841k20190p83625
7997f78600k43011J174988J099738j201822l136490k458154n76487j9583l05070
$$ plain form
7988 -6344491 -5650592 -3372616 -1835406 -3174873 -5459224 -4898892 -1376998 1401036 1460171
7979 1460171 880249 1450448 1372596 -1302844 -4506968 -4596276 -1631523 871975 872875 -370139
7969 -370139 -1214129 -1593140 -1688114 -1027919 376828 1771317 2907964 3882332 3720861
7960 3720861 1311062 -1996113 -3110468 -1187688 1358434 2446177 2405308 1682411 -488933
7951 -488933 -3525080 -4587410 -2595073 -616273 -1573222 -3824383 -4075185 -2649410 -2243265
7942 -2243265 -2918459 -2373114 -494593 429588 -37881 -8727 571324 -713605 -4193368
7933 -4193368 -6668354 -6066121 -4191344 -3111210 -2116042 -455477 118588 -1557705 -3061079
7924 -3061079 -1773358 687305 854706 -1211348 -2518933 -2237759 -2506184 -4276895 -5843762
$$ packed form
7988f344491O93899K277976J537210j339467k284351N60332L521894K778034N9135
7979A460171n79922N70199p7852k675440l204124q9308K964753K503498R00j243014
7969c70139q43990l79011r4974O60195J404747J394489J136647R74368j61471
7960C720861k409799l307175j114355J922780K546122J087743m0869p22897k171344
7951d88933l036147j062330J992337J978800r56949k251161k50802J425775M06145
7942b243265o75194N45345J878521R24181m67469K9154N80051j284929l479763
7933d193368k474986O02233J874777J080134R95168J660565N74065j676293j503374
7924c061079J287721K460663J67401k066054j307585K81174k68425j770711j566867
$$ plain form
7915 -5843762 -5989690 -5501085 -4762720 -2769594 227947 1712386 255200 -2103980 -2646754
7906 -2646754 -1598999 -1115820 -1855667 -2563244 -2399684 -1807557 -1296961 -1004221 -1420310
7897 -1420310 -3017893 -4895491 -5171670 -3319154 -1082634 -375194 -1022925 -1371457 -567862
7888 -567862 693591 1470001 1617214 1328504 447745 -1175293 -3033652 -4231500 -4280924
7879 -4280924 -3279739 -1557398 329283 1452059 1152225 22209 -419310 518456 1677259
7870 1677259 1314832 -711508 -2459952 -1790664 1334648 4607913 5614428 4216848 2264409
7861 2264409 970971 -424540 -2777177 -4937342 -5010243 -3213390 -1756921 -1826057 -2330766
7852 -2330766 -1999685 -1131817 -693139 -1108493 -2518043 -4727818 -6314781 -5542697 -3028205
$$ packed form
7915e843762j45928M88605P38365J993126K997541J484439j457186k359180n42774
7906b646754J047755M83179p39847p07577J63560N92127N10596K92740m16089
7897a420310j597583j877598k76179J852516K236520P07440o47731l48532Q03595
7888e67862J261453P76410J47213k88710q80759j623038j858359j197848m9424
7879d280924J001185J722341J886681J122776k99834j130016m41519R37766J158803
7870A677259l62427k026340j748444O69288L125312L273265J006515j397580j952439
7861B264409j293438j395511k352637k160165p2901J796853J456469o9136n04709
7852b330766L31081Q67868M38678m15354j409550k209775j586963P72084K514492
$$ plain form
7843 -3028205 -1599407 -2369542 -3046638 -1745004 -245203 -1080422 -3219353 -3566139 -1568789
7834 -1568789 638167 1853699 2542413 2542688 1253923 -108732 275082 1297271 31971
7825 31971 -3135510 -4057211 -639771 4160895 6623452 6489080 5269134 3437123 1539309
7816 1539309 1365156 3334827 4790760 3472766 924854 -56326 324956 -162568 -1926241
7807 -1926241 -3370471 -3558260 -2629255 -598670 1895283 2809838 1234262 -419917 444417
7798 444417 2370880 1964380 -524590 -1399615 709201 2929777 2732403 1170539 383098
7789 383098 656804 1333311 2220423 2617269 1042552 -2397156 -4966141 -4243748 -1077396
$$ packed form
7843c028205J428798p70135o77096J301634J499801q35219k138931l46786J997350
7834a568789K206956J215532O88714K75j288765j362655L83814J022189j265300
7825C1971l167481r21701L417440M800666K462557j34372j219946j832011j897814
7816A539309j74153J969671J455933j317994k547912r81180L81282m87524j763673
7807a926241j444230j87789R29005K030585K493953R14555j575576j654179Q64334
7798D44417J926463m06500k488970q75025K108816K220576j97374j561864p87441
7789C83098K73706O76507Q87112L96846j574717l439708k568985P22393L166352
$$ [...]
##END NTUPLES=NMR SPECTRUM
##END=
