##TITLE=31Pdec_3PEPPA0607-2
 D2O, 24 sc
 7.07.2021
##JCAMPDX= 6.0         $$ Bruker NMR JCAMP-DX V2.0
##DATA TYPE= NMR SPECTRUM
##DATA CLASS= NTUPLES
##ORIGIN= UXNMR, Bruker Analytische Messtechnik GmbH
##OWNER= root
$$ XWIN-NMR		Version 3.5
$$ Wed Jul  7 10:18:28 2021 Russian Standard Time (UT+4h)  she@DPX200
##.OBSERVE FREQUENCY= 81.013821
##.OBSERVE NUCLEUS= ^31P
##.ACQUISITION MODE= SIMULTANEOUS
##.ACQUISITION SCHEME= undefined
##.AVERAGES= 24
##.DIGITISER RES= 16
##SPECTROMETER/DATA SYSTEM= spect
##.PULSE SEQUENCE= zgpg30
##.SOLVENT NAME= CD3CN
##.SHIFT REFERENCE= (INTERNAL, CD3CN, 0, 248.564)
##AUDIT TRAIL= $$ (NUMBER, WHEN, WHO, WHERE, WHAT)
$$ ##TITLE= Audit trail, XWIN-NMR		Version 3.5
$$ ##JCAMPDX= 5.01
$$ ##ORIGIN= Bruker BioSpin GmbH
$$ ##OWNER= she
$$ F:/spectra/data/she/nmr/P31/1/pdata/1/auditp.txt
$$ ##AUDIT TRAIL=  $$ (NUMBER, WHEN, WHO, WHERE, WHAT)
(   1,<2021-07-07 10:17:11.53 +0400>,<she>,<DPX200>,
      <created by zg, POWCHK disabled, PULCHK disabled
       configuration hash MD5:
       00 E9 B6 7A A2 85 ED C7 34 08 36 98 17 FE 4E 26
       data hash MD5: 32K
       46 D6 80 39 45 DC E2 5D D5 BE 03 BE 70 31 71 31>)
(   2,<2021-07-07 10:17:18.18 +0400>,<she>,<DPX200>,
      <Start of raw data processing
       efp BC_mod = 2 LB = 1 FT_mod = 6 PKNL = 1 PHC0 = -7377.99 PHC1 = 24.88586 SI = 64K 
       data hash MD5: 64K
       D8 D4 3E 7B 3D 2E AE C7 7A EA 78 3B 47 F2 8C 23>)
(   3,<2021-07-07 10:17:46.28 +0400>,<she>,<DPX200>,
      <pk PHC0 = 125.9934 PHC1 = -283 
       data hash MD5: 64K
       1D D1 20 E9 B5 56 38 24 D6 50 2A 46 2A AB 96 02>)
(   4,<2021-07-07 10:17:50.12 +0400>,<she>,<DPX200>,
      <abs ABSG = 5 
       data hash MD5: 64K
       03 EF BA B3 99 A9 D9 5F 7E 82 8A 62 20 74 58 6C>)
$$ ##END=
$$ 
$$ hash MD5
$$ 04 42 56 D5 50 24 C9 BE F4 28 28 F1 D2 2C DB 54
##$RELAX= 
##$RELAX= 
##$RELAX= 
##$RELAX= 
##$RELAX= 
##$RELAX= 
##$RELAX= 
##$RELAX= 
$$ Bruker specific parameters
$$ --------------------------
##$DU= <F:/spectra>
##$EXPNO= 1
##$NAME= <P31>
##$PROCNO= 1
##$TYPE= <nmr>
##$USER= <she>
##$AMP= (0..31)
100 100 100 100 100 100 100 100 100 100 100 100 100 100 100 100 100 100 
100 100 100 100 100 100 100 100 100 100 100 100 100 100 
##$AQSEQ= 0
##$AQ_mod= 1
##$AUNM= <au_zg>
##$AUTOPOS= <>
##$BF1= 81.014009
##$BF2= 200.13
##$BF3= 200.13
##$BF4= 200.13
##$BF5= 200.13
##$BF6= 200.13
##$BF7= 200.13
##$BF8= 200.13
##$BYTORDA= 1
##$CFDGTYP= 0
##$CFRGTYP= 5
##$CHEMSTR= <none>
##$CNST= (0..31)
1 1 145 1 1 1 1 1 1 1 1 1 1 1 1 1 1 1 1 1 1 1 1 1 1 1 1 1 1 1 1 1 
##$CPDPRG= <waltz16>
##$CPDPRG1= <>
##$CPDPRG2= <waltz16>
##$CPDPRG3= <>
##$CPDPRG4= <mlev>
##$CPDPRG5= <mlev>
##$CPDPRG6= <mlev>
##$CPDPRG7= <mlev>
##$CPDPRG8= <mlev>
##$CPDPRGB= <>
##$CPDPRGT= <>
##$D= (0..31)
0 1 0 0 0 0 0 0 0 0 0 0.03 2e-05 3e-06 0 0 0 0 0 0 0 0 0 0 0 0 0 0 0 0 
0 0 
##$DATE= 1625638630
##$DBL= (0..7)
120 120 120 11 120 120 24 19 
##$DBP= (0..7)
150 150 150 150 150 150 150 150 
##$DBP07= 0
##$DBPNAM0= <>
##$DBPNAM1= <>
##$DBPNAM2= <>
$$ [...]
##$SUBNAM3= <"">
##$SUBNAM4= <"">
##$SUBNAM5= <"">
##$SUBNAM6= <"">
##$SUBNAM7= <"">
##$SUBNAM8= <"">
##$SUBNAM9= <"">
##$SW= 501.771253377433
##$SWIBOX= (0..15)
0 1 3 0 0 0 0 0 0 0 0 0 0 0 0 0 
##$SW_h= 40650.406504065
##$TD= 32768
##$TD0= 1
##$TE= 0
##$TE2= 300
##$TE3= 300
##$TEG= 300
##$TL= (0..7)
0 120 53 12 22 120 120 120 
##$TP= (0..7)
150 150 150 150 150 150 150 150 
##$TP07= 0
##$TPNAME0= <>
##$TPNAME1= <>
##$TPNAME2= <>
##$TPNAME3= <>
##$TPNAME4= <>
##$TPNAME5= <>
##$TPNAME6= <>
##$TPNAME7= <>
##$TPOAL= (0..7)
0.5 0.5 0.5 0.5 0.5 0.5 0.5 0.5 
##$TPOFFS= (0..7)
0 0 0 0 0 0 0 0 
##$TUNHIN= 0
##$TUNHOUT= 0
##$TUNXOUT= 0
##$USERA1= <user>
##$USERA2= <user>
##$USERA3= <user>
##$USERA4= <user>
##$USERA5= <user>
##$V9= 5
##$VALIST= <valist>
##$VCLIST= <CCCCCCCCCCCCCCC>
##$VD= 0
##$VDLIST= <DDDDDDDDDDDDDDD>
##$VPLIST= <PPPPPPPPPPPPPPP>
##$VTLIST= <TTTTTTTTTTTTTTT>
##$WBST= 1024
##$WBSW= 4
##$XGAIN= (0..3)
0 0 0 0 
##$XL= 0
##$YL= 0
##$YMAX_a= 1823
##$YMIN_a= -2241
##$ZGOPTNS= <>
##$ZL1= 120
##$ZL2= 120
##$ZL3= 120
##$ZL4= 120
##$ABSF1= 248.5645
##$ABSF2= -253.2056
##$ABSG= 5
##$ABSL= 3
##$ALPHA= 0
##$AQORDER= 0
##$ASSFAC= 0
##$ASSFACI= 0
##$ASSFACX= 0
##$ASSWID= 0
##$AUNMP= <proc_1d>
##$AZFE= 0.1
##$AZFW= 0.5
##$BCFW= 0
##$BC_mod= 2
##$BYTORDP= 0
##$COROFFS= 0
##$CY= -3
##$DATMOD= 1
##$DC= 0
##$DFILT= <>
##$DTYPP= 0
##$F1P= 0
##$F2P= 0
##$FCOR= 1
##$FTSIZE= 65536
##$FT_mod= 6
##$GAMMA= 0
##$GB= 0
##$INTBC= 1
##$INTSCL= 5.30512e-09
##$ISEN= 30
##$LB= 1
##$LEV0= 0
##$LPBIN= 0
##$MAXI= 10000
##$MC2= 0
##$MEAN= 0
##$ME_mod= 0
##$MI= 50
##$NCOEF= 0
##$NC_proc= -7
##$NLEV= 6
##$NOISF1= 182.463
##$NOISF2= 159.3651
##$NSP= 0
##$NTH_PI= 0
##$NZP= 0
##$OFFSET= 248.5645
##$PC= 4
##$PHC0= -7251.997
##$PHC1= -258.1141
##$PH_mod= 1
##$PKNL= yes
##$PPARMOD= 0
##$PSCAL= 0
##$PSIGN= 0
##$REVERSE= no
##$SF= 81.014009
##$SI= 65536
##$SIGF1= 159.3651
##$SIGF2= -187.1042
##$SINO= 113.3802
##$SIOLD= 16384
##$SREGLST= <1H.CDCl3>
##$SSB= 0
##$STSI= 65536
##$STSR= 0
##$SW_p= 40650.406504065
##$SYMM= 0
##$S_DEV= 0
##$TDeff= 32768
##$TDoff= 0
##$TI= <>
##$TILT= no
##$TM1= 0
##$TM2= 0
##$TOPLEV= 0
##$USERP1= <user>
##$USERP2= <user>
##$USERP3= <user>
##$USERP4= <user>
##$USERP5= <user>
##$WDW= 1
##$XDIM= 65536
##$YMAX_p= 321291699
##$YMIN_p= -61338106
$$ End of Bruker specific parameters
$$ ---------------------------------
##NTUPLES= NMR SPECTRUM
##VAR_NAME=  FREQUENCY,     SPECTRUM/REAL,   SPECTRUM/IMAG
##SYMBOL=    X,             R,               I
##VAR_TYPE=  INDEPENDENT,   DEPENDENT,       DEPENDENT
##VAR_FORM=  AFFN,          ASDF,            ASDF
##VAR_DIM=   65536,         65536,           65536
##UNITS=     HZ,            ARBITRARY UNITS, ARBITRARY UNITS
##FACTOR=    0.620285442955139, 1,           1
##FIRST=     20137.2065510759, 0,            0
##LAST=      -20513.1999529892, 0,           0
##MIN=       -20513.1999529892, -61338106,   0
##MAX=       20137.2065510759, 321291699,    0
$$ Real data points
##PAGE= N=1
##DATA TABLE= (X++(R..R)), XYDATA
$$ [...]
$$ plain form
13146 -3381873 -1249318 126878 243744 711112 1731382 967924 -2203306 -4162092 -1727486
13137 -1727486 2630120 3799665 1178343 -995882 -307217 811854 -197835 -1809402
13129 -1809402 -1156984 1378270 2910001 2097627 122422 -1690644 -3045324 -3652693 -3071860
13120 -3071860 -1971177 -1898853 -3024702 -3407646 -1623029 806170 1107735 -940757 -2661923
13111 -2661923 -2332185 -1562963 -2525031 -4342747 -4499047 -3061432 -2676236 -4101664 -4731055
13102 -4731055 -2888265 -907363 -1686522 -4123771 -4673371 -2291074 825698 2687584
13094 2687584 3023349 1766990 -1082369 -3822653 -3890711 -1119957 1839274 2971957 2884603
13085 2884603 2802315 2652044 2095516 1698061 1956789 2512775 3142682 4112844 4801285 3612059
$$ packed form
13146c381873K132555J376196J16866M67368J020270p63458l171230j958786K434606
13137a727486M357606J169545k621322k174225O88665J119071j009689j611567
13129a809402O52418K535254J531731q12374j975205j813066j354680o07369N80833
13120c071860J100683P2324j125849l82944J784617K429199L01565k048492j721166
13111b661923L29738P69222r62068j817716j56300J437615L85196j425428o29391
13102d731055J842790J980902p79159k437249n49600K382297L116772J861886
13094B687584L35765j256359k849359k740284o8058K770754K959231J132683q7354
13085B884603q2288j50271n56528l97455K58728N55986O29907R70162O88441j189226
$$ plain form
13075 3612059 339930 -2851710 -4021073 -3720965 -3459100 -3204717 -2038133 -402188 70557
13066 70557 -1162894 -2734237 -2977086 -1655383 12668 715278 372592 -29411 -97636
13057 -97636 -837606 -2903176 -4782773 -4398845 -2247245 -970584 -1656557 -2690237 -2798433
13048 -2798433 -2904831 -3826834 -4311511 -3095386 -1295928 -832412 -1508006 -1457617 84184
13039 84184 1924375 2535421 1625601 384087 475109 2093682 3122307 1620219 -994206
13030 -994206 -1441566 514009 1520697 -62603 -1577969 -643880 939778 659668 -255982
13021 -255982 556691 1879362 1032632 -844262 -292916 2285321 2721408 -217288 -2701962
13012 -2701962 -1740573 703800 1424866 600696 376936 1183746 1871399 2016421 2038061
$$ packed form
13075C612059l272129l191640j169363L00108K61865K54383J166584J635945M72745
13066G0557j233451j571343k42849J321703J668051P02610l42686m02003o8225
13057i7636p39970k065570j879597L83928K151600J276661o85973j033680j08196
13048b798433j06398r22003m84677J216125J799458M63516o75594N0389J541801
13039H4184J840191O11046r09820j241514R1022J618573J028625j502088k614425
13030i94206m47360J955575J006688j583300j515366R34089J583658k80110r15650
13021b55982Q12673J322671q46730j876894N51346K578237M36087k938696k484674
13012b701962R61389K444373P21066q24170k23760Q06810O87653J45022K1640
$$ plain form
13003 2038061 1984982 1763777 1797024 2291080 2590307 2113614 1131700 12783 -1261806
12994 -1261806 -2203502 -1651508 566302 2724738 2891161 998594 -1306218 -2365078 -1799565
12985 -1799565 -688041 -499504 -1265727 -1226617 727102 2917344 2751123 237065 -2266121
12976 -2266121 -3433449 -3812986 -3453194 -1508226 1259902 2399644 1265624 84801
12968 84801 371760 862176 433958 329194 1441964 1969888 358078 -1543631 -1171441
12959 -1171441 587594 1052943 330180 821166 2691270 3253395 1204324 -1387915 -2015872
12950 -2015872 -391152 2382922 5106735 6222430 4354946 297215 -3023175 -3665218
12942 -3665218 -2699602 -2295759 -2849818 -2978907 -1677948 398571 1589725 852982 -1008400
$$ packed form
13003B038061n3079k21205L3247M94056K99227m76693r81914j118917j274589
12994a261806r41696N51994K217810K158436J66423j892567k304812j058860N65513
12985a799565J111524J88537p66223L9110J953719K190242j66221k514058k503186
12976b266121j167328l79537L59792J944968K768128J139742j134020j180823
12968H4801K86959M90416m28218j04764J112770N27924j611810j901709L72190
12959a171441J759035M65349p22763M90986J870104N62125k049071k592239o27957
12950b015872J624720K774074K723813J115695j867484m057731l320390o42043
12942c665218R65616M03843n54059j29089J300959K076519J191154p36743j861382
$$ plain form
12933 -1008400 -1883512 -696303 1113076 1410121 358051 163655 1756813 3380568 3183748
12924 3183748 1762046 951335 1112515 1081296 432160 308362 1596562 3219881 3114072
12915 3114072 838064 -1482525 -1422073 676578 1776882 -200888 -3572638 -4801741
12907 -4801741 -2890810 -517018 -514100 -2518095 -3969941 -3519590 -2131203 -1099118 -432981
12898 -432981 233269 266685 -1135479 -3042625 -3213794 -1012658 1312326 1433413 176095
12889 176095 264765 2159705 3250372 1732233 -795127 -1943214 -2025772 -2926262 -4524583
12880 -4524583 -4665290 -2609847 -331562 257652 -261533 -48255 1477882 3331898 4504645
12871 4504645 4867429 4703772 3973822 2314517 -137041 -2057529 -1820660 375134 2050293
$$ packed form
12933a008400q75112J187209J809379K97045j052070j94396J593158J623755j96820
12924C183748j421702q10711J61180l1219o49136j23798J288200J623319j05809
12915C114072k276008k320589O0452K098651J100304j977770l371750j229103
12907d801741J910931K373792K918k003995j451846M50351J388387J032085O66137
12898d32981O66250L3416j402164j907146j71169K201136K324984J21087j257318
12889A76095Q8670J894940J090667j518139k527360j148087q2558r00490j598321
12880d524583j40707K055443K278285N89214n19185K13278J526137J854016J172747
12871D504645L62784j63657p29950j659305k451558j920488K36869K195794J675159
$$ plain form
12862 2050293 1285533 -472821 -53062 2978361 5329575 4221814 1023922 -686161
12854 -686161 393410 2402719 3423768 3609757 3842839 3820016 2631736 593820 -702468
12845 -702468 -229653 1414877 3020106 4086041 4638923 4388535 2999985 1023939 -357749
12836 -357749 -628708 -268699 224971 767332 1040256 510532 -519547 -964329 -594880
12827 -594880 -484628 -1112827 -1315622 -220434 1028053 1000738 473503 1373952 3765545
12818 3765545 5658695 5586932 3788759 1163598 -1202333 -1795009 -83852 1745457 707338
12809 707338 -2811211 -4965487 -3431738 -385801 834636 190663 185662 1855125 3604832
12800 3604832 3702482 2201801 245653 -1282307 -1995205 -1669491 -277906 1697718 3293361
$$ packed form
12862B050293p64760j758354M19759L031423K351214j107761l197892j710083
12854f86161J079571K009309J021049J85989K33082k2823j188280k037916j296288
12845g02468M72815J644530J605229J065935N52882k50388j388550j976046j381688
12836c57749k70959L60009M93670N42361K72924n29724j030079m44782L69449
12827e94880J10252o28199k02795J095188J248487k7315n27235R00449K391593
12818C765545J893150p1763j798173k625161k365931n92676J711157J829309j038119
12809G07338l518549k154276J533749L045937J220437o43973n001J669463J749707
12800C604832R7650j500681j956148j527960p12898L25714J391585J975624J595643
$$ plain form
12791 3293361 3778102 3440677 3126277 2700198 939394 -2164125 -4165212 -2974652 -91580
12782 -91580 1259310 803033 1204808 3198981 4047395 2141055 -40100 207824 1647980
12773 1647980 1679279 1029987 2380230 5301152 6194075 3474970 -147797 -1362259 -47810
12764 -47810 1481087 1430235 -66441 -1423219 -1039489 956373 2483055 1968781 614580
12755 614580 820131 2722058 4067023 3529792 2273792 1748713 1630469 799804 -806762
12746 -806762 -2148652 -2207125 -805737 1024704 1495002 -195702 -2560794 -3292367 -1987177
12737 -1987177 -323268 288995 -178897 -1488908 -3572932 -5504132 -5782888 -4349398 -2828595
12728 -2828595 -2096692 -1169921 606604 1933170 1565198 707480 1604606 4229490 6015561
$$ packed form
12791C293361M84741l37425l14400m26079j760804l103519k001087J190560K883072
12782i1580J350890m56277M01775J994173Q48414j906340k181155K47924J440156
12773A647980L1299o49292J350243K920922Q92923k719105l622767j214462J314449
12764d7810J528897n0852j496676j356778L83730J995862J526682n14274j354201
12755F14580K05551J901927J344965n37231j256000n25079j18244q30665j606566
12746h06762j341890n8473J401388J830441M70298j690704k365092p31573J305190
12737a987177J663909O12263m67892j310011k084024j931200k78756J433490J520803
12728b828595P31903R26771J776525J326566l67972q57718Q97126K624884J786071
$$ plain form
12719 6015561 5036568 2333829 645031 1380256 3363753 4549918 4497469 4437667 4913659
12710 4913659 4628607 2541106 -51864 -1065206 -449476 357912 1110341 2545934 3825889
12701 3825889 2998768 444573 -966956 -111345 741526 -128513 -1094171 -382296 445482
12692 445482 -976192 -3487307 -3643392 -554710 3127118 4784956 4299158 3119435 2592699
12683 2592699 3032737 3237259 1588009 -1275827 -2243217 172102 3133499 3198722 1215768
12674 1215768 532459 1519312 1555276 40943 -633974 308049 437236 -1382891 -2433223
12665 -2433223 -347359 2865189 3619677 1624624 -654674 -1953553 -2903573 -3508554 -2579686
12656 -2579686 81887 2747752 3517001 2126642 -54597 -1227243 -616482 702648
$$ packed form
12719F015561r78993k702739j688798P35225J983497J186165n2449n9802M75992
12710D913659k85052k087501k592970j013342O15730Q07388P52429J435593J279955
12701C825889q27121k554195j411529Q55611Q52871q70039r65658P11875Q27778
12692D45482j421674k511115j56085L088682L681828J657838m85798j179723n26736
12683B592699M40038K04522j649250k863836r67390K415319K961397O5223j982954
12674A215768o83309R86853L5964j514333o74917R42023J29187j820127j050332
12665b433223K085864L212548P54488j995053k279298j298879r50020o04981R28868
12656b579686K661573K665865P69249j390359k181239j172646O10761J319130
$$ plain form
12648 702648 837282 -631874 -2104576 -2210205 -1550642 -1298639 -1170157 -216657 1105791
12639 1105791 1342680 305018 -653861 -767289 -808050 -1434808 -1882290 -1243043 -213358
12630 -213358 -310278 -1558937 -2292442 -1738957 -1565542 -3495452 -6080118 -5929201 -2498630
12621 -2498630 606749 475867 -1019993 -261166 2581939 4151805 3293753 2252412 2267484
12612 2267484 1732736 -9193 -614074 1301023 3103482 1884277 -958776 -1938683 -693901
12603 -693901 158181 -650522 -1952639 -2822655 -3421450 -3438623 -2436927 -1619383 -2571365
12594 -2571365 -4276198 -4118552 -1943122 -188667 354113 1669938 4420849 5983047
12586 5983047 4413601 1660500 527547 590926 -275452 -1878734 -2079690 -527784 597589
$$ packed form
12648G02648J34634j469156j472702j05629O59563K52003J28482R53500J322448
12639A105791K36889j037662r58879j13428m0761o26758m47482O39247J029685
12630b13358r6920j248659p33505N53485J73415j929910k584666J50917L430571
12621b498630L105379j30882j495860P58827K843105J569866q58052j041341J5072
12612B267484n34748j741929o04881J915097J802459j219205k843053r79907J244782
12603f93901Q52082q08703j302117q70016n98795j7173J001696Q17544r51982
12594b571365j704833J57646K175430J754455N42780J315825K750911J562198
12586E983047j569446k753101j132953O3379q66378j603282k00956J551906J125373
$$ plain form
12577 597589 -291325 -2236195 -3252209 -2537848 -943930 -83123 -894190 -2401363 -2321967
12568 -2321967 240733 3242127 3891749 1957727 -293010 -1112539 -916965 -981299 -1762391
12559 -1762391 -2784218 -3295511 -2839900 -1827638 -1471039 -2415419 -3641861 -3667625 -2649631
12550 -2649631 -2135615 -2733612 -3347694 -3037586 -2333764 -2083394 -2134035 -2000046 -1876798 -1975594
12540 -1975594 -1589116 -12071 1983765 2767769 1888980 514690 -201619 -252341 -135744
12531 -135744 -61384 -202738 -892112 -1948690 -2472064 -2026648 -1493703 -1846023 -2422956 -1558877
12521 -1558877 982214 3314199 3676013 2472211 1291770 604285 -386415 -1793834 -2340152
12512 -2340152 -1215574 300527 176326 -1659187 -3020323 -2144199 250729 2187161
$$ packed form
12577E97589q88914j944870j016014P14361J593918Q60807q11067j507173P9396
12568b321967K562700L001394O49622j934022k250737q19529J95574o4334p81092
12559a762391j021827n11293M55611J012262L56599r44380j226442k5764J017994
12550b649631N14016n97997o14082L10108P03822K50370n0641J33989J23248r8796
12540a975594L86478J577045J995836P84004q78789j374290p16309n0722J16597
12531a35744P4360j41354o89374j056578n23374M45416N32945l52320n76933Q64079
12521a558877K541091K331985L61814j203802j180441o87485r90700j407419n46318
12512b340152J124578J516101j24201j835513j361136Q76124K394928J936432
$$ plain form
12504 2187161 2870174 2798097 2017725 70026 -2050135 -1951233 722342 2564671 405946
12495 405946 -3813207 -4927202 -1371795 2736987 3248129 917571 -1004757 -1578176 -1903728
12486 -1903728 -1851721 -344330 1743828 2114163 573595 -703374 -753689 -923364 -1671604
12477 -1671604 -1076798 1934426 5056917 5212929 2306787 -1241648 -3561397 -4414620 -4218774
12468 -4218774 -3534348 -2952306 -2411062 -1301830 16974 37691 -1543151 -2737953 -1971167
12459 -1971167 -444615 -25056 -181109 659035 1803897 1187660 -880058 -1831954 -915454
12450 -915454 -232424 -954347 -1341797 6366 1442992 985197 -49887 1231252 4653056
12441 4653056 6598739 4597255 423819 -2175451 -1707437 69025 821620 273758 -106758
$$ packed form
12504B187161O83013p2077p80372j947699k120161R8902K673575J842329k158725
12495D05946m219153j113995L555407M108782N11142k330558j922328n73419l25552
12486a903728N2007J507391K088158L70335j540568j276969n0315j69675p48240
12477a671604N94806L011224L122491J56012k906142l548435k319749q53223J95846
12468d218774O84426N82042N41244J109232J318804K0717j580842j194802P66786
12459a971167J526552M19559j56053Q40144J144862o16237k067718r51896R16500
12450i15454O83030p21923l87450J348163J436626m57795j035084J281139L421804
12441D653056J945683k001484m173436k599270M68014J776462P52595n47862l80516
$$ plain form
12432 -106758 636836 1890500 2698020 2990579 2846816 1487021 -1499396 -4304365 -4166116
12423 -4166116 -935458 2265658 2810565 1571604 1005618 1534505 1573202 551345 -38675
12414 -38675 1004668 2489694 1931544 -1518724 -5642279 -6876052 -3841683 853478 3052643
12405 3052643 1493678 -1161780 -2167704 -2075850 -2957525 -4567076 -4552740 -2191895 395328
12396 395328 1242550 814648 499784 538072 547860 675193 908517 402123 -1106240 -2161218
12386 -2161218 -1398695 296638 1104095 1081595 1697857 2854298 2623706 322225 -2231022
12377 -2231022 -3285441 -3170785 -2852478 -2342895 -1792423 -2292264 -3809695 -3961518 -1137445
12368 -1137445 2384378 3153210 1659530 1649162 4324135 6508755 5515344 2773500 963876
$$ packed form
12432a06758P43594J253664Q07520K92559j43763j359795k986417k804969J38249
12423d166116L230658L201116N44907j238961n65986N28887L8697j021857n90020
12414c8675J043343J485026n58150l450268m123555j233773L034369M695161K199165
12405C052643j558965k655458j005924R1854q81675j609551J4336K360845K587223
12396C95328Q47222m27902l14864L8288R788J27333K33324n06394j508363j054978
12386b161218P62523J695333Q07457k2500O16262J156441k30592k301481k553247
12377b231022j054419J14656L18307N09583N50472m99841j517431j51823K824073
12368a137445L521823P68832j493680j0368K674973K184620r93411k741844j809624
$$ plain form
12359 963876 237999 -446407 -482474 999711 2374242 1309416 -1308969 -2298928 -969348
12350 -969348 -10529 -1086383 -2386019 -1786452 -68340 744337 528290 636022 1393814
12341 1393814 1874302 1694928 1482530 1599712 1533570 690038 -821745 -2222797 -2637502
12332 -2637502 -1910245 -946743 -681448 -708167 70054 1287491 1059251 -1256009 -3744529
12323 -3744529 -4512174 -4155004 -4161490 -4195795 -3056858 -1451851 -1306869 -2443409 -2397437 -54789
12313 -54789 2651808 3497379 2594315 1267020 -63541 -1580844 -2915253 -3648803 -4099227
12304 -4099227 -4458305 -4082318 -2866507 -2314907 -3609335 -5338398 -5096662 -3105040 -2124934
12295 -2124934 -3363263 -4512430 -3049877 32148 1505482 218575 -1665172 -1846916
$$ packed form
12359I63876p25877o84406l6067J482185J374531j064826k618385r89959J329580
12350i69348R58819j075854j299636N99567J718112Q12677k16047J07732P57792
12341A393814M80488j79374k12398J17182o6142q43532j511783j401052m14705
12332b637502P27257R63502K65295k6719P78221J217437k28240k315260k488520
12323c744529p67645L57170o486l4305J138937J605007J44982j136540M5972K342648
12313e4789K706597Q45571r03064j327295j330561j517303j334409p33550m50424
12304d099227l59078L75987J215811N51600j294428j729063K41736J991622R80106
12295b124934j238329j149167J462553L082025J473334j286907j883747j81744
$$ plain form
12287 -1846916 -747267 -357699 -1219467 -1833895 -1004739 369166 460414 -1092756 -2744411
12278 -2744411 -2891683 -1478659 375363 1731232 2468243 2982408 3625264 4232288 4081338
12269 4081338 2731320 1000624 360483 952372 1141678 -84284 -1209179 -196427 2104630
12260 2104630 2604344 346882 -1856758 -1344868 607158 803246 -1204853 -2852689 -2710314
12251 -2710314 -2365981 -3421055 -4785771 -4541109 -3043195 -2204613 -2380132 -2081459 -879686
12242 -879686 -590070 -2665700 -5824185 -7531218 -7028807 -5598763 -4338686 -3204675 -2285465
12233 -2285465 -2413999 -3705537 -4625482 -3728002 -1786956 -932286 -1759584 -2539203 -1624262
12224 -1624262 463188 2040435 2479417 2406139 2216713 1652032 877278 816590 1937601
$$ packed form
12287a846916J099649L89568q61768o14428Q29156J373905R1248j553170j651655
12278b744411j47272J413024J854022J355869P37011N14165O42856O07024j50950
12269D081338j350018j730696o40141N91889J89306j225962j124895J012752K301057
12260B104630M99714k257462k203640N11890J952026J96088k008099j647836J42375
12251b710314L44333j055074j364716K44662J497914Q38582j75519K98673J201773
12242h79686K89616k075630l158485j707033N02411J430044J260077J134011R19210
12233b285465j28534j291538r19945Q97480J941046Q54670q27298p79619R14941
12224a624262K087450J577247M38982p3278j89426n64681p74754o0688J121011
$$ plain form
12215 1937601 3536166 4792473 5785688 6670569 6493257 4063691 -30871 -3465216 -4644525
12206 -4644525 -4215633 -3546665 -2647164 -713016 1787951 3077407 2382068 1033872 559644
12197 559644 672227 219703 -559273 -189676 1646592 3260065 3033902 1347037 -270819
12188 -270819 -1089131 -1419995 -1517797 -1267865 -734193 -109411 760383 1976279 2879931 2728368
12178 2728368 2024869 2017135 2652366 2295142 95297 -2513174 -3612448 -3173730 -2496415
12169 -2496415 -2027463 -1190615 -77340 238563 -714952 -2159996 -3309045 -4057251 -4029420
12160 -4029420 -2316159 869431 3351990 3160984 1007796 -696900 -996410 -1142769 -2146768
12151 -2146768 -3112117 -2759517 -1513257 -973109 -1783378 -2989458 -3351405 -2511957 -896280
$$ packed form
12215A937601J598565J256307R93215Q84881j77312k429566m094562l434345j179309
12206d644525M28892O68968Q99501J934148K500967J289456o95339j348196m74228
12197E59644J12583m52524p78976L69597J836268J613473k26163j686865j617856
12188b70819q18312l30864r7802K49932N33672O24782Q69794J215896R03652j51563
12178B728368p03499p734O35231l57224k199845k608471j099274M38718O77315
12169b496415M68952Q36848J113275L15903r53515j445044j149049p48206K7831
12160d029420J713261L185590K482559j91006k153188j704696k99510j46359j003999
12151b146768r65349L52600J246260N40148q10269j206080l61947Q39448J615677
$$ plain form
12142 -896280 822193 1986904 2218521 1673277 822982 -32674 -773084 -1115353 -754487
12133 -754487 129932 961163 1411824 1532569 1267241 465040 -503565 -840138 -347002 251854
12123 251854 390803 424047 792366 1051576 498478 -567863 -979692 -82087 1456563
12114 1456563 2208106 1296215 -499505 -1027206 974086 3767927 4123934 1561872 -512006
12105 -512006 756678 3631920 4211882 1729146 -1107321 -2384295 -2639966 -2298517 -708215
12096 -708215 1406273 1598014 -656323 -2576263 -2122780 -960339 -1260087 -1977591 -1130181
12087 -1130181 207150 -401116 -2274428 -2488460 -803149 -75490 -1418306 -2400178 -1133793
12078 -1133793 827100 1216949 260101 -626749 -1366356 -2438706 -2951242 -1635503 814870
$$ packed form
12142h96280J718473J164711K31617n45244q50295q55656p40410l42269L60866
12133g54487Q84419Q31231M50661J20745k65328q02201r68605l36573M93136N98856
12123B51854J38949L3244L68319K59210n53098j066341m11829Q97605J538650
12114A456563P51543r11891j795720n27701K001292K793841L56007k562062k073878
12105e12006J268684K875242N79962k482736k836467j276974k55671L41449J590302
12096g08215K114488J91741k254337j919940M53483J162441k99748p17504Q47410
12087a130181J337331o08266j873312k14032J685311P27659j342816r81872J266385
12078a133793J960893L89849r56848q86850p39607j072350n12536J315739K450373
$$ plain form
12069 814870 2176333 1365707 -538020 -1887022 -2109556 -1661214 -1025565 -136876 1208420
12060 1208420 2498515 2585497 1104439 -674750 -1235836 -661488 -113425 63535 396654
12051 396654 806101 694354 379861 653551 891551 -326689 -2387992 -2710709 -481971
12042 -481971 1838014 1945289 652602 20505 372923 825568 1201136 1665514 1782822
12033 1782822 1566321 2128842 3683729 4438601 3312303 2038772 2240681 2106946 -932418
12024 -932418 -5321053 -6696910 -3932759 -538387 355261 -663648 -1715694 -2423209 -2895480
12015 -2895480 -2386257 -752885 431682 -107850 -1402452 -1672015 -727097 254168 543477
12006 543477 425014 555075 1481496 3179308 4628252 4697638 3819108 3689600 4815507
$$ packed form
12069H14870J361463q10626j903727j349002k22534M48342O35649Q88689J345296
12060A208420J290095Q6982j481058j779189n61086N74348N48063J76960L33119
12051C96654M09447j11747l14493K73690K38000j218240k061303l22717K228738
12042d81971K319985J07275j292687o32097L52418M52645L75568M64378J17308
12033A782822k16501N62521J554887P54872j126298j273531K01909j33735l039364
12024i32418m388635j375857K764151L394372Q93648j018909j052046p07515m72271
12015b895480N09223J633372J184567n39532j294602k69563R44918R81265K89309
12006E43477j18463J30061R26421J697812J448944O9386q78530j29508J125907
$$ plain form
11997 4815507 5587498 4564544 2532770 1323334 1480237 2086780 2249748 1886075 1482817
11988 1482817 1626672 2298343 2452857 1174474 -589005 -730454 1126476 2902404 3009566
11979 3009566 2501829 3091560 4402817 4780585 3868044 2719344 1949887 1310577 676571
11970 676571 49241 -1050478 -2836831 -4305913 -4450624 -4030229 -4479889 -5294460 -4475822
11961 -4475822 -1876889 -59187 -834139 -2651141 -2969488 -2075124 -2499058 -4835117 -6244355
11952 -6244355 -4118017 145548 2663482 1913326 241918 205514 1303171 1627387 1141556
11943 1141556 1117187 1197921 -206119 -2533816 -2986638 -812952 968949 -222629 -2896291
11934 -2896291 -4165522 -4051024 -4422763 -5116173 -4264784 -1925864 -290367 -181612 -67199
$$ packed form
11997D815507P71991j022954k031774j209436J56903O06543J62968l63673m03258
11988A482817J43855O71671J54514j278383j763479j41449J856930J775928J07162
11979C009566n07737N89731J311257L77768r12541j148700p69457o39310o34006
11970F76571o27330j099719j786353j469082j44711M20395m49660q14571Q18638
11961d475822K598933J817702p74952j817002l18347Q94364m23934k336059j409238
11952f244355K126338M263565K517934p50156j671408l6404J097657L24216m85831
11943A141556k4369Q0734j404040k327697m52822K173686J781901j191578k673662
11934b896291j269231J14498l71739o93410Q51389K338920J635497J08755J14413
$$ plain form
11925 -67199 1061589 2318163 2978452 3560398 4131801 3770124 2564759 2026119 2577456
11916 2577456 2821398 2375943 3064163 5707575 7998706 7623351 5588180 4155419 3207796
11907 3207796 1385927 -515900 -452191 1202195 2034131 1537278 1533404 2296918 1551350
11898 1551350 -1421202 -3604515 -2199388 1374930 3635115 3613978 2940571 2462592 1443175
11889 1443175 -118941 -843914 -181733 569524 237970 -574414 -651122 27967 475313
11880 475313 34687 -1128406 -2299958 -2450128 -904850 1486459 2521459 995370 -1487731
11871 -1487731 -2158886 -456808 1376410 1268113 -281237 -1365670 -1200245 -405817 612499
11862 612499 2181889 4165124 5445908 5223057 4123243 3341519 3047268 2323355 603902
$$ packed form
11925f7199J128788J256574O60289N81946N71403l61677j205365n38640N51337
11916B577456K43942m45455O88220K643412K291131l75355k035171j432761r47623
11907C207796j821869j901827O3709J654386Q31936m96853l874P63514p45568
11898A551350k972552k183313J405127L574318K260185k1137o73407m77979j019417
11889A443175j562116p24973O62181P51257l31554q12384p6708O79089M47346
11880D75313m40626j163093j171552j50170J545278K391309J035000j526089k483101
11871a487731o71155J702078J833218j08297j549350j084433J65425P94428J018316
11862F12499J569390J983235J280784k22851j099814p81724k94251p23913j719453
$$ plain form
11853 603902 -1410315 -2465867 -2128732 -1244502 -1001609 -1545748 -1692595 -301076 2147619
11844 2147619 3832773 3573728 1956309 206755 -1304363 -2707281 -3423127 -2551252 -446417
11835 -446417 1288105 1787749 1930574 2768610 3854449 4055951 3439161 3170833 3648923
11826 3648923 3842813 2830863 1159141 72107 -125899 -225915 -718241 -937378 -15717
11817 -15717 1631534 2467306 1724842 550165 570444 1645561 2059157 1013463 -298615
11808 -298615 -695049 -803740 -1635193 -2349226 -1274450 1141300 2376668 1184115 -941138
11799 -941138 -2386304 -3662896 -5592004 -6791293 -5211456 -1694430 259989 -1228800
11791 -1228800 -4032864 -4760085 -2727667 -124265 1092231 1161664 1344486 1892829 2025570
$$ packed form
11853F03902k014217j055552L37135Q84230K42893n44139j46847J391519K448695
11844B147619J685154k59045j617419j749554j511118j402918p15846Q71875K104835
11835d46417J734522M99644J42825Q38036J085839K01502o16790k68328M78090
11826C648923J93890j011950j671722j087034j98006j00016m92326k19137R21661
11817a5717J647251Q35772p42464j174677K0279J075117M13596j045694j312078
11808b98615l96434j08691q31453p14033J074776K415750J235368j192553k125253
11799i41138j445166j276592j929108j199289J579837L517026J954419j488789
11791a228800k804064p27221K032418K603402J216496O9433J82822N48343J32741
$$ plain form
11782 2025570 1614256 1854699 3656650 5958717 6702331 5450888 3897783 3411285 3307964
11773 3307964 2433576 1332663 1416675 2601438 3383838 3112200 2604729 2350254 1676530
11764 1676530 318988 -516163 384633 2535507 4385878 5128740 5156245 5141301 5338616
11755 5338616 5555431 5329825 4337218 2936902 2042463 2142917 2667244 2547987 1304890
11746 1304890 -409098 -1174848 -25460 2272503 3582899 2749976 1105444 635186 1191655
11737 1191655 1037009 -171056 -959534 -846408 -1329609 -3094249 -4242692 -2836316 289702
11728 289702 2854149 4065363 4617847 4832481 4553161 4099988 3626615 2211977 -719142
11719 -719142 -3698917 -4695494 -3783713 -2607890 -1737673 -537050 699542 671279 -780747
$$ packed form
11782B025570m11314K40443J801951K302067P43614j251443j553105m86498j03321
11773C307964q74388j100913Q4012J184763P82400k71638n07471k54475o73724
11764A676530j357542q35151R00796K150874J850371P42862K7505j4944J97315
11755E338616K16815k25606r92607j400316q94439J00454N24327j19257j243097
11746A304890j713988p65750J149388K297963J310396q32923j644532m70258N56469
11737A191655j54646j208065p88478J13126m83201j764640j148443J406376L126018
11728B89702K564447J211214N52484K14634k79320m53173m73373j414638k931119
11719g19142k979775r96577R11781J175823Q70217J200623J236592k8263j452026
$$ plain form
11710 -780747 -2369512 -3310320 -3740638 -3253434 -1222113 1136196 1381512 -712422 -2511368
11701 -2511368 -2282804 -1490810 -1993783 -2869643 -1850777 1325849 4750141 6765637 7158247
11692 7158247 6525082 5663941 5175446 4849569 3950599 2576857 1779166 1761149 1239448
11683 1239448 -496579 -2205722 -2591782 -2365087 -2914765 -3891655 -3797907 -2413802 -1038449
11674 -1038449 -593680 -848519 -1334193 -1856271 -2262424 -2643941 -3446297 -4543007 -4805641
11665 -4805641 -3624043 -2161986 -1829725 -2127833 -1486107 188011 1400014 1345261 747565
11656 747565 373314 137776 -104722 -151801 -129038 -494877 -1060822 -903418 456996 2438569
11646 2438569 4035569 4539352 3830284 2572181 1785139 1624672 1184986 194142 -127387
$$ packed form
11710g80747j588765r40808m30318M87204K031321K358309K45316k093934j798946
11701b511368K28564P91994n02973q75860J018866L176626L424292K015496L92610
11692G158247o33165q61141m88495l25877q98970j373742p97691j8017n21701
11683A239448j736027j709143l86060K26695n49678r76890R3748J384105J375353
11674a038449M44769k54839m85674n22078m06153l81517q02356j096710k62634
11665d805641J181598J462057L32261k98108O41726J674118J212003n4753n97696
11656G47565l74251k35538k42498m7079K2763l65839n65945J57404J360414J981573
11646B438569J597000N03783p09068j258103p87042j60467m39686r90844l21529
$$ plain form
11637 -127387 938502 1930075 1284706 106996 604169 2367447 2823055 1293075 -165480
11628 -165480 -417028 -940245 -2781707 -4332805 -3779029 -1888794 -669403 -637854 -945908
11619 -945908 -1050295 -877350 -331696 172270 -337647 -1913008 -3225147 -3415336 -3047338
11610 -3047338 -2354787 -358663 2852259 4800341 3599063 896445 -254230 660956
11602 660956 1920393 2674717 3240092 3092728 1397741 -642401 -704721 1118639 2202212
11593 2202212 1297214 152726 457896 1495539 2037386 2507037 3634219 4497087 3724040
11584 3724040 1772612 396271 275601 457699 -85448 -1336837 -2535622 -2882189 -2088828
11575 -2088828 -717202 267606 596127 906709 1546189 1839342 1165501 159569 -38166
$$ packed form
11637a27387J065889R91573o45369j177710M97173J763278M55608j529980j458555
11628a65480k51548n23217j841462j551098N53776J890235J219391L1549l08054
11619i45908j04387J72945N45654N03966n09917j575361j312139j90189L67998
11610c047338O92551J996124L210922J948082j201278k702618j150675R15186
11602F60956J259437P54324N65375j47364j694987k040142o2320J823360J083573
11593B202212r04998j144488L05170J037643N41847M69651J127182Q62868p73047
11584C724040j951428j376341j20670J82098n43147j251389j198785l46567P93361
11575b088828J371626R84808L28521L10582O39480K93153o73841j005932j97735
$$ plain form
11566 -38166 531299 601256 -559898 -2026629 -2299325 -1262594 -492979 -1280728 -2722922
11557 -2722922 -2675013 -778680 626456 -436290 -2603410 -2895704 -979385 347145 -735354
11548 -735354 -2528890 -2531069 -1047179 -361038 -1177342 -1794856 -840302 668212 588279 -1708134
11538 -1708134 -4487523 -5331111 -3549822 -912141 185751 -827420 -2493665 -3410894
11530 -3410894 -3616146 -3627663 -3138269 -1494264 1058057 3370045 4400625 3840390 2157087
11521 2157087 355539 -864655 -1989560 -3942422 -6170317 -6721209 -5015424 -3211084
11513 -3211084 -3445752 -4765014 -4519101 -2166017 209632 927865 353314 -594690 -1669797
11504 -1669797 -2511564 -2337672 -1327089 -1034804 -2430950 -4394334 -5011650 -3746228 -1717360
$$ packed form
11566c8166N69465O9957j161154j466731k72696J036731P69615p87749j442194
11557b722922M7909J896333J405136j062746k167120k92294J916319J326530j082499
11548g35354j793536k179J483890O86141q16304o17514R54554J508514p9933k296413
11538a708134k779389q43588J781289K637681J097892j013171j666245r17229
11530c410894k05252j1517M89394J644005K552321K311988J030580n60235j683303
11521B157087j801548j220194j124905j952862k227895n50892J705785J804340
11513c211084k34668j319262K45913K353084K375649P18233n74551r48004j075107
11504a669797q41767J73892J010583K92285j396146j963384o17316J265422K028868
$$ plain form
11495 -1717360 -476759 -976509 -2965702 -4853108 -4928498 -3308100 -1927666 -2018499 -2438844
11486 -2438844 -1360792 1043418 2614654 1712322 -963105 -2971914 -2302712 718540
11478 718540 3512526 3719201 1637310 -450058 -1141283 -823642 172282 2258047 4689864
11469 4689864 5206183 3161216 1117786 1219439 1693813 -226597 -3118185 -2673043 1790952
11460 1790952 5602589 4624035 160582 -3403188 -3639472 -1223772 1950041 3884406
11452 3884406 3087971 1725 -2895150 -3752009 -3344680 -3352895 -3815203 -3715792 -3028149 -2484346
11442 -2484346 -2052309 -1306040 -771851 -1325806 -2667727 -3817755 -4603302 -5183689 -4790322
11433 -4790322 -2790284 -524987 -15492 -995654 -1349433 -517218 -124646 -784034 -762370
$$ packed form
11495a717360J240601m99750j989193j887406p5390J620398J380434r0833m20345
11486b438844J078052K404210J571236r02332k675427k008809O69202L021252
11478G18540K793986K06675k081891k087368o91225L17641R95924K085765K431817
11469D689864N16319k044967k043430J01653M74374j920410k891588M45142M463995
11460A790952L811637r78554m463453l563770k36284K415700L173813J934365
11452C884406p96435l086246k896875q56859M07329q215m62308R9411O87643N43803
11442b484346M32037P46269N34189n53955j341921j150028p85547n80387L93367
11433d790322K000038K265297N09495r80162l53779Q32215L92572o59388K1664
$$ plain form
11424 -762370 997860 2691771 2232325 540476 308548 2175523 3858172 3020972 -102751
11415 -102751 -3004968 -3238759 -620009 2569364 3895724 3343389 2854687 3334806 3490423
11406 3490423 2217507 626478 386039 1089250 863827 -840254 -2571090 -2984917 -2445256
11397 -2445256 -2230351 -2874375 -3587966 -3074649 -977831 1409071 2340910 1691367 1047652
11388 1047652 1381901 1758379 1273483 1125603 3048841 6120795 7068831 4269225 37094
11379 37094 -2000327 -1037910 403003 -127523 -2075630 -2796905 -908822 2090411 3696688
11370 3696688 3086027 1332240 -326777 -1397005 -1768346 -1730625 -2131564 -3168606 -3288264
11361 -3288264 -1052214 1993938 2602001 418207 -1242714 -258664 1357363 1142553 172005
$$ packed form
11424g62370J760230J693911m59446j691849k31928J866975J682649q37200l123723
11415a02751k902217k33791K618750L189373J326360n52335m88702M80119J55617
11406C490423j272916j591029k40439P03211k25423j704081j730836m13827N39661
11397b445256K14905o44024p13591N13317K096818K386902R31839o49543o43715
11388A047652L34249L76478m84896j47880J923238L071954R48036k799606m232131
11379C7094k037421R62417J440913n30526j948107p21275J888083K999233J606277
11370C696688o10661j753787j659017j070228l71341L7721m00939j037042j19658
11361c288264K236050L046152O08063k183794j660921R84050J616027k14810r70548
$$ plain form
11352 172005 705757 1935034 1359335 -774691 -1716579 -398922 1583187 2859200 3300559
11343 3300559 2449727 779 -2139440 -1464013 1053875 1679344 -550388 -2269220 -1014013
11334 -1014013 1165459 1257059 -255865 -910530 -318780 -204674 -1460571 -3190081 -4075172
11325 -4075172 -3402353 -1500440 -34899 -716437 -2900384 -3900151 -2532227 -627081 -19224
11316 -19224 -97285 179557 -70688 -1951068 -4391660 -5575184 -5411610 -4651780 -3002123
11307 -3002123 -263095 2054241 2571985 2277218 2632856 2877507 1856962 1102241 2765004
11298 2765004 5394003 5413382 2565550 245933 166262 312086 -975860 -2369495 -2403930
11289 -2403930 -1919358 -1904990 -1449476 258815 1955589 2157023 1264529 240088 -1025154
$$ packed form
11352A72005N33752J229277n75699k134026r41888J317657J982109J276013M41359
11343C300559q50832k448948k140219O75427K517888O25469k229732j718832J255207
11334a014013K179472R1600j512924o54665N91750J14106j255897j729510q85091
11325d075172O72819J901913J465541o81538k183947r99767J367924J905146O07857
11316a9224p8061K76842k50245j880380k440592j183524J63574P59830J649657
11307c002123K739028K317336N17744k94767L55638K44651j020545p54721J662763
11298B765004K628999J9379k847832k319617p9671J45824j287946j393635l4435
11289b403930M84572J4368M55514J708291J696774K01434q92494j024441j265242
$$ plain form
11280 -1025154 -2403288 -2502756 -930291 116386 -1225186 -3306459 -3113199 -628938 1350117
11271 1350117 1147059 -371924 -1907445 -2926920 -2854993 -1349888 368220 520353 -545560
11262 -545560 -635116 901764 2138523 1659461 541196 39765 -655427 -2509033 -4080059
11253 -4080059 -3263151 -806496 399437 -467922 -999948 742444 3365129 4231407 3024343
11244 3024343 1669061 1423809 1629160 1265638 407609 -286589 -660942 -1047830 -1566672
11235 -1566672 -1959058 -2074302 -2145463 -2305605 -1906519 102514 3537638 6120804 5418475
11226 5418475 1878781 -1245246 -1604415 -169783 949893 1595147 2674803 3395589 2063548
11217 2063548 -496414 -1189828 795907 2200678 64985 -4015340 -6003090 -4496369
$$ packed form
11280a025154j378134r9468J572465J046677j341572k081273J93260K484261J979055
11271A350117k03058j518983j535521j019475P1927J505105J718108J52133j065913
11262e45560q9556J536880J236759m79062j118265n01431o95192j853606j571026
11253d080059Q16908K456655J205933q67359n32026J742392K622685Q66278j207064
11244C024343j355282k45252K05351l63522q58029o94198l74353l86888n18842
11235a566672l92386j15244p1161j60142L99086K009033L435124K583166p02329
11226E418475l539694l124027l59169J434632J119676O45254J079656P20786j332041
11217B063548k559962o93414J985735J404771k135693m080325j987750J506721
$$ plain form
11209 -4496369 -1556412 750776 2314351 3482037 3721761 2593081 792873 -646465
11201 -646465 -1544915 -2282050 -2715467 -2092302 -124378 2315469 4050434 5060306 6322082
11192 6322082 7838278 7885690 5409645 2320589 1528094 2962916 3729799 2401589 709765
11183 709765 242351 151578 -363814 79404 2415333 4517262 4000277 2021943 1297486
11174 1297486 1624751 779210 -943262 -928673 925959 1478239 -503325 -1953429 -145928
11165 -145928 3081276 4071679 2335755 305436 -670746 -1600120 -3467132 -5628469 -6851182
11156 -6851182 -6631695 -5113980 -2590990 360325 2582809 2806545 918405 -1285290
11148 -1285290 -1468033 527893 2127724 1178934 -1092271 -1701475 66852 2071598 2614581
$$ packed form
11209d496369K939957K307188J563575J167686K39724j128680j800208j439338
11201f46465q98450p37135m33417O23165J967924K439847J734965J009872J261776
11192F322082J516196M7412k476045l089056p92495J434822P66883j328210j691824
11183G09765m67414r0773n15392M43218K335929K101929n16985j978334p24457
11174A297486L27265q45541j722472J4589J854632N52280j981564j450104J807501
11165a45928L227204R90403j735924k030319r76182r29374j867012k161337j222713
11156f851182K19487J517715K522990K951315K222484K23736j888140k203695
11148a285290j82743J995926J599831r48790k271205o09204J768327K004746N42983
$$ plain form
11139 2614581 2299776 2207534 2172296 1762944 1410440 1552272 1896708 2396386 3641904 5282904
11129 5282904 5399805 2876277 -510392 -1892306 -765533 704293 643415 -532686 -1279450
11120 -1279450 -1058509 -682683 -909531 -1354675 -1099806 -126177 469098 -82596 -1147077
11111 -1147077 -1573120 -1160469 -578881 -240350 -12666 262206 679594 1351031 1946673
11102 1946673 1761973 971202 894183 1888243 2035593 -345868 -3672872 -4705570 -2882908
11093 -2882908 -856921 -649890 -1513378 -2054294 -2286794 -2576397 -2302329 -872677 953390
11084 953390 1791003 1131547 -350976 -1473378 -1437272 -635479 -332819 -890389 -983984 422941
11074 422941 2301811 3171112 3343999 3670235 3288450 1211893 -866784 -514027 1257072
$$ packed form
11139B614581l14805r2242l5238m09352l52504J41832L44436M99678J245518J641000
11129E282904J16901k523528l386669j381914J126773J469826o0878j176101p46764
11120a279450K20941L75826k26848m45144K54869R73629N95275n51694j064481
11111a147077m26043M12651N81588L38531K27684K74872M17388O71437N95642
11102A946673j84700p90771p7019R94060J47350k381461l327004j032698J822662
11093b882908K025987K07031q63488n40916k32500k89603K74068J429652J826067
11084I53390Q37613o59456j482523j122402L6106Q01793L02660n57570r3595J406925
11074D22941J878870Q69301J72887L26236l81785k076557k078677L52757J771099
$$ plain form
11065 1257072 1214522 -789068 -1486846 385042 2174116 1822481 564313 -325580 -1858651
11056 -1858651 -4451140 -5953979 -4833186 -2654201 -1328519 -433733 763372 1271752
11048 1271752 543690 217462 1506842 3120892 3732992 4059496 4573938 3960796 2030049
11039 2030049 1186986 2489955 3345627 1990775 959982 2537484 3987858 1765041
11031 1765041 -2086188 -2706862 34459 1745512 371389 -1857980 -2927766 -3026337 -2101807
11022 -2101807 309933 2520268 1923043 -633531 -1350095 925007 3006631 2247744 38917
11013 38917 -786267 428393 2343202 3604996 3772741 3498626 3919127 4791009 4031718
11004 4031718 761458 -2372146 -2232296 457245 2381446 2308341 1706811 1608475 1906515
$$ packed form
11065A257072m2550k003590o97778J871888J789074l51635j258168q89893j533071
11056a858651k592489j502839J120793K178985J325682Q94786J197105N08380
11048A271752p28062l26228J289380J614050O12100L26504N14442o13142j930747
11039B030049q43063J302969Q55672j354852j030793J577502J450374k222817
11031A765041l851229o20674K741321J711053j374123k229369j069786r8571R24530
11022b101807K411740K210335n97225k556574p16564K275102K081624p58887k208827
11013C8917q25184J214660J914809J261794J67745k74115M20501Q71882p59291
11004D031718l270260l133604J39850K689541J924201p3105o01530r8336K98040
$$ plain form
10995 1906515 3027061 5103946 6127727 4197265 1015109 -203288 451905 498102 -145312
10986 -145312 378338 1253111 -143876 -2749849 -2563905 363714 1289541 -1270814 -2621313
10977 -2621313 368676 3851704 3083663 -403431 -2011717 -1171356 -750294 -1665483 -2423825
10968 -2423825 -2648114 -3169222 -3421258 -2153671 -281282 -33703 -1428577 -2171769 -1168823
10959 -1168823 -7762 -594390 -2802853 -4853162 -5206540 -3954189 -2588527 -2130797 -1704156
10950 -1704156 76386 2604602 3786503 2988446 1570857 446682 -564894 -740637
10942 -740637 1293964 4488130 5614291 4033926 3184424 5313598 7639071 6412696
10934 6412696 2379809 -906513 -2391759 -3788004 -5584756 -6094448 -4352800 -1428154
$$ packed form
10995A906515J120546K076885J023781j930462l182156j218397O55193M6197o43414
10986a45312N23650Q74773j396987k605973J85944K927619R25827k560355j350499
10977b621313K989989L483028p68041l487094j608286Q40361M21062r15189p58342
10968b423825k24289n21108k52036J267587J872389K47579j394874p43192J002946
10959a168823J161061n86628k208463k050309l53378J252351J365662M57730M26641
10950a704156J780542K528216J181901p98057j417589j124175j011576j75743
10942g40637K034601L194166J126161j580365q49502K129174K325473j226375
10934F412696m032887l286322j485246j396245j796752n09692J741648K924646
$$ plain form
10926 -1428154 1231568 2855346 2965511 1771714 766864 1247772 2414294 2459126 1228751
10917 1228751 146915 -281678 -1032962 -2387623 -2910927 -1432681 999904 2089928 844465
10908 844465 -1512914 -3125743 -3387947 -2853674 -1799149 -40455 1671973 1662069 -222366
10899 -222366 -1639228 -876855 408859 -172557 -1569819 -774111 2099376 3748346 2930950
10890 2930950 2072506 2622959 2553983 433132 -1399921 -545263 1184087 534933 -1802001
10881 -1802001 -2139680 400085 2367032 930944 -2126873 -2830922 -197598 2663563
10873 2663563 2707319 831893 322984 2025759 3279409 2262759 800020 939583 1206097
10864 1206097 -674242 -3212200 -3187491 -1082185 -197243 -900869 -452418 1287494 981176
$$ packed form
10926a428154K659722J623778J10165j193797j004850M80908J166522M4832j230375
10917A228751j081836m28593p51284j354661n23304J478246K432585J090024j245463
10908H44465k357379j612829k62204N34273J054525J758694J712428r904j884435
10899b22366j416862P62373J285714n81416j397262P95708K873487J648970q17396
10890B930950q58444N50453o8976k120851j833053Q54658J729350o49154k336934
10881a802001l37679K539765J966947j436088l057817p04049K633324K861161
10873B663563M3756j875426n08909J702775J253650j016650j462739J39563K66514
10864A206097j880339k537958K4709K105306Q84942p03626M48451J739912l06318
$$ plain form
10855 981176 -2241769 -4735093 -3996665 -2060000 -1283008 -930474 -121094 -33815 -681693
10846 -681693 488513 3995973 6177786 4580666 1736273 522940 -245944 -2063236
10838 -2063236 -2634528 40557 2936749 2185886 -682666 -1417259 350387 1869357 2529308
10829 2529308 3485624 3763967 1755275 -583228 80978 2800358 3520514 1439053 -252467
10820 -252467 208732 1199989 1283978 962682 668440 279684 603069 2313111 3747547
10811 3747547 2737486 90179 -1680890 -2211300 -2755062 -2970359 -1803379 -519769 -1029192
10802 -1029192 -2097675 -1178085 885101 1186481 -46252 -168474 551732 -710960 -3657291
10793 -3657291 -4561630 -2249016 280556 894557 489029 -472914 -2754175 -4793861 -3445250
$$ packed form
10855I81176l222945k493324P38428J936665P76992L52534Q09380Q7279o47878
10846f81693J170206L507460K181813j597120k844393j213333p68884j817292
10838b063236n71292K675085K896192p50863k868552p34593J767646J518970O59951
10829B529308R56316K78343k008692k338503O64206K719380P20156k081461j691520
10820b52467M61199R91257Q3989l21296k94242l88756L23385J710042J434436
10811C747547j010061k647307j771069n30410n43762k15297J166980J283610n09423
10802a029192j068483R19590K063186L01380j232733j22222P20206j262692k946331
10793c657291r04339K312614K529572O14001m05528r61943k281261k039686J348611
$$ plain form
10784 -3445250 318166 1511635 -1196302 -3107417 -1285632 500065 -1757596 -5444249
10776 -5444249 -5432809 -1757810 1409335 2173347 1943662 1643968 1060530 1097252 2903079
10767 2903079 5065982 4914847 2537452 633534 330834 -55880 -1661022 -3110584 -2980084
10758 -2980084 -2070188 -1675288 -1053946 1398193 4994538 6861346 5679265 3563454 2998533
10749 2998533 3375849 2601069 1115682 1344850 3145677 3286559 709682 -1127808 438040
10740 438040 2607524 1057472 -3592474 -6934733 -6976879 -5393606 -3476033 -862405 1727439
10731 1727439 2268776 648085 -845324 -871262 -366617 -173958 130141 627641 615293
10722 615293 120488 -213995 -731088 -2037473 -2962363 -1812995 508023 1406880 586745
$$ packed form
10784c445250L763416J193469k707937j911115J821785J785697k257661l686653
10776e444249J1440L674999L167145P64012k29685k99694n83438L6722J805827
10767B903079K162903j51135k377395j903918l02700l86714j605142j449562J30500
10758b980084R09896L94900O21342K452139L596345J866808j182081k115811n64921
10749B998533L77316p74780j485387K29168J800827J40882k576877j837490J565848
10740D38040K169484j550052m649946l342259m2146J583273J917573K613628K589844
10731A727439N41337j620691j493409k5938N04645J92659L04099M97500j2348
10722F15293m94805l34483n17093j306385r24890J149368K321018Q98857q20135
$$ plain form
10713 586745 267207 1339269 2305147 2342229 2337136 2306085 881256 -1699562 -2948977 -1652171
10703 -1652171 382880 1128989 627157 -427738 -2007772 -3457030 -2972510 151419 4070261
10694 4070261 6168677 5372500 2451656 -778490 -2488502 -2274312 -1464953 -1093832 -484259
10685 -484259 850345 1418970 -992 -1744739 -1461194 307335 1468518 1931430 2702155
10676 2702155 2855140 1131265 -514380 931741 4391788 5786859 3971526 1521430
10668 1521430 -128953 -1943609 -3534711 -2676960 564402 3128156 3260696 2111592
10660 2111592 659015 -1287130 -2673938 -1719891 516399 829497 -1150868 -2174348
10652 -2174348 -172071 3403123 6241514 6953357 4531432 -323256 -3916332 -3537757
$$ packed form
10713E86745l19538J072062R65878L7082n093l1051j424829k580818j249415J296806
10703a652171K035051P46109n01832j054895j580034j449258M84520L123929L918842
10694D070261K098416p96177k920844l230146j710012K14190Q09359L71121O09573
10685d84259J334604N68625j419962j743747K83545J768529J161183M62912P70725
10676B702155J52985j723875j645645J446121L460047J395071j815333k450096
10668A521430j650383j814656j591102Q57751L241362K563754J32540j149104
10660B111592j452577j946145j386808R54047K236290L13098j980365j023480
10652b174348K002277L575194K838391P11843k421925m854688l593076L78575
$$ plain form
10644 -3537757 -1785217 -2517647 -4039970 -2047326 1935449 2137742 -1588574 -3087432
10636 -3087432 -87784 2530456 1532863 -81978 110132 -162402 -1929027 -1893053 902134
10627 902134 1914396 -1168969 -3797212 -2249487 -15716 -1389823 -4083645 -3704160
10619 -3704160 -972922 928136 2101543 3788782 4340810 2574300 1617102 4151304
10611 4151304 6995040 5657145 1493553 -853585 -750314 -1174985 -2855086 -3681362 -2933019
10602 -2933019 -2063077 -1977363 -2429745 -3047192 -2830982 -397454 3466765 5813481 5697041
10593 5697041 5375735 5792871 4600253 796983 -2636264 -3323090 -2909497 -3346579 -3712680
10584 -3712680 -3371841 -4098582 -6111284 -6190030 -2921219 246377 357753 -695011 -335955
$$ packed form
10644c537757J752540p32430j522323J992644L982775K02293l726316j498858
10636c087432K999648K618240r97593j614841J92110k72534j766625L5974K795187
10627I02134J012262l083365k628243J547725K233771j374107k693822L79485
10619c704160K731238J901058J173407J687239N52028j766510r57198K534202
10611D151304K843736j337895m163592k347138J03271m24671j680101q26276P48343
10602b933019Q69942Q5714m52382o17447K16210K433528L864219K346716j16440
10593E697041l21306M17136j192618l803270l433247o86826M13593m37082l66101
10584c712680L40839p26741k012702p8746L268811L167596J11376j052764L59056
$$ plain form
10575 -335955 339143 -274698 -777292 175087 942439 74141 -1118975 -1601398 -2419957
10566 -2419957 -3563399 -3320897 -2271023 -2952811 -4466067 -3334825 -656240 -1171820 -4055891
10557 -4055891 -3204053 1402010 2411188 -1814604 -3588388 184850 1883361 -2814546
10549 -2814546 -6263311 -2262533 2695687 1026551 -3029202 -2425917 -136034 -1809139
10541 -1809139 -3781534 -196044 4877564 4284922 689458 983613 3318135 1378931
10533 1378931 -3156121 -3827433 -1008875 242250 -23079 1203107 2271875 686491
10525 686491 -343313 2015025 3343212 -101961 -3403172 -1833458 245915 -1316670
10517 -1316670 -1516050 3160131 5501610 542719 -3435792 416974 4054775 -113099
$$ packed form
10575c35955O75098o13841n02594R52379P67352q68298j193116m82423q18559
10566b419957j143442K42502J049874o81788j513256J131242K678585n15580k884071
10557d055891Q51838M606063J009178m225792j773784L773238J698511m697907
10549b814546l448765M000778M958220j669136m055753O03285K289883j673105
10541a809139j972395L585490N073608n92642l595464K94155K334522j939204
10533A378931m535052o71312K818558J251125k65329J226186J068768j585384
10525F86491j029804K358338J328187l445173l301211J569714K079373j562585
10517a316670j99380M676181K341479m958891l978511L852766L637801m167874
$$ plain form
10509 -113099 -3768785 1289402 5926377 847839 -3946185 2321054 8793886 2498816
10501 2498816 -5981609 -2573612 2076725 -5485644 -10657058 2367674 13438514 -112656
10493 -112656 -13985578 4218825 26634042 8690708 -7864069 70581901 230236793
10486 230236793 321291699 243893011 85274144 -159541 14003977 35681499 14410691
10479 14410691 -8678726 -167091 11854623 1702910 -9428447 -1054042 8971444
10472 8971444 2486730 -6183877 -1658266 3871675 -2128488 -7295397 276893 7983646
10464 7983646 2517555 -5285347 -1099458 7294026 5960067 -636772 -924113 2328408
10456 2328408 539053 -2841794 -315649 4063930 2708693 -890906 318835 3184991
$$ packed form
10509a13099l655686N058187M636975n078538m794024O267239O472832o295070
10501B498816q480425L407997M650337p562369n171414J3024732J1070840j3551170
10493a12656j3872922J8204403K2415217j7943334j6554777P8445970J59654892
10486B30236793R1054906p7398688j58618867q5433685J4163518K1677522k1270808
10479A4410691k3089417Q511635J2021714j0151713j1131357Q374405J0025486
10472H971444o484714q670607M525611N529941o000163n166909P572290P706753
10464G983646n466091p802902M185889Q393484j333959o596839k87341L252521
10456B328408j789355l380847K526145M379579j355237l599599J209741K866156
$$ plain form
10448 3184991 1214042 -2515516 -1675764 1073704 -214978 -3193832 -2297108 251668
10440 251668 -1151248 -4854998 -5141213 -2046915 117127 362758 292110 -388154 -1766290
10431 -1766290 -1246864 1836291 3664162 2225753 898830 1870257 2087628 -168950 -1276975
10422 -1276975 784977 2223462 676473 -263342 1519512 1916484 -1479164 -3801640
10414 -3801640 -1044644 2791204 2555018 -72172 -1079202 -863868 -1144996 -748662 565310
10405 565310 -254517 -3522361 -4466869 -1233682 1407097 743834 1078591 4938622 7220028
10396 7220028 4189787 619478 1129787 1915927 -1366927 -4675170 -2983152 -221489
10388 -221489 -2700660 -7758122 -8094989 -3418820 816653 2783512 4257270 4494601 2087590
$$ packed form
10448C184991j970949l729558Q39752K749468j288682k978854Q96724K548776
10440B51668j402916l703750k86215L094298K164042K45631p0648o80264j378136
10431a766290N19426L083155J827871j438409j326923R71427K17371k256578j108025
10422a276975K061952J438485j546989r39815J782854L96972l395648k322476
10414c801640K756996L835848k36186k627190j007030K15334k81128L96334J313972
10405E65310q19827l267844r44508L233187K640779o63263L34757L860031K281406
10396G220028l030241l570309N10309P86140l282854l308243J692018K761663
10388b21489k479171n057462l36867M676169M235473J966859J473758K37331k407011
$$ plain form
10379 2087590 109101 1908988 4489562 3203159 112260 352198 2965754 2910204 -90739
10370 -90739 -2059461 -2137489 -2380561 -2126575 384911 2513081 379686 -3844853 -4575858
10361 -4575858 -1485163 984705 1453312 2291169 3532348 2797770 766909 440537 1309284
10352 1309284 185571 -2522579 -3134788 -1047824 668135 749268 717275 890271 399025
10343 399025 457622 2613202 4625147 3178037 -337000 -1980359 -1913808 -3164925 -4935609
10334 -4935609 -3508740 639160 3023340 2500015 2226532 2998755 1953282 -1200834 -2763008
10325 -2763008 -1295421 198739 -180876 -706488 -473682 -1160949 -2594948 -1659609 2112654
10316 2112654 4482933 2615229 -713148 -1599352 -298636 537157 65971 -719324 -1008335
$$ packed form
10379B087590j978489J799887K580574j286403l090899K39938K613556n5550l000943
10370i0739j968722p8028k43072K53986K511486K128170k133395m224539p31005
10361d575858L090695K469868M68607Q37857J241179p34578k030861l26372Q68747
10352A309284j123713k708150o12209K086964J715959Q1133l1993J72996m91246
10343C99025N8597K155580K011945j447110l515037j643359O6551j251117j770684
10334d935609J426869M147900K384180n23325k73483P72223j045473l154116j562174
10325b763008J467587J494160l79615n25612K32806o87267j433999R35339L772263
10316B112654K370279j867704l328377q86204J300716Q35793m71186p85295k89011
$$ plain form
10307 -1008335 -300087 1717497 4095400 5072110 4375382 3413526 2911614 2311959 1566030
10298 1566030 1320337 1301230 694939 -72161 -139674 -191244 -1107362 -1514863 294226 2820769
10288 2820769 3124656 1427181 300596 -43117 -1487639 -3393730 -2859558 29269 1740418
10279 1740418 958722 400374 1780687 3128235 2716715 1874392 1976853 1902456 429413
10270 429413 -1477026 -2364598 -2035713 -649224 1567363 3226536 3033883 2256772 2877732
10261 2877732 3506595 1109881 -3149206 -4611269 -2431231 -959124 -2265908 -2834630
10253 -2834630 -291305 2091624 1324340 51917 1324926 2451091 -359468 -4627420
10245 -4627420 -5090099 -2380582 -1766986 -4132658 -4718999 -1424820 1667533 969901 -1387339
$$ packed form
10307a008335P08248K017584K377903R76710o96728r61856n01912n99655p45929
10298A566030k45693j9107o06291p67100o7513n1570r16118m07501J809089K526543
10288B820769L03887j697475j126585l43713j444522j906091N34172K888827J711149
10279A740418p81696n58348J380313J347548m11520q42323J02461p4397j473043
10270D29413j906439q87572L28885J386489K216587J659173j92653p77111O20960
10261B877732O28863k396714m259087j462063K180038J472107j306784n68722
10253b834630K543325K382929p67284j272423J273009J126165k810559m267952
10245d627420m62679K709517O13596k365672n86341L294179L092353o97632k357240
$$ plain form
10236 -1387339 -1734752 -419632 23397 -411796 303068 2415159 4049152 4187345 3680371
10227 3680371 3401177 3229909 2985145 2891167 2857283 2413450 1580194 817031 -40164 -1646159
10217 -1646159 -3557419 -4003538 -2164927 190904 518243 -1477095 -3679436 -4154176 -2836274
10208 -2836274 -850744 646736 946411 292981 45350 1188161 2617365 2255112 42551
10199 42551 -1791635 -1960518 -1910829 -3416043 -5842533 -7049160 -5968568 -3241151 -272328
10190 -272328 1388702 831531 -941067 -1441948 565882 3529575 4954021 3732236 181807
10181 181807 -4533187 -8082206 -7953483 -4254432 -58004 2307860 3542981 4599585
10173 4599585 4074776 873552 -2519598 -2704094 -352239 606281 -1505754 -4230695 -4709131
$$ packed form
10236a387339l47413J315120M43029m35193P14864K112091J633993J38193n06974
10227C680371k79194j71268k44764r3978l3884m43833q33256p63163q57195j605995
10217a646159j911260m46119J838611K355831L27339j995338k202341m74740J317902
10208b836274J985530J497480K99675o53430k47631J142811J429204l62253k212561
10199D2551j834186j68883M9689j505214k426490j206627J080592K727417K968823
10190b72328J661030n57171j772598n00881K007830K963693J424446j221785l550429
10181A81807m714994l549019J28723L699051M196428K365864J235121J056604
10173D599585n24809l201224l393150j84496K351855R58520k112035k724941m78436
$$ plain form
10164 -4709131 -2877435 -591775 482120 -276236 -2170542 -3496546 -3178867 -1947080
10156 -1947080 -1052062 -602995 -285011 -567401 -1614740 -2148634 -1282537 -406211 -1102034
10147 -1102034 -2183491 -1295225 1189358 2518081 1641630 466659 821850 2268787 3291677
10138 3291677 3032979 1626719 89238 -192368 1087064 2678691 3639873 4467263 5103090
10129 5103090 3598549 -945890 -5537222 -6238649 -3255719 -412403 -54539 -1084730
10121 -1084730 -1726025 -1600140 -997841 -286216 -124301 -608685 -645687 270507 733598 -197260
10111 -197260 -760838 834608 2957923 2786376 698833 -895345 -1889194 -3797983 -5669851
10102 -5669851 -5000421 -2430476 -1110613 -1252838 101983 3242476 4487178 2229377
$$ packed form
10164d709131J831696K285660J073895p58356j894306j326004L17679J231787
10156a947080Q95018M49067L17984k82390j047339n33894Q66097Q76326o95823
10147a102034j081457Q88266K484583J328723q76451j174971L55191J446937J022890
10138C291677k58698j406260j537481k81606J279432J591627R61182Q27390O35827
10129E103090j504541m544439m591332p01427K982930K843316L57864j030191
10121a084730o41295J25885O02299P11625J61915m84384l7002R16194M63091r30858
10111a97260n63578J595446K123315j71547k087543j594178r93849j908789j871868
10102e669851O69430K569945J319863j42225J354821L140493J244702k257801
$$ plain form
10094 2229377 -198015 35903 823707 -1062247 -4702285 -6578542 -5456991 -3175499
10086 -3175499 -1835203 -2076715 -3107612 -3200784 -1263423 1361003 2052089 352014 -1472812
10077 -1472812 -1732061 -1148057 -814182 -511507 583 -31969 -1003244 -2063107 -2362946
10068 -2362946 -1953415 -1160669 -359782 -249642 -925810 -1206891 -506442 -259172 -1261006
10059 -1261006 -1165239 2073242 5622205 4854450 357302 -2663061 -1853887 71204 716791
10050 716791 576874 -327021 -3005557 -5561332 -4218034 57134 1639541 -958849 -2511735
10041 -2511735 -238907 1015043 -2732484 -7086607 -6288223 -2827957 -3122228 -7026738
10033 -7026738 -8893675 -7078649 -5334065 -5514301 -5449135 -4219569 -3685259 -4057540 -3136790
$$ packed form
10094B229377k427392K33918P87804j885954l640038j876257J121551K281492
10086c175499J340296k41512j030897r3172J937361K624426O91086j700075j824826
10077a472812k59249N84004L33875L02675N12090l2552r71275j059863k99839
10068b362946M09531P92746Q00887J10140o76168k81081P00449K47270j001834
10059a261006R5767L238481L548963p67755m497148l020363Q09174J925091O45587
10050G16791j39917r03895k678536k555775J343298M275168J582407k598390j552886
10041b511735K272828J253950l747527m354123P98384L460266k94271l904510
10033g026738j866937J815026J744584j80236O5166J229566N34310l72281R20750
$$ plain form
10024 -3136790 -910065 -174963 -1420014 -1541297 781337 2492695 953654 -2054679
10016 -2054679 -3322543 -2583021 -1810662 -2191962 -3606497 -5479525 -6683067 -6089392 -4408081
10007 -4408081 -3883964 -5015031 -5309016 -2797361 762582 2030134 380440 -1823235
9999 -1823235 -2645368 -2344100 -1816681 -1171800 -474815 -459129 -1373163 -1957130 -864593 1208296
9989 1208296 2127110 1126415 -304209 -718679 -485772 -467024 -355602 352346 915704
9980 915704 488544 -251975 -368669 -628035 -2113568 -3667982 -3244724 -1433444 -875928
9971 -875928 -2080368 -2675313 -1438827 -312906 -1270917 -3488311 -4943567 -4994640 -4181234
9962 -4181234 -3038331 -2112200 -1830501 -1760771 -1330481 -1321765 -2748952 -4312518 -3554877 -935532
$$ packed form
10024c136790K226725P35102j245051j21283K322634J711358j539041l008333
10016b054679j267864P39522P72359l81300j414535j873028j203542N93675J681311
10007d408081N24117j131067k93985K511655L559943J267552j649694k203675
9999a823235q22133L01268N27419O44881O96985J5686r14034n83967J092537K072889
9989A208296R18814j000695j430624m14470K32907J8748J11422P07948N63358
9980I15704m27160p40519j16694k59366j485533j554414M23258J811280N57516
9971h75928j204440n94945J236486J125921r58011k217394j455256n1073Q13406
9962d181234J142903R26131K81699O9730M30290Q716j427187j563566P57641K619345
$$ plain form
9952 -935532 118458 -1833257 -4032658 -3608412 -1336832 264367 420511 41139 -73951
9943 -73951 389412 1209796 1201044 -458751 -2173435 -1539907 691822 1202938 -734429 -2038901
9933 -2038901 -905948 392790 -471575 -2377389 -3344235 -3577518 -3668889 -2630687 -182922
9924 -182922 1576539 1285659 786859 2033328 3642841 3008255 183515 -2428342 -2922278
9915 -2922278 -1124370 1384624 1753376 -1442475 -5569484 -6729989 -5218293 -4561561 -5275008
9906 -5275008 -4617888 -3097452 -4978139 -10322871 -12970937 -9669715 -5129292 -4171504 -4900881
9897 -4900881 -4163550 -3719905 -5528274 -6448811 -3694294 -645974 -1154490 -2818772 -2162553
9888 -2162553 -1553943 -4181447 -7026478 -6173898 -4361987 -5498306 -6595918 -3692304 -767048
$$ packed form
9952i35532J053990j951715k199401M24246K271580J601199J56144l79372j15090
9943g3951M63363Q20384q752j659795j714684O33528K231729N11116j937367j304472
9933b038901J132953J298738q64365j905814r66846k33283r1371J038202K447765
9924a82922J759461k90880m98800J246469J609513o34586k824740k611857m93936
9915b922278J797908K508994L68752l195851m127009j160505J511696O56732p13447
9906e275008O57120J520436j880687n344732k648066L301222M540423R57788p29377
9897d900881P37331M43645j808369r20537K754517L048320n08516j664282O56219
9888b162553O08610k627504k845031Q52580J811911j136319j097612K903614K925256
$$ plain form
9879 -767048 -3245591 -7590713 -7859131 -7335497 -11466536 -15038787 -12053469 -13457224 -34077224
9870 -34077224 -61338106 -60660947 -21000219 25245535 41348396 29080318 16512911
9863 16512911 16599911 18426156 13069589 6643094 5848838 7107568 5403512 2813985 2885910
9854 2885910 4309300 4748401 5168659 6554370 6859020 4527918 1676955 1098269 2597957
9845 2597957 4239682 5190377 5812484 6365125 6619273 6039929 4385536 2712017 2692526
9836 2692526 3922488 3663711 946543 -1144263 279179 3311242 3972619 2017181 556030
9827 556030 809308 950182 129120 130527 2116066 4333973 4363985 2151058 -165434 -673255
9817 -673255 537550 1675196 1299921 28028 -395600 535258 1877734 3071582 4045781
$$ packed form
9879g67048k478543m345122k68418N23634m131039l572251K985318j403755k0620000
9870c4077224k7260882O77159L9660728M6245754J6102861j2268078j2567407
9863A6512911Q7000J826245n356567o426495p94256J258730j704056k589527P1925
9854B885910J423390M39101M20258J385711L04650k331102k850963n78686J499688
9845B597957J641725R50695O22107N52641K54148n79344j654393j673519j9491
9836B692526J229962k58777k717168k090806J423442L032063O61377j955438j461151
9827E56030K53278J40874q21062J407J985539K217907L0012k212927k316492n07821
9817f73255J210805J137646l75275j271893m23628R30858J342476J193848R74199
$$ plain form
9808 4045781 3699956 1007226 -2062784 -1990448 969967 2449695 468184 -1579295 -735569
9799 -735569 773554 24777 -1120231 430925 2801520 1809389 -1681684 -2476498 1087280
9790 1087280 4859593 5155416 3184622 1929808 1863411 1432639 -263167 -2598620 -4079314
9781 -4079314 -3480291 -1329980 83863 -538536 -1470792 -299077 2513504 4356867 4089928
9772 4089928 2839129 1709294 830511 361797 427462 260226 -834147 -2019080 -2093998
9763 -2093998 -1512381 -1424070 -1400860 -208566 1608787 2041600 395728 -1968682 -3480084
9754 -3480084 -3502217 -2165081 -500233 -34021 -798104 -697693 1596116 4329233 5011340
9745 5011340 3751754 2276618 1110403 87175 193675 2158910 4392014 5068409 5048319
$$ packed form
9808D045781l45825k692730l070010P2336K960415J479728j981511k047479Q43726
9799g35569J509123p48777j145008J551156K370595r92131l491073p94814L563778
9790A087280L772313K95823j970794j254814o6397m30772j695806k335453j480694
9781d079314N99023K150311J413843o22399r32256J171715K812581J843363k66939
9772D089928j250799j129835q78783m68714O5665j67236j094373j184933p4918
9763b093998N81617Q8311K3210J192294J817353M32813j645872k364410j511402
9754c480084k2133J337136J664848M66212p64083J00411K293809K733117O82107
9745E011340j259586j475136j166215j023228J06500J965235K233104O76395k0090
$$ plain form
9736 5048319 5858629 6244055 4223317 1370306 1061628 3114800 4227400 3386424 2604714
9727 2604714 2338325 733482 -1976422 -2871676 -1322009 -284869 -1152418 -1496766 173977
9718 173977 1536483 713867 -474283 -388992 -1064152 -4295948 -7256792 -6078734 -1815330
9709 -1815330 1160070 1390073 1091365 1430184 964161 -920358 -2323545 -1596781 427792
9700 427792 1916514 2231162 1989034 2048151 2812172 3685080 3220546 775537 -2090794
9691 -2090794 -2953354 -1278782 1136320 2499761 2777809 2926418 3311103 3403453 2606072
9682 2606072 981057 -747051 -1800573 -1956598 -1512128 -828356 -223674 -56400 -256751
9673 -256751 39447 1431079 2835004 2378970 61215 -1852233 -1827837 -1056006 -1226506
$$ packed form
9736E048319Q10310L85426k020738k853011l08678K053172J112600q40976p81710
9727B604714k66389j604843k709904q95254J549667J037140q67549l44348J670743
9718A73977J362506q22616j188150Q5291o75160l231796k960844J178058M263404
9709a815330K975400K30003k98708L38819m66023j884519j403187P26764K024573
9700D27792J488722L14648k42128N9117P64021Q72908m64534k445009k866331
9691b090794q62560J674572K415102J363441K78048J48609L84685R2350p97381
9682B606072j625015j728108j053522j56025M44470O83772O04682J67274k00351
9673b56751K96198J391632J403925m56034k317755j913448K4396P71831j70500
$$ plain form
9664 -1226506 -1649509 -549606 1483754 1800647 -201877 -1612013 -9008 2794648 3139243
9655 3139243 835261 -468736 1364485 3697890 2841117 -625797 -2611203 -1012792
9647 -1012792 1958670 3191314 2211143 550055 -490667 -310503 1146400 2716535 2531293
9638 2531293 472706 -1238971 -1218539 -1055352 -2496445 -4137292 -3430452 -881407 634196
9629 634196 285288 116911 1385269 2862658 3394615 3618501 4142372 4118395 2813503
9620 2813503 1001236 -239072 -781357 -762431 -35190 931881 980190 -114196 -1153456
9611 -1153456 -1291453 -1029709 -888994 -515726 205901 594044 501668 801322 1708200 2025118
9601 2025118 995709 -401646 -943535 -684537 -156727 544212 984748 319222 -868992
$$ packed form
9664a226506m23003J099903K033360L16893k002524j410136J603005K803656L44595
9655C139243k303982j303997J833221K333405q56773l466914j985406J598411
9647a012792K971462J232644r80171j661088j040722J80164J456903J570135j85242
9638B531293k058587j711677K0432J63187j441093j640847P06840K549045J515603
9629F34196l48908j68377J268358J477389N31957K23886N23871k3977j304892
9620B813503j812267j240308n42285J8926P27241R67071M8309j094386j039260
9611a153456j37997K61744J40715L73268P21627L88143r2376K99654R06878L16918
9601B025118j029409j397355n41889K58998N27810P00939M40536o65526j188214
$$ plain form
9592 -868992 -388039 2324015 4394803 2982299 -659084 -2835623 -2374969 -1504916 -1931978
9583 -1931978 -2457992 -1227001 1368317 3156122 2823031 1242349 282652 638830 1117796
9574 1117796 405527 -792290 -494825 1510457 2925457 2151587 753013 1185620 3185540
9565 3185540 4326783 3569895 2248655 1644688 1487480 1153215 726572 375813 -20542
9556 -20542 -157511 616985 2060475 2966677 2777401 2218340 1941702 1709558 1437437 1742348
9546 1742348 2611471 2755565 1448151 10988 101419 1261461 1680981 893914 29800
9537 29800 -410860 -1138974 -2150676 -2138404 -705468 461019 -115488 -1512335 -1940273
9528 -1940273 -1402747 -1164617 -1356529 -994515 8679 755597 1127628 1697712 1889293
$$ packed form
9592h68992M80953K712054K070788j412504l641383k176539M60654Q70053m27062
9583a931978n26014J230991K595318J787805l33091j580682r59697L56178M78966
9574A117796p12269j197817K97465K005282J415000p73870j398574M32607J999920
9565C185540J141243p56888j321240o03967j57208l34265m26643l50759l96355
9556b0542j36969P74496J443490R06202j89276n59061k76638k32144k72121L04911
9546A742348Q69123J44094j307414j437163R0431J160042M19520p87067q64114
9537B9800m40660p28114j011702J2272J432936J166487n76507j396847m27938
9528a940273N37526K38130j91912L62014J003194P46918L72031N70084J91581
$$ plain form
9519 1889293 373305 -2325181 -3791625 -2996421 -1528659 -759412 -56701 1004320 1093338
9510 1093338 -416503 -1611612 -801303 755447 1120195 774606 898348 494152 -1571517
9501 -1571517 -3252910 -1776010 1572241 2964123 1743392 591399 350775 -734611
9493 -734611 -2247503 -1032049 3069967 5545806 3651324 511210 4652 1168211 961877
9484 961877 -453523 -869086 -182066 198753 391365 1143302 1393731 4307 -1369681
9475 -1369681 -404830 1924334 2641653 1134887 -759510 -2019852 -2642369 -1636431 1614603
9466 1614603 4653551 4297277 1360500 -583696 -779110 -1525149 -2922175 -2206706 606921
9457 606921 1310230 -1921092 -4734999 -2644254 2284736 4393097 1987513 -1595107 -3192556
$$ packed form
9519A889293j515988k698486j466444P95204J467762P69247P02711J061021Q9018
9510A093338j509841j195109Q10309J556750L64748l45589J23742m04196k065669
9501a571517j681393J476900L348251J391882j220731j151993k40624j085386
9493g34611j512892J215454M102016K475839j894482l140114n06558J163559k06334
9484I61877j415400m15563O87020L80819J92612P51937K50429j389424j373988
9475a369681R64851K329164P17319j506766j894397j260342o22517J005938L251034
9466A614603L038948l56274k936777j944196j95414p46039j397026P15469K813627
9457F06921P03309l231322k813907K090745M928990K108361k405584l582620j597449
$$ plain form
9448 -3192556 -2709421 -1274979 512504 2139368 2937045 2742651 1809187 270295 -1457935
9439 -1457935 -2431288 -2433567 -2728254 -4267048 -5792023 -5149798 -2176751 959848 2150898
9430 2150898 1197464 -428497 -935858 277687 1886406 1960037 417438 -789289 -375514
9421 -375514 776600 1547207 2250107 3054114 2544190 -124046 -3017241 -3679556 -2620589
9412 -2620589 -2214928 -2973055 -3480764 -3413998 -3738400 -4154750 -3394027 -2176326 -2593861 -3910415
9402 -3910415 -2513616 2395649 6381963 5464246 1591807 -443467 427142 1315069 467713
9393 467713 -863504 -1386227 -1414751 -1079350 415448 2787727 4071045 3208431 1659118
9384 1659118 1209121 1467863 892549 -588003 -1456222 -842968 363251 833491 377494
$$ packed form
9448c192556M83135J434442J787483J626864P97677j94394r33464j538892j728230
9439a457935r73353k279k94687j538794j524975O42225K973047L136599J191050
9430B150898r53434j625961n07361J213545J608719P3631j542599j206727M13775
9421c75514J152114P70607P02900Q04007n09924k668236k893195o62315J058967
9412b620589M05661p58127n07709O6766l24402m16350P60723J217701m17535j316554
9402c910415J396799M909265L986314r17717l872439k035274Q70609Q87927q47356
9393D67713j331217n22723k8524L35401J494798K372279J283318q62614j549313
9384A659118m49997K58742n75314j480552q68219O13254J206219M70240m55997
$$ plain form
9375 377494 -210165 -396655 -429798 -683557 -1063368 -1348571 -1624818 -1829733 -1373356 -133050
9365 -133050 614469 -313100 -1721096 -1171930 1204388 2323703 712201 -979331 -74692
9356 -74692 1753748 1179228 -1336719 -2401701 -1156140 48415 313193 1315462 3022042
9347 3022042 2618678 -475434 -2539570 -1140728 750096 -416284 -2816066 -2248642 939932
9338 939932 2463258 767899 -1303684 -1591899 -1258512 -1440774 -857762 1538383 4099934
9329 4099934 4563731 3032454 1416501 967444 1401961 1691913 1112860 107858 108971
9320 108971 1675871 3253828 3081230 1768816 1238640 1639581 1515717 683197 315959
9311 315959 180174 -1260287 -3516140 -3998877 -2291303 -1326205 -2741569 -4158103 -3228899
$$ packed form
9375C77494n87659j86490l3143k53759l79811k85203k76247k04915M56377J240306
9365a33050P47519r27569j407996N49166K376318J119315j611502j691532R04639
9356g4692J828440n74520k515947j064982J245561J204555K64778J002269J706580
9347C022042m03364l094112k064136J398842J890824j166380k399782N67424L188574
9338I39932J523326j695359k071583k88215L33387j82262N83012K396145K561551
9329D099934M63797j531277j615953m49057M34517K89952n79053j005002J113
9320A08971J566900J577957j72598j312414n30176M00941j23864q32520l67238
9311C15959j35785j440461k255853m82737J707574R65098j415364j416534R29204
$$ plain form
9302 -3228899 -1506470 -1525934 -2514099 -2259526 -1346251 -1875930 -3148014 -2451074 152920
9293 152920 1520248 353203 -843343 207261 2261724 2749232 1289289 -465329 -1135589
9284 -1135589 -459583 1180510 2903779 3585291 2836459 1453243 512667 365680 586031
9275 586031 382848 -876217 -2856561 -4064894 -3292353 -1202035 362966 539285 -49427
9266 -49427 -770026 -1654584 -2388038 -1943818 58892 2417124 3433393 2633769 1174079
9257 1174079 801247 2277516 4426877 5106370 3696984 2012879 1819062 2212960 945294
9248 945294 -2184527 -5089760 -6394926 -6678041 -6520644 -5419596 -3310125 -1273676 113882
9239 113882 1363717 2207257 1283818 -990727 -1494634 1484262 4910264 4476831 532639
$$ packed form
9302c228899J722429j9464r88165K54573R13275n29679j272084O96940K603994
9293A52920J367328j167045j196546J050604K054463M87508j459943j754618o70260
9284a135589O76006J640093J723269O81512p48832j383216r40576j46987K20351
9275E86031k03183j259065j980344j208333P72541K090318J565001J76319n88712
9266d9427p20599q84558p33454M44220K002710K358232J016269p99624j459690
9257A174079l72832J476269K149361O79493j409386j684105j93817L93898j267666
9248I45294l129821k905233j305166k83115J57397J101048K109471K036449J387558
9239A13882J249835Q43540r23439k274545n03907K978896L426002m33433l944192
$$ plain form
9230 532639 -2237431 -923288 2342615 3681348 1963409 -804950 -2139122 -1305612 248113
9221 248113 336106 -1394233 -2561983 -875565 2486671 4018352 2404676 -60288 -963505
9212 -963505 -540853 -28682 612464 1697537 2214518 1247165 -46393 101021 1253219
9203 1253219 1368776 -115958 -1646251 -1901454 -1089244 120008 1277946 1617984 479797
9194 479797 -1341373 -2100270 -1314209 -150104 524552 833333 448709 -1404301 -3714647
9185 -3714647 -3654847 -247536 3717706 5099707 4171911 3137115 2446878 1074983 -514553
9176 -514553 -489864 1289882 2709527 2256863 605055 -919869 -1728813 -1607874 -708647
9167 -708647 -192725 -1167498 -2676567 -2579732 -829256 181277 -736591 -1723840 -892290
$$ packed form
9230E32639k770070J314143L265903J338733j717939k768359j334172Q33510J553725
9221B48113Q7993j730339j167750J686418L362236J531681j613676k464964r03217
9212i63505M22652N12171O41146J085073N16981r67353j293558J47414J152198
9203A253219J15557j484734j530293k55203Q12210J209252J157938L40038j138187
9194D79797j821170p58897P86061J164105O74656L08781l84624j853010k310346
9185c714647N9800L407311L965242J382001r27796j034796o90237j371895j589536
9176e14553K4689J779746J419645m52664j651808j524924q08944J20939Q99227
9167g08647N15922r74773j509069R6835J750476J010533r17868r87249Q31550
$$ plain form
9158 -892290 834509 1613907 1748837 2689425 3991092 3642388 1303732 -775856 -576595
9149 -576595 1234264 2295836 1369797 -352005 -698964 844744 2327435 1733478 -146580
9140 -146580 -567250 1250057 2733286 1524368 -1031336 -1619042 648045 3389501 4306217
9131 4306217 3642325 2909325 2489017 1448925 -662134 -2625685 -2589520 -324892 2049082
9122 2049082 2243862 457111 -1043552 -821043 518340 2071203 3886272 5735765 6251075
9113 6251075 4573908 1813701 -313560 -1392825 -1832418 -1533741 -257000 1565422 3481616
9104 3481616 5525626 7083003 6648929 4156628 2095949 2406702 3541600 2909747 1186404
9095 1186404 1381284 3963109 5813824 4554320 1593330 29565 1152375 3670136
$$ packed form
9158h92290J726799P79398J34930R40588J301667l48704k338656k079588J99261
9149e76595J810859J061572r26039j721802l46959J543708J482691n93957j880058
9140a46580m20670J817307J483229j208918k555704n87706K267087K741456R16716
9131D306217o63892p33000m20308j040092k111059j963551L6165K264628K373974
9122B049082J94780j786751j500663K22509J339383J552863J815069J849493N15310
9113F251075j677167k760207k127261j079265m39593K98677J276741J822422J916194
9104C481616K044010J557377m34074k492301k060679L10753J134898o31853j723343
9095A186404J94880K581825J850715j259504k960990j563765J122810K517761
$$ plain form
9087 3670136 5151843 3956167 951608 -700629 1135168 4631020 6000765 4278120
9079 4278120 2170189 2075454 3343920 3997555 3292290 1850789 725945 832469 1963260
9070 1963260 2241154 189361 -2605856 -2925616 -290560 2298452 2512029 1231642 79977
9061 79977 -1129588 -3009367 -4702634 -5089714 -4437200 -3465171 -2209938 -1054796 -1238368
9052 -1238368 -2813520 -3626349 -2039783 594310 1893196 1738850 1811818 2689693 3253492
9043 3253492 2641654 1383525 698838 1391325 3001711 3771853 2487462 573459 666643
9034 666643 2620265 3220913 1045118 -926201 445593 3811581 5500985 4592762 2963618
9025 2963618 1569716 -166737 -1844884 -1999552 -624536 599556 715181 203235 -477681
$$ packed form
9087C670136J481707j195676l004559j652237J835797L495852J369745j722645
9079D278120k107931r4735J268466O53635p05265j441501j124844J06524J130791
9070A963260K77894k051793k795217l19760K635056K589012K13577j280387j151665
9061G9977j209565j879779j693267l87080O52514R72029J255233J155142j83572
9052a238368j575152q12829J586566K634093J298886j54346P2968Q77875N63799
9043C253492o11838j258129o84687O92487J610386P70142j284391j914003R3184
9034F66643J953622O00648k175795j971319J371794L365988J689404r08223j629144
9025B963618j393902j736453j678147j54668J375016J224092J15625n11946o80916
$$ plain form
9016 -477681 -1092038 -714651 1258703 3420201 3735036 2360696 1061866 282201 -876419
9007 -876419 -2167983 -2329653 -1597153 -1472238 -1952046 -1624180 -543428 -156054 -213983 1090226
8997 1090226 3471259 4393724 3377862 2951145 4058758 4207090 2084444 403062 1482349
8988 1482349 3223441 2671364 851835 482954 1122102 563525 -556451 172127 2069280
8979 2069280 1853146 -969595 -3128412 -2597337 -1079614 -616432 -962788 -1485458 -2560032
8970 -2560032 -3535809 -2253966 1326400 3598368 2029337 -557309 488823 4945195
8962 4945195 7863009 6359064 3100282 1987631 2979178 3230978 1844958 908821 1938672
8953 1938672 3584001 3798160 2638528 1401622 72648 -2304879 -5034636 -5893902 -4474827
$$ packed form
9016d77681o14357L77387J973354K161498L14835j374340j298830p79665j158620
9007h76419j291564j61670P32500J24915m79808L27866J080752L87374n7929J304209
8997A090226K381033R22465j015862m26717J107613J48332k122646j681382J079287
8988A482349J741092n52077j819529l68881O39148n58577j119976P28578J897153
8979B069280k16134k822741k158817N31075J517723M63182l46356n22670j074574
8970b560032r75777J281843L580366K271968j569031k586646J046132M456372
8962D945195K917814j503945l258782j112651R91547K51800j386020r36137J029851
8953A938672J645329K14159j159632j236906j328974k377527k729757q59266J419075
$$ plain form
8944 -4474827 -3219368 -3815031 -4512599 -3009493 -449472 68907 -1846182 -3574920 -3681399
8935 -3681399 -3414702 -3507193 -2588741 -269966 960338 -730427 -3059104 -2491358 559206
8926 559206 2338917 1238799 -289681 108055 1301714 1002806 -402745 -541367 1110086
8917 1110086 2196119 658614 -2577507 -4969442 -5444401 -4919234 -4152782 -2622274 -72330
8908 -72330 2054169 1965102 -170614 -2436594 -3537841 -3812253 -3865787 -3491342 -2427080
8899 -2427080 -1189595 -529094 -679505 -1423825 -2114434 -1525012 1058171 4174609 5091447
8890 5091447 3229099 1255654 1585911 3224287 3725920 2999859 2915534 3826239 4027936
8881 4027936 2792423 1614987 1749273 2359673 2051511 796478 -614116 -1833625 -2659382
$$ packed form
8944d474827J255459n95663o97568J503106K560021N18379j915089j728738j06479
8935c681399K66697r2491R18452K318775J230304j690765k328677N67746L050564
8926E59206J779711j100118j528480L97736J193659k98908j405551j38622J651453
8917A110086J086033j537505l236121k391935m74959N25167P66452J530508K549944
8908g2330K126499q9067k135716k265980j101247k74412n3534L74445J064262
8899b427080J237485O60501j50411p44320o90609N89422K583183L116438R16838
8890E091447j862348j973445L30257J638376N01633p26061q4325R10705K01697
8881D027936j235513j177436J34286O10400l08162j255033j410594j219509q25757
$$ plain form
8872 -2659382 -2400218 -644990 1789348 3481714 3749178 2953591 1820751 838239 141278
8863 141278 -186981 220967 1553640 2804391 2290024 127160 -997927 798185 3484431
8854 3484431 3712832 1845840 1364745 3222705 4267466 2362632 -300653 -910670 -33285
8845 -33285 537625 1168323 2543559 2779894 168253 -2716033 -1793195 2223607 4467734
8836 4467734 3046599 1409474 2469909 4149165 2950994 -752720 -3534602 -3415629
8828 -3415629 -1385126 615863 1464046 1151481 581380 743904 1490931 1727127 1057788
8819 1057788 175919 -622028 -1790082 -2878887 -2299274 210150 2447096 2381857 666114
8810 666114 -716507 -1014388 -603746 319449 1310158 1100317 -737888 -2487412 -2490183 -1776409
$$ packed form
8872b659382K59164J755228K434338J692366K67464p95587j132840r82512o96961
8863A41278l28259M07948J332673J250751n14367k162864j125087J796112K686246
8854C484431K28401j866992m81095J857960J044761j904834k663285o10017Q77385
8845c3285N70910O30698J375236K36335k611641k884286R22838M016802K244127
8836D467734j421135j637125J060435J679256j198171l703714k781882J18973
8828c415629K030503K000989Q48183l12565n70101J62524P47027K36196o69339
8819A057788q81869p97947j168054j088805N79613K509424K236946o5239j715743
8810F66114j382621k97881M10642R23195R90709k09841j838205j749524k771P13774
$$ plain form
8800 -1776409 -2415773 -3964566 -4015009 -2084360 -363366 -156609 -25845 1472832 3219754
8791 3219754 3193033 1397771 -332570 -726599 -98604 541102 523504 28677 75520 1444632
8781 1444632 3215019 3261277 855825 -2157965 -3633933 -3593216 -3307646 -2902236 -1570840
8772 -1570840 265675 928542 -128637 -1428581 -1417494 -31851 2050170 4292288 5807024
8763 5807024 5446428 3390461 1421474 571030 -202783 -1736518 -2633633 -1539993 -147925
8754 -147925 -1139661 -3661177 -3997501 -1119049 1594043 1316150 -465205 -965856 -240456
8745 -240456 206417 823836 2866811 5033989 4585370 1596104 -871156 -1096433 -521913
8736 -521913 -656298 -706148 534293 2408167 3415970 3199794 2338880 1203341 4886
$$ packed form
8800a776409o39364j548793n0443J930649J720994K06757J30764J498677J746922
8791C219754k6721j795262j730341l94029O27995O39706j7598m94827M6843J369112
8781A444632J770387M6258k405452l013790j475968M0717K85570M05410J331396
8772a570840J836515O62867j057179j299944J1087J385643K082021K242118J514736
8763E807024l60596k055967j968987q50444p73813j533735q97115J093640J392068
8754a47925r91736k521516l36324K878452K713092k77893j781355n00651P25400
8745b40456M46873O17419K042975K167178m48619k989266k467260k25277N74520
8736e21913j34385m9850J240441J873874J007803k16176q60914j135539j198455
$$ plain form
8727 4886 -924850 -1812422 -3552764 -6185809 -7910748 -6671941 -2639485 1487105 2799774
8718 2799774 872339 -1727314 -1937351 487774 2793782 2831364 1686300 1522055 2119223
8709 2119223 1732314 600033 810500 2585578 3522591 2330700 751680 500305 582452
8700 582452 -616997 -2315840 -2337449 -178606 2416242 3348913 1811979 -1085314 -2766280
8691 -2766280 -1469904 1366911 2481159 1103332 39101 1523962 4065767 4880441
8683 4880441 3633520 1996267 990250 626068 984197 1850310 2160236 1304687 159551
8674 159551 -307458 -355232 -414534 -184728 130445 -590594 -2312774 -3261891 -2794376 -2658224
8664 -2658224 -3741879 -4072228 -2237025 -237631 -225106 -863072 -80193 934251 111410
$$ packed form
8727D886r29736q87572j740342k633045j724939J238807M032456M126590J312669
8718B799774j927435k599653k10037K425125K306008L7582j145064j64245N97168
8709B119223l86909j132281K10467J775078R37013j191891j579020k51375Q2147
8700E82452j199449j698843k1609K158843K594848R32671j536934k897293j680966
8691b766280J296376K836815J114248j377827j064231J484861K541805Q14674
8683D880441j246921j637253j006017l64182L58129Q66113L09926q55549j145136
8674A59551m67009m7774n9302K29806L15173p21039j722180r49117M67515J36152
8664b658224j083655l30349J835203J999394J2525o37966P82879J014444q22841
$$ plain form
8655 111410 -1304962 -1027006 -236569 -1256795 -2381306 -310254 3227368 3115894 -814977
8646 -814977 -2980662 -613665 2452757 2378088 497026 -480621 -719611 -879511 271503
8637 271503 2735202 3537232 1345052 -651169 129631 1067445 -1148098 -4408008 -4192306
8628 -4192306 -649091 2038084 2154068 1695110 1560256 76541 -2977857 -4687734 -2850108
8619 -2850108 946257 3401745 3063109 1004573 -710039 -648402 912128 2194781 1856475
8610 1856475 519590 -294715 -180502 98805 -120103 -1067138 -2679024 -4006810 -3447031
8601 -3447031 -868878 1432204 1365462 -250185 -1133662 -752121 -289101 -183577 254566
8592 254566 1095626 1535733 1330303 956344 502346 -198818 -609355 -109219 681078 643926
$$ packed form
8655A11410j416372K77956P90437j020226j124511K071052L537622j11474l930871
8646h14977k165685K366997L066422p4669j881062r77647k38990j59900J151014
8637B71503K463699Q02030k192180j996221P80800R37814k215543l259910K15702
8628d192306L543215K687175J15984m58958j34854j483715l054398j709877J837626
8619b850108L796365K455488l38636k058536j714612O1637J560530J282653l38306
8610A856475j336885q14305J14213K79307k18908r47035j611886j327786N59779
8601c447031K578153K301082o6742j615647q83477L81541M63020J05524M38143
8592B54566Q41060M40107k05430l73959m53998p01164m10537N00136P90297l7152
$$ plain form
8582 643926 7339 25479 964848 1706812 1236462 -524211 -2978349 -4895157 -4849208 -2886729
8572 -2886729 -1040105 -802580 -948912 475229 2880085 3871974 2631272 407153 -1876266
8563 -1876266 -4182675 -5771342 -5505130 -3938913 -2890946 -2721209 -2212402 -1308376 -1456468
8554 -1456468 -2655894 -2730814 -646974 1681936 2251133 1714808 1776349 2415837 2371435 1313851
8544 1313851 71119 -633817 -632078 -161711 -2421 -952409 -2579810 -3437405 -3007707 -2263571
8534 -2263571 -1793404 -865020 809620 1934145 1453622 186721 -634194 -1127650 -1604581
8525 -1604581 -998914 1568758 4548024 5451355 4241441 3146274 3106601 2542590 272827
8516 272827 -2165048 -2330268 -51857 2315448 2431671 102651 -2845696 -4349528 -3938974
$$ packed form
8582F43926o36587J8140R39369P41964m70350j760673k454138j916808M5949J962479
8572b886729J846624K37525j46332J424141K404856R91889j240702k224119k283419
8563a876266k306409j588667K66212J566217J047967J69737N08807R04026j48092
8554a456468j199426p4920K083840K328910N69197n36325O1541O39488m4402j057584
8544A313851j242732p04936J739M70367J59290r49988j627401q57595M29698P44136
8534b263571M70167R28384J674640J124525m80523j266901q20915m93456m76931
8525a604581O05667K567672K979266R03331j209914j095167l9673n64011k269763
8516B72827k437875j65220K278411K367305J16223k329020k948347j503832M10554
$$ plain form
8507 -3938974 -3035659 -3263063 -4523050 -5250214 -4579346 -3466440 -3267322 -3932920 -4307506
8498 -4307506 -3710971 -2381935 -664721 1222155 2604049 2615533 1418671 239395 -307750
8489 -307750 -982535 -2259455 -2879070 -1282293 2073540 5080517 6243438 5367788 2679010
8480 2679010 -895601 -2944774 -1463206 2093222 3929255 2775415 1247445 1366340
8472 1366340 1534978 -90675 -1902131 -1431103 314669 515093 -680808 -679203 798240
8463 798240 1283633 125017 -242651 1430944 3036220 2694486 1569823 1290142 1222049
8454 1222049 459837 159574 1333669 2264859 1078182 -471674 883094 4476677 5734692
8445 5734692 2234403 -3072700 -5912178 -5697060 -4749385 -4161564 -2802227 -60134 2621833
$$ packed form
8507c938974R03315k27404j259987p27164O70868J112906J99118o65598l74586
8498d307506N96535J329036J717214J886876J381894J1484j196862j179276n47145
8489c07750o74785j276920o19615J596777L355833L006977J162921q75650k688778
8480B679010l574611k049173J481568L556428J836033j153840j527970J18895
8472A366340J68638j625653j811456M71028J745772K00424j195901J605J477443
8463G98240M85393j158616l67668J673595J605276l41734j124663k79681o8093
8454A222049p62212l00263J174095R31190j186677j549856J354768L593583J258015
8445E734692l500289n307103k839478K15118R47675N87821J359337K742093K681967
$$ plain form
8436 2621833 3654752 3365460 3148057 3383947 3347014 2755997 2167842 1843707 1450965 1135526
8426 1135526 1629692 2754140 3048063 1740077 49677 -391652 529966 1880645 2893374
8417 2893374 2783109 918179 -1414765 -1201087 2237392 5060585 3621471 -1865 -734440
8408 -734440 1964516 3486604 1331331 -1394037 -1328835 211441 285583 -701819 -285373
8399 -285373 1623936 2711166 1876718 380787 -341995 -195524 102855 -109037 -795872
8390 -795872 -844779 835432 3311625 4001774 1795733 -1531644 -3694070 -4086305 -2970087
8381 -2970087 -613177 1596076 1421101 -1142255 -3006875 -1993569 180493 716648 -482669
8372 -482669 -1916973 -3265276 -4533625 -4339284 -1938094 539916 769243 -241951 -233283
$$ packed form
8436B621833J032919k89292k17403K35890l6933n91017n88155l24135l92742l15439
8426A135526M94166J124448K93923j307986j690400m41329R21618J350679J012729
8417B893374j10265j864930k332944K13678L438479K823193j439114l623336p32575
8408g34440K698956J522088k155273k725368O5202J540276P4142r87402M16446
8399b85373J909309J087230q34448j495931p22782J46471K98379k11892o86835
8390g95872m8907J680211K476193O90149k206041l327377k162426l92235J116218
8381b970087K356910K209253j74975k563356j864620J013306K174062N36155j199317
8372d82669j434304j348303j268349J94341K401190K478010K29327j011194Q668
$$ plain form
8363 -233283 202210 -953704 -2782971 -2398591 158667 1793442 1196991 257097 283191
8354 283191 238848 -551517 -1001557 -451971 331224 990286 1959737 2665974 1966513 674696
8344 674696 829505 2149692 2280200 951434 459967 1306487 1116749 -817542 -1779614
8335 -1779614 -333767 906187 -246017 -1663114 -614921 1415823 1172881 -1063745
8327 -1063745 -2166214 -1004883 596576 1113781 827386 482415 602139 1633670 2998626
8318 2998626 2876026 744633 -1005422 -124180 1940237 1947766 -509175 -2830196 -3337613
8309 -3337613 -2820895 -2291002 -1601746 -572245 417439 1172692 1558544 873430 -1033519
8300 -1033519 -2455885 -1581276 736434 2032130 1898832 2305311 4055715 5345558 4641387
$$ packed form
8363b33283M35493j155914j829267L84380K557258J634775n96451r39894K6094
8354B83191m4343p90365m50040N49586P83195O59062R69451P06237o99461j291817
8344F74696J54809J320187J30508j328766m91467Q46520j89738j934291r62072
8335a779614J445847J239954j152204j417097J048193K030744k42942k236626
8327a063745j102469J161331J601459N17205k86395l44971J19724J031531J364956
8318B998626j22600k131393j750055Q81242K064417P529k456941k321021n07417
8309c337613N16718N29893O89256J029501R89684P55253L85852o85114j906949
8300a033519j422366Q74609K317710J295696j33298M06479J750404J289843p04171
$$ plain form
8291 4641387 2912044 1808979 1218607 -15264 -1940335 -3330842 -3232118 -1875200 -348334
8282 -348334 179317 -784139 -2695787 -4453378 -5249518 -4933577 -3922087 -3004948 -2752146
8273 -2752146 -2844726 -2644795 -2547695 -3526447 -4930155 -4565804 -2151343 -738228 -2662433
8264 -2662433 -5684249 -5815968 -2987152 -958326 -1985987 -4492721 -6072725 -5954568 -4149909
8255 -4149909 -1038943 1472701 1157299 -1128315 -1835562 254762 2036140 760517 -1791766
8246 -1791766 -2096763 89767 2037897 2119577 1115367 187009 -221626 138773 1004670
8237 1004670 1047898 -588827 -2460675 -2315717 -367575 689522 -818967 -3594667 -5314490
8228 -5314490 -5112857 -3551072 -1450268 305241 788312 61867 -244809 1438601 4444233
$$ packed form
8291D641387j729343j103065n90372j233871j925071j390507R8724J356918J526866
8282c48334N27651r63456j911648j757591p96140L15941J011490R17139K52802
8273b752146r2580J99931R7100r78752j403708L64351K414461J413115j924205
8264b662433l021816j31719K828816K028826j027661k506734j580004J18157J804659
8255d149909L110966K511644l15402k285614p07247K090324J781378j275623k552283
8246a791766l04997K186530J948130Q1680j004210r28358m08635L60399Q65897
8237A004670M3228j636725j871848J44958J948142J057097j508489k775700j719823
8228e314490K01633J561785K100804J755509M83071p26445l06676J683410L005632
$$ plain form
8219 4444233 6384487 6135353 5189565 5226734 5407614 3775064 963680 221717 2939102
8210 2939102 6238815 6646653 4503613 2564752 1515493 -222046 -2629616 -3221743 -806833
8201 -806833 2401486 3643310 2734354 1213213 -17402 -984427 -1742161 -2177921 -2030530
8192 -2030530 -941990 490596 206423 -2823645 -6032233 -5952938 -3412749 -2572879 -4313561
8183 -4313561 -4777256 -1995230 657209 413706 -39636 2175038 4062622 1449207 -3130912
8174 -3130912 -3573803 224405 2513285 1154199 192911 1827582 2426478 -597607 -3522636
8165 -3522636 -1912747 2555097 5029620 4382457 3120945 2439823 1352092 -241367 -1065501
8156 -1065501 -830599 -629332 -1179642 -2377851 -3995178 -5323942 -5036931 -2902809 -625950
$$ packed form
8219D444233J940254k49134r45788L7169J80880j632550k811384p41963K717385
8210B939102L299713M07838k143040j938861j049259j737539k407570n92127K414910
8201h06833L208319J241824r08956j521141j230615r67025p57734m35760J47391
8192b030530J088540J432586k84173l030068l208588P9295K540189Q39870j740682
8183d313561m63695K782026K652439k43503m53342K214674J887584k613415m580119
8174c130912m42891L798208K288880j359086r61288J634671N98896l024085k925029
8165c522636J609889M467844K474523o47163j261512o81122j087731j593459q24134
8156a065501K34902K01267n50310j198209j617327j328764K87011K134122K276859
$$ plain form
8147 -625950 436692 1097885 2333282 3022770 1732667 -581674 -1863789 -1847348 -1502091
8138 -1502091 -753003 841875 2160399 1893339 1101619 1720942 3120411 2979040 1197089
8129 1197089 -59187 -110625 -439875 -1371538 -1320227 -118294 56501 -1654208 -3054341
8120 -3054341 -2389699 -953522 -345070 411388 2646541 4907699 4760123 2548361 783478
8111 783478 465791 403105 -190893 -766894 -1190896 -2298770 -4147909 -5364376 -4989735
8102 -4989735 -3787814 -2933807 -2292880 -924281 1085314 2175038 975856 -1889415 -4138163
8093 -4138163 -4159720 -2621715 -1275677 -664223 -76587 481667 -40542 -1581899 -2203739
8084 -2203739 -749389 1047595 755853 -1357383 -2984022 -3296255 -3674028 -4811781 -5262486
$$ packed form
8147f25950J062642O61193J235397O89488j290103k314341j282115J6441L45257
8138a502091P49088J594878J318524k67060p91720O19323J399469j41371j781951
8129A197089j256276n1438l29250r31663N1311J201933J74795j710709j400133
8120c054341O64642J436177O08452P56458K235153K261158j47576k211762j764883
8111G83478l17687o2686n93998n76001m24002j107874j849139j216467L74641
8102d989735J201921Q54007O40927J368599K009595J089724j199182k865271k248748
8093d138163k1557J538005J346038O11454N87636N58254n22209j541357o21840
8084b203739J454350J796984k91742k113236j626639l12233l77773j137753m50705
$$ plain form
8075 -5262486 -3793608 -1574325 -658221 -1211934 -1639946 -1066120 -336522 -380971 -698469
8066 -698469 -219113 874152 1196918 150754 -1115401 -1419854 -1410920 -2436513 -3979009
8057 -3979009 -4042196 -2386032 -1327676 -2210247 -3008842 -1324299 1783162 3385119 3033755
8048 3033755 2595999 2251331 166625 -3244130 -4318078 -1258691 2584186 3008301 429986
8039 429986 -1623894 -1834473 -1801159 -2381631 -2633373 -2357595 -2652695 -3405625 -2949751 -1125205
8029 -1125205 -228622 -1650857 -3673893 -4094808 -3215941 -2564846 -2283892 -1789390 -1731736
8020 -1731736 -2955028 -4180160 -3138393 -15852 2361098 2175306 619524 -379343 -726999
8011 -726999 -1341036 -2021721 -1656839 -180563 932804 397529 -1290859 -2360639 -1693200
$$ packed form
8075e262486J468878K219283R16104n53713m28012N73826P29598m4449l17498
8066f98469M79356J093265L22766j046164j266155l04453Q934j025593j542496
8057c979009o3187J656164J058356q82571p98595J684543L107461J601957l51364
8048C033755m37756l44668k084706l410755j073948L059387L842877M24115k578315
8039D29986k053880k10579L3314n80472k51742K75778k95100p52930M55874J824546
8029a125205Q96583j422235k023036m20915Q78867O51095K80954M94502N7654
8020a731736j223292j225132J041767L122541K376950j85792j555782r98867l47656
8011g26999o14037o80685L64882J476276J113367n35275j688388j069780O67439
$$ plain form
8002 -1693200 64110 1470896 2093583 2684696 3496495 3442690 1724953 -574870 -1822852
7993 -1822852 -2231241 -3296401 -4935011 -5101023 -2880707 -209876 669677 81271 -225042
7984 -225042 23932 -261632 -1054924 -958432 292105 938476 -249799 -1860719 -1574975
7975 -1574975 638326 2384807 1844859 -180764 -1541747 -1232002 -35466 779317 615850
7966 615850 -426298 -1805483 -2579414 -1956031 -336764 724754 228830 -1009455 -1448767
7957 -1448767 -746466 190863 641067 508123 -308107 -1609940 -2065060 -330760 2596594
7948 2596594 3817167 2114656 -383311 -1107866 -99320 1104831 2018792 2754149 2338133
7939 2338133 -15939 -2563205 -2618628 -562670 330792 -1347752 -3095995 -2441073 -659046
$$ packed form
8002a693200J757310J406786O22687N91113Q11799n3805j717737k299823j247982
7993a822852m08389j065160j638610j66012K220316K670831Q79553n88406l06313
7984b25042K48974k85564p93292R6492J250537O46371j188275j610920K85744
7975a574975K213301J746481n39948k025623j360983L09745J196536Q14783j63467
7966F15850j042148j379185p73931O23383J619267J061518m95924j238285m39312
7957a448767P02301R37329M50204j32944q16230j301833m55120J734300K927354
7948B596594J220573j702511k497967p24555J008546J204151R13961P35357m16016
7939B338133k354072k547266n5423K055958Q93462j678544j748243O54922J782027
$$ plain form
7930 -659046 -596734 -2298174 -3104673 -1551584 880932 1978831 1211122 -363644 -1462853
7921 -1462853 -1465604 -718629 -267034 -749399 -1488149 -1261162 9707 1031499 719322 -676772
7911 -676772 -2211364 -3297635 -3767069 -3536523 -2786342 -2071138 -1727351 -1457763 -920785
7902 -920785 -306518 244628 1287125 3177431 4809728 4499739 2334588 418044 248429
7893 248429 1000684 1165032 713950 515219 634169 649173 798444 1187989 686337 -1364363
7883 -1364363 -3014066 -1828933 1134850 2477549 1786093 2280673 5042447 6493343 4085270
7874 4085270 988888 1504781 4438189 5320013 3495305 2252619 2585494 1801955 -1067192
7865 -1067192 -3030855 -1841872 749798 2211397 2558085 2682578 2260482 1303086 1237134
$$ packed form
7930f59046O2312j701440q06499J553089K432516J097899p67709j574766j099209
7921a462853k751P46975M51595m82365p38750K26987J270869J021792l12177j396094
7911f76772j534592j086271m69434K30546P50181P15204L43787K69588N36978
7902i20785O14267N51146J042497J890306J632297l09989k165151j916544j69615
7893B48429P52255J64348m51082j98731J18950J5004J49271L89545n01652k050700
7883a364363j649703J185133K963783J342699o91456M94580K761774J450896k408073
7874D085270l096382N15893K933408Q81824j824708j242686L32875p83539k869147
7865a067192j963663J188983K591670J461599L46688J24493m22096r57396o5952
$$ plain form
7856 1237134 2433763 2999693 1931823 1030950 1603982 1853601 108997 -1802681 -1465306
7847 -1465306 -44516 -122926 -1070883 -421101 1188033 549322 -2754529 -5347087 -4971779
7838 -4971779 -3145270 -2097514 -1966748 -2069885 -2416943 -2732124 -2004410 -143745 1525135
7829 1525135 2126918 1975393 1119313 -788501 -2693364 -2566413 -477610 1103143 1064069
7820 1064069 1104233 2021827 1510123 -1817393 -4712445 -3145504 1448394 3602532 1367143
7811 1367143 -1234211 -262929 2780932 3680496 1479065 -837763 -888992 273952 290708
7802 290708 -1206183 -2400725 -1674316 730224 3208597 4264231 3487139 1671574 176983
7793 176983 -191020 152461 244075 -169326 -547763 -665761 -938625 -1375580 -1197363 -141930
$$ packed form
7856A237134J196629N65930j067870r00873N73032K49619j744604j911678L37375
7847a465306J420790p8410r47957O49782J609134o38711l303851k592558L75308
7838d971779J826509J047756J30766j03137l47058l15181P27714J860665J668880
7829A525135O01783j51525q56080j907814j904863J26951K088803J580753l9074
7820A064069M0164R17594n11704l327516k895052J566941M593898K154138k235389
7811A367143k601354R71282L043861Q99564k201431k316828n1229J162944J6756
7802B90708j496891j194542P26409K404540K478373J055634p77092j815565j494591
7793A76983l68003L43481R1614m13401l78437j17998k72864m36955J78217J055433
$$ [...]
##END NTUPLES=NMR SPECTRUM
##END=
