##TITLE=31Pdec_3PEPPA0607-1
 CD3CN, 124 sc
 7.07.2021
##JCAMPDX= 6.0         $$ Bruker NMR JCAMP-DX V2.0
##DATA TYPE= NMR SPECTRUM
##DATA CLASS= NTUPLES
##ORIGIN= UXNMR, Bruker Analytische Messtechnik GmbH
##OWNER= root
$$ XWIN-NMR		Version 3.5
$$ Wed Jul  7 09:57:14 2021 Russian Standard Time (UT+4h)  she@DPX200
##.OBSERVE FREQUENCY= 81.013821
##.OBSERVE NUCLEUS= ^31P
##.ACQUISITION MODE= SIMULTANEOUS
##.ACQUISITION SCHEME= undefined
##.AVERAGES= 124
##.DIGITISER RES= 16
##SPECTROMETER/DATA SYSTEM= spect
##.PULSE SEQUENCE= zgpg30
##.SOLVENT NAME= CD3CN
##.SHIFT REFERENCE= (INTERNAL, CD3CN, 0, 248.564)
##AUDIT TRAIL= $$ (NUMBER, WHEN, WHO, WHERE, WHAT)
$$ ##TITLE= Audit trail, XWIN-NMR		Version 3.5
$$ ##JCAMPDX= 5.01
$$ ##ORIGIN= Bruker BioSpin GmbH
$$ ##OWNER= she
$$ F:/spectra/data/she/nmr/P31/1/pdata/1/auditp.txt
$$ ##AUDIT TRAIL=  $$ (NUMBER, WHEN, WHO, WHERE, WHAT)
(   1,<2021-07-07 09:56:11.89 +0400>,<she>,<DPX200>,
      <continue with go, POWCHK disabled, PULCHK disabled
       configuration hash MD5:
       00 E9 B6 7A A2 85 ED C7 34 08 36 98 17 FE 4E 26
       data hash MD5: 32K
       7E C5 16 9F 5A 11 57 61 83 B4 79 AD 9B 35 B9 4F>)
(   2,<2021-07-07 09:56:14.25 +0400>,<she>,<DPX200>,
      <Start of raw data processing
       efp BC_mod = 2 LB = 1 FT_mod = 6 PKNL = 1 PHC0 = -7402.702 PHC1 = 155.8859 SI = 64K 
       data hash MD5: 64K
       3E 0A D7 2C 6A 6B 9F 75 DF B5 41 49 D9 1E E6 E8>)
(   3,<2021-07-07 09:56:29.37 +0400>,<she>,<DPX200>,
      <pk PHC0 = -90.37793 PHC1 = 6.8 
       data hash MD5: 64K
       5B 7A 42 41 DB D8 D4 77 9D 3F EE 18 1F 87 68 42>)
(   4,<2021-07-07 09:56:32.67 +0400>,<she>,<DPX200>,
      <abs ABSG = 5 
       data hash MD5: 64K
       95 13 76 6C 60 83 08 33 E3 93 99 B2 FF 38 17 2E>)
$$ ##END=
$$ 
$$ hash MD5
$$ 5B 44 B0 43 68 D4 4D 6C D6 17 E0 F2 42 67 E8 57
##$RELAX= 
##$RELAX= 
##$RELAX= 
##$RELAX= 
##$RELAX= 
##$RELAX= 
##$RELAX= 
##$RELAX= 
$$ Bruker specific parameters
$$ --------------------------
##$DU= <F:/spectra>
##$EXPNO= 1
##$NAME= <P31>
##$PROCNO= 1
##$TYPE= <nmr>
##$USER= <she>
##$AMP= (0..31)
100 100 100 100 100 100 100 100 100 100 100 100 100 100 100 100 100 100 
100 100 100 100 100 100 100 100 100 100 100 100 100 100 
##$AQSEQ= 0
##$AQ_mod= 1
##$AUNM= <au_zg>
##$AUTOPOS= <>
##$BF1= 81.014009
##$BF2= 200.13
##$BF3= 200.13
##$BF4= 200.13
##$BF5= 200.13
##$BF6= 200.13
##$BF7= 200.13
##$BF8= 200.13
##$BYTORDA= 1
##$CFDGTYP= 0
##$CFRGTYP= 5
##$CHEMSTR= <none>
##$CNST= (0..31)
1 1 145 1 1 1 1 1 1 1 1 1 1 1 1 1 1 1 1 1 1 1 1 1 1 1 1 1 1 1 1 1 
##$CPDPRG= <waltz16>
##$CPDPRG1= <>
##$CPDPRG2= <waltz16>
##$CPDPRG3= <>
##$CPDPRG4= <mlev>
##$CPDPRG5= <mlev>
##$CPDPRG6= <mlev>
##$CPDPRG7= <mlev>
##$CPDPRG8= <mlev>
##$CPDPRGB= <>
##$CPDPRGT= <>
##$D= (0..31)
0 1 0 0 0 0 0 0 0 0 0 0.03 2e-05 3e-06 0 0 0 0 0 0 0 0 0 0 0 0 0 0 0 0 
0 0 
##$DATE= 1625637202
##$DBL= (0..7)
120 120 120 11 120 120 24 19 
##$DBP= (0..7)
150 150 150 150 150 150 150 150 
##$DBP07= 0
##$DBPNAM0= <>
##$DBPNAM1= <>
$$ [...]
##$SUBNAM3= <"">
##$SUBNAM4= <"">
##$SUBNAM5= <"">
##$SUBNAM6= <"">
##$SUBNAM7= <"">
##$SUBNAM8= <"">
##$SUBNAM9= <"">
##$SW= 501.771253377433
##$SWIBOX= (0..15)
0 1 3 0 0 0 0 0 0 0 0 0 0 0 0 0 
##$SW_h= 40650.406504065
##$TD= 32768
##$TD0= 1
##$TE= 0
##$TE2= 300
##$TE3= 300
##$TEG= 300
##$TL= (0..7)
0 120 53 12 22 120 120 120 
##$TP= (0..7)
150 150 150 150 150 150 150 150 
##$TP07= 0
##$TPNAME0= <>
##$TPNAME1= <>
##$TPNAME2= <>
##$TPNAME3= <>
##$TPNAME4= <>
##$TPNAME5= <>
##$TPNAME6= <>
##$TPNAME7= <>
##$TPOAL= (0..7)
0.5 0.5 0.5 0.5 0.5 0.5 0.5 0.5 
##$TPOFFS= (0..7)
0 0 0 0 0 0 0 0 
##$TUNHIN= 0
##$TUNHOUT= 0
##$TUNXOUT= 0
##$USERA1= <user>
##$USERA2= <user>
##$USERA3= <user>
##$USERA4= <user>
##$USERA5= <user>
##$V9= 5
##$VALIST= <valist>
##$VCLIST= <CCCCCCCCCCCCCCC>
##$VD= 0
##$VDLIST= <DDDDDDDDDDDDDDD>
##$VPLIST= <PPPPPPPPPPPPPPP>
##$VTLIST= <TTTTTTTTTTTTTTT>
##$WBST= 1024
##$WBSW= 4
##$XGAIN= (0..3)
0 0 0 0 
##$XL= 0
##$YL= 0
##$YMAX_a= 5039
##$YMIN_a= -2635
##$ZGOPTNS= <>
##$ZL1= 120
##$ZL2= 120
##$ZL3= 120
##$ZL4= 120
##$ABSF1= 248.5645
##$ABSF2= -253.2056
##$ABSG= 5
##$ABSL= 3
##$ALPHA= 0
##$AQORDER= 0
##$ASSFAC= 0
##$ASSFACI= 0
##$ASSFACX= 0
##$ASSWID= 0
##$AUNMP= <proc_1d>
##$AZFE= 0.1
##$AZFW= 0.5
##$BCFW= 0
##$BC_mod= 2
##$BYTORDP= 0
##$COROFFS= 0
##$CY= -3
##$DATMOD= 1
##$DC= 0
##$DFILT= <>
##$DTYPP= 0
##$F1P= 0
##$F2P= 0
##$FCOR= 1
##$FTSIZE= 65536
##$FT_mod= 6
##$GAMMA= 0
##$GB= 0
##$INTBC= 1
##$INTSCL= 5.30512e-09
##$ISEN= 30
##$LB= 1
##$LEV0= 0
##$LPBIN= 0
##$MAXI= 10000
##$MC2= 0
##$MEAN= 0
##$ME_mod= 0
##$MI= 50
##$NCOEF= 0
##$NC_proc= -6
##$NLEV= 6
##$NOISF1= 182.463
##$NOISF2= 159.3651
##$NSP= 0
##$NTH_PI= 0
##$NZP= 0
##$OFFSET= 248.5645
##$PC= 4
##$PHC0= -7493.08
##$PHC1= 162.6859
##$PH_mod= 1
##$PKNL= yes
##$PPARMOD= 0
##$PSCAL= 0
##$PSIGN= 0
##$REVERSE= no
##$SF= 81.014009
##$SI= 65536
##$SIGF1= 159.3651
##$SIGF2= -187.1042
##$SINO= 113.3802
##$SIOLD= 16384
##$SREGLST= <1H.CDCl3>
##$SSB= 0
##$STSI= 65536
##$STSR= 0
##$SW_p= 40650.406504065
##$SYMM= 0
##$S_DEV= 0
##$TDeff= 32768
##$TDoff= 0
##$TI= <>
##$TILT= no
##$TM1= 0
##$TM2= 0
##$TOPLEV= 0
##$USERP1= <user>
##$USERP2= <user>
##$USERP3= <user>
##$USERP4= <user>
##$USERP5= <user>
##$WDW= 1
##$XDIM= 65536
##$YMAX_p= 275607257
##$YMIN_p= -44973104
$$ End of Bruker specific parameters
$$ ---------------------------------
##NTUPLES= NMR SPECTRUM
##VAR_NAME=  FREQUENCY,     SPECTRUM/REAL,   SPECTRUM/IMAG
##SYMBOL=    X,             R,               I
##VAR_TYPE=  INDEPENDENT,   DEPENDENT,       DEPENDENT
##VAR_FORM=  AFFN,          ASDF,            ASDF
##VAR_DIM=   65536,         65536,           65536
##UNITS=     HZ,            ARBITRARY UNITS, ARBITRARY UNITS
##FACTOR=    0.620285442955139, 1,           1
##FIRST=     20137.2065510759, 0,            0
##LAST=      -20513.1999529892, 0,           0
##MIN=       -20513.1999529892, -44973104,   0
##MAX=       20137.2065510759, 275607257,    0
$$ Real data points
##PAGE= N=1
##DATA TABLE= (X++(R..R)), XYDATA
$$ [...]
$$ plain form
13123 -3517641 -3841401 -2031718 -177281 941210 2189463 3536215 4226374 4983499 6739809
13114 6739809 7532105 4443305 -1138299 -4097074 -2258768 1119410 2462130 1794201
13106 1794201 352091 -1820131 -3982699 -3937910 -1415050 789243 1093899 1434438 3161486
13097 3161486 4108616 2573009 934878 1842882 3562134 2983388 1102532 1395200 4112770
13088 4112770 6155620 5903321 4669436 3768354 3174219 2761823 2327066 970010 -1278705
13079 -1278705 -2404113 -1480352 -1073427 -3261030 -5015742 -1985750 4059691 6636788
13071 6636788 3676783 206510 547055 2575389 2238252 -187992 -1734138 -1946534 -2784250
13062 -2784250 -4547861 -5119612 -3149188 145902 2489241 2546454 532198 -2102408 -3590864
$$ packed form
13123c517641l23760J809683J854437J118491J248253J346752O90159P57125J756310
13114F739809P92296l088800n581604k958775J838306L378178J342720o67929
13106A794201j442110k172222k162568M4789K522860K204293L04656L40539J727048
13097C161486R47130j535607j638131R08004J719252n78746j880856K92668K717570
13088D112770K042850k52299j233885r01082n94135m12396m34757j357056k248715
13079a278705j125408R23761M06925k187603j754712L029992O045441K577097
13071F636788k960005l470273L40545K028334l37137k426244j546146k12396q37716
13062b784250j763611n71751J970424L295090K343339N7213k014256k634606j488456
$$ plain form
13053 -3590864 -3150842 -1454615 204669 812930 -58061 -1832327 -2780365 -1474330 1352669
13044 1352669 3568764 4453195 5241833 6420722 6374436 4063939 1517098 1591031 3801024
13035 3801024 4464321 1407182 -3054849 -4871476 -3149410 -949908 -1164539 -2890734
13027 -2890734 -2916772 -172506 2829427 3297720 1561300 258753 995120 2844253 3689081
13018 3689081 2163338 -1303260 -4534457 -5138264 -2833445 137008 1579187 1640984 1691724
13009 1691724 1859433 1096775 -874593 -3205183 -5221583 -6684834 -6992716 -5611701 -3282565
13000 -3282565 -1457427 -530216 169515 805610 854677 356794 -186246 -1111811 -3103315
12991 -3103315 -5284219 -5692883 -4151985 -2792883 -2889677 -3017276 -1693742 -238992 -980407
$$ packed form
13053c590864M40022J696227J659284O08261q70991j774266r48038J306035K826999
13044A352669K216095Q84431P88638J178889m6286k310497k546841P3933K209993
13035C801024O63297l057139m462031j816627J722066K199502k14631j726195
13027b890734k6038K744266L001933M68293j736420j302547P36367J849133Q44828
13018C689081j525743l466598l231197o03807K304819K970453J442179O1797N0740
13009A691724J67709p62658j971368k330590k016400j463251l07882J381015K329136
13000c282565J825138R27211O99731O36095M9067m97883n43040r25565j991504
12991c103315k180904m08664J540898J359102r6794j27599J323534J454750p41415
$$ plain form
12982 -980407 -3333033 -3829613 -437467 4651738 7410825 6351145 3482107 1182808
12974 1182808 -541674 -2929069 -5565400 -6270328 -4000324 -364834 2420616 3817234
12966 3817234 4307821 3778661 2019216 -19467 -1124970 -1644267 -2921255 -4991947 -6145844
12957 -6145844 -4979159 -2026253 771379 1739252 790758 -632811 -1351013 -2021551 -3711164
12948 -3711164 -5082292 -3425730 748432 3130240 1511665 -743314 -37724 1569794
12940 1569794 -18867 -3691018 -4769263 -2904172 -2536259 -5150527 -6904725 -5536894
12932 -5536894 -4052842 -4861254 -5337184 -2929492 -367193 -1238925 -3619637 -3064728 136038
12923 136038 1688952 191453 -1478716 -1449483 -1137509 -1715396 -2072051 -1303671 -209102
$$ packed form
12982i80407k352626m96580L392146N089205K759087j059680k869038k299299
12974A182808j724482k387395k636331p04928K270004L635490K785450J396618
12966C817234M90587n29160j759445k038683j105503n19297j276988k070692j153897
12957f145844J166685K952906K797632R67873r48494j423569p18202o70538j689613
12948c711164j371128J656562M174162K381808j618575k254979P05590J607518
12940A569794j588661l672151j078245J865091L67913k614268j754198J367831
12932e536894J484052q08412m75930K407692K562299q71732k380712N54909L200766
12923A36038J552914j497499j670169K9233L11974n77887l56655P68380J094569
$$ plain form
12914 -209102 703573 2073250 3595868 3569921 1681430 59970 314086 1406791 1733504
12905 1733504 1579617 2107308 3294393 4255628 4505826 3736726 1506360 -1542809 -3202644
12896 -3202644 -1956083 865197 2441643 1523794 -874532 -3161016 -4360636 -4255250
12888 -4255250 -3643779 -3956591 -5270118 -5298962 -2058848 2874493 5781371 5397567 3862922
12879 3862922 2868834 1609187 -368659 -1167507 407807 2104977 1367598 -441243 -208693
12870 -208693 1611324 1525376 -1389672 -4141601 -4609367 -4106203 -4097965 -3764690 -2405512
12861 -2405512 -1184807 -676028 409498 2144488 2164908 -141081 -1482209 324292 2416250
12852 2416250 1668373 311168 2042053 4981288 4159968 -239362 -3071703 -2431592 -1680366
$$ packed form
12914b09102R12675J369677J522618k5947j888491j621460K54116J092705L26713
12905A733504j53887N27691J187085R61235K50198p69100k230366l049169j659835
12896c202644J246561K821280J576446r17849k398326k286484j199620J05386
12888d255250O11471l12812j313527k8844L240114M933341K906878l83804j534645
12879C862922r94088j259647j977846p98848J575314J697170p37379j808841K32550
12870b08693J820017q5948k915048k751929m67766N03164Q238L33275J359178
12861b405512J220705N08779J085526J734990K0420k305989j341128J806501K091958
12852B416250p47877j357205J730885K939235q21320m399330k832341O40111P51226
$$ plain form
12843 -1680366 -2545810 -2190189 894020 3513091 3128374 1939043 2366090 2577763 344055
12834 344055 -2017961 -882248 2731930 4670007 3807911 2851544 3600720 4870291 5164045
12825 5164045 4627526 3919454 3163670 2532923 2561449 3423968 4456214 4538024 3171831
12816 3171831 1720607 2766135 6607506 9308701 7099948 2328996 1155558 4789665
12808 4789665 7571769 5514176 1942630 1473704 2833534 2144211 -112763 -632254 487831
12799 487831 317260 -1481964 -2783396 -3527646 -5112172 -5929017 -2820604 2901341 6067990
12790 6067990 5003037 3369152 3640367 3720232 1879299 324900 1144127 2555127 2183312
12781 2183312 969335 866283 1251390 560900 -632056 -952490 -828302 -1179854 -1201969
$$ packed form
12843a680366q65444L55621L084209K619071l84717j189331M27047K11673k233708
12834C44055k362016J135713L614178J938077q62096r56367P49176J269571K93754
12825E164045n36519p08072p55784o30747K8526Q62519J032246Q1810j366193
12816C171831j451224J045528L841371K701195k208753m770952j173438L634107
12808D789665K782104k057593l571546m68926J359830o89323k256974n19491J120085
12799D87831j70571j799224j301432p44250j584526q16845L108413N721945L166649
12790F067990j064953j633885K71215P9865j840933j554399Q19227J411000l71815
12781B183312j213977j03052L85107o90490j192956l20434J24188l51552k2115
$$ plain form
12772 -1201969 -38109 864794 -266525 -2459795 -3521269 -3533952 -4128794 -5119004 -4745823
12763 -4745823 -2968210 -1784288 -2165507 -3046965 -3549750 -3849037 -3412176 -846728 3352402
12754 3352402 5904858 4261230 -85673 -3310397 -3634344 -2603002 -2259055 -2488116 -1730514
12745 -1730514 448137 2401864 2196633 -22797 -1922250 -1401096 1140188 3311210
12737 3311210 3425763 2193176 1492859 1935402 2326877 1540202 99464 -659556 -477883
12728 -477883 -368862 -1088848 -2306397 -3355868 -3891013 -3543951 -1912222 606324 2801704
12719 2801704 4019727 4735305 5256439 4902659 3302816 1535894 945027 1577291 2665750
12710 2665750 3627808 3548496 1053884 -3567941 -7223590 -7144492 -4549251 -3029230 -3733613
$$ packed form
12772a201969J163860R02903j131319k193270j061474j2683n94842r90210L73181
12763d745823J777613J183922l81219q81458n02785k99287M36861K565448M199130
12754C352402K552456j643628m346903l224724l23947J031342L43947k29061P57602
12745a730514K178651J953727k05231k219430j899453N21154K541284K171022
12737C311210J14553j232587p00317M42543L91475p86675j440738p59020J81673
12728d77883J09021p19986j217549j049471n35145L47062J631729K518546K195380
12719B801704J218023P15578N21134l53780j599843j766922n90867O32264J088459
12710B665750R62058p9312k494612m621825l655649P9098K595241J520021p04383
$$ plain form
12701 -3733613 -4508669 -3635510 -1831261 -208877 1232908 2368025 2502139 2063683 2539106
12692 2539106 3713716 3269192 526106 -1662459 -705044 1873740 2662390 1143189 -221081
12683 -221081 19111 708835 567244 212935 1056644 3314578 5628764 6147986 4058108
12674 4058108 596343 -1723449 -1462105 528845 2596029 4022739 4438476 2735017
12666 2735017 -1577589 -6326265 -7978142 -5489654 -1490091 982935 1781631 2814141
12658 2814141 4770689 6041168 5053655 2669809 1318153 1893005 2559878 1242228 -1512538
12649 -1512538 -3241074 -2672713 -756221 1224105 2824074 3473387 2357763 280994
12641 280994 -194925 1945439 4176308 3629860 1144384 -134161 504893 622579 -1184944
$$ packed form
12701c733613p75056Q73159J804249J622384J441785J135117J34114m38456M75423
12692B539106J174610m44524k743086k188565R57415K578784P88650j519201j364270
12683b21081K40192O89724j41591l54309Q43709K257934K314186N19222k089878
12674D058108l461765k319792K61344J990950K067184J426710M15737j703459
12666B735017m312606m748676j651877K488488L999563K473026P98696J032510
12658B814141J956548J270479r87513k383846j351656N74852O66873j317650k754766
12649a512538j728536N68361J916492J980326J599969O49313j115624k076769
12641B80994m75919K140364K230869n46448k485476j278545O39054J17686j807523
$$ plain form
12632 -1184944 -2911604 -2025959 993697 3330259 3097847 897888 -1306443 -2041824 -1319483
12623 -1319483 -243320 434231 1133584 2300167 2953019 1685071 -922243 -2428776 -1567402
12614 -1567402 268467 1296132 1679274 2448597 3313053 3153936 2087525 1434584 1729036
12605 1729036 2017729 1202520 -848810 -3393884 -5065378 -4338724 -1066137 2492122 3595309
12596 3595309 2210290 833271 783194 480497 -1551117 -3752734 -3542509 -1251629 226904
12587 226904 -443281 -1466636 -958205 391655 833928 348858 420032 1658502 3004228
12578 3004228 3167381 1879975 -294065 -2605236 -4412314 -5343991 -5403676 -4852209 -4118331
12569 -4118331 -3791797 -4162953 -4572496 -3929066 -2286229 -1061873 -1016330 -1030699 -106402
$$ packed form
12632a184944j726660Q85645L019656K336562k32412k199959k204331p35381P22341
12623a319483J076163O77551O99353J166583O52852j267948k607314j506533Q61374
12614a567402J835869J027665L83142P69323Q64456j59117j066411o52941K94452
12605A729036K88693q15209k051330k545074j671494P26654L272587L558259J103187
12596C595309j385019j377019n0077l02697k031614k201617K10225K290880J478533
12587B26904o70185j023355N08431J349860M42273m85070P1174J238470J345726
12578C004228J63153j287406k174040k311171j807078r31677n9685N51467P33878
12569d118331L26534l71156m09543O43430J642837J224356M5543j4369R24297
$$ plain form
12560 -106402 369118 -1675471 -5258994 -6621942 -4032798 -386258 441201 -1577058 -3311243
12551 -3311243 -3209077 -3042539 -4593072 -6567101 -6152010 -2784796 959987 2163559 382793
12542 382793 -2390373 -3900031 -3527364 -2532431 -2729434 -4642378 -6783245 -7072550 -5095978
12533 -5095978 -2432689 -530442 882590 2547562 3763632 3185940 1153550 -526378
12525 -526378 -1251872 -2194578 -3585851 -3511180 -839651 2404467 3581512 3026963 2795771
12516 2795771 2881964 1652302 -252182 151769 3454225 6123512 5308436 2906828 2483650
12507 2483650 3983999 4415760 2842778 1539816 1995230 2608995 1512365 -408099 -954435
12498 -954435 136540 1141185 1077774 850970 1456488 2346574 2345815 1448574 705362 538307
$$ packed form
12560a06402M75520k044589l583523j362948K589144L646540Q27459k018259j734185
12551c311243J02166J66538j550533j974029M15091L367214L744783J203572j780766
12542C82793k773166j509658L72667R94933j97003j912944k140867k89305J976572
12533e095978K663289J902247J413032J664972J216070n77692k032390j679928
12525e26378p25494r42706j391273P4671K671529L244118J177045n54549k31192
12516B795771Q6193j229662j904484M03951L302456K669287q15076k401608m23178
12507B483650J500349M31761j572982j302962M55414O13765j096630j920464n46336
12498i54435J090975J004645o3411k26804O05518Q90086p59q97241p43212j67055
$$ plain form
12488 538307 248322 -519249 -885679 -154268 721331 403751 -563475 -517884 220508 -804641
12478 -804641 -4158831 -6432146 -4398926 18137 1823317 -217040 -1922660 129972
12470 129972 3695118 4394835 2165916 1005782 2871133 5110538 4737324 2481391 882806
12461 882806 414092 -127423 -552666 582789 2817459 3449165 1386615 -701456 279475
12452 279475 3584816 5458260 3675939 -332761 -3704480 -4914513 -4115224 -2177334
12444 -2177334 -204214 872438 1141870 1853737 4030852 7011550 8842718 8199763 5686996
12435 5686996 3183933 2068236 2195409 2503670 2261884 1493619 544464 -137478 90101
12426 90101 1522849 3258962 3737586 2548507 885437 -272513 -1360680 -2774988 -3416164
$$ packed form
12488E38307k89985p67571l66430P31411Q75599l17580r67226M5591P38392j025149
12478h04641l354190k273315K033220M417063J805180k040357j705620K052632
12470A29972L565146O99717k228919j160134J865351K239405l73214k255933j598585
12461H82806m68714n41515m25243J135455K234670O31706k062550k088071R80931
12452B79475L305341J873444j782321m008700l371719j210033P99289J937890
12444b177334J973120J076652K69432P11867K177115K980698J831168o42955k512767
12435E686996k503063j115697J27173L08261k41786p68265r49155o81942K27579
12426I0101J432748J736113M78624j189079j663070j157950j088167j414308o41176
$$ plain form
12417 -3416164 -2194261 -244566 135786 -1448414 -3125588 -3390580 -2455090 -939985 915515
12408 915515 2338484 2193178 848692 200690 927953 1414767 541672 -238778 673485
12399 673485 2009870 1260838 -1461968 -3417850 -2858770 -677730 1529076 3087665 3660013
12390 3660013 2951053 1749497 1739619 3362291 5011335 5186149 4366567 3835176 3661624
12381 3661624 3049185 1979162 1179547 730245 -49503 -1212205 -1700437 -682437 1199054
12372 1199054 2366721 1972494 840093 652681 2010207 3391728 2653640 -240665 -2813395
12363 -2813395 -3019646 -1779683 -1519198 -2860801 -4254642 -4561186 -4137824 -3153256 -917478
12354 -917478 2102935 3448446 1473837 -2251197 -5004605 -6260415 -7070158 -7156061 -5231213
$$ packed form
12417c416164J221903J949695L80352j584200j677174k64992R35490J515105J855500
12408I15515J422969j45306j344486o48002P27263M86814q73095p80450R12263
12399F73485J336385p49032k722806j955882N59080K181040K206806J558589N72348
12390C660013p08960j201556r878J622672J649044J74814q19582n31391j73552
12381C661624o12439j070023p99615m49302p79748j162702m88232J018000J881491
12372A199054J167667l94227j132401j87412J357526J381521p38088k894305k572730
12363b813395k06251J239963K60485j341603j393841l06544M23362R84568K235778
12354i17478L020413J345511j974609l725034k753408j255810q09743q5903J924848
$$ plain form
12345 -5231213 -1961237 114353 119885 -71129 961608 2186088 2372201 2093317 2002294
12336 2002294 1181686 -916554 -2667323 -2561123 -1810611 -2296945 -3172923 -2267769 -75493
12327 -75493 715336 -458121 -1257285 -493851 11652 -1136529 -2183359 -873837 1869254
12318 1869254 3079860 1801338 123209 265955 2057223 3664465 3931240 3247112 2216567
12309 2216567 294209 -3312755 -7502780 -9475116 -7869788 -4517197 -1963018 -539574
12301 -539574 570224 816571 -732126 -2807367 -3222323 -2433418 -2863490 -4656460 -5331713
12292 -5331713 -4137542 -3280315 -3751100 -3522898 -1669361 -695687 -2161048 -3236413 -1038175
12283 -1038175 2179944 2084282 -1229857 -3812582 -3821422 -2794992 -1546962 845332 3580506
$$ packed form
12345e231213L269976K075590N532j91014J032737J224480J86113k78884r1023
12336B002294q20608k098240j750769J06200P50512m86334q75978R05154K192276
12327g5493P90829j173457p99164P63434N05503j148181j046830J309522K743091
12318A869254J210606j278522j678129J42746J791268J607242K66775o84128j030545
12309B216567j922358l606964m190025j972336J605328L352591K554179J423444
12301e39574J109798K46347j548697k075241m14956P88905m30072j792970o75253
12292e331713J194171Q57227m70785K28202J853537R73674j465361j075365K198238
12283a038175L218119r5662l314139k582725q840J026430J248030K392294K735174
$$ plain form
12274 3580506 3824328 1139854 -1224109 -1056837 -180350 -857380 -1927375 -975454 1555069
12265 1555069 3036428 2428312 1084429 260219 -242484 -973066 -1849921 -2535457 -2958325
12256 -2958325 -3316655 -3915553 -4758827 -5043875 -3644619 -602009 2353863 3307010 1920843
12247 1920843 -461003 -1976558 -1463153 639741 2317477 1729689 -737877 -2921326
12239 -2921326 -3448091 -2732904 -1343998 842678 3093624 3328577 803293 -2038486 -2259137
12230 -2259137 -147193 1547033 1399036 374106 -444386 -1010425 -1137158 -220712 1405179
12221 1405179 2514605 2762025 2808675 2520648 1067482 -777989 -847230 954049 1887234
12212 1887234 579667 -617263 353135 1480579 101889 -2078568 -1537031 771449
$$ packed form
12274C580506K43822k684474k363963J67272Q76487o77030j069995R51921K530523
12265A555069J481359o08116j343883q24210n02703p30582q76855o85536m22868
12256b958325l58330n98898q43274k85048J399256L042610K955872R53147j386167
12247A920843k381846j515555N13405K102894J677736n87788k467566k183449
12239b921326n26765P15187J388906K186676K250946K34953k525284k841779k20651
12230b259137K111944J694226j47997j024930q18492n66039j26733R16446J625891
12221A405179J109426K47420M6650k88027j453166j845471o9241J801279R33185
12212A887234j307567j196930R70398J127444j378690k180457N41537K308480
$$ plain form
12204 771449 564848 -2343987 -3053166 533242 3875781 2716616 -550089 -1322081 -63136
12195 -63136 -344521 -2059754 -2020623 -273837 -326063 -2832120 -4168323 -2448503 -360588
12186 -360588 -270036 -725141 -133439 -27924 -1725360 -3062539 -1907410 -252542 -1076088
12177 -1076088 -3211111 -3345651 -1658860 -1201034 -2382465 -2469767 -730297 160867 -1159356
12168 -1159356 -2438891 -1827795 -819924 -1044703 -1048811 946143 3223336 2692767 -297094
12159 -297094 -2361032 -1921651 -742783 -363040 164610 1749390 2734006 941849 -2825999
12150 -2825999 -5395884 -5091197 -3222951 -1531389 48009 2112288 3746563 3416332
12142 3416332 1306295 -896854 -2412032 -3853738 -5118392 -4724371 -2242483 284895
$$ packed form
12204G71449k06601k908835p09179L586408L342539j159165l266705p71992J258945
12195f3136k81385j715233L9131J746786n2226k506057j336203J719820K087915
12186c60588R0552m55105N91702J05515j697436j337179J155129J654868q23546
12177a076088k135023j34540J686791M57826j181431q7302J739470Q91164j320223
12168a159356j279535O11096J007871k24779m108J994954K277193n30569k989861
12159b97094k063938M39381J178868L79743N27650J584780R84616j792157l767848
12150b825999k569885L04687J868246J691562J579398K064279J634275l30231
12142C416332k110037k203149j515178j441706j264654L94021K481888K527378
$$ plain form
12134 284895 921984 668891 1824220 4201702 5194893 3714447 1881868 1874525 2826654
12125 2826654 2462974 834570 459210 2686692 5704502 7067475 6858430 6668496 6154048
12116 6154048 3128536 -2231567 -5867458 -4725521 -1357035 -498226 -2007531 -1252321
12108 -1252321 3049598 5922962 3401067 -1200348 -2060584 761268 2268442 472163
12100 472163 -1550664 -1617627 -1663219 -3474453 -5093190 -3891148 -670683 1628398 1588107
12091 1588107 -174281 -2586654 -4476867 -4704938 -3543659 -2743830 -2942070 -2475777 -157274
12082 -157274 2505279 3636567 3795109 4199642 3769564 851093 -3037868 -4380352 -2482883
12073 -2482883 -217077 330825 121956 395186 465795 -274662 -482916 1071738 3114366
$$ packed form
12134B84895O37089k53093J155329K377482R93191j480446j832579p343R52129
12125B826654l63680j628404l75360K227482L017810J362973k09045j89934n14448
12116F154048l025512n360103l635891J141937L368486Q58809j509305P55210
12108a252321M301919K873364k521895m601415q60236K821852J507174j796279
12100D72163k022827o6963m5592j811234j618737J202042L220465K299081m0291
12091A588107j762388k412373j890213k28071J161279P99829j98240M66293K318503
12082a57274K662553J131288J58542M04533m30078k918471l888961j342484J897469
12073b482883K265806N47902k08869K73230P0609p40457k08254J554654K042628
$$ plain form
12064 3114366 3508481 2353431 1620247 2212591 3047284 2947692 2079174 1307294 1089672
12055 1089672 1302152 1599252 1667191 1266462 112766 -1976895 -4302909 -5011591 -2869579
12046 -2869579 481877 1550224 -929138 -4332507 -5687542 -5412804 -5812593 -7101242
12038 -7101242 -7351446 -5911741 -4268091 -3257547 -1895398 211506 1482343 651555
12030 651555 -1273785 -2628792 -3113581 -2876013 -1261615 1623093 3443901 2120541 -813408
12021 -813408 -1654788 728308 3716239 4722104 4071983 3397009 3012387 2176514 780290
12012 780290 -587265 -1675605 -2501503 -2482981 -725741 2542496 5447418 5941040 3855358
12003 3855358 1210470 228876 1188964 2572062 3035603 2445846 1093137 -814491 -2447693
$$ packed form
12064C114366L94115j155050p33184N92344Q34693r9592q68518p71880k17622
12055A089672K12480K97100O7939m00729j153696k089661k326014p08682K142012
12046b869579L351456J068347k479362l403369j355035K74738l99789j288649
12038g101242k50204J439705J643650J010544J362149K106904J270837q30788
12030F51555j925340j355007m84789K37568J614398K884708J820808j323360k933949
12021h13408q41380K383096K987931J005865o50121o74974l84622q35873j396224
12012G80290j367555j088340q25898J8522J757240L268237K904922M93622k085682
12003C855358k644888r81594R60088J383098M63541n89757j352709j907628j633202
$$ plain form
11994 -2447693 -2558039 -1331430 -740878 -1742293 -2351990 -339335 3035018 4176796 1851886
11985 1851886 -1359981 -2547003 -1607565 -436971 -438436 -1459894 -2295965 -1951827 -939699
11976 -939699 -872179 -2038355 -2524280 -1191521 -97175 -1527290 -3779159 -3178282 81602
11967 81602 1745168 -403765 -3759290 -5178644 -4662094 -3370088 -1271053 1297268 2584343
11958 2584343 2067675 1694729 2561513 2866730 1181348 -880547 -1534727 -1746416 -2752344
11949 -2752344 -3297188 -2246322 -1448615 -2701499 -4103812 -3007092 -627041 124936 -272921
11940 -272921 827204 3144142 3855632 2454087 1156476 801979 202023 -639687 -454538
11931 -454538 264475 -83754 -609147 1166383 4727031 6767992 6201452 5079198 4307889
$$ packed form
11994b447693j10346J226609N90552j001415o09697K012655L374353J141778k324910
11985A851886l211867j187022R39438J170594j465j021458q36071L44138J012128
11976i39699O7520j166176m85925J332759J094346j430115k251869O00877L259884
11967H1602J663566k148933l355525j419354N16550J292006K099035K568321J287075
11958B584343n16668l72946Q66784L05217j685382k061895o54180k11689j005928
11949b752344n44844J050866P97707j252884j402313J096720K380051P51977l97857
11940b72921J100125K316938P11490j401545j297611l54497n99956q41710J85149
11931d54538P19013l48229n25393J775530L560648K040961n66540j122254p71309
$$ plain form
11922 4307889 2571575 -47853 -1633232 -2170345 -3300422 -3847505 -791172 4178968
11914 4178968 4920504 -22110 -4294408 -3088267 -106905 -777699 -3482722 -3097833 471780
11905 471780 3258499 4154387 4969302 5337533 3418723 713545 546040 2106380 1408499
11896 1408499 -1749215 -3162724 -1240289 616157 84700 -497701 1214946 3536628
11888 3536628 3928816 2834059 1795125 668757 -810690 -1399718 -857539 -1562371 -4787071
11879 -4787071 -7600064 -6635031 -3180669 -1151283 -1274005 -904409 966277 2220014 1434645
11870 1434645 -54978 -775245 -1079954 -1455340 -1302658 -703180 -1161599 -2941330 -3609048
11861 -3609048 -1321555 1855139 2269096 -424393 -3024634 -3211792 -1911149 -885633
$$ packed form
11922D307889j736314k619428j585379n37113j130077n47083L056333M970140
11914D178968P41536m942614m272298J206141K981362o70794k705023L84889L569613
11905D71780K786719Q95888Q14915L68231j918810k705178j67505J560340o97881
11896A408499l157714j413509J922435J856446n31457n82401J712647K321682
11888C536628L92188j094757j038934j126368j479447n89028N42179p04832l224700
11879d787071k812993R65033L454362K029386j22722L69596J870686J253737p85369
11870A434645j489623p20267l04709l75386J52682N99478m58419j779731o67718
11861c609048K287493L176694M13957k693489k600241j87158J300643J025516
$$ plain form
11853 -885633 -150216 1059084 2222669 2020030 426871 -902798 -578580 753837 1022917
11844 1022917 -726128 -2716266 -2216254 874980 3516381 3489446 2341419 2563684 3322701
11835 3322701 2018630 -609972 -876796 1717129 2877558 53086 -3204075 -2543755
11827 -2543755 611309 1775971 467762 -12229 1281200 1848518 855945 782016 2901186
11818 2901186 4936190 4656000 2650229 177310 -2666930 -5142497 -5335193 -3355326
11810 -3355326 -2237333 -3492758 -4452752 -2533593 423293 1180566 401389 1264061 3956777
11801 3956777 5378202 4216913 2868560 3568526 5342759 5888085 4464001 1839975
11793 1839975 -1010700 -3033646 -3156330 -1431175 584406 1491743 1537093 1657864 1623260
$$ packed form
11853h85633P35417J209300J163585k02639j593159j329669L24218J332417K69080
11844A022917j749045j990138N00012L091234K641401k6935j148027K22265P59017
11835C322701j304071k628602k66824K593925J160429k824472l257161O60320
11827b543755L155064J164662j308209m79991J293429N67318r92573p3929K119170
11818B901186K035004k80190k005771k472919k844240k475567j92696J979867
11810c355326J117993j255425r59994J919159K956886P57273p79177Q62672K692716
11801C956777J421425j161289j348353O99966J774233N45326j424084k624026
11793A839975k850675k022946j22684J725155K015581R07337M5350J20771l4604
$$ plain form
11784 1623260 266110 -2391473 -4308926 -3489261 -489712 2002688 2185220 874506
11776 874506 -104491 -198294 125119 899602 2286789 3077445 1515421 -2015865 -4823460
11767 -4823460 -5151438 -4167384 -3768777 -3676193 -2062558 1549966 5288165 6801765 5473626
11758 5473626 2769948 742200 233096 602141 1134409 1948526 2966268 3043847 1522714
11749 1522714 -71197 282168 1964507 2258711 161004 -2288330 -2908782 -1836889 -575315
11740 -575315 -229487 -1130247 -2588504 -2757535 -593995 1829656 1215377 -2314565 -4955879
11731 -4955879 -4323643 -2084233 -419254 1064825 2968664 3487765 944466 -2910503
11723 -2910503 -4807604 -3999411 -2279749 -1204384 -1273362 -2590103 -4310407 -4582557 -2845999
$$ packed form
11784A623260j357150k657583j917453Q19665K999549K492400J82532j310714
11776H74506r78997r3803L23413P74483J387187P90656j562024l531286k807595
11767d823460l27978R84054L98607R2584J613635L612524L738199J513600j328139
11758E473626k703678k027748n09104L69045N32268Q14117J017742P7579j521133
11749A522714j593911L53365J682339K94204k097707k449334o20452J071893J261574
11740e75315L45828r00760j458257j69031K163540K423651o14279l529942k641314
11731d955879O32236K239410J664979J484079J903839N19101k543299l854969
11723b910503j897101Q08193J719662J075365o8978j316741j720304k72150J736558
$$ plain form
11714 -2845999 -924841 -219743 415402 2036860 2959763 1446590 -797564 -1052197 -140825
11705 -140825 -991655 -3379121 -3824877 -860870 2910834 4599979 4121891 2818942 1395186
11696 1395186 155720 -450251 -324413 293492 1357599 2504624 2677672 1769149 1716451
11687 1716451 3888629 6196236 5318421 1357473 -2367800 -3963007 -4601006 -5395939 -5544715
11678 -5544715 -4388262 -2919647 -2200483 -2023764 -1857377 -1606309 -1095466 -297264 -69304
11669 -69304 -959192 -1511323 157892 3312699 5479795 6173490 6964589 7809338 6614692
11660 6614692 3272660 916657 1710156 4084295 5650924 6233943 6268965 4751675 1102573
11651 1102573 -2718464 -4148337 -2863286 -205947 2657906 4547866 4113206 1746323
$$ packed form
11714b845999J921158P05098O35145J621458R22903j513173k244154k54633R11372
11705a40825q50830k387466m45756K964007L771704J689145m78088j302949j423756
11696A395186j239466o05971J25838O17905J064107J147025J73048r08523n2698
11687A716451K172178K307607q77815l960948l725273j595207o37999p94933j48776
11678e544715J156453J468615P19164J76719J66387K51068N10843P98202K27960
11669f9304q89888n52131J669215L154807K167096O93695P91099Q44749j194646
11660F614692l342032k356003P93499K374139J566629N83019L5022j517290l649102
11651A102573l821037j429873J285051K657339K863853J889960m34660k366883
$$ plain form
11643 1746323 14549 320919 824773 -362912 -1903943 -1721814 -893316 -1759873 -3451088
11634 -3451088 -3083043 -888037 -55787 -1090835 -577907 2861039 5315080 3101765 -1418181
11625 -1418181 -3080251 -1113004 783335 677730 480167 1297219 868534 -2348296 -5714269
11616 -5714269 -5838146 -3340982 -1206943 18891 1926269 4039433 3905543 1689108
11608 1689108 836765 2877188 4961002 4447005 2800580 2380729 2144721 26175 -2242699
11599 -2242699 -728142 4609321 8923737 8226027 3651286 -649602 -1925542 -529522
11591 -529522 1215165 1243266 -237280 -1008299 49987 1013542 -264736 -2326389 -1660128
11582 -1660128 2037650 4874372 3782399 282953 -1935054 -1492623 -5723 609062
$$ packed form
11643A746323j731774L06370N03854j187685j541031J82129Q28498q66557j691215
11634c451088L68045K195006Q32250j035048N12928L438946K454041k213315m519946
11625a418181j662070J967247J896339j05605j97563Q17052m28685l216830l365973
11616e714269j23877K497164K134039J225834J907378K113164j33890k216435
11608A689108q52343K040423K083814n13997j646425m19851k36008k118546k268874
11599b242699J514557N337463M314416o97710m574741m300888j275940J396020
11591e29522J744687K8101j480546p71019J058286R63555j278278k061653O66261
11582a660128L697778K836722j091973l499446k218007M42431J486900O14785
$$ plain form
11574 609062 103230 -533024 -516972 -1679 499332 1005238 1730370 2053601 1149064 -113938
11564 -113938 292962 2316290 3201658 1507993 -501303 -483710 294008 -360155 -1373969
11555 -1373969 -445427 1409169 1412087 65124 278672 1989547 2246948 717859 336597
11546 336597 1812728 2376361 1296269 1631134 4250262 4976738 1104276 -3243325 -2473028
11537 -2473028 2442538 5529218 3841100 33258 -2361406 -2763865 -2487833 -2356707 -2083753
11528 -2083753 -988844 843624 2056052 1574896 619922 1354870 3266495 3283138 338642
11519 338642 -2750934 -3281716 -2015639 -953982 -302220 350239 177616 -1230150 -2282913
11510 -2282913 -1681753 -542107 -182630 276387 1863186 3210151 2561991 757858 -151467
$$ packed form
11574F09062n05832o36254J6052N15293N01011N05906P25132L23231r04537j263002
11564a13938M06900K023328Q85368j693665k009296J7593P77718o54163j013814
11555a373969R28542J854596K918j346963K13548J710875K57401j529089l81262
11546C36597J476131N63633j080092L34865K619128P26476l872462m347601P70297
11537b473028M915566L086680j688118l807842k394664m02459K76032J31126K72954
11528b083753J094909J832468J212428m81156r54974P34948J911625J6643k944496
11519C38642l089576n30782J266077J061657O51762O52459j72623j407766j052763
11510b282913O01160J139646L59477M59017J586799J346965o48160j804133r09325
$$ plain form
11501 -151467 229191 1277184 2995598 4638981 3761036 -416843 -4444641 -4650716 -2262320
11492 -2262320 -1208332 -2067805 -1868898 702341 3450573 4003348 2081833 -1409030 -4853457
11483 -4853457 -5774263 -2958996 1378775 3939120 4324296 4244918 3777156 1726687 -864866
11474 -864866 -1333482 313656 1246238 442526 59856 1377523 2673480 2365994 1331170
11465 1331170 662332 -290773 -2066761 -3416579 -3050899 -1483971 -2100 816703 914816
11456 914816 642216 1164508 3137588 4800623 3658082 337653 -1842177 -1608535 -1026422
11447 -1026422 -1226244 -329550 2542975 4488677 2812962 -606146 -1914474 -540762
11439 -540762 1044146 1586827 2161716 3633740 5543183 7256751 8217649 7465464 4842330
$$ packed form
11501a51467L80658J047993J718414J643383q77945m177879m027798k06075K388396
11492b262320J053988q59473J98907K571239K748232N52775j921515l490863l444427
11483d853457r20806K815267M337771K560345L85176p9378m67762k050469k591553
11474h64866m68616J647138R32582q03712l82670J317667J295957l07486j034824
11465A331170o68838r53105j775988j349818L65680J566928J481871Q18803R8113
11456I14816k72600N22292J973080J663035j142541l320429k179830K33642N82113
11447a026422j99822Q96694K872525J945702j675715l419108j308328J373712
11439e40762J584908N42681N74889J472024J909443J713568R60898p52185k623134
$$ plain form
11430 4842330 2210240 1442578 1554257 -42737 -3536604 -6171373 -6015506 -4235972 -2924985
11421 -2924985 -2421582 -1834487 -916214 -145070 393411 1059552 1712952 1496138 -196032
11412 -196032 -2785418 -4800384 -5228858 -4452596 -3493000 -2473370 -631878 1913995 3485483
11403 3485483 2805407 921998 78472 1047726 2616165 3363950 2803874 1006676 -1527213
11394 -1527213 -3535584 -3873682 -3024492 -2482194 -2339127 -1042748 1728811 3670270 2816522
11385 2816522 613421 53149 1447769 2275678 1147853 -415771 -823581 -849139 -1815810
11376 -1815810 -2915760 -2160179 755744 4112033 6187925 6216821 3901697 -174894 -3665527
11367 -3665527 -3882843 -884356 2086866 2095009 -293194 -1977914 -932416 1822277 3629477
$$ packed form
11430D842330k632090p67662J11679j596994l493867k634769J55867J779534J310987
11421b924985N03403N87095R18273P71144N38481O66141O53400k16814j692170
11412a96032k589386k014966m28474P76262R59596J019630J841492K545873J571488
11403C485483o80076j883409q43526R69254J568439P47785n60076j797198k533889
11394a527213k008371l38098Q49190N42298J43067J296379K771559J941459q53748
11385B816522k203101n60272J394620Q27909j127825j563624m07810k5558r66671
11376a815810j099950P55581K915923L356289K075892K8896k315124m076591l490633
11367c665527k17316K998487K971222Q143k388203j684720J045498K754693J807200
$$ plain form
11358 3629477 3110050 1508032 1065059 2269795 3417183 2984013 1264154 -903514 -3402159
11349 -3402159 -5466837 -4807836 -567386 3990456 4801748 2568069 1690465 3622031 5093839
11340 5093839 3871172 2222621 2564508 3310811 2063454 -5013 -431322 163862 -266109
11331 -266109 -886903 620793 3382127 4155428 2466903 947565 557866 -395334 -1877060
11322 -1877060 -1019091 2974121 6511280 6473096 4420604 3479284 3564590 2587919 548667
11313 548667 -686562 -663453 -495331 -231983 1174593 3206680 3591166 1461218 -1187401
11304 -1187401 -2092085 -1373010 -662755 -705163 -940812 -835728 -449242 207643 1362949
11295 1362949 2662776 2830798 917190 -2140944 -3931637 -3042812 -758074 395455
$$ packed form
11358C629477n19427j602018m42973J204736J147388m33170j719859k167668k498645
11349c402159k064678O59001M240450M557842Q11292k233679q77604J931566J471808
11340E093839j222667j648551L41887P46303j247357k068467m26309N95184m29971
11331b66109o20794J507696K761334P73301j688525j519338l89699r53200j481726
11322a877060Q57969L993212L537159l8184k052492r41320Q5306r76671k039252
11313E48667j235229K3109J68122K63348J406576K032087L84486k129948k648619
11304a187401r04684P19075P10255m2408k35649J05084L86486O56885J155306
11295A362949J299827J68022j913608l058134j790693Q88825K284738J153529
$$ plain form
11287 395455 -353160 -1377101 -1237497 -804620 -1787331 -3811299 -4505295 -2688622 -24099
11278 -24099 1285186 1183667 859663 271986 -1293129 -2597459 -1164911 2507611 4105154
11269 4105154 827481 -4462329 -6956098 -6182251 -5408942 -5807927 -5208973 -2906520 -1547911
11260 -1547911 -2614422 -3564161 -1912563 644557 1051032 -316064 -828184 -94965 63411
11251 63411 -607621 -345459 1260398 2326871 1648362 274729 -593961 -1320001 -2501048
11242 -2501048 -3419204 -2906900 -1033398 804391 1260488 399789 -239707 588295 1914642
11233 1914642 1551477 -491961 -1317400 800920 3404723 3060294 335128 -992944 923276
11224 923276 4162673 6023035 5366367 2112921 -2941952 -7350500 -8393912 -6065663
$$ packed form
11287C95455p48615j023941J39604M32877r82711k023968o93996J816673K664523
11278b4099J309285j01519l24004n87677j565115j304330J432548L672522J597543
11269D105154l277673n289810k493769P73847P73309l98985N98954K302453J358609
11260a547911j066511r49739J651598K557120M06475j367096n12120P33219J58376
11251F3411o71032K62162J605857J066473o78509j373633q68690p26040j181047
11242b501048r18156N12304J873502J837789M56097q60699o39496Q28002J326347
11233A914642l63165k043438q25439K118320K603803l44429k725166j328072J916220
11224I23276L239397J860362o56668l253446n054873m408548j043412K328249
$$ plain form
11216 -6065663 -3066892 -1504467 -1237582 -1489983 -1952317 -1935218 -616493 1174198 1314334
11207 1314334 -790130 -3448336 -5190959 -6142508 -6461773 -5616966 -4025721 -3258224 -3518935
11198 -3518935 -2937360 -616244 1541145 1559397 266687 -267818 133664 -21921 -1358621
11189 -1358621 -2909325 -3525842 -2827870 -1017971 1373322 3603685 4871729 4316855 1478663
11180 1478663 -2397909 -4395015 -2995765 -528081 -296704 -1697607 -1157108 1881081
11172 1881081 3480916 1076282 -2507825 -3095175 -571035 2169537 3401929 3053137
11164 3053137 991122 -2165628 -3903338 -2456905 280264 1185992 425601 762166 2963220
11155 2963220 4874537 5061167 4579809 4571093 4306515 2424556 -1293895 -5702910 -8742462
$$ packed form
11216f065663K998771J562425K66885k52401m62334J7099J318725J790691J40136
11207A314334k104464k658206j742623r51549l19265Q44807J591245P67497k60711
11198c518935N81575K321116K157389J8252j292710n34505M01482j55585j336700
11189a358621j550704o16517O97972J809899K391293K230363J268044n54874k838192
11180A478663l876572j997106J399250K467684K31377j400903N40499L038189
11172A881081J599835k404634l584107n87350K524140K740572J232392l48792
11164C053137k062015l156750j737710J446433K737169R05728p60391L36565K201054
11155B963220J911317J86630m81358q716k64578j881959l718451m409015l039552
$$ plain form
11146 -8742462 -8449426 -4967177 -1101434 725790 1410875 3095943 5006521 4229694 604750
11137 604750 -2252183 -1691227 812552 2467080 2838076 3109419 3455687 3043980 1770269
11128 1770269 565271 380283 1476206 3008326 3105203 629901 -2781793 -3962180 -1983911
11119 -1983911 1008942 3225781 5142389 6856952 6301537 2549570 -1175233 -998417
11111 -998417 2147948 3794156 2238273 264111 261297 957211 316379 -1012663 -1074811
11102 -1074811 329410 1793383 2322401 1684354 -143189 -2373879 -3268577 -2133073 -568254
11093 -568254 -194095 -152036 1198439 3036024 3128678 1881017 2383506 5619341 8326480
11084 8326480 7388787 4374551 3353809 5194966 6534447 4495330 318253 -2608525
$$ packed form
11146h742462K93036L482249L865743J827224O85085J685068J910578p76827l624944
11137F04750k856933N60956K503779J654528L70996K71343L46268m11707j273711
11128A770269j204998j84988J095923J532120R6877k475302l411694j180387J978269
11119a983911K992853K216839J916608J714563n55415l751967l724803J76816
11111i98417L146365J646208j555883j974162k814O95914o40832j329042o2148
11102a074811J404221J463973N29018o38047j827543k230690q94698J135504J564819
11093e68254L74159M2059J350475J837585R2654j247661N02489L235835K707139
11084H326480r37693l014236j020742J841157J339481k039117m177077k926778
$$ plain form
11076 -2608525 -2971344 -2424722 -2683375 -3113470 -1901444 1013855 3323328 2975819 562344
11067 562344 -1640005 -2356667 -2061704 -1544719 -1117039 -1202170 -2258988 -3716121 -4194525
11058 -4194525 -3276714 -1991175 -1177281 -620786 -253827 -686434 -1708516 -1767651 -113417
11049 -113417 1833011 2493086 2222322 2014633 1553985 406683 -137653 1212527 2993952
11040 2993952 2569989 215097 -1027691 187526 1752566 1508375 23537 -1098403
11032 -1098403 -1500405 -1186392 727956 4378456 7477859 7385968 4397307 1293421 -23622
11023 -23622 186917 1333295 3590578 6549873 8396142 7725023 5453016 3763464 3484648
11014 3484648 3570685 3026739 2099809 1233685 89840 -1483827 -2439404 -1784680 -373101
$$ packed form
11076b608525l62819N46622k58653m30095J212026K915299K309473l47509k413475
11067E62344k202349p16662K94963N16985M27680q5131j056818j457133m78404
11058d194525R17811J285539Q13894N56495L66959m32607j022082n9135J654234
11049a13417J946428O60075k70764k07689m60648j147302n44336J350180J781425
11040B993952m23963k354892j242788J215217J565040k44191j484838j121940
11032a098403m02002L14013J914348L650500L099403r1891k988661l103886j317043
11023b3622K10539J146378K257283K959295J846269o71119k272007j689552k78816
11014C484648Q6037n43946r26930q66124j143845j573667r55577O54724J411579
$$ plain form
11005 -373101 -8 -842860 -1339994 -797764 -423483 -1090122 -1733661 -1219888 -503695 -1277996
10995 -1277996 -3164503 -3932774 -2423658 81226 1585706 1509714 802692 496256 454628
10986 454628 -397501 -2395885 -3954591 -3045245 -78343 1904141 672067 -2514522 -4508987
10977 -4508987 -3696567 -962384 1820190 3189405 2736253 1484830 1135211 2047052 2599760
10968 2599760 1404011 -637269 -1529987 -805283 161518 44255 -1118959 -2254071 -2406704
10959 -2406704 -1893794 -2225474 -3994526 -5205863 -3442009 413272 2950629 2987723 2674454
10950 2674454 3138347 2576904 439559 -199318 2634578 5890829 5834807 3667874 2903827
10941 2903827 3434451 2653916 812383 446446 1368621 994007 -636986 -782707 929661
$$ packed form
11005c73101L73093q42852m97134N42230L74281o66639o43539N13773P16193p74301
10995a277996j886507p68271J509116K504884J504480p5992p07022l06436m1628
10986D54628q52129j998384j558706R09346K966902J982484j232074l186589j994465
10977d508987Q12420K734183K782574J369215m53152j251423l49619R11841N52708
10968B599760j195749k041280q92718P24704R66801j17263j163214j135112j52633
10959b406704N12910l31680j769052j211337J763854L855281K537357L7094l13269
10950B674454M63893n61443k137345o38877K833896L256251n6022k166933p64047
10941B903827N30624p80535j841533l65937R22175l74614j630993j45721J712368
$$ plain form
10932 929661 1838407 1161574 1229544 2866349 3650006 2183656 519370 782702 2433092
10923 2433092 4227816 6045992 7470470 7207045 5154773 2827695 1045221 -472038
10915 -472038 -1078492 233453 2000421 1457113 -803498 -880486 2672538 6508695 7140989
10906 7140989 4823638 1726565 -582979 -846634 1320293 3482363 2416050 -937216
10898 -937216 -2275905 -636206 110462 -2056387 -3960246 -2989945 -1511613 -2317393 -3891911
10889 -3891911 -3879526 -3502044 -4508339 -4996111 -2557715 1048633 2611760 2652805 3724464
10880 3724464 5346830 4842080 2093732 -205031 -242553 1831825 5172454 7819907 6878547
10871 6878547 2353678 -998844 742009 4827597 5492843 2165402 -253392 1228101
$$ packed form
10932I29661R08746o76833O7970J636805P83657j466350j664286K63332J650390
10923B433092J794724J818176J424478k63425k052272k327078j782474j517259
10915d72038o06454J311945J766968n43308k260611p6988L553024L836157O32294
10906G140989k317351l097073k309544k63655K166927K162070j066313l353266
10898i37216j338689J639699P46668k166849j903859R70301J478332q05780j574518
10889c891911J2385L77482j006295m87772K438396L606348J563127M1045J071659
10880C724464J622366n04750k748348k298763l7522K074378L340629K647453r41360
10871F878547m524869l352522J740853M085588O65246l327441k418794J481493
$$ plain form
10863 1228101 4292367 5614047 4822293 3251521 1681241 518818 264365 775298 1113180
10854 1113180 464557 -1284942 -3301466 -3645062 -814085 3608883 5712406 4069472
10846 4069472 1837540 2406736 5117702 7261109 7931290 7417896 5183159 1500136 -973858
10837 -973858 -576992 179723 -1774490 -4935422 -5398838 -2842731 -462234 175070 337699
10828 337699 693848 412256 -397558 -701578 -992916 -2700146 -5222575 -6375048 -5602653
10819 -5602653 -4134808 -2464582 -447462 759959 -128828 -1971007 -2689728 -2485474 -2494691
10810 -2494691 -1523532 1964245 5574094 5256525 1597330 -813859 -440688 -328350 -1905876
10801 -1905876 -2495923 -721406 583504 -562500 -1770307 -998191 -772294 -3705845 -6965677
$$ packed form
10863A228101L064266J321680p91754j570772j570280j162423k54453N10933L37882
10854A113180o48623j749499k016524l43596K830977M422968K103523j642934
10846D069472k231932N69196K710966K143407O70181n13394k234737l683023k473994
10837i73858L96866P56715j954213l160932m63416K556107K380497O37304J62629
10828C37699L56149k81592q09814l04020k91338j707230k522429j152473P72395
10819e602653J467845J670226K017120J207421q88787j842179p18721K04254r217
10810b494691R71159L487777L609849l17569l659195k411189L73171J12338j577526
10801a905876n90047J774517J304910j146004j207807P72116K25897k933551l259832
$$ plain form
10792 -6965677 -5906696 -1413951 1193115 87569 -827898 1534020 4607454 4093453
10784 4093453 199194 -2853560 -2589695 -862721 -460315 -1462402 -2212929 -2214917 -2114724
10775 -2114724 -1730352 -368072 1148791 1159893 144139 560480 2979283 4836355 4216700
10766 4216700 2487600 1642856 1365255 655376 250309 1176484 2621416 3393798 3858445
10757 3858445 4382320 3742494 1400597 -551144 -336406 427012 -558862 -2224681 -1999654
10748 -1999654 -265389 508277 49307 210696 1223920 1397926 345139 -496119 -483809
10739 -483809 -331244 -267494 34674 142288 -367437 -602580 50195 239932 -1077649 -2218952
10729 -2218952 -1388288 -36528 -411864 -1488581 -1040282 -117351 -1150684 -2896694 -2114869
$$ packed form
10792f965677J058981M492745K607066j105546r15467K361918L073434n14001
10784D093453l894259l052754K63865J726974M02406j002087p50527j988J00193
10775b114724L84372J362280J516863J1102j015754M16341K418803J857072o19655
10766D216700j729100q44744k77601p09879m05067R26175J444932P72382M64647
10757C858445N23875o39826k341897j951741K14738P63418r85874j665819K25027
10748a999654J734265P73666m58970J61389J013224J74006j052787q41258J2310
10739d83809J52565O3750L02168J07614n09725k35143O52775J89737j317581j141303
10729b218952Q30664J351760l75336j076717M48299R22931j033333j746010P81825
$$ plain form
10720 -2114869 384116 452975 -2610885 -5038946 -4911682 -4529149 -5321276 -5239395 -3140315
10711 -3140315 -1482199 -2196119 -3329116 -2338041 30019 1538778 1879219 2047024 2129368
10702 2129368 1815254 1783275 2704708 3665013 3058513 730073 -1699793 -2664728 -2472976
10693 -2472976 -2903023 -4494887 -5001620 -2411501 900769 310096 -4035500 -6292946 -3020338
10684 -3020338 1932799 3621212 2834263 2656725 2405919 350487 -1120588 673996 2553209
10675 2553209 38143 -4124085 -3598127 685643 1535594 -2711608 -5841541 -4439940
10667 -4439940 -2613145 -3454051 -3569808 -61608 3585879 3250322 750551 133832 1382218
10658 1382218 2050298 1958252 2354648 2855612 2501352 1954288 2224477 3026618 4025266 5549562
$$ packed form
10720b114869K498985O8859l063860k428061J27264L82533p92127Q1881K099080
10711c140315J658116p13920j132997R91075K368060J508759L40441J67805Q2344
10702B129368l14114l1979R21433R60305o06500k328440k429866r64935J91752
10693b472976m30047j591864n06733K590119L312270n90673m345596k257446L272608
10684c020338M953137J688413p86949j77538k50806k055432j471075J794584J879213
10675B553209k515066m162228N25958M283770Q49951m247202l129933J401601
10667d439940J826795q40906j15757L508200L647487l35557k499771o16719J248386
10658A382218O68080r2046L96396N00964l54260n47064K70189Q02141R98648J524296
$$ plain form
10648 5549562 6836036 6077531 3369616 1048637 284649 149960 550445 2605790 5315129
10639 5315129 5543537 2571907 -665692 -1901232 -1752919 -863704 1460479 4633031 6283255
10630 6283255 5509625 3669779 1588361 -683894 -1480892 994469 4737523 5833702
10622 5833702 4319686 3576820 4084422 3081713 505589 -594247 -91658 -1147336 -3684918
10613 -3684918 -3802790 -871900 1257372 1507457 3132281 6185796 5749471 478982 -4098263
10604 -4098263 -4105702 -2439897 -1993049 -647119 2919879 5071405 3483704 1605264 2315653
10595 2315653 2962473 1305481 466766 2867844 4885950 3043539 376364 1007670 3087553
10586 3087553 2842364 1410351 1936772 3530318 3515961 2477483 2236172 2030144 1056359
$$ packed form
10648E549562J286474p58505k707915k320979p63988j34689M00485K055345K709339
10639E315129K28408k971630l237599j235540J48313Q89215K324183L172552J650224
10630F283255p73630j839846k081418k272255p96998K475361L743054J096179
10622E833702j514016p42866N07602j002709k576124j099836N02589j055678k537582
10613c684918j17872K930890K129272K50085J624824L053515m36325n270489m577245
10604d098263p439J665805M46848J345930L566998K151526j587701j878440P10389
10595B315653O46820j656992q38715K401078K018106j842411k667175O31306K079883
10586C087553k45189j432013N26421J593546j4357j038478k41311k06028r73785
$$ plain form
10577 1056359 1287199 3481917 4119088 713026 -3383283 -3744998 -985941 1742828 3599922
10568 3599922 4645980 3621503 981751 151986 2141012 3140387 887134 -1338517
10560 -1338517 -561655 1220584 1870202 2970209 4853159 3824868 -968542 -3929782
10552 -3929782 -1418416 2096114 1685963 -108917 1137148 3835385 4285194 3453020 3763692
10543 3763692 3738704 1534665 -638063 -759398 -925870 -2410523 -2207405 881848 2651016
10534 2651016 709340 -984962 500277 1934557 840354 172121 1350389 700563
10526 700563 -2272886 -1960341 2847249 5292665 2764460 2013815 5912161 7222513 2734924
10517 2734924 456384 4239645 5222139 -1506082 -6264087 -2069747 2450601 -184520
$$ packed form
10577A056359K30840K194718O37171l406062m096309l61715K759057K728769J857094
10568C599922J046058j024477k639752q29765J989026R99375k253253k225651
10560a338517P76862J782239O49618J100007J882950j028291m793410k961240
10552c929782K511366L514530m10151j794880J246065K698237M49809q32174L10672
10543C763692k4988k204039k172728j21335j66472j484653K03118L089253J769168
10534B651016j941676j694302J485239J434280j094203o68233J178268o49826
10526G00563k973449L12545M807590K445416k528205p50645L898346J310352m487589
10517B734924k278540L783261R82494o728221m758005M194340M520348k635121
$$ plain form
10509 -184520 -2480216 1456277 2542687 -4517471 -7244767 2022348 8719235 1567285
10501 1567285 -5004237 2510433 9632825 1367460 -6448257 3417268 12940316 1966398
10493 1966398 -6822129 13612979 35280569 20283585 9681173 82245585 215095229
10486 215095229 275607257 191488744 52390229 -12906845 3527236 19259160 604336
10479 604336 -12994573 -470049 8830084 -1731551 -8265218 3582229 12778089 4279818
10471 4279818 -5580282 -2360676 2613642 -1651877 -5520402 -690008 2963441 -2205550
10463 -2205550 -6428201 -1942057 2051870 -2746172 -8531602 -6812947 -3207640 -4658445
10455 -4658445 -6120396 -1795902 2869395 1557954 -1408845 12548 2772964 1726896
$$ packed form
10509a84520k295696L936493J086410p060158k727296R267115O696887p151950
10501A567285o571522P514670P122392q265365p815717R865525R523048j0973918
10493A966398q788527K0435108K1667590j4996984j0602412P2564412J32849644
10486B15095229O0512028q4118513j39098515o5297074J6434081J5731924j8654824
10479F04336j3598909J2524524R300133j0561635o533667J1847447R195860q498271
10471D279818r860100L219606M974318m265519l868525M830394L653449n168991
10463b205550m222651M486144L993927m798042n785430J718655L605307j450805
10455d658445j461951M324494M665297j311441k966799J421393K760416j046068
$$ plain form
10447 1726896 -1257230 -2813915 -4459113 -6979480 -6657032 -2768088 -639624 -2346361
10439 -2346361 -2916177 -157866 956257 -1824780 -3368818 -1151491 -204319 -2977234
10431 -2977234 -3989653 -177954 2928833 1307956 -502750 1359238 2793805 300570
10423 300570 -1758381 530624 2992938 1160998 -1619288 -914816 901661 472518 485855
10414 485855 3750076 6488871 4743819 1700296 1612059 2129435 -44079 -1389187 2539592
10405 2539592 7994051 8003701 3276548 523494 2166564 4488661 4361491 2053456 -1172924
10396 -1172924 -3580214 -2926841 217633 1691867 -310975 -2091407 -837715 399469
10388 399469 -1272839 -2461663 743222 5124483 5124523 1951973 954367 2386634 1935945
$$ packed form
10447A726896k984126j556685j645198k520367L22448L888944K128464j706737
10439b346361n69816K758311J114123k781037j544038K217327R47172k772915
10431b977234j012419L811699L106787j620877j810706J861988J434567k493235
10423C00570k058951K289005K462314j831940k780286P04472J816477m29143J3337
10414D85855L264221K738795j745052l043523q8237N17376k173514j345108L928779
10405B539592N454459R650m727153k753054J643070K322097j27170k308035l226380
10396a172924k407290O53373L144474J474234k002842j780432J253692J237184
10388C99469j672308j188824L204885M381261M0l172550r97606J432267m50689
$$ plain form
10379 1935945 -1046854 -2851585 -2429381 -2615027 -4109178 -4120868 -1858384 -277438 -1136473
10370 -1136473 -2532573 -2581497 -1916983 -1274977 247628 3007164 5198258 4934196 2709744
10361 2709744 890481 1280746 3274231 4155853 1892625 -2161791 -4604899 -4255583 -3178052
10352 -3178052 -2959023 -2475625 -510000 1968791 3694297 4900054 5645213 4837232 2714037
10343 2714037 1755210 3057692 4238918 3138244 1202011 788549 1387477 1155427 275633
10334 275633 142653 753595 1268829 1782911 2557576 2944813 2688458 2537994 2193353 -1669
10324 -1669 -3676582 -5459238 -3510449 -420820 685389 237114 -54987 -622847 -2105676
10315 -2105676 -2655011 -714658 1627782 1642561 499194 1165069 3274777 3898973 2513495
$$ packed form
10379A935945k982799j804731M22204j85646j494151j1690K262484J580946q59035
10370a136473j396100m8924O64514O42006J522605K759536K191094k64062k224452
10361B709744j819263L90265J993485Q81622k263228m054416k443108L49316J077531
10352c178052K19029M83398J965625K478791J725506J205757P45159q07981k123195
10343B714037r58827J302482J181226j100674j936233m13462N98928k32050q79794
10334B75633j32980O10942N15234N14082P74665L87237k56355j50464l44641k195022
10324a669l674913j782656J948789L089629J106209m48275k92101n67860j482829
10315b105676n49335J940353K342440J4779j143367O65875K109708O24196j385478
$$ plain form
10306 2513495 1569596 2452227 3950471 4620763 4188260 2856279 1292041 770542 1485779
10297 1485779 1559468 -427739 -2902783 -3116170 -508606 3216339 5991666 6008617 2508764
10288 2508764 -2217799 -3879879 -1423437 1088992 218010 -1902916 -1421464 1064959
10280 1064959 2082044 1049486 309792 676337 984695 1167634 1910074 1989621 -214748
10271 -214748 -3134446 -3693590 -2130799 -1444136 -2479936 -3437086 -3909847 -5214440 -6575354
10262 -6575354 -5331813 -1701199 739358 436064 -125214 832095 1391022 -269220 -2324360
10253 -2324360 -2018215 338394 2282135 2419482 1021215 -1018581 -2341543 -1740643 138073
10244 138073 1212659 1036884 1522889 3410304 4318375 2360127 -204860 333457 3687994
$$ packed form
10306B513495r43899Q82631J498244O70292m32503j331981j564238n21499P15237
10297A485779P3689j987207k475044k13387K607564L724945K775327J6951l499853
10288B508764m726563j662080K456442K512429q70982k120926M81452K486423
10280A064959J017085j032558p39694L66545L08358J82939P42440P9547k204369
10271b14748k919698n59144J562791O86663j035800r57150m72761j304593j360914
10262f575354J243541L630614K440557l03294n61278R57309N58927j660242k055140
10253b324360L06145K356609J943741J37347j398267k039796j322962O00900J878716
10244A38073J074586j75775M86005J887415R08071j958248k564987N38317L354537
$$ plain form
10235 3687994 5594889 3369263 -865565 -3229666 -2596698 -813221 440105 1219273
10227 1219273 1820605 1541695 47591 -1220528 -777736 259613 -587822 -3125642 -4165657
10218 -4165657 -2252733 -211195 -1025491 -3261334 -3250923 -468298 2263995 3296114 3838483
10209 3838483 5023453 6024721 5812223 4710477 3474615 2395795 1800016 2004040 2485800
10200 2485800 2442943 2200353 2613663 3297076 3257776 3069488 4144795 5736609 5273600
10191 5273600 2437661 364379 1380221 3635503 3771798 1486698 -413354 274940
10183 274940 2922193 5185859 5312577 3523497 1631380 1027795 1114490 487046 -649315
10174 -649315 -742538 423805 1227284 929931 914314 2159550 3359587 3066705 2192118
$$ packed form
10235C687994J906895k225626m234828k364101O32968J783477J253326P79168
10227A219273O01332k78910j494104j268119M42792J037349q47435k537820j040015
10218d165657J912924K041538q14296k235843J0411K782625K732293J032119N42369
10209C838483J184970J001268k12498j101746j235862j078820n95779K04024M81760
10200B485800m2857k42590M13310O83413l9300j88288J075307J591814m63009
10191E273600k835939k073282J015842K255282J36295k285100j900052O88294
10183B74940K647253K263666J26718j789080j892117o03585Q6695o27444j136361
10174f49315r3223J166343Q03479k97353j5617J245236J200037k92882q74587
$$ plain form
10165 2192118 2593626 4212720 5372704 5250148 4453680 3594607 2677535 1613878 288255
10156 288255 -1416823 -2785530 -2322948 207340 2764782 3479781 3163567 3659358 4627430
10147 4627430 4198526 2321440 979666 1047255 1373268 1361900 1961198 3245735 3454636
10138 3454636 1849114 478047 1349679 3427982 4289442 3554877 2814093 3027704 3767273
10129 3767273 4373132 4309292 3047574 1040713 -54632 377590 632152 -462823 -873199
10120 -873199 1641090 4919582 4460795 66862 -3367664 -2581254 176263 1536463 1776088
10111 1776088 2781205 4215375 4788221 5224520 6703276 7738701 5881466 1794827
10103 1794827 -1341606 -2108054 -1825810 -1573269 -976140 -56452 266580 -109102 -404467
$$ packed form
10165B192118M01508J619094J159984j22556p96468q59073r17072j063657j325623
10156B88255j705078j368707M62582K530288K557442P14999l16214M95791R68072
10147D627430m28904j877086j341774O7589L26013j1368N99298J284537K08901
10138C454636j605522j371067Q71632K078303Q61460p34565p40784K13611P39569
10129C767273O05859o3840j261718k006861j095345M32222K54562j094975m10376
10120h73199K514289L278492m58787m393933l434526P86410K757517J360200K39625
10111A776088J005117J434170N72846M36299J478756J035425j857235m086639
10103A794827l136433p66448K82244K52541N97129R19688L23032l75682k95365
$$ plain form
10094 -404467 -794567 -2082184 -3335660 -2367920 716820 2848627 2036507 88957 -119497
10085 -119497 1482645 2586936 1710029 -568266 -2976769 -4706473 -5151462 -3591700 41888
10076 41888 4041596 5418752 2827764 -993484 -1526849 1889778 4699290 3066544 -870158
10067 -870158 -2362793 -960780 -362057 -2117470 -3713101 -3377707 -2629992 -2531554 -1150375
10058 -1150375 2822976 6790146 7376777 4996938 2768601 2265795 2692256 3216081 3814541
10049 3814541 4274011 4193141 3805606 3609994 3533481 3281684 2892727 2307537 1297174 377971
10039 377971 584902 1716788 2298483 2054299 2624738 4669035 6151264 5182372 2949394
10030 2949394 1880432 2165380 2086125 797832 -1166842 -3305202 -5106778 -5324940 -3266004
$$ packed form
10094d04467l90100j287617j253476R67740L084740K131807q12120j947550k08454
10085a19497J602142J104291q76907k278295k408503j729704m44989J559762L633588
10076D1888L999708J377156k590988l821248n33365L416627K809512j632746l936702
10067h70158j492635J402013N98723j755413j595631L35394P47715R8438J381179
10058a150375L973351L967170N86631k379839k228337n02806M26461N23825N98460
10049C814541M59470q0870l87535j95612p6513k51797l88957n85190j010363r19203
10039C77971K06931J131886N81695k44184N70439K044297J482229r68892k232978
10030B949394j068962K84948p9255j288293j964674k138360j801576k18162K058936
$$ plain form
10021 -3266004 -354155 1382733 1966026 2894166 4421367 5334241 5216291 5003634 5190511
10012 5190511 5180793 4617763 3843326 2870602 1414025 165582 424718 1921162 2528559
10003 2528559 1037675 -1012461 -1403841 -255427 392850 -384026 -1293517 -1042703 -244940
9994 -244940 -95998 -152984 906532 2614279 2848617 1225318 309099 2035894 4665521
9985 4665521 5292814 4017384 3141927 3189825 2656755 1380988 1004538 1735730 1726028 543975
9975 543975 398461 2608856 5366219 6425136 5771116 4298027 2250564 555746 1226188
9966 1226188 4368638 6853395 6084643 3312913 1275581 535706 281791 563311 1027884
9957 1027884 -537928 -5059817 -8953429 -7705620 -2162237 2162599 2015683 -554407
$$ packed form
10021c266004K911849J736888N83293R28140J527201R12874j17950k12657J86877
10012E190511r718n63030p74437r72724j456577j248443K59136J496444O07397
10003B528559j490884k050136l91380J148414O48277p76876r09491K50814P97763
9994b44940J48942n6986J059516J707747K34338j623299r16219J726795K629627
9985D665521O27293j275430q75457M7898n33070j275767l76450P31192r702j182053
9975E43975j45514K210395K757363J058917o54020j473089k047463j694818O70442
9966A226188L142450K484757p68752k771730k037332p39875k53915K81520M64573
9957A027884j565812m521889l893612J247809N543383M324836j46916k570090
$$ plain form
9949 -554407 -2387519 -3176691 -3975431 -4288500 -2659780 844271 4167643 5130093 3353328
9940 3353328 563371 -1028689 -850769 -105643 296964 843127 1886893 2468999 1907181
9931 1907181 1319747 2005049 3328892 3910869 3978501 4647883 5615584 5639736 4842393 4392924
9921 4392924 4108868 2564832 -240196 -2365043 -2505067 -1275910 564924 3247618 6327605
9912 6327605 7593712 5374598 1255274 -1162949 -352625 1483343 1408572 -426845 -1029373
9903 -1029373 1501954 5427784 7272860 5443656 1290969 -2608421 -4328436 -3522843
9895 -3522843 -1635686 -713368 -1104232 -1027815 760683 3065760 4139804 4060056 3876584
9886 3876584 4058525 5158593 7652574 9485322 7300552 2705822 2602085 8931176 13635947
$$ packed form
9949e54407j833112p89172p98740l13069J628720L504051L323372R62450j776765
9940C353328k789957j592060J77920P45126M02607N46163J043766N82106n61818
9931A907181n87434O85302J323843N81977O7632O69382R67701K4152p97343m49469
9921D392924k84056j544036k805028k124847j40024J229157J840834K682694L079987
9912F327605J266107k219114m119324k418223Q10324J835968p4771j835417o02528
9903a029373K531327L925830J845076j829204m152687l899390j720015Q05593
9895c522843J887157R22318l90864P6417J788498K305077J074044p9748j83472
9886C876584J81941J100068K493981J832748k184770m594730j03737O329091M704771
$$ plain form
9877 13635947 10556175 6416423 10135972 16900112 17055483 17142187 32307126 55021001
9869 55021001 53813861 15445957 -30167933 -44973104 -29511153 -14483740 -15255174 -18908372
9861 -18908372 -14009987 -8092265 -9467560 -12020660 -8448362 -3965318 -5894547 -10399399
9853 -10399399 -10053577 -6469605 -5680774 -7283206 -7090827 -5604661 -5777904 -6445855 -5174314
9844 -5174314 -3941045 -5375365 -6939616 -5262878 -2808273 -3771998 -6516883 -6657165 -4880348
9835 -4880348 -4936937 -6115330 -4737370 -1729698 -1659939 -4549455 -5193092 -1242255 3649116
9826 3649116 5695278 5166657 3674246 1561095 -686916 -1855818 -1969156 -2192508 -2339398
9817 -2339398 -1113804 995641 1797190 645016 -784168 -1014747 46562 1976644 3583476
$$ packed form
9877A3635947l079772m139752L719549O764140J55371Q6704J5164939K2713875
9869E5021001j207140l8367904m5613890j4805171J5461951J5027413p71434l653198
9861a8908372M898385N917722j375295k553100L572298M483044j929229m504852
9853a0399399L45822L583972P88831j602432J92379J486166j73243o67951J271541
9844e174314J233269j434320j564251J676738K454605r63725k744885j40282J776817
9835d880348n6589j178393J377960L007672O9759k889516o43637L950837M891371
9826C649116K046162n28621j492411k113151k248011j168902j13338k23352j46890
9817b339398J225594K109445Q01549j152174j429184k30579J061309J930082J606832
$$ plain form
9808 3583476 2652340 -1240649 -4484421 -3269940 817299 2496389 -118751 -3769332
9800 -3769332 -5537815 -6146543 -6816355 -6585270 -4621307 -2363850 -1345186 -978912 -321627
9791 -321627 -246670 -1964380 -4538321 -5568071 -3888644 -704325 1527404 1092230 -1298250
9782 -1298250 -2799060 -1502797 919200 1168057 -1152339 -2986367 -2279325 -760784 -996475
9773 -996475 -2455517 -2412774 67392 2824796 3230960 993742 -1818895 -2956517 -2069992
9764 -2069992 -815738 -825272 -1732599 -1771503 -281777 1291758 1297866 -49284 -1217514 -1418032
9754 -1418032 -1180863 -984740 -260617 1745915 4519404 6276374 5589531 2860519 51087
9745 51087 -1121858 -854569 -1126748 -3560122 -7173956 -8813567 -6540939 -2173790 719331
$$ packed form
9808C583476r31136l892989l243772J214481M087239J679090k615140l650581
9800c769332j768483o08728o69812K31085J963963K257457J018664L66274O57285
9791c21627P4957j717710k573941j029750J679427L184319K231729m35174k390480
9782a298250j500810J296263K421997K48857k320396j834028P07042J518541k35691
9773i96475j459042M2743K480166K757404M06164k237218k812637j137622Q86525
9764b069992J254254r534r07327l8904J489726J573535O108j347150j168230k00518
9754a418032K37169J96123P24123K006532K773489J756970o86843k729012k809432
9745E1087j172945K67289k72179k433374l613834j639611K272628M367149K893121
$$ plain form
9736 719331 1132014 1211508 2283354 2645132 820486 -1131384 -195571 2839456 4122761
9727 4122761 1997415 -1219866 -2974247 -3431206 -3997047 -5099889 -6426281 -7644788 -8028720
9718 -8028720 -6820033 -4602259 -2912552 -2116761 -1232486 -101936 123260 -940793 -2232609
9709 -2232609 -3006931 -3324355 -2646020 -395672 1753920 1046679 -2139737 -4267122 -3873272
9700 -3873272 -3527937 -5021455 -6161944 -4761955 -2528669 -1958491 -2186001 -1337789 -615870
9691 -615870 -2226977 -4961547 -5637921 -3779688 -1394636 664715 2517598 2714330 15629
9682 15629 -3117645 -3281659 -2007157 -3912592 -8511996 -9352729 -3476879 3224216 3740425
9673 3740425 -641921 -3062739 -937657 1792936 1627733 -71130 -732114 -746499 -1574120
$$ packed form
9736G19331M12683P9494J071846L61778j824646j951870R35813L035027J283305
9727D122761k125346l217281j754381m56959n65841j102842j326392j218507l83932
9718h028720J208687K217774J689707P95791Q84275J130550K25196j064053j291816
9709b232609p74322l17424O78335K250348K149592p07241l186416k127385L93850
9700c873272L45335j493518j140489J399989K233286N70178k27510Q48212P21919
9691f15870j611107k734570o76374J858233K385052K059351J852883J96732k698701
9682A5629l133274j64014J274502j905435m599404q40733N875850O701095N16209
9673C740425m382346k420818K125082K730593j65203j698863o60984j4385q27621
$$ plain form
9664 -1574120 -2254305 -911962 1383705 1477456 -1016544 -2657642 -1142754 1126721 435357
9655 435357 -3015374 -5711712 -5658485 -3995114 -2195964 -349989 1484993 2545696 2592706
9646 2592706 2144101 1301310 107442 -205561 1305855 2849099 1926327 -144922 680950
9637 680950 4891429 8060084 7120894 4124295 1868877 -192306 -3007186 -4675132 -3587539
9628 -3587539 -1793355 -1749803 -2393938 -1853414 -1299142 -2379379 -3535967 -2962280 -2599229
9619 -2599229 -4641136 -6542887 -4683140 -974349 -124609 -1728656 -1209626 1983273 3462124
9610 3462124 1461179 -860235 -1595474 -2547928 -4018409 -3112507 424384 2254709 287843
9601 287843 -1585127 11359 2356155 1492583 -1379066 -2782172 -2946157 -4188805 -5721759
$$ packed form
9664a574120o80185J342343K295667R3751k494000j641098J514888K269475o91364
9655D35357l450731k696338N3227J663371J799150J845975J834982J060703M7010
9646B592706m48605q42791j193868l13003J511416J543244r22772k071249Q25872
9637F80950M210479L168655r39190k996599k255418k061183k814880j667946J087593
9628c587539J794184M3552o44135N40524N54272j080237j156588N73687L63051
9619b599229k041907j901751J859747L708791Q49740j604047N19030L192899J478851
9610C462124k000945k321414p35239r52454j470481R05902L536891J830325j966866
9601B87843j872970J596486K344796q63572k871649j403106j63985j242648j532954
$$ plain form
9592 -5721759 -4860701 -1975131 216561 1428209 3680025 6702124 7461171 4792863 1269578
9583 1269578 -414948 -456657 -517486 -1266643 -2149956 -2209637 -701796 1863599 3215938
9574 3215938 1377053 -2470177 -4669246 -3274036 -327173 821752 -502531 -2027953
9566 -2027953 -1726542 -108900 868580 326864 -814670 -1328718 -1051477 -620855 -582370
9557 -582370 -1099238 -1900057 -2169535 -1264737 93093 416985 -187581 293553 2660862
9548 2660862 4648092 3906807 1443677 -101983 -458335 -1387065 -3106386 -3955409 -3420440
9539 -3420440 -2662111 -2023782 -907264 -242115 -1805739 -4441532 -4393663 -798923 2323241
9530 2323241 1486231 -1602640 -3058799 -2189462 -1251992 -1487116 -2061670 -2157443 -1927203
$$ packed form
9592e721759Q61058K885570K191692J211648K251816L022099P59047k668308l523285
9583A269578j684526m1709o0829p49157q83313n9681J507841K565395J352339
9574C215938j838885l847230k199069J395210K946863J148925j324283j525422
9566b027953L01411J617642R77480n41716j141534n14048K77241M30622L8485
9557e82370n16868q00819k69478R04798J357830L23892o04566M81134K367309
9548B660862J987230p41285k463130j545660l56352r28730j719321q49023N34969
9539c420440P58329O38329J116518O65149j563624k635793M7869L594740L122164
9530B323241q37010l088871j456159Q69337R37470k35124n74554r5773K30240
$$ plain form
9521 -1927203 -1720111 -1819073 -2502582 -3369562 -3358298 -2270284 -1246649 -924479 -416318 902189
9511 902189 1975474 1636080 405759 -377108 -146259 984641 2548702 3232405 1790480
9502 1790480 -621432 -1015505 1307566 3325115 2510967 289389 -621275 -112296 376031
9493 376031 722097 1202859 572454 -1841714 -3680715 -2588013 -428373 -711250 -2737205
9484 -2737205 -2664320 -226905 458967 -2127692 -3907273 -1616753 1832608 1981452 -111423
9475 -111423 247296 3814195 6144320 4102538 -111680 -2668100 -2904094 -2567994 -2403624
9466 -2403624 -1873526 -1221181 -1423306 -2261995 -2443265 -1847093 -1862927 -2979444 -3739027 -2927920
9456 -2927920 -1259629 164145 1484415 2743673 2504158 -90580 -2986867 -3391581 -1653989
$$ packed form
9521a927203K07092r8962o83509q66980J1264J088014J023635L22170N08161J318507
9511I02189J073285l39394j230321p82867K30849J130900J564061O83703j441925
9502A790480k411912l94073K323071K017549q14148k221578r10664N08979M88327
9493C76031L46066M80762o30405k414168j839001J092702K159640k82877k025955
9484b737205P2885K437415O85872k586659j779581K290520L449361J48844k092875
9475a11423L58719L566899K330125k041782m214218k556420k35994L36100J64370
9466b403624N30098O52345k02125q38689j81270N96172j5834j116517p59583Q11107
9456b927920J668291J423774J320270J259258k39515k594738k896287m04714J737592
$$ plain form
9447 -1653989 -445896 -443768 256166 2221106 3333281 2403186 1265211 1609225 2105823
9438 2105823 701222 -2062631 -4101380 -4740494 -4615712 -3833998 -2295537 -991156 -1030213
9429 -1030213 -1930676 -2456381 -2448591 -2296941 -1539987 104046 1122332 -108085 -2374715
9420 -2374715 -2764011 -933911 91717 -1764135 -4532975 -4885341 -2637655 -781327 -1361240
9411 -1361240 -3052532 -3417122 -2255914 -1294034 -1046534 -23742 2256397 3511925 1894160
9402 1894160 -440797 279124 3886867 6143361 4644708 1847011 889596 1188795 360186
9393 360186 -1527907 -2267407 -1088279 421707 732840 93251 -90826 1324115 4082438
9384 4082438 6331948 6317083 4546656 3097703 2650732 2032743 926100 470700 391329
$$ packed form
9447a653989J208093K128O99934J964940J112175r30095j137975L44014M96598
9438B105823j404601k763853k038749o39114J24782P81714J538461J304381l9057
9429a030213r00463n25705P790J51650P56954J644033J018286j230417k266630
9420b374715l89296J830100J025628j855852k768840l52366K247686J856328n79913
9411a361240j691292l64590J161208R61880K47500J022792K280139J255528j617765
9402A894160k334957P19921L607743K256494j498653k797697r57415K99199q28609
9393C60186j888093p39500J179128J509986L11133o39589j84077J414941K758323
9384D082438K249510j4865j770427j448953m46971o17989j106643m55400p9371
$$ plain form
9375 391329 -1428132 -4924348 -6542997 -4247818 -823899 679742 1743665 4815525
9367 4815525 7648887 6112699 1236639 -1659630 -577698 1199371 1056226 296515 384788
9358 384788 227762 -955743 -1491426 -49271 1998473 2796235 2392514 1475127 -59822
9349 -59822 -1770047 -1974302 -55768 2186917 2941968 2669427 2692785 2909906 2286583 698540
9339 698540 -752996 -721820 1264736 3777543 3967812 705860 -3138250 -3708169 -1232927
9330 -1232927 523567 -90432 -661061 873572 3050842 3543709 2245996 182996 -2094839
9321 -2094839 -3510182 -2507391 123462 1063070 -937772 -2848092 -1913525 221440 559637
9312 559637 -606352 -1248366 -1692117 -3558939 -5949634 -6217079 -3913335 -1025641 1048982
$$ packed form
9375C91329j819461l496216j618649K295179L423919J503641J063923L071860
9367D815525K833362j536188m876060k896269J081932J777069j43145p59711Q8273
9358C84788j57026j183505n35683J442155K047744P97762m03721r17387j534949
9349e9822j710225k04255J918534K242685P55051k72541K3358K17121o23323j588043
9339F98540j451536L1176J986556K512807J90269l261952l844110n69919K475242
9330a232927J756494o13999n70629J534633K177270M92867j297713k063000k277835
9321b094839j415343J002791K630853R39608k000842j910320R34567K134965L38197
9312E59637j165989o42014m43751j866822k390695k67445K303744K887694K074623
$$ plain form
9303 1048982 2064370 1427458 -844293 -2473426 -1421291 561441 188953 -2036725 -2421978
9294 -2421978 44484 2338672 2554306 2503248 3806756 4999868 4562825 3799331 4225250
9285 4225250 4434434 2267075 -1394054 -3504077 -2763249 -741798 354510 -339977 -2009330
9276 -2009330 -2736163 -1124630 1913428 3950628 4103405 3789647 3848577 3082943 984642
9267 984642 -389372 646901 2517662 2830855 1974549 1509309 649153 -2099224 -4841791
9258 -4841791 -4005586 -122649 2279320 1331200 151716 915085 875931 -2643932 -6739722
9249 -6739722 -6486574 -2072821 1741741 2373605 1674649 1612984 1546510 635367 -186626 20645
9239 20645 750728 1408366 2014372 1742826 -750801 -4288294 -5112960 -1911661 1425603
$$ packed form
9303A048982J015388o36912k271751j629133J052135J982732l72488k225678l85253
9294b421978K466462K294188K15634n1058J303508J193112m37043p63494M25919
9285D225250K09184k167359l661129k110023P40828K021451J096308o94487j669353
9276b009330p26833J611533L038058K037200J52777l13758N8930p65634k098301
9267I84642j374014J036273J870761L13193q56306m65240q60156k748377k742567
9258d841791Q36205L882937K401969r48120j179484P63369l9154l519863m095790
9249f739722K53148M413753L814562O31864o98956o1665o6474r11143q21993K07271
9239B0645P30083O57638O06006k71546k493627l537493q24666L201299L337264
$$ plain form
9230 1425603 758044 -2341614 -2841451 385760 3061737 1807676 -1270439 -1870906 824042
9221 824042 3800142 4442189 3077838 1385796 -55019 -1731833 -3408051 -3673954 -1885241
9212 -1885241 243323 310098 -1554440 -2700739 -1721421 -431571 -804727 -1660405 -627619
9203 -627619 1699693 2380569 685364 -882961 -738512 -590814 -2205605 -4062158 -3418568
9194 -3418568 -460799 1774192 1229478 -1057393 -2588431 -1957137 220883 2047665 2030328
9185 2030328 607710 -221231 741250 2378818 2747642 1532842 84213 -707959 -1461373
9176 -1461373 -2976350 -4681691 -5062779 -3482818 -1016515 826864 1804101 2613016 3070477
9167 3070477 2094298 151335 -74533 2711324 5525109 4502673 493353 -1943251 -1099295
$$ packed form
9230A425603o67559l099658m99837L227211K675977j254061l078115o00467K694948
9221H24042K976100O42047j364351j692042j440815j676814j676218k65903J788713
9212a885241K128564O6775j864538j146299R79318J289850l73156q55678J032786
9203f27619K327312O80876j695205j568325J44449J47698j614791j856553O43590
9194c418568K957769K234991n44714k286871j531038O31294K178020J826782j7337
9185B030328j422618q28941R62481J637568L68824j214800j448629p92172p53414
9176a461373j514977j705341l81088J579961K466303J843379R77237Q08915M57461
9167C070477r76179j942963k25868K785857K813785j022436m009320k436604Q43956
$$ plain form
9158 -1099295 71921 -393715 -238382 2177235 3722021 1125325 -2988872 -3414904 -240524
9149 -240524 1579776 219480 -525975 2220987 5954573 6957963 5256666 2779657 -446345
9140 -446345 -5039620 -9070352 -9485928 -6183307 -2117921 486260 2009453 3502204 4666164
9131 4666164 4377080 2421053 283772 138994 2539848 5124580 4752814 1348601 -1679763
9122 -1679763 -1565220 649462 2059496 1597140 381024 -474676 -754233 -503341 130107
9113 130107 883188 2003464 3893968 5441770 4505455 1394624 -344898 1194951 2903711
9104 2903711 1308267 -1451274 -692252 2896472 3754161 249894 -2614911 -1298780 778325
9095 778325 -626962 -3365046 -2696047 630609 1669032 -594749 -1968463 -195706 1712448
$$ packed form
9158a099295J171216m65636J55333K415617J544786k596696m114197m26032L174380
9149b40524J820300j360296p45455K746962L733586J003390j701297k477009l226002
9140d46345m593275m030732m15576L302621M065386K604181J523193J492751J163960
9131D666164k89084j956027k137281j44778K400854K584732l71766l404213l028364
9122a679763J14543K214682J410034m62356j216116q55700k79557K50892O33448
9113A30107P53081J120276J890504J547802r36315l110831j739522J539849J708760
9104B903711j595444k759541P59022L588724Q57689l504267k864805J316131K077105
9095G78325j405287k738084O68999L326656J038423k263781j373714J772757J908154
$$ plain form
9086 1712448 890209 -815006 -229637 2099672 3046919 1333466 -1670338 -4341788 -5653926
9077 -5653926 -4481437 -588146 3691365 4941195 2502628 -669892 -1725653 -1185243
9069 -1185243 -1346283 -2379818 -1887514 1330834 4685204 4394376 150154 -4321314 -5542116
9060 -5542116 -3818158 -1961742 -1709038 -2379350 -2248176 -223282 3212797 5840229 5299177
9051 5299177 1934079 -880364 -662313 854266 139412 -3173143 -6032858 -6285459 -4666930
9042 -4666930 -2504835 -323930 745454 -625943 -2833901 -1849258 2915466 6219315
9034 6219315 3644675 -1708333 -3189794 95259 2575320 832248 -1824080 -1110006
9026 -1110006 1885020 3107313 1721225 400149 597829 891924 77590 -909086 -1000215
$$ packed form
9086A712448q22239j705215N85369K329309R47247j713453l003804k671450j312138
9077e653926J172489L893291M279511J249830k438567l172520j055761N40410
9069a185243j61040j033535M92304L218348L354370k90828m244222m471468j220802
9060e542116J723958J856416K52704o70312J31174K024894L436079K627432n41052
9051E299177l365098k814443K18051J516579p14854l312555k859715k52601J618529
9042d666930K162095K180905J069384j371397k207958R84643M764724L303849
9034F219315k574640n353008j481461L285053K480061j743072k656328P14074
9026a110006K995026J222293j386088j321076J97680K94095q14334r86676r1129
$$ plain form
9017 -1000215 -841289 -1375140 -1959635 -1294691 526397 2192794 3028864 3463522 3785406
9008 3785406 3695621 3344382 3592052 4574808 5011484 3904551 2212523 1674516 2400121
8999 2400121 2867016 2107970 583190 -1110246 -2945311 -4569975 -5137904 -4642413 -4149333
8990 -4149333 -4018812 -3212019 -1258037 437020 472834 -513475 -1079876 -1166201 -1442228 -1467872
8980 -1467872 -512629 409660 -426722 -2509806 -3402742 -2285397 -1041156 -1212627 -1979142
8971 -1979142 -2190680 -2468284 -3741159 -5146374 -5173811 -4056852 -3357610 -3646867 -4047142
8962 -4047142 -3724017 -2445614 4618 3345764 5716623 4880406 1254523 -1674479 -1125773
8953 -1125773 1671405 3216580 2198989 642998 580752 1318444 958570 -627414 -1887574
$$ packed form
9017a000215J58926n33851n84495O64944J821088J666397Q36070M34658L21884
9008C785406q9785l51239K47670R82756M36676j106933j692028n38007P25605
8999B400121M66895p59046j524780j693436j835065j624664n67929M95491M93080
8990d149333J30521Q06793J953982J695057L5814r86309n66401q6325k76027k5644
8980a467872R55243R22289q36382k083084q92936J117345J244241j71471p66515
8971a979142k11538k77604j272875j405215k7437J116959O99242k89257m00275
8962d047142L23125J278403K450232L341146K370859q36217l625883k929002N48706
8953a125773K797178J545175j017591j555991o2246P37692l59874j585984j260160
$$ plain form
8944 -1887574 -2114054 -2208408 -2835623 -3392529 -3382555 -3435047 -4029646 -4313588 -3335498 -1668320
8934 -1668320 -655677 -677520 -1265375 -2227355 -3351320 -3673678 -2638099 -1485908 -1705703
8925 -1705703 -2457505 -1647811 510867 1518843 658901 292396 1757511 2685411 797881
8916 797881 -1711938 -879833 2835129 4589119 1818972 -2234696 -3052192 -473973 2171780
8907 2171780 2901567 2543479 2044849 934292 -1040179 -2795067 -3512394 -3878192 -4437941
8898 -4437941 -4016015 -1625957 882661 572583 -2047592 -2870303 238044 4048829 4251243
8889 4251243 1360280 -479250 359463 1426629 968117 685035 2136641 3407313 2103974
8880 2103974 -241431 -86932 2479389 3423305 646685 -2856141 -3339168 -1464976 -693096
$$ packed form
8944a887574k26480r4354o27215n56906R974n2492n94599k83942R78090J667178
8934a668320J012643k1843n87855r61980j123965l22358J035579J152191k19795
8925a705703p51802Q09694K158678J007976q59942l66505J465115R27900j887530
8916G97881k509819Q32105L714962J753990k770147m053668q17496K578219K645753
8907B171780P29787l58088m98630j110557j974471j754888p17327l65798n59749
8898d437941M21926K390058K508618l10078k620175q22711L108347L810785K02414
8889D251243k890963j839530Q38713J067166m58512k83082J451606J270672j303339
8880B103974k345405J54499K566321R43916k776620l502826m83027J874192P71880
$$ plain form
8871 -693096 -1889546 -2572103 -1488407 -890770 -2866883 -5718298 -6240448 -4236302 -2192353
8862 -2192353 -1183125 -34643 1430742 1622454 668648 1349272 4484505 6455260 4403636
8853 4403636 1352829 2042686 5292906 5421848 990619 -3023847 -2897151 -1115566 -1336464
8844 -1336464 -2633908 -2131146 -208258 727329 607016 1149315 2289907 2577336 2167511
8835 2167511 2209997 2060706 373291 -1617563 -1355108 627101 1029552 -1091514 -2885103
8826 -2885103 -2273272 -837281 -746033 -1455529 -1220502 74234 1283594 1777248 1503543
8817 1503543 497423 -646968 -1007779 -820548 -1417959 -3031621 -4151239 -3749887 -2541947
8808 -2541947 -1383884 -271361 346809 -544799 -2211537 -2057550 604077 2899512 2405698
$$ packed form
8871f93096j196450o82557J083696N97637j976113k851415n22150K004146K043949
8862b192353J009228J148482J465385J91712r53806O80624L135233J970755k051624
8853D403636l050807O89857L250220J28942m431229m014466J26696J781585k20898
8844a336464j297444N02762J922888R35587j20313N42299J140592K87429m09825
8835B167511M2486j49291j687415j990854K62455J982209M02451k121066j793589
8826b885103O11831J435991R1248p09496K35027J294736J209360M93654k73705
8817A503543j006120j144391l60811J87231n97411j613662j119618M01352J207940
8808b541947J158063J112523O18170q91608j666738J53987K661627K295435m93814
$$ plain form
8799 2405698 674415 530480 1904734 2987990 3643443 4515864 4244634 1240462 -2504164
8790 -2504164 -3180083 -746269 827082 -625124 -2813474 -3074123 -1859350 -703533 464260
8781 464260 2092758 3248186 2964697 1781211 427024 -1509213 -4196340 -6306365 -6536099
8772 -6536099 -5168075 -3134934 -1051787 -48749 -1464587 -4297784 -5132267 -2505448
8764 -2505448 666999 1236479 390412 1274363 3663784 4385351 2342531 -158598 -1066887
8755 -1066887 -742818 -280406 -152215 -728381 -1899707 -2125912 -119748 2558024 2997608
8746 2997608 997846 -971711 -1825439 -2853442 -4353914 -4599433 -3061810 -1469523 -534430
8737 -534430 1062930 3028875 2466026 -1276727 -4297060 -3583584 -1561222 -1734900 -2751520
$$ packed form
8799B405698j731283j43935J374254J083256O55453Q72421k71230l004172l744626
8790b504164o75919K433814J573351j452206k188350k60649J214773J155817J167793
8781D64260J628498J155428k83489j183486j354187j936237k687127k110025k29734
8772f536099J368024K033141K083147J003038j415838k833197q34483K626819
8764b505448L172447N69480q46067Q83951K389421P21567k042820k501129r08289
8755a066887L24069M62412J28191n76166j171326k26205K006164K677772M39584
8746B997608j999762j969557q53728j028003j500472k45519J537623J592287R35093
8737e34430J597360J965945n62849l742753l020333P13476K022362j73678j016620
$$ plain form
8728 -2751520 -1148764 2143489 3028317 976583 -459923 133736 143285 -1778088 -2952279
8719 -2952279 -1196780 1344862 1357914 -927988 -2465384 -1474237 912258 2259513 1186521
8710 1186521 -1082975 -1443414 1416522 4387531 3382423 -558677 -1802048 2199946
8702 2199946 7053485 7285693 3206530 -786325 -2405100 -2597804 -1960771 111801 2724061
8693 2724061 3295906 1144997 -1000247 -375586 2263997 3657732 1982221 -1122228 -2408652
8684 -2408652 -476994 2912460 5063103 5321279 4963177 4541141 3100760 475407 -1548075
8675 -1548075 -1588270 -679289 -454762 -681305 -352040 -26230 -887846 -2178613 -1902598 32907
8665 32907 1468020 928070 -906825 -2836613 -4436183 -5354888 -5029605 -3686220 -2256708
$$ packed form
8728b751520J602756L292253Q84828k051734j436506N93659R549j921373j174191
8719b952279J755499K541642J3052k285902j537396R91147K386495J347255j072992
8710A186521k269496l60439K859936K971009j005108l941100j243371M001994
8702B199946M853539K32208m079163l992855j618775j92704O37033K072572K612260
8693B724061N71845k150909k145244O24661K639583J393735j675511l104449j286424
8684b408652J931658L389454K150643K58176l58102m22036j440381k625353k023482
8675a548075m0195R08981K24527k26543L29265L25810q61616j290767K76015J935505
8665C2907J435113n39950j834895j929788j599570r18705L25283J343385J429512
$$ plain form
8656 -2256708 -885550 1048147 3015503 3132996 769268 -2022191 -2769888 -1320094 618209
8647 618209 1749584 2006274 1779179 1351145 793029 -140625 -1560079 -2526448 -1419737
8638 -1419737 2083638 6080366 8240042 8021030 6527489 4909699 3710037 3080894 2589287
8629 2589287 1230884 -1343271 -3917916 -4988292 -4619997 -3968981 -3246941 -1563616 1068681
8620 1068681 3013582 2982183 1716636 896808 1073188 1499745 1485288 1018545 323393 -360744
8610 -360744 -604288 -92200 836257 1461148 1471136 995180 10742 -1517410 -2843252 -2648151
8600 -2648151 -501822 2432261 4588919 5447943 5365359 4465328 2453070 -481131 -3119556
8591 -3119556 -3940488 -2527622 -260873 805466 192217 -314353 965055 3023643 3406763
$$ packed form
8656b256708J371158J933697J967356J17493k363728k791459p47697J449794J938303
8647F18209J131375K56690k27095m28034n58116r33654j419454r66369J106711
8638a419737L503375L996728K159676k19012j493541j617790j199662o29143m91607
8629B589287j358403k574155k574645j070376L68295O51016P22040J683325K632297
8620A068681J944901l1399j265547q19828J76380M26557j4457m66743o95152o84137
8610c60744k43544N12088R28457O24891R988m75956r84438j528152j325842J95101
8600b648151K146329K934083K156658Q59024q2584r00031k012258k934201k638425
8591c119556q20932J412866K266749J066339o13249n06570J279408K058588L83120
$$ plain form
8582 3406763 1869440 752076 1157847 1125116 -900371 -3042604 -2838875 -1303479 -1083876
8573 -1083876 -1796795 -915057 1113206 882284 -2000046 -3171264 91793 4220212 4129141
8564 4129141 182013 -2976032 -2970484 -1598774 -834232 -282132 991061 2636162 3862464
8555 3862464 4547194 4969393 5490543 6593036 8262330 9479942 9258422 7807730 5799462
8546 5799462 3295578 675695 -362723 1378612 4309435 5520596 4325291 2562272
8538 2562272 1642975 1246329 891427 820102 1077225 1405908 2165412 3693474 4838846
8529 4838846 4047360 1899010 474448 149448 -602127 -1964497 -2100316 -570539 277314
8520 277314 -1262503 -3804530 -5410026 -6292045 -7108218 -6708378 -3991565 -452230 1601329
$$ packed form
8582C406763j537323j117364M05771l2731k025487k142233K03729J535396K19603
8573a083876p12919Q81738K028263k30922k882330j171218L263057M128419r1071
8564D129141l947128l158045N548J371710P64542N52100J273193J645101J226302
8555C862464O84730M22199N21150J102493J669294J217612k21520j450692k008268
8546E799462k503884k619883j038418J741335K930823J211161j195305j763019
8538B562272r19297l96646l54902p1325K57123L28683P59504J528062J145372
8529D838846p91486k148350j424562l25000p51575j362370j35819J529777Q47853
8520B77314j539817k542027j605496q82019q16173L99840K716813L539335K053559
$$ plain form
8511 1601329 2269597 3161556 4260756 4259815 3463336 3660353 4994019 5386550 3711950 1598809
8501 1598809 1160357 2328664 3444215 3617515 3516153 4041682 4886693 4771399 3244515
8492 3244515 1786084 2134975 3560760 3356928 722002 -1565134 -745463 2143590 3985722
8483 3985722 3833716 3051856 2080231 61950 -2198582 -1954004 1607333 5449358 6204606
8474 6204606 4135958 2235537 2531455 4538273 6427024 6545642 4504552 1764764 504576
8465 504576 1109235 1611630 446161 -1318395 -1724536 -940710 -858145 -2105576 -3206467
8456 -3206467 -2849086 -1541767 -560697 -341852 -463891 -458596 -134733 379284 575798 -5551
8446 -5551 -1125592 -2146144 -3052366 -4371393 -5756412 -5612666 -3031067 420521 1939712
$$ packed form
8511A601329O68268Q91959J099200r41p96479J97017J333666L92531j674600k113141
8501A598809m38452J168307J115551J73300j01362N25529Q45011j15294j526884
8492C244515j458431L48891J425785k03832k634926k287136Q19671K889053J842132
8483C985722j52006p81860r71625k018281k260532K44578L561337L842025P55248
8474F204606k068648j900421K95918K006818J888751J18618k041090k739788j260188
8465E04576O04659N02395j165469j764556m06141P83826Q2565j247431j100891
8456c206467L57381J307319R81070K18845j22039N295L23863N14017J96514n81349
8446e551j120041j020552r06222j319027j385019J43746K581599L451588J519191
$$ plain form
8437 1939712 613495 -1529217 -1966742 -645936 102883 -1455950 -4093930 -4659934 -1545749
8428 -1545749 3214546 5717546 4095016 286335 -2217097 -1927535 -253097 710959 397037
8419 397037 -331106 -620162 -340745 198317 494489 -81304 -1662441 -3062449 -2297812
8410 -2297812 1275879 5488837 6830638 3846189 -1240037 -4651150 -4607028 -2450357 -650214
8401 -650214 -507777 -1822244 -3710091 -4998324 -4520668 -2126500 753058 2437671 2778234
8392 2778234 2686507 2161764 353682 -2091786 -2670799 -377682 2051766 1345126 -1576514
8383 -1576514 -2525501 163292 3325981 3556317 1803356 1277508 2311417 2233060 132553
8374 132553 -1307282 31920 2057650 1145882 -2755332 -6102029 -6510798 -5162252 -4067130
$$ packed form
8437A939712j326217k142712m37525J320806P48819j558833k637980n66004L114185
8428a545749M760295K503000j622530l808681k503432K89562J674438R64056l13922
8419C97037p28143k89056K79417N39062K96172n75793j581137j400008P64637
8410b297812L573691M212958J341801k984449n086226l411113M4122K156671J800143
8401f50214J42437j314467j887847j288233M77656K394168K879558J684613L40563
8392B778234r1727n24743j808082k445468n79013K293117K429448p06640k921640
8383a576514r48987K688793L162689K30336j752961n25848J033909p8357k100507
8374A32553j439835J339202K025730r11768l901214l346697m08769J348546J095122
$$ plain form
8365 -4067130 -3321322 -2415699 -2297661 -3909156 -5706109 -5159835 -2662652 -1572054 -3709292
8356 -3709292 -6821226 -7678486 -6121838 -4494204 -4066863 -3782525 -2359267 -274132 719864
8347 719864 -429274 -2675374 -3505762 -1528791 1592493 2846317 1690408 637811 1405509
8338 1405509 2425274 1698181 291904 590097 2196256 2405008 464981 -1363027 -1334780
8329 -1334780 -401163 -178877 -752416 -1284922 -1220588 -368957 664548 24358 -3367827
8320 -3367827 -7145657 -7442165 -4156363 -1434910 -1773515 -2813837 -1949677 -810841 -1989961
8311 -1989961 -3955417 -3293266 -468680 990787 453273 883613 3274315 4800075 3929647
8302 3929647 3313009 5089126 6615466 4303286 -294253 -2031706 686162 3724390
$$ packed form
8365d067130P45808R05623J18038j611495j796953N46274K497183J090598k137238
8356c709292l111934q57260J556648J627634M27341K84338J423258K085135R93996
8347G19864j149138k246100q30388J976971L121284J253824j155909j052597P67698
8338A405509J019765p27093j406277K98193J606159K08752j940027j828008K8247
8329a334780R33617K22286n73539n32506O4334Q51631J033505o40190l392185
8320c367827l777830k96508L285802K721453l38605j040322Q64160J138836j179120
8311a989961j965456O62151K824586J459467n37514M30340K390702J525760q70428
8302C929647o16638J776117J526340k312180m597539j737453K717868L038228
$$ plain form
8294 3724390 2878642 -872337 -3237731 -2187107 162483 872336 -204250 -867424 112710
8285 112710 1372607 1031379 -559121 -1253335 -34973 1755498 2396531 1844293 1165250
8276 1165250 895185 985848 1730519 3392551 4931689 4391663 1217742 -2497432 -3851496
8267 -3851496 -2020094 1211282 3544569 4022908 2836054 493202 -1949800 -2720848 -930707
8258 -930707 1705800 2250836 102327 -2142662 -2024360 -50179 1753498 2622903 2857112
8249 2857112 2178191 497251 -437557 1256550 4216191 4636496 1038614 -3942581 -7223943
8240 -7223943 -8425774 -8320584 -6709638 -3892582 -2191791 -3231000 -4792670 -3272986
8232 -3272986 1051216 3992994 3036217 379134 -608008 181875 336800 -1249736 -3189100
$$ packed form
8294C724390q45748l750979k365394J050624K349590P09853j076586o63174R80134
8285A12710J259897l41228j590500o94214J218362J790471O41033n52238o79043
8276A165250k70065R0663P44671J662032J539138n40026l173921l715174j354064
8267c851496J831402L231376K333287M78339j186854k342852k443002p71048J790141
8258i30707K636507N45036k148509k244989J18302J974181J803677Q69405K34209
8249B857112o78921j680940r34808J694107K959641M20305l597882m981195l281362
8240g223943j201831J05190J610946K817056J700791j039209j561670J519684
8232c272986M324202K941778r56777k657083r87142P89883J54925j586536j939364
$$ plain form
8223 -3189100 -3848540 -3249423 -2482431 -2208372 -2236392 -2184140 -2084500 -2250218 -2689437 -2919677
8213 -2919677 -2539813 -1809887 -1336295 -1223245 -911055 -12854 935590 905365 -268899 -1157199
8203 -1157199 -15718 2755993 4150329 1764064 -2735797 -4999938 -3268586 -444419
8195 -444419 169147 -701686 -154628 2003767 2997078 1341200 -1345929 -3104416 -3742653
8186 -3742653 -3541690 -2201300 -131730 1250567 1671544 2483713 3799891 3391450 271698
8177 271698 -2751001 -2607493 -480414 43099 -1709855 -3060126 -2384717 -836922 469343
8168 469343 1888316 3049953 2104227 -1327623 -4619723 -5299004 -4195423 -3797450 -4690750
8159 -4690750 -5317629 -4459554 -2360073 164834 2319371 3211202 2357679 473345 -964933
$$ packed form
8223c189100o59440N99117P66992K74059k8020N2252R9640j65718m39219k30240
8213b919677L79864P29926M73592J13050L12190Q98201R48444l0225j174264q88300
8203a157199J141481K771711J394336k386265m499861k264141J731352K824167
8195d44419O13566q70833N47058K158395R93311j655878k687129j758487o38237
8186c742653K00963J340390K069570J382297M20977Q12169J316178m08441l119752
8177B71698l022699J43508K127079N23513j752954j350271O75409J547795J306265
8168D69343J418973J161637r45726l431850l292100o79281J103581L97973q93300
8159d690750o26879Q58075K099481K524907K154537Q91831q53523j884334j438278
$$ plain form
8150 -964933 -1091397 -279588 503450 718124 686767 981625 1292529 491691 -1489123 -2608456
8140 -2608456 -1017413 1960521 3091443 1615968 176881 664433 1529698 796504 -404648
8131 -404648 255230 2177589 2419257 121103 -2225412 -2458147 -1596951 -1860420 -3131016
8122 -3131016 -2915949 287468 4633116 6553774 4532334 534650 -2541832 -3853794
8114 -3853794 -4139211 -3419096 -1249381 1072757 1086525 -1444367 -3943246 -4621118 -4411637
8105 -4411637 -4385874 -3897175 -2830119 -2885284 -4336159 -4143317 -296035 4127691 4664700
8096 4664700 1596123 -1231501 -2404745 -3779863 -5994248 -7239177 -6640464 -5306070
8088 -5306070 -3810309 -1920382 -732204 -1426130 -1883994 1339161 7156729 10337358 8726735
$$ packed form
8150i64933j26464Q11809P83038K14674l1357K94858L10904q00838j980814j119333
8140b608456J591043K977934J130922j475475j439087M87552Q65265p33194j201152
8131d04648O59878J922359K41668k298154k346515k32735Q61196k63469j270596
8122c131016K15067L203417M345648J920658k021440l997684l076482j311962
8114c853794k85417P20115K169715K322138J3768k530892k498879o77872K09481
8105d411637K5763M88699J067056n5165j450875J92842L847282M423726N37009
8096D664700l068577k827624j173244j375118k214385j244929N98713J334394
8088e306070J495761J889927J188178o93926m57864L223155N817568L180629j610623
$$ plain form
8079 8726735 5738961 4292754 2973068 506138 -614484 1557788 4217504 3810034
8071 3810034 1395892 166496 11215 -1358283 -3575983 -4011014 -2144583 -72118 819056
8062 819056 765424 -69769 -1420361 -1728273 213328 3059834 4711301 5313043 5969622
8053 5969622 5778678 3290352 -9675 -1115582 -31175 403394 -894106 -2050863 -1813401
8044 -1813401 -1202079 -1071220 -807645 -138657 175029 40061 274896 825292 872216 821945
8034 821945 1834876 3293203 3365209 2369823 2782287 5263415 7414256 7376872 6121451
8025 6121451 5142621 4341059 3387942 2941649 3195954 3120134 2242734 1390123 828538 -311440
8015 -311440 -1951043 -2616807 -1983091 -1517930 -1604518 -657624 1525067 2337471 292735
$$ packed form
8079H726735k987774j446207j319686k466930j120622K172272K659716m07470
8071C810034k414142j229396j55281j369498k217700m35031J866431K072465Q91174
8062H19056n3632q35193j350592l07912J941601K846506J651467O01742O56579
8053E969622j90944k488326l300027j105907J084407M34569j297500j156757K37462
8044a813401O11322J30859K63575O68988L13686j34968K34835N50396M6924n0271
8034H21945J012931J458327P2006r95386M12464K481128K150841l7384j255421
8025F121451r78830q01562r53117m46293K54305p5820q77400q52611n61585j139978
8015c11440j639603o65764O33716M65161q6588R46894K182691Q12404k044736
$$ plain form
8006 292735 -2114144 -1834866 519870 2353918 3084183 3726275 3973787 2669541 429070
7997 429070 -861883 -784298 -437438 -220538 342379 962764 791885 -220 -635990 -1341911
7987 -1341911 -2761577 -4173570 -4201734 -3070487 -2326098 -2471919 -2621767 -2303285 -1788191
7978 -1788191 -797030 1097888 2619748 1386606 -2930501 -7510141 -9116799 -6980384
7970 -6980384 -2805277 893763 2284710 1276396 -547614 -1769591 -2614227 -3611316 -3647851
7961 -3647851 -1327514 2151269 3963261 3727752 4000041 5923145 7116870 5453471 2456560
7952 2456560 704214 -107675 -1635452 -2816213 -858518 3788159 6867341 5819580
7944 5819580 3184640 2825891 4801022 6187990 5738103 5080080 5392186 5300843 3157457
$$ packed form
8006B92735k406879K79278K354736J834048P30265O42092K47512j304246k240471
7997D29070j290953P7585L46860K16900N62917O20385j70879p92105o35770p05921
7987a341911j419666j411993k8164J131247P44389j45821j49848L18482N15094
7978a788191R91161J894918J521860j233142m317107m579640j606658K136415
7970f980384M175107L699040J390947j008314j824010j221977q44636r97089l6535
7961c647851K320337L478783J811992k35509K72289J923104J193725j663399k996911
7952B456560j752346q11889j527777j180761J957695M646677L079182j047761
7944E819580k634940l58749J975131J386968m49887o58023L12106r1343k143386
$$ plain form
7935 3157457 -2872 -1210633 995774 4771745 6778591 5487069 2520148 649578
7927 649578 590181 418967 -1416225 -3475258 -3152238 -737101 420179 -1538563 -4213802
7918 -4213802 -4193910 -1586671 627547 829393 130388 -157333 -149042 -184001 17858 340297
7908 340297 39059 -775500 -932981 -259430 -319799 -2008904 -3693265 -3137091 -503338
7899 -503338 1810419 1879136 -121906 -2514943 -3517931 -2465417 -342828 1198592 1673148
7890 1673148 1986731 2660212 2981512 2506167 2118985 2587754 3171007 2923381 2485945 3102089
7880 3102089 4349458 4303643 1943470 -1577121 -4069716 -4175236 -2296324 -1977 1795905
7871 1795905 3815855 6513330 7747379 4784754 -903459 -3892456 -1540640 2432495
$$ packed form
7935C157457l160329j207761K206407L775971K006846j291522k966921j870570
7927F49578n9397j71214j835192k059033L23020K415137J157280j958742k675239
7918d213802J9892K607239K214218K01846o99005k87721Q291l4959K01859L22439
7908C40297l01238q14559j57481O73551o0369j689105j684361N56174K633753
7899e03338K313757O8717k001042k393037j002988J052514K122589J541420M74556
7890A673148L13583O73481L21300m75345l87182M68769N83253k47626m37436O16144
7880C102089J247369m5815k360173l520591k492595j05520J878912K294347J797882
7871A795905K019950K697475J234049k962625n688213k988997K351816L973135
$$ plain form
7863 2432495 3544684 2691420 3071112 3831106 2112053 -92095 2353986 8547579 10659219
7854 10659219 4894457 -2371790 -3513845 -11729 1427482 -309236 -373255 2719539
7846 2719539 4142076 614538 -4101563 -4551507 -1099546 1151662 -753204 -4685671
7838 -4685671 -6853493 -5993977 -3876973 -2786613 -3074358 -3242953 -2413677 -1919312 -3371235
7829 -3371235 -5689586 -5898996 -3150192 -145859 223242 -1842459 -4027382 -4703808 -3643851
7820 -3643851 -1291230 1213210 2201148 1094500 -725583 -1664857 -1659188 -1219003 -141396
7811 -141396 1213060 784366 -2626929 -6451562 -6714074 -3197275 323192 1152017 300930
7802 300930 -440057 -1107346 -1955095 -1947785 -815643 -493559 -2290559 -4273437 -3842829 -1689911
$$ packed form
7863B432495J112189q53264L79692P59994j719053k204148K446081O193593K111640
7854A0659219n764762p266247j142055L502116J439211j736718o4019L092794
7846B719539J422537l527538m716101m49944L451961K251208j904866l932467
7838d685671k167822Q59516K117004J090360k87745j68595Q29276M94365j451923
7829c371235k318351k09410K748804L004333L69101k065701k184923o76426J059957
7820c643851K352621K504440R87938j106648j820083r39274N669M40185J077607
7811a41396J354456m28694l411295l824633k62512L516799L520467Q28825q51087
7802C00930p40987o67289q47749P310J132142L22084j797000j982878M30608K152918
$$ [...]
##END NTUPLES=NMR SPECTRUM
##END=
