##TITLE=31Pdec_3PEPA1609
 D2O, 24 sc
 21.09.2021
##JCAMPDX= 6.0         $$ Bruker NMR JCAMP-DX V2.0
##DATA TYPE= NMR SPECTRUM
##DATA CLASS= NTUPLES
##ORIGIN= UXNMR, Bruker Analytische Messtechnik GmbH
##OWNER= root
$$ XWIN-NMR		Version 3.5
$$ Tue Sep 21 09:31:29 2021 Russian Standard Time (UT+4h)  she@DPX200
##.OBSERVE FREQUENCY= 81.013821
##.OBSERVE NUCLEUS= ^31P
##.ACQUISITION MODE= SIMULTANEOUS
##.ACQUISITION SCHEME= undefined
##.AVERAGES= 24
##.DIGITISER RES= 16
##SPECTROMETER/DATA SYSTEM= spect
##.PULSE SEQUENCE= zgpg30
##.SOLVENT NAME= CDCl3
##.SHIFT REFERENCE= (INTERNAL, CDCl3, 0, 248.564)
##AUDIT TRAIL= $$ (NUMBER, WHEN, WHO, WHERE, WHAT)
$$ ##TITLE= Audit trail, XWIN-NMR		Version 3.5
$$ ##JCAMPDX= 5.01
$$ ##ORIGIN= Bruker BioSpin GmbH
$$ ##OWNER= she
$$ F:/spectra/data/she/nmr/P31/1/pdata/1/auditp.txt
$$ ##AUDIT TRAIL=  $$ (NUMBER, WHEN, WHO, WHERE, WHAT)
(   1,<2021-09-21 09:30:28.59 +0400>,<she>,<DPX200>,
      <created by zg, POWCHK disabled, PULCHK disabled
       configuration hash MD5:
       00 E9 B6 7A A2 85 ED C7 34 08 36 98 17 FE 4E 26
       data hash MD5: 32K
       07 56 B2 43 53 FF A6 6F 69 D3 AE C0 15 8A 73 F6>)
(   2,<2021-09-21 09:30:31.04 +0400>,<she>,<DPX200>,
      <Start of raw data processing
       efp BC_mod = 2 LB = 1 FT_mod = 6 PKNL = 1 PHC0 = -8109.266 PHC1 = 77.86986 SI = 64K 
       data hash MD5: 64K
       64 AE 60 13 B7 74 53 2D 50 70 DE B0 11 1C C7 6E>)
(   3,<2021-09-21 09:30:58.92 +0400>,<she>,<DPX200>,
      <pk PHC0 = 86.82832 PHC1 = -229.2 
       data hash MD5: 64K
       40 F7 77 89 65 CA 29 07 49 E1 06 90 7A F1 51 9E>)
(   4,<2021-09-21 09:31:02.04 +0400>,<she>,<DPX200>,
      <abs ABSG = 5 
       data hash MD5: 64K
       28 4A 8C FE 19 87 15 0A F4 0A D1 E9 36 42 32 EF>)
$$ ##END=
$$ 
$$ hash MD5
$$ 2C 8E A9 E3 02 8E FB AC A1 52 9F 23 63 29 1A F5
##$RELAX= 
##$RELAX= 
##$RELAX= 
##$RELAX= 
##$RELAX= 
##$RELAX= 
##$RELAX= 
##$RELAX= 
$$ Bruker specific parameters
$$ --------------------------
##$DU= <F:/spectra>
##$EXPNO= 1
##$NAME= <P31>
##$PROCNO= 1
##$TYPE= <nmr>
##$USER= <she>
##$AMP= (0..31)
100 100 100 100 100 100 100 100 100 100 100 100 100 100 100 100 100 100 
100 100 100 100 100 100 100 100 100 100 100 100 100 100 
##$AQSEQ= 0
##$AQ_mod= 1
##$AUNM= <au_zg>
##$AUTOPOS= <>
##$BF1= 81.014009
##$BF2= 200.13
##$BF3= 200.13
##$BF4= 200.13
##$BF5= 200.13
##$BF6= 200.13
##$BF7= 200.13
##$BF8= 200.13
##$BYTORDA= 1
##$CFDGTYP= 0
##$CFRGTYP= 5
##$CHEMSTR= <none>
##$CNST= (0..31)
1 1 145 1 1 1 1 1 1 1 1 1 1 1 1 1 1 1 1 1 1 1 1 1 1 1 1 1 1 1 1 1 
##$CPDPRG= <waltz16>
##$CPDPRG1= <>
##$CPDPRG2= <waltz16>
##$CPDPRG3= <>
##$CPDPRG4= <mlev>
##$CPDPRG5= <mlev>
##$CPDPRG6= <mlev>
##$CPDPRG7= <mlev>
##$CPDPRG8= <mlev>
##$CPDPRGB= <>
##$CPDPRGT= <>
##$D= (0..31)
0 1 0 0 0 0 0 0 0 0 0 0.03 2e-05 3e-06 0 0 0 0 0 0 0 0 0 0 0 0 0 0 0 0 
0 0 
##$DATE= 1632202228
##$DBL= (0..7)
120 120 120 11 120 120 24 19 
##$DBP= (0..7)
150 150 150 150 150 150 150 150 
##$DBP07= 0
##$DBPNAM0= <>
##$DBPNAM1= <>
##$DBPNAM2= <>
$$ [...]
##$SUBNAM3= <"">
##$SUBNAM4= <"">
##$SUBNAM5= <"">
##$SUBNAM6= <"">
##$SUBNAM7= <"">
##$SUBNAM8= <"">
##$SUBNAM9= <"">
##$SW= 501.771253377433
##$SWIBOX= (0..15)
0 1 3 0 0 0 0 0 0 0 0 0 0 0 0 0 
##$SW_h= 40650.406504065
##$TD= 32768
##$TD0= 1
##$TE= 0
##$TE2= 300
##$TE3= 300
##$TEG= 300
##$TL= (0..7)
0 120 53 12 22 120 120 120 
##$TP= (0..7)
150 150 150 150 150 150 150 150 
##$TP07= 0
##$TPNAME0= <>
##$TPNAME1= <>
##$TPNAME2= <>
##$TPNAME3= <>
##$TPNAME4= <>
##$TPNAME5= <>
##$TPNAME6= <>
##$TPNAME7= <>
##$TPOAL= (0..7)
0.5 0.5 0.5 0.5 0.5 0.5 0.5 0.5 
##$TPOFFS= (0..7)
0 0 0 0 0 0 0 0 
##$TUNHIN= 0
##$TUNHOUT= 0
##$TUNXOUT= 0
##$USERA1= <user>
##$USERA2= <user>
##$USERA3= <user>
##$USERA4= <user>
##$USERA5= <user>
##$V9= 5
##$VALIST= <valist>
##$VCLIST= <CCCCCCCCCCCCCCC>
##$VD= 0
##$VDLIST= <DDDDDDDDDDDDDDD>
##$VPLIST= <PPPPPPPPPPPPPPP>
##$VTLIST= <TTTTTTTTTTTTTTT>
##$WBST= 1024
##$WBSW= 4
##$XGAIN= (0..3)
0 0 0 0 
##$XL= 0
##$YL= 0
##$YMAX_a= 4390
##$YMIN_a= -4619
##$ZGOPTNS= <>
##$ZL1= 120
##$ZL2= 120
##$ZL3= 120
##$ZL4= 120
##$ABSF1= 248.5645
##$ABSF2= -253.2056
##$ABSG= 5
##$ABSL= 3
##$ALPHA= 0
##$AQORDER= 0
##$ASSFAC= 0
##$ASSFACI= 0
##$ASSFACX= 0
##$ASSWID= 0
##$AUNMP= <proc_1d>
##$AZFE= 0.1
##$AZFW= 0.5
##$BCFW= 0
##$BC_mod= 2
##$BYTORDP= 0
##$COROFFS= 0
##$CY= -3
##$DATMOD= 1
##$DC= 0
##$DFILT= <>
##$DTYPP= 0
##$F1P= 0
##$F2P= 0
##$FCOR= 1
##$FTSIZE= 65536
##$FT_mod= 6
##$GAMMA= 0
##$GB= 0
##$INTBC= 1
##$INTSCL= 5.30512e-09
##$ISEN= 30
##$LB= 1
##$LEV0= 0
##$LPBIN= 0
##$MAXI= 10000
##$MC2= 0
##$MEAN= 0
##$ME_mod= 0
##$MI= 50
##$NCOEF= 0
##$NC_proc= -7
##$NLEV= 6
##$NOISF1= 182.463
##$NOISF2= 159.3651
##$NSP= 0
##$NTH_PI= 0
##$NZP= 0
##$OFFSET= 248.5645
##$PC= 4
##$PHC0= -8022.438
##$PHC1= -151.3301
##$PH_mod= 1
##$PKNL= yes
##$PPARMOD= 0
##$PSCAL= 0
##$PSIGN= 0
##$REVERSE= no
##$SF= 81.014009
##$SI= 65536
##$SIGF1= 159.3651
##$SIGF2= -187.1042
##$SINO= 113.3802
##$SIOLD= 16384
##$SREGLST= <1H.CDCl3>
##$SSB= 0
##$STSI= 65536
##$STSR= 0
##$SW_p= 40650.406504065
##$SYMM= 0
##$S_DEV= 0
##$TDeff= 32768
##$TDoff= 0
##$TI= <>
##$TILT= no
##$TM1= 0
##$TM2= 0
##$TOPLEV= 0
##$USERP1= <user>
##$USERP2= <user>
##$USERP3= <user>
##$USERP4= <user>
##$USERP5= <user>
##$WDW= 1
##$XDIM= 65536
##$YMAX_p= 301427838
##$YMIN_p= -23299362
$$ End of Bruker specific parameters
$$ ---------------------------------
##NTUPLES= NMR SPECTRUM
##VAR_NAME=  FREQUENCY,     SPECTRUM/REAL,   SPECTRUM/IMAG
##SYMBOL=    X,             R,               I
##VAR_TYPE=  INDEPENDENT,   DEPENDENT,       DEPENDENT
##VAR_FORM=  AFFN,          ASDF,            ASDF
##VAR_DIM=   65536,         65536,           65536
##UNITS=     HZ,            ARBITRARY UNITS, ARBITRARY UNITS
##FACTOR=    0.620285442955139, 1,           1
##FIRST=     20137.2065510759, 0,            0
##LAST=      -20513.1999529892, 0,           0
##MIN=       -20513.1999529892, -23299362,   0
##MAX=       20137.2065510759, 301427838,    0
$$ Real data points
##PAGE= N=1
##DATA TABLE= (X++(R..R)), XYDATA
$$ [...]
41293A254971j533009r29300l50287k56028k66187K20705J203186J913638J426090
41284B683779l84700k457598l423161k888435j489093J43643J659647K281201
41276c874717J110488j244063k534142j405099Q12436J954605J797727J587613
41268a795152J582049R13971l87415j188550j193041j249206j417896o55225R82174
41259d408291J774289R45118O621L13670J063014J152109J167700J624834J044269
41250D683333j620497m011989k996667L33725J676913k67166j973306m78972K498873
41241b155753L548571K159744K62063r08288j299364q56018J6971m7544j398105
41232f77723k002475k02149K261113K426152M66784q57167n36593p4057p6244
$$ y = [1254971, -278038, -1207338, -1557625, -1813653, -2079840, -1859135, -655949, 1257689, 2683779, 2299079, -158519, -3581680, -6470115, -7959208, -7815565, -6155918, -3874717, -2764229, -4008292, -6542434, -7947533, -7135097, -5180492, -3382765, -1795152, -213103, 700868, 313453, -875097, -2068138, -3317344, -4735240, -5390465, -4408291, -2634002, -1688884, -1682263, -1368593, -305579, 846530, 2014230, 3639064, 4683333, 3062836, -949153, -3945820, -3612095, -1935182, -2202348, -4175654, -4654626, -2155753, 1392818, 3552562, 3814625, 2906337, 1606973, 750955, 767926, 720382, -677723, -2680198, -2882347, -621234, 1804918, 2271702, 1414535, 877942, 803885, 727641]
41223G27641N49320J509506P43175j647077k483414m32034J396077L40970j326038
41214f21874k63626K074589J763789q82239j800993j25270M20712j825236l206626
41205d466774o60708K968486L025333n2908j735332j58269J682331O15187k484187
41196a266841l982283j718219K563127M711158K523999j374874k427114j29684
41188a100731J339357m03403k088714j61596K981199K449571j212655k685794
41180h82766j49763K303438J477203o02984j108647p62168j036095p42532J226250
41171b78064K668070J216946j388944j763967l2051R56045L49665k58580l04736
41162A164384o91884j157913n43958M42231k695j186079m88241J987064K763210
$$ y = [727641, 1276961, 2786467, 3529642, 1882565, -600849, -1032883, 363194, 704164, -621874, -885500, 1189089, 2952878, 2070639, 269646, 144376, 565088, -1260148, -4466774, -5127482, -2158996, 866337, 813429, -921903, -1080172, 602159, 1217346, -1266841, -5249124, -6967343, -4404216, 306942, 2830941, 1456067, -971047, -1100731, 238626, -164777, -2253491, -2415087, 566112, 3015683, 1803028, -882766, -1032529, 1270909, 2748112, 2145128, 1036481, 274313, -761782, -1504314, -278064, 2390006, 3606952, 2218008, 454041, 421990, 1378035, 1727700, 1469120, 1164384, 472500, -685413, -1229371, -787140, -789835, -1975914, -2464155, -477091, 2286119]
41153B286119J48018l026316l431613j465521L36568R62815J037322Q96818M96587
41144a759203J90973J16308k70465r46303q39307K80595Q42871j95373j417282
41135c997186r55502P60468J987311K279912K197870J419807n41793k333212j967890
41126a150215N547R61702J24903m05597O84580J696605Q28653p64912r00390J08197
41116A189073K79659m72001k87353J092483J388600o66774l007008k931519n93612
41107d008452J741651K626306J971308l2027k396863k799346k12825K480609J577229
41098I47590j774997k529642Q05792L539566J686526k139719k992965q69453M33192
41089b894110j23803q7849J238684J456567m30932k141893j853857n30160N52017
$$ y = [2286119, 2434137, -592179, -4023792, -5489313, -5152745, -4189930, -3152608, -2255790, -1759203, -1568230, -1451922, -1722387, -2668690, -3507997, -3227402, -2384531, -2579904, -3997186, -4952688, -4192220, -2204909, 75003, 2272873, 3692680, 3150887, 817675, -1150215, -1144668, -182966, -58063, -463660, 220920, 1917525, 2746178, 1981266, 1080876, 1189073, 1468732, 996731, 709378, 1801861, 3190461, 2523687, -483321, -3414840, -4008452, -2266801, 359505, 2330813, 2298786, -98077, -2897423, -3110248, -629639, 947590, -827407, -3357049, -2551257, 988309, 2674835, 535116, -2457849, -3327302, -2894110, -3017913, -3105762, -1867078, -410511, -841443, -2983336, -4837193, -5367353, -4815336]
41080d815336J475878J844844N53183j276310n53845K764979M372174J729409
41072F094976j781887j888160L26886R02139n90921j349032o28390l44880q65354
41063a24623l78373J243687J695123J63714j167573n85551Q46922J460907J090754
41054D244987Q6331j495320k733094k107455l6295R56816k03300j478672r39460
41045c705462L98550O20803k2358m1887P12072J363515J768787K034557J317196
41036D445773p85006k436991j508490J007750J884119J25082j720282j332961
41028c21006L86577J228294Q08827J94718l78737j431258k335852j541016Q87134
41019b502319K590991J776979l38063j151738q8696J026279P99826j03420n58026
$$ y = [-4815336, -3339458, -1494614, -941431, -2217741, -2771586, -6607, 4365567, 6094976, 4313089, 2424929, 2751815, 3653954, 3063033, 1714001, 1085611, 740731, -124623, -502996, 740691, 2435814, 2599528, 1431955, 846404, 1693326, 3154233, 4244987, 4331318, 2835998, 102904, -2004551, -2040846, -1084030, -1287330, -2766002, -3705462, -3306912, -2686109, -2708467, -2750354, -2038282, -674767, 1094020, 3128577, 4445773, 3660767, 1223776, -284714, 723036, 2607155, 2732237, 1011955, -321006, 65571, 1293865, 2102692, 2297410, 1918673, 487415, -1848437, -3389453, -2502319, 88672, 1865651, 1527588, 375850, 287154, 1313433, 2113259, 2009839, 1451813]
41010A451813o96102j033469j048153q1828R96330P09816n31973n96241J182880
41001C53073K541922J229615j574908k441574k17866K199565J467978j790170
40993A767635l600566j634442J865501L015726J079775j167954j416425l02581
40985c93331M20139M12570L96424N37550M52499R4417l52048p98177q27722n427
40975f3106P55219j99727k179582j868994J757036M470179K083993k846180l930991
40966b022153j62033K586600L18424l499664l592043k75456K219642K170645J361671
40957h94367J170253J185578J091260J005230L52324j099100j655015J86794K501749
40948C844706J837122j549108l460858j634246J049597Q66628j534692k561466
$$ y = [1451813, 755711, -277758, -1325911, -1407739, -411409, 298407, -233566, -829807, 353073, 2894995, 4124610, 2549702, 108128, -109738, 2089827, 3557805, 1767635, -1832931, -3467373, -1601872, 1413854, 2493629, 1325675, -90750, -393331, 26808, 439378, 835802, 1373352, 1825851, 1920268, 1568220, 770043, -57679, -63106, 692113, 492386, -1687196, -3556190, -1799154, 2671025, 4755018, 1908838, -2022153, -2184186, 402414, 720838, -2778826, -6370869, -6646325, -4426683, -2256038, -894367, 275886, 1461464, 2552724, 3557954, 3910278, 2811178, 1156163, 1342957, 3844706, 5681828, 4132720, 671862, -962384, 87213, 953841, -580851, -3142317]
40940c142317j047512M64196j01991j198566r1127K714975L650544J079970j937875
40931C90297j655102J003867J891253J5577j084985O96556K390284P08426k552014
40922A804159l234342r18411J328470J915057J706567R82151o64792j829503o88106
40913D01250J186009M97499k050743k145446J201431L741755K615772L04225l55520
40904E396232o21766k148031k934562j011126J132023K69305j906526j506025
40896c330476J039521K001472P22733O3685R03702J006855k83828p13743N46390
40887A956311J218773l2759j299614p87544L96848M83371k83930p19911n32578
40878C98967O2027Q13173Q38466n04127j757258p64754J657786K313137N77005
$$ y = [-3142317, -4189829, -3725633, -3827624, -5026190, -5117317, -2402342, 1248202, 2328172, 390297, -1264805, -260938, 1630315, 1645892, 560907, 1257463, 3647747, 4356173, 1804159, -1430183, -2348594, -1020124, 894933, 2601500, 3583651, 2918859, 1089356, 401250, 1587259, 2084758, 34015, -2111431, -910000, 2831755, 5447527, 5751752, 5396232, 4774466, 2626435, -308127, -1319253, -187230, 82075, -1824451, -3330476, -2290955, -289483, 433250, 496935, 1400637, 2407492, 2123664, 1409921, 1956311, 3175084, 3142325, 1842711, 1055167, 1452015, 1935386, 1651456, 931545, 398967, 460994, 1274167, 2112633, 1608506, -148752, -913506, 744280, 3057417, 3634422]
40869C634422n23587N70965J319635l47080k229601j542252M36966P74034k75103
40860A818399m49049J51516k69573j200816m61976J456840J603098m65848j596931
40851E85660q0748J488426K96184k232786k488488J67891K679404K389583l4877
40842B770249k102865k547781j989883j218458j16198J333600K096933J357178
40834d17225J82764L86874J831790K563142J762046O20100j01087j065235k117848
40825C645321j708786M068K95736j738924k814326m60190K330456J478523j284877
40816b52999q77319K776812M322636J321300k267369k540354q91244l74522p94890
40807D22051m54293J98191j55339q32860l93390P60043J312849J145650O04148
$$ y = [3634422, 3110835, 3681800, 5001435, 4654355, 2424754, 882502, 1319468, 2093502, 1818399, 1369350, 1520866, 1251293, 50477, -411499, 1045341, 2648439, 2182591, 585660, 504912, 1993338, 2289522, 56736, -2431752, -2263861, 415543, 2805126, 2770249, 667384, -1880397, -3870280, -5088738, -5204936, -3871336, -1774403, -417225, -234461, 152413, 1984203, 4547345, 6309391, 6929491, 6828404, 5763169, 3645321, 1936535, 1940603, 2236339, 497415, -2316911, -2777101, -446645, 1031878, -252999, -1130318, 1646494, 5969130, 7290430, 5023061, 2482707, 1591463, 1216941, 422051, -32242, 165949, 10610, -822250, -1215640, -455597, 857252, 2002902, 2607050]
40798B607050o62355k241812k225354m9601J820536J338344M1984J88004P67721
40789A584517l70683k098158j525350R23596J864305K73289j184489n47215J008686
40780g1502J819994J875507J436842J66498j403039j837000j059932n00096m64929
40771c7657J72320J164132O98681j050823j370068M85917J482690k79014j981996
40762g15818m89450K300056K279825m28676j997191j038577l9319n25038q11386
40753a465574L54267J351156N92888p80168j006325m45879l14033l16731M67777
40744a562622J499309J448273K65010r17545j352118r86163j1209P70090J62457
40735f84518j537051k071753k54600J827652J707872L48484L15011J135740O6985
$$ y = [2607050, 1944695, -297117, -2522471, -2572072, -751536, 586808, 628792, 816796, 1584517, 1213834, -884324, -2409674, -1486078, 378227, 651516, -532973, -1080188, -71502, 1748492, 3623999, 5060841, 5227339, 3824300, 1987300, 927368, 427272, -37657, 134663, 1298795, 1997476, 946653, -423415, 62502, 1545192, 1266178, -715818, -1205268, 1094788, 3374613, 2945937, 948746, -89831, -129150, -654188, -1465574, -1111307, 239849, 832737, 52569, -953756, -1399635, -1713668, -2030399, -1562622, -63313, 1384960, 1649970, 732425, -619693, -1605856, -1617065, -846975, -684518, -2221569, -4293322, -4547922, -2720270, -1012398, -663914, -348903, 786837, 853822]
40726H53822k600512l049658Q4121L059251K510314K85470n5596J163864J139267
40717C390343l87034j339946j391912j932525k503855j190046J400227K414859
40709a539889J503756J374937K661536K365238p26422l054979j588842J189988
40701B185323J119667j263458k050755j47515J737705J626190K95085j033888
40693B468354j913264j574311M69411K519823K103575m09376k125899j795699
40685b57386r91815p98870k76249R31529J339581L01987n82091j90860L41842
40676a82332Q3992J27753J095115J179531r28429l103444k508437J08947J597995
40667b529309R42681r3804k43248N4477M68341J221578J666081Q21640m43937
$$ y = [853822, -1746690, -4796348, -4712227, -1652976, 857338, 1142808, 1087212, 2251076, 3390343, 3003309, 1663363, 271451, -1661074, -4164929, -5354975, -3954748, -1539889, -36133, 1338804, 4000340, 6365578, 5639156, 2584177, 995335, 2185323, 3304990, 2041532, -9223, -156738, 1580967, 3207157, 3502242, 2468354, 555090, -1019221, -549810, 1970013, 4073588, 3664212, 1538313, -257386, -1249201, -2048071, -2324320, -1392791, -53210, 248777, -333314, -524174, -182332, -98340, 29413, 1124528, 2304059, 1375630, -1727814, -4236251, -4127304, -2529309, -1586628, -1680432, -1923680, -1869203, -1400862, -179284, 1486797, 2308437, 1864500]
40658A864500j34164J535707J869247l87744k965258l131994j198802L81271K59902
40649a907335p27135j052752j44544J116098J253065N2943p13754M53068K205477
40640E35131J874635m71237j889948j069609k67262j305019k291504p93302J741195
40631c936920J883511m27288j704927j17899K050591J971137M7099j158123l98834
40622a791653J119065J532921M27563q52931q84985J1810L20442k52068l20766
40613f90602N62574P60517m81294r92818R24645K921749J803560j025932j480244
40604B302155M40376O32261j880196k917886j89585K648946K001251k7873J35143
40595C144592J444068R62171l54403K38595J545489L28018k326051k243759N48519
$$ y = [1864500, 1730336, 3266043, 5135290, 4747546, 1782288, -1349706, -2548508, -2167237, -1907335, -2634470, -3687222, -3831766, -2715668, -1462603, -1409660, -2123414, -1670346, 535131, 2409766, 1938529, 48581, -1021028, -1288290, -2593309, -4884813, -5678115, -3936920, -2053409, -2480697, -4185624, -4303523, -2252932, -281795, -234696, -1392819, -1791653, -672588, 860333, 1287896, 434965, -450020, -438210, -117768, -369836, -690602, -128028, 632489, 151195, -841623, 83022, 3004771, 4808331, 3782399, 2302155, 2742531, 3374792, 1494596, -1423290, -1612875, 1036071, 3037322, 3009449, 3144592, 4588660, 5550831, 5196428, 5435023, 6980512, 7308530, 4982479, 2738720, 3287239]
40586C287239J485709j013230l172496k349555p05535l99808l4889J400516J551472
40577D9423r00038k662313o06124K861787L302319Q38895r04619p13304l30517
40568I35509k09420Q70793K211913J449605j067040j915723K50396K410145J618845
40559F555023q46342j750125n15664N59520r6118j385892j365631N2008Q82319
40550B089098m17596k711848l306927j374578R66718J598971J029807Q79926J107072
40541a39357N46068o87373j348525j152894q24852m14730N54050J557344J619423
40532b90846J130200J113990J023797l59920j997088j399758J195595K421998
40524B837968N99354j838112k228907j320014r76563o99458Q28942K466699K004635
$$ y = [3287239, 4772948, 3759718, 587222, -1762333, -2467868, -2867676, -2902565, -1502049, 49423, -850615, -3512928, -4119052, -1257265, 2045054, 2883949, 1979330, 1266026, 935509, 726089, 1596882, 3808795, 5258400, 4191360, 2275637, 2526033, 4936178, 6555023, 5708681, 3958556, 3442892, 4002412, 3906294, 2520402, 1154771, 1206779, 2089098, 1671502, -1040346, -4347273, -5721851, -4755133, -3156162, -2126355, -1246429, -139357, 406711, -280662, -1629187, -2782081, -3606933, -4021663, -3467613, -1910269, -290846, 839354, 1953344, 2977141, 2617221, 620133, -779625, 415970, 2837968, 3437322, 1599210, -629697, -1949711, -2926274, -3625732, -2796790, -330091, 1674544]
40515A674544j2483q71142J31964R28800L39261k55727K34435N57684n43936j805857
40505C77543j229341O59104J399858J46320j260804j044508K55483R98396P19914
40496A021965J74292j44631l76676n39100n00482n99392j221006j738255j036031
40487d959316O66202J729989J330365N59626N80178R29144P16170L02312L56930
40478B211600K92952n53422j000998M41507K405479J674243j996893m554457k670246
40469c750235J690646L687030J611761j541915k291815n54353J247392J608959
40461A707470J247771J265746J225792q6564k325132l253313j443024J525787
40453a35467K689122J151086j262421k583746k538940j703207l77515J028701
$$ y = [1674544, 1662061, 790919, 922883, 1851683, 2190944, 1935217, 2169652, 2727336, 2183400, 377543, -851798, -192694, 1207164, 1353484, 92680, -951828, -696345, 302051, 1021965, 1196257, 1051626, 674950, 135850, -364632, -964024, -2185030, -3923285, -4959316, -4293114, -2563125, -1232760, -673134, -92956, 836188, 1552358, 1854670, 2211600, 2504552, 1951130, 950132, 1391639, 3797118, 5471361, 3474468, -1079989, -3750235, -2059589, 1627441, 3239202, 1697287, -594528, -1148881, 98511, 1707470, 2955241, 4220987, 5446779, 5360215, 3035083, -218230, -1661254, -135467, 2553655, 3704741, 2442320, -141426, -2680366, -4383573, -4761088, -3732387]
40445c732387J700970J330663N10641k70840j023272j240216j2658J932321K034210
40436A229432n51062k667764r14867L062088M052913M00550l407298k765191R75346
40427e85853K896990J281537j094521j794261j466607j162458j39879J833841
40419b31211K552892M33400k117511j495845J660368L083931R98730j681566k129691
40410A073497j314353j190787j134447J77998J537033J017609l23879J12240J955993
40401A910904K129911k73693k511192k293222o35988M38316O45345N69879J29189
40392A09449n66559m96657N70243J074794o7099j461796j195250K46871Q43869
40383i42135Q5848p52287r57043r93900p97164M56384K222103K172615o41231
$$ y = [-3732387, -2031417, -700754, -190113, -460953, -1484225, -2724441, -2737099, -804778, 1229432, 678370, -1989394, -2904261, 157827, 4210740, 4611290, 1203992, -1561199, -585853, 2311137, 3592674, 2498153, 703892, -762715, -1925173, -2065052, -231211, 2321681, 2755081, 637570, -858275, 802093, 3886024, 4884754, 3203188, 1073497, -240856, -1431643, -2566090, -2388092, -851059, 166550, -157329, -45089, 1910904, 4040815, 3767122, 1255930, -1037292, -1673280, -1234964, -589619, -19740, 109449, -457110, -953767, -383524, 691270, 624171, -837625, -2032875, -1786004, -942135, -856287, -1608574, -2565617, -3559517, -4356681, -3900297, -1678194, 494421, -146810]
40374a46810l471650k682505J402431M434463L379677J40984j446481o85035J40728
40365A065802Q3005N83260J839290J492487j283812l331477j933505O23620M73283
40356c88047j478278r73852K358444L995212J610837j391580j455312L3496R2127
40347B403047p40152k25599R77386M77476j372458j930262o70522L03360N8871
40338g18853q8886M06231L12102o34310q00844L85607J070650q891j349772j240140
40328b667106n64336r77422j784684j065089R64506K226248K117288K033059K339315
40319B621779J482448q27805k037302l51541J905665J210960j831989l152831
40311i80616j236186P52095O5294j382122l25354K363683K800959N7216k331023
$$ y = [-146810, -3618460, -6300965, -4898534, -464071, 2915606, 3056590, 1610109, 925074, 1065802, 1148807, 1732067, 3571357, 5063844, 3780032, 448555, -1484950, -861330, -388047, -1866325, -2840177, -481733, 3513479, 5124316, 3732736, 2277424, 2310920, 2403047, 1662895, 1437296, 2414682, 2892158, 1519700, -410562, -1081084, -777724, -718853, -807739, -401508, -89406, -723716, -1524560, -1138953, -68303, -77194, -1426966, -2667106, -3231442, -4208864, -5993548, -7058637, -6094131, -3867883, -1750595, 282464, 2621779, 4104227, 3276422, 1239120, 887579, 2793244, 4004204, 2172215, -980616, -2216802, -1464707, -1399413, -2781535, -3106889, -743206, 2057753, 2114969, -216054]
40302b16054j488610Q89702J347820l99473j443214n7004J846393J347872j359589
40293D67843k818974o70887K876935L416467K9337l307716k851710K13970J913466
40284g31269R24284m13506J4090J502082K041699P61696j441090k648040j504693
40275a494747R64612J887547J31938j858390j597059l60880p62166j942990q99751
40266e931886K033033L227597J565727j5429L08016P24559o9217l50207Q49258
40257B341451J333758j94137j252958R4213J333273l78953k960567k462840N88212
40248a558548K225333J222104M2483J14652Q2647j025212k128832k098166j049362
40239d172901M87353J733159J451908l10599j069175R96702L565966K788842j010075
$$ y = [-216054, -1704664, -814962, 532858, 133385, -1309829, -1366833, 479560, 1827432, 467843, -2351131, -3022018, -145083, 3271384, 3300721, -6995, -2858705, -2644735, -731269, 193015, -220491, -206401, 1295681, 3337380, 4099076, 2657986, 9946, -1494747, -530135, 1357412, 1489350, -369040, -1966099, -2326979, -3089145, -5032135, -5931886, -3898853, -671256, 894471, 879042, 1187058, 1911617, 1842400, 1492193, 2341451, 3675209, 3481072, 2228114, 2322327, 3655600, 3276647, 316080, -2146760, -1558548, 666785, 1888889, 1931372, 2046024, 2128671, 1103459, -1025373, -3123539, -4172901, -3685548, -1952389, -500481, -811080, -1880255, -883553, 2682413, 5471255, 4461180]
40230D461180l446889k104540O05191J324477j33565j601696j518544o2025J371979
40221a104432J307154k19034j360778q42021J50646J9895m19446N05989J898562
40212f3465J364269q57240j968222r65598J48009L534k73343L21169R97467J191782
40202a01638J651207K297685J534504q53219k444584j550770J65061K59399j002884
40193d5239j623856r48593J37562J022035J540942J148278l04135j453916p63919
40184a290841J206881K287521J445526j82360j142059j338642j326424r21273
40176a261671L49919J701236J396213p37261k290231j194308J111296J478897
40168E54090k34036r24159O86548J806328J69742k008566j517416O41360J066834
$$ y = [4461180, 1014291, -1090249, -485058, 839419, 705854, -895842, -2414386, -2476411, -1104432, 202722, -16312, -1377090, -2219111, -2068465, -2048570, -2468016, -1962027, -63465, 1300804, 443564, -1524658, -2490256, -2342247, -2338713, -2612056, -2290887, -1293420, -101638, 1549569, 3847254, 5381758, 4528539, 2083955, 533185, 698246, 957645, -45239, -1669095, -2617688, -2480126, -1458091, 82851, 1231129, 926994, -526922, -1290841, -83960, 2203561, 3649087, 3466727, 2324668, 986026, -340398, -1261671, -911752, 789484, 2185697, 1448436, -841795, -2036103, -924807, 554090, 320054, -604105, 82443, 1888771, 2058513, 49947, -1467469, -826109, 240725]
40159B40725l89926o71535J209064K727756K078245M98053m72953j171526k129897
40150A918006k593822j951072q81144j34040M42278J125950J835228K506866K699985
40141D968235J322949j544676l383327k131796L90640P82746q16175j237744L20460
40132a328688J209863R6433j020980o39161n0480l89934n77417K64184J194310
40123a241870J550590J800508J344732j105646l835584k891693J577290M035772
40115A234099J371242k176441j514181J677125K373006K95564p18880K13370M5398
40106B800302k256491l590921j529939K267569M609876M207404J708161j511823
40098F704138l695338l525672j521100L03947N48516m13584j238685r41032K79469
$$ y = [240725, -149201, -820736, 388328, 3116084, 5194329, 5692382, 5219429, 4047903, 1918006, -675816, -2626888, -3508032, -3642072, -3199794, -2073844, -238616, 2268250, 4968235, 6291184, 4746508, 1363181, -768615, -377975, 404771, -411404, -1649148, -1328688, -118825, -22392, -1043372, -1682533, -1733013, -2122947, -2700364, -2436180, -1241870, 308720, 2109228, 3453960, 2348314, -1487270, -4378963, -2801673, 1234099, 2605341, 428900, -1085281, 591844, 2964850, 3260414, 2541534, 2754904, 2800302, 543811, -3047110, -4577049, -2309480, 2300396, 6507800, 8215961, 6704138, 3008800, -516872, -2037972, -1734025, -1185509, -1599093, -2837778, -3778810, -3499341]
40089c499341J101522N36796n50357m90972N94821J068277Q50515J656324L311351
40080D578936K925704m34299l279662k545764k41378k5268j381051j054443J135378
40071c21847K045052L76172j619569j882649r46159j03241L41110M52446K19192
40062a439493N9900L60608O78206O55398R61849J837649J847334K0688j919216
40053C062923j703287R5119J046107K15279j629956l763506m964472k967559K310472
40044h298880O474275N316009P15153j998201j525401r81461j526103q98970J264870
40035a458709J977239K30414r89585K3154Q09567n12550j694474l74522J811369
40026a78097K109038P58125n23767j454290j964671q66716J488540K061868l30067
$$ y = [-3499341, -2397819, -1861023, -2411380, -2902352, -2307531, -1239254, -388739, 1267585, 4578936, 7504640, 7070341, 3790679, 1244915, 1003537, 978269, -402782, -1457225, -321847, 1723205, 2099377, 479808, -1402841, -2349000, -2452241, -2111131, -1658685, -1439493, -1379593, -1018985, -340779, 314619, 1276468, 3114117, 4961451, 4982139, 3062923, 1359636, 1454755, 2500862, 2716141, 1086185, -2677321, -7641793, -10609352, -8298880, -1824605, 3491404, 4206557, 2208356, 682955, -298506, -1824609, -2723579, -1458709, 518530, 748944, -240641, -217487, 592080, 79530, -1614944, -1989466, -178097, 1930941, 2689066, 2165299, 711009, -1253662, -2120378, -631838, 1430030, 1099963]
40017A099963k203588n99557J804777R62028j723062j840539N14885J261195l30260
40008a054158o44827J388838K125259l03392k428087j134193J341374J456977
40000G47791j8070k13713O16930J74390j270494j462887m71825l81365r74335
39991c253578J91366K925127L645012Q75736k058963j932502j97444n0125j329394
39982a184765j464657N6526J407837J784687J944878J721595K5279k442754l227540
39973a378914j520568P18279J630169J386482P67659k0398m90726K4472P50023
39964A866478J02323j430733j470648M06730J725614J131976M08054Q81061R54742
39955D575597n15315j458869j79171J041311m91412k941440k609495O0730J430053
$$ y = [1099963, -1103625, -1703182, 101595, 1063623, -659439, -2499978, -1985093, -723898, -1054158, -1698985, -310147, 1815112, 1511720, -916367, -2050560, -709186, 747791, 729721, 516008, 1132938, 1307328, 36834, -1426053, -1897878, -2279243, -3253578, -3062212, -137085, 3507927, 4383663, 2324700, 392198, 194754, 144629, -1184765, -2649422, -2592896, -1185059, 599628, 2544506, 4266101, 4291380, 1848626, -1378914, -2899482, -2181203, -551034, 835448, 1603107, 1582709, 1091983, 1116455, 1866478, 1968801, 538068, -932580, -525850, 1199764, 2331740, 2739794, 3620855, 4575597, 4060282, 2601413, 2422242, 3463553, 2972141, 30701, -2578794, -2518064, -1088011]
39946a088011O23526J03579O60631L57465j157794j623070m16064J61320q01180
39937c179598j001603P96064K182526J111392n29970m3841J766774K247139J078451
39928D427334k2604n67849j463036k510955k301998o09934J053608J467047Q41120
39919C12733j39236j100228j596642j062890L74311J615077J502617q3143j989306
39910b166707k558848r82566J763542L506862K756935R5637k314861k651617j044020
39901c595643O85521J083354O34007O51484R81749K71417j301755j536059N07760
39892a618165K597359K363160O37248k65168j89858o26280j568628j569383m14679
39883f54394P33258J436929J864628J228309r75810k815319k086658j45706j17941
$$ y = [-1088011, -464485, -360906, 299725, 657190, -500604, -2123674, -2539738, -2378418, -3179598, -4181201, -3385137, -1202611, -91219, -621189, -665030, 1101744, 3348883, 4427334, 4404730, 3836881, 2373845, -137110, -2439108, -3049042, -1995434, -528387, 312733, 173497, -926731, -2523373, -3586263, -3211952, -1596875, -94258, -177401, -2166707, -4725555, -5708121, -3944579, -437717, 2319218, 2414855, 99994, -2551623, -3595643, -2910122, -1826768, -1192761, -541277, 440472, 711889, -589866, -2125925, -1618165, 979194, 3342354, 3979602, 3714434, 3524576, 2898296, 1329668, -239715, -654394, 78864, 1515793, 3380421, 4608730, 3632920, 817601, -1269057, -1414763, -1532704]
39874a532704j574603j055184J771595K981978P63940j502135p74970J003044
39866H0961P36033o89501n63087Q22335J082412j07194j018662r85850p41939
39857a384492m92282k6213P9479n45624q22493J00704J095128R24316M72406Q93536
39847B94465J055964m49194k012840r02775K160974L547528J846755n01926j124967
39838C913984n48166l05614n59015p74102j011953j299845r50841L17620J401730
39829A83798J026156m35705j252690n01374O86523N43428q66208j525139l09831
39820b451042J156831Q49442m19634k77551J159628J346821k81532j132452J46428
39811I6939J254292K14139j109991j49616K004980K391462O73001j088788j817813
$$ y = [-1532704, -3107307, -4162491, -2390896, 591082, 1355022, -147113, -922083, 80961, 816994, 127493, -435594, 386741, 1469153, 1361959, 343297, -642553, -1384492, -1876774, -1902987, -1823508, -2369132, -3191625, -3090921, -1995793, -1071477, -599071, 294465, 1350429, 901235, -1111605, -2014380, 146594, 3694122, 5540877, 5038951, 3913984, 3365818, 3060204, 2501189, 1727087, 715134, -584711, -1535552, -1217932, 183798, 1209954, 774249, -478441, -979815, -293292, 250136, -616072, -2141211, -2451042, -1294211, -444769, -864403, -1141954, 17674, 1364495, 1082963, -49489, 96939, 1351231, 1565370, 455379, 305763, 2310743, 4702205, 5375206, 4286418, 2468605]
39802B468605j734740n52004J648718K767516R80722k050534l150388k011152
39794a633257o79989L32294J946691L201487J970834r38138k186433q99379K81111
39785A395221j98065o99687O6778Q20640M34659j56851k54212p54420j716829
39776a062766j395969N65509J667412K58892j658875j412079N86090K013074J776545
39767A337833K83272j584949k276597m89773K211423K249450o91815k234447L01622
39758h93981L201440J678881k693036m354398j954195O45239R41361M96042O80226
39749b252421L29462r83036j212206P27138K783752K841040J494095K39455o39868
39740C327411q84590M01639K388195K142469j067671l563318k156660Q93848J196500
$$ y = [2468605, 733865, 181861, 1830579, 4598095, 5578817, 3528283, 377895, -1633257, -2313246, -1980952, -34261, 3167226, 5138060, 4199922, 2013489, 1114110, 1395221, 1197156, 497469, 564247, 1384887, 1819546, 1662695, 1408483, 654063, -1062766, -2458735, -1893226, -225814, 33078, -1625797, -3037876, -2451786, -438712, 1337833, 1621105, 36156, -2240441, -2730214, -518791, 1730659, 1038844, -1195603, -893981, 2307459, 3986340, 1293304, -3061094, -5015289, -4370050, -3428689, -2932647, -2252421, -1922959, -2905995, -4118201, -3391063, -607311, 2233729, 3727824, 3967279, 3327411, 2442821, 2844460, 5232655, 7375124, 6307453, 2744135, 587475, 1481323, 2677823]
39731B677823j130758k053002j38853J674419J249773L10024R39009K180542K057691
39722G766668O53141p83443j947200k778649k300454k52163J422140R27343n36160
39713B171223n64718N86542N25422j141496j965342n03715J464604J734327P04308
39704C011155R5534J10165l17232j206695j305877j79315Q88037N82106o43238
39695A034640j152341l41474M08869m61383k221777k341738O847K236957J624124
39686a207276o30027q81029J549102L138923J284730j868209k608359q00148O28353
39677a393940K92223k69722K69019R79002N00021q29287j638618j270489r5049
39668c456840J148209J717131J212560J10963n03671j51465M85415N12585p8538
$$ y = [2677823, 1547065, -505937, -644790, 1029629, 2279402, 2589426, 3528435, 5708977, 7766668, 8419809, 7636366, 5689166, 2910517, 610063, 357900, 1780040, 2707383, 2171223, 1606505, 2193047, 2718469, 1576973, -388369, -892084, 572520, 2306847, 3011155, 3106689, 3216854, 2899622, 1692927, 387050, 207735, 1095772, 1677878, 1034640, -117701, -459175, -50306, -511689, -2733466, -5075204, -5068357, -2831400, -1207276, -1837303, -2718332, -1169230, 1969693, 3254423, 1386214, -1222145, -2022293, -1393940, -1101717, -1371439, -1102420, -123418, 376603, -452684, -2091302, -3361791, -3456840, -2308631, -591500, 621060, 732023, 228352, 76887, 562302, 1074887, 996349]
39659I96349n91652n78650k51895p2622j78505k68130m5361L08387L67061J87417
39649a27601L19392Q16260Q06706l11476j616628j452215M61527K370152K284700
39640C550817K03032j739913j473002O29366J914078N03473k131296k708029l54595
39631a606069K082234J721643o30854j825159o32090J016195R36264o61652j847624
39622a447112j343180K48295J197415N49594o14656l57927J358491K177889N73709
39613B342518j609576j540088M96611J545122K58742j596227k120160j428328
39605c651386k64987J142643J922966P23245j575838j823565P65051K481417M22690
39596A42236k422945j300991K624778L608588K48161k256504l87038K252093J098346
$$ y = [996349, 404697, -173953, -425848, -498470, -676975, -945105, -990466, -682079, -315018, -127601, 191791, 1008051, 1814757, 1503281, -113347, -1565562, -1104035, 1266117, 3550817, 3753849, 2013936, 540934, 1170300, 3084378, 3587851, 1456555, -1251474, -1606069, 476165, 2197808, 1566954, -258205, -890295, 125900, 1062164, 400512, -1447112, -2790292, -2541997, -1344582, -794988, -1409644, -1767571, -409080, 1768809, 2342518, 732942, -807146, -310535, 1234587, 1493329, -102898, -2223058, -3651386, -3916373, -2773730, -850764, -127519, -1703357, -3526922, -2761871, -280454, 142236, -2280709, -3581700, -956922, 2651666, 2899827, 643323, 256285, 2508378, 3606724]
39587C606724j957377k024961O64981J558516m37291j593541j49891Q90611n86829
39578b9058k114496j214312L42342Q1770p11293J83043J358838K65775j743591
39569c580982j395786P41682J243754l1293J68167K221547K501780j66350j949215
39560b46696k59604J943514J258810o42602m34339J045993P50348r48618j128375
39551A338431L57625Q50003k19394n80669M91406R43803j00690o93189L13866
39542B701192J062174j31001j866578j953430p56542j57456m12161j40930J100807
39533e53925K065785J681869M28619m62307m92931k32604l76959p64784o18484
39524F74279K18971Q69683O51721O4215j77088l78930j057632j526836q04426
$$ y = [3606724, 1649347, -375614, 289367, 1847883, 1410592, -182949, -332840, 557771, -29058, -2143554, -3357866, -3015524, -2933754, -3645047, -3462004, -2103166, -1837391, -3580982, -4976768, -4235086, -2991332, -3022625, -2854458, -632911, 1868869, 1702519, -246696, -506300, 1437214, 2696024, 2053422, 1619083, 2665076, 3415424, 2466806, 1338431, 1696056, 2546059, 2326665, 1745996, 2237402, 3181205, 3080515, 2387326, 2701192, 3763366, 3632365, 1765787, -187643, -944185, -1101641, -1513802, -1654732, -553925, 1511860, 3193729, 3622348, 3160041, 2667110, 2434506, 2057547, 1292763, 674279, 893250, 1762933, 2414654, 2478869, 2301781, 1922851, 865219, -661617, -1466043]
39515a466043L86397K83679j121662j759850m95759J214215J574600Q60465L59585
39506a64373J58476m40395j069735o52012N21870P36235o59964k007908j452002
39497e029808N31047J803895J419856N88174N78718Q46642J43424j225955j566332
39488a910339k14623J368167J406022n4830j379848j272534j8817R59429O14943
39479e02430m63986n20546J110988K612198J627854j514210l871633l404376j065410
39470e991551J021901J985227K057657J451803N22406M5301K44272K67706n43098
39461A061624j603852j943345j301736L7216J456835J793406L98042j229354p33182
39452b064346J581128K686334J149250r46071j581976j518471j686001r08191
$$ y = [-1466043, -1079646, -795967, -1917629, -3677479, -4173238, -2959023, -1384423, -523958, -164373, -5897, -446292, -1516027, -2168039, -1646169, -909934, -1569898, -3577806, -5029808, -4498761, -2694866, -1275010, -686836, -108118, 738524, 881948, -344007, -1910339, -2124962, -756795, 649227, 594397, -785451, -2057985, -2076802, -1117373, -502430, -966416, -1486962, -375974, 2236224, 3864078, 2349868, -1521765, -4926141, -5991551, -4969650, -2984423, -926766, 525037, 1047443, 1092744, 1337016, 1604722, 1061624, -542228, -2485573, -3787309, -3750093, -2293258, -499852, -101810, -1331164, -2064346, -483218, 2203116, 3352366, 2406295, 824319, -694152, -2380153, -3288344]
39444c288344J246571K256521M94179j328861k59577J743926J071471j145434
39436G90452r37693J450471J917074l54311j662912l31281Q78659K27612j99896
39427A778175Q84820J248891m96042j992149j324531l00955o72341p45782R69883
39418f50031K160713N19370j737986j280120P11877O84550j142265j299008R87225
39409a045675K678288J847823J629j012509j236184j054991j64686J061658J385353
39400B460706O37809J9314K3971q4361l94093L578R10843O43309j273206k824510
39390A23360k170774k08118Q27969K94653n95687p31785j17164O75527J064491
39381h37528P06891l4411j35329Q30628J754937J181849o95605k159222k123147
$$ y = [-3288344, -2041773, 214748, 708927, -619934, -879511, 864415, 1935886, 790452, -147241, 1303230, 3220304, 2865993, 1203081, 871800, 1750459, 1978071, 1778175, 2662995, 3911886, 3415844, 1423695, 99164, -201791, -874132, -1619914, -650031, 1510682, 2030052, 292066, -988054, -276177, 408373, -733892, -2032900, -1045675, 1632613, 3480436, 3482065, 2469556, 1233372, 178381, 13695, 1075353, 2460706, 3098515, 3117829, 3141800, 3057439, 2663346, 2666924, 3577767, 4221076, 2947870, 123360, -2047414, -2255532, -1427563, -1132910, -1728597, -2460382, -2577546, -1902019, -837528, -130637, -165048, -300377, 530251, 2285188, 3467037, 2771432, 612210, -1510937]
39372a510937j166825k05070O66801J350616J019198n32181j727435j021180O81585
39363b445428J220136M43631J45802P86244Q45066j8285J4640J488573K050364
39354D530743J63928k100937k329348j428232j308983j220966K86785J772743
39346a634267J129573j79937O55077K511724J899934q68453k059100r72839p45810
39337b64098k092709j762923J222575L153972J770859j56267j45652o8564j525471
39328A31722j842358J042390L727973K299825j067846j665568J04200K04832j562621
39319A372549j471056J118394K322083K14243k082427j495582N70571R71407p06624
39310H13558k428812k700339j586111J55122J657008K178063J499880O4288j191246
$$ y = [-1510937, -2677762, -2882832, -2216031, -865415, 153783, -378398, -2105833, -3127013, -2445428, -1225292, -781661, -635859, 150385, 995451, 977166, 991806, 2480379, 4530743, 4694671, 2593734, 264386, -1163846, -2472829, -3693795, -3407010, -1634267, -504694, -684631, -29554, 2482170, 4382104, 3513651, 1454551, 481712, -264098, -2356807, -4119730, -2897155, 256817, 2027676, 1871409, 1725757, 1657193, 131722, -1710636, -668246, 3059727, 5359552, 4291706, 2626138, 2730338, 2935170, 1372549, -98507, 1019887, 3341970, 3556213, 1473786, -21796, 548775, 1520182, 813558, -1615254, -4315593, -5901704, -5746582, -4089574, -1911511, -411631, -347343, -1538589]
39301a538589j127646N88931K395316K054516k54541j634427m17944J335908R64995
39292B366519q93042j702079r52266k19046k00368j29550L22316O54012P25071
39283b8433P05187L89047q3840J54343R76711O69636j207735k241266p48727J005055
39273d10022J63354j883600j634773P38642J793161N58890k70756P29536J540164
39264A324596N87496n84161k09998P28755L25191j170372j803752o11902J247015
39255a67132J777749L01686j540693j522875J57690R91521k6912q33650m8051
39246i10667L03654j552437l219751j556542J758752K338836k00851j992897j012128
39237f044031Q71490J958245K569129K437598M75677k058335k170142R6939J333829
$$ y = [-1538589, -2666235, -2077304, 318012, 2372528, 2117987, 483560, 65616, 1401524, 2366519, 1473477, -228602, -1180868, -1399914, -1600282, -1729832, -1407516, -753504, -28433, 676754, 1065801, 981961, 1136304, 2113015, 2782651, 1574916, -666350, -1415077, -410022, -246668, -2130268, -3765041, -3026399, -1233238, -674348, -945104, -215568, 1324596, 1912092, 1327931, 1117933, 1846688, 2171879, 1001507, -802245, -1414147, -167132, 1610617, 1912303, 371610, -1151265, -993575, -2054, -28966, -862616, -910667, -607013, -2159450, -5379201, -6935743, -5176991, -2838155, -3039006, -5031903, -6044031, -5172541, -3214296, -645167, 1792431, 2268108, 209773, -1960369, -1863430, -529601]
39228e29601K26025o12826M67764J494694Q43941j2494J72588q157j371989j875430
39218a205485k11238J404605Q43680l07969K89394J564035J034603q37346j478480
39209A095799k82493Q86336O28188o49503j797609j861497o26200Q06773R71150
39200h29056J32776m7343O49991N74600p75667j692889j055679K44214J402599
39191a396454K472490K421768j08861l156791k663776J039765K533185m82683
39183F58643l141044j129256K325388J996164r17707j668013j62156L7386j058214
39174c058809j86233K396469K757286R5997j964634j539191p17708p50135R289
39165b957669J996811K816509J347392m22273j036115j345778j587543o30293
$$ y = [-529601, -303576, -916402, -448638, 1046056, 1889997, 1877503, 2050091, 2041934, 669945, -1205485, -1416723, -12118, 831562, 523593, 812987, 2377022, 3411625, 2574279, 1095799, 813306, 1699642, 2327830, 1678327, -119282, -1980779, -2606979, -1800206, -829056, -696280, -743623, -93632, 480968, -294699, -1987588, -3043267, -2799053, -1396454, 1076036, 3497804, 3388943, 232152, -2431624, -1391859, 1141326, 658643, -2482401, -3611657, -1286269, 709895, -207812, -1875825, -2037981, -2000595, -3058809, -3245042, -848573, 1908713, 2004710, 40076, -1499115, -2216823, -2966958, -2957669, -960858, 1855651, 3203043, 2780770, 1744655, 398877, -1188666, -1818959]
39157a818959P70952K07378j638571j105735J934793K811341j80456k144200M74417
39148f89040L449311J507364k678545k600713J618814L718888J270473j522909
39140D073643j437385m82048q95873j215940J23248J488809J179606M93399Q15330
39131D142789N61734j809033m047388k861187R41057L336633K462829K42765j010946
39122A959253r57166j90833P52147J039293J65847p70546j87848J399619J755365
39113D965131J69571j535493j723327q47394l6495M19677M26244k72942r04736
39104F60236M3630K211684K911932P85090j844011k127073o83713k02943j178146
39095E76686j568294k73319J452797K159184J792673Q74838k54420j035123q90734
$$ y = [-1818959, -1048007, -840629, -2479200, -3584935, -1650142, 1161199, 980743, -1163457, -689040, 2760271, 4267635, 1589090, -1011623, 607191, 4326079, 5596552, 4073643, 2636258, 2154210, 1258337, 42397, 165645, 1654454, 2834060, 3327459, 4142789, 4704523, 2895490, -1151898, -4013085, -3072028, 264605, 2727434, 2970199, 1959253, 1002087, 811254, 1563401, 2602694, 2768541, 1997995, 1810147, 3209766, 4965131, 5134702, 3599209, 1875882, 1028488, 991993, 1411670, 1837914, 1564972, 660236, 703866, 2915550, 5827482, 6612572, 4768561, 2641488, 1957775, 1754832, 576686, -991608, -1264927, 187870, 2347054, 4139727, 5014565, 4760145, 3725022, 2834288]
39086B834288j57586K04469j10743o47048j080098j244330p57828K40151O15128
39077a03597j76509q19124o1365J003104O38258l88527L0576J468600J259060
39068B850476j075513k690025j611680N81335J498035J028775K75433n66948j551543
39059a261655j711010k01845K077915L277977K566608P43090n80165l32268P33698
39050E312345N16149j543853k925869j313790J503398J795593n48331j977435
39042H18207q55482O18245P42356P03685J300718J063843m83335j257052m62528
39033B188657m68130k307655k912952p4473L098881K545950m90674j668383r1081
39024a79860J441770J392376P62272K67465k21423p4407J117446J716009J36273
$$ y = [2834288, 2676702, 2881171, 2770428, 2123380, 1043282, -201048, -958876, -718725, -103597, -280106, -1099230, -1160595, -157491, 480767, 92240, 122816, 1591416, 2850476, 1774963, -915062, -2526742, -1945407, -447372, 581403, 856836, 289888, -1261655, -2972665, -3174510, -1096595, 2181382, 4747990, 5491080, 4910915, 4578647, 5312345, 5828494, 4284641, 1358772, 44982, 1548380, 3343973, 2795642, 818207, -37275, 580970, 1323326, 2027011, 3327729, 4391572, 3908237, 2651185, 2188657, 1720527, -587128, -3500080, -3574553, -475672, 2070278, 1579604, -88779, -179860, 1261910, 2654286, 3416558, 3684023, 3462600, 3388193, 4505639, 6221648, 6357921]
39015F357921k182999k807222k047351j565658q17742J350721K999170J452763
39007B739603j459973j341353J720062K942931L26559k486446k228291m70879
38999b57787r651n48254m94535j54387n61485j137505p06529N39344J582668J873923
38989A25802J257949M1072m60747P41198K172253J331519j391852k797747j468153
38980d48706M23692P57070J42853k07179n65515j145181r20239L80374J210302
38971c72529O17437k57420l45539k23560l55364l3441P27031O85406o859N27776
38961I62938K148192J832975j295184l381820j266185K389956K983050O79796
38953E053718p30537p6374L48021n42742j178296o44271M6862L72946R76354J520234
$$ y = [6357921, 4174922, 1367700, -679651, -2245309, -3063051, -1712330, 1286840, 2739603, 1279630, -61723, 1658339, 4601270, 4927829, 2441383, 213092, -257787, -267438, -815692, -1310227, -1464614, -2026099, -3163604, -3870133, -3330789, -1748121, 125802, 1383751, 1424823, 964076, 1705274, 3877527, 5209046, 3817194, 1019447, -448706, -25014, 732056, 874909, 667730, 102215, -1042966, -1963205, -1582831, -372529, 244908, -12512, -358051, -581611, -936975, -970416, -243385, 442021, 435162, 962938, 3111130, 4944105, 3648921, 267101, -999084, 1390872, 4373922, 5053718, 4323181, 4246807, 4594828, 4052086, 2873790, 2229519, 2276381, 2649327, 3625681, 5145915]
38943E145915O99473j086246j737943p59931J0348l04492k55997Q86192J342283
38934C939602j63513j742286r53118J314877K019964M54096q39944O1621J678505
38925E769804J318918j119849l016187k437086l22921J150240J248512P61863
38917C353294K51023k92299l28703Q59559K284831J632475j304300l191736j091233
38908B172911L053452M205038O67712l442388l309788N02641K970505J200372
38900H020455k036000k350384L17094K002575N40730j644295j555623R4445P45468
38891D134465K02848R2866L17393n26722j611205m84088K377843L379105J282345
38882I164850q04949n92542Q223q50499j026829J578453M027411K037024k923844
$$ y = [5145915, 5845388, 4759142, 3021199, 2261268, 2271616, 1967124, 1711127, 2597319, 3939602, 3776089, 2033803, 1080685, 2395562, 4415526, 4869622, 4029678, 4091299, 5769804, 7088722, 5968873, 2952686, 515600, 192679, 1342919, 2591431, 3353294, 3604317, 3312018, 2983315, 3842874, 6127705, 7760180, 6455880, 3264144, 2172911, 5226363, 9431401, 10099113, 6656725, 3346937, 3849578, 6820083, 8020455, 5984455, 3634071, 3951165, 5953740, 6494470, 4850175, 3294552, 3388997, 4134465, 4337313, 4430179, 4747572, 4220850, 2609645, 2125557, 4503400, 7882505, 9164850, 8359901, 7767359, 7775582, 6925083, 5898254, 7476707, 11504118, 13541142, 10617298]
38873A0617298n033574k293041J100977J129071j126619k185237q18328J526919
38865B917466K929984K412904N77415n84383J44579J219027K44696k275406l356678
38856D229604j835389K14150Q77041P05050P38666O36191N6247j83912K26395
38847E664043P1809j239528k107235r69107J137445J898488P98353n54260o79590
38838D020418K60590R13468J69537j490048k143538p69149R49008O70963j093449
38829A487800j672597l37678R65477J292080J864186K590410J127395k518802
38821D798271m105340j048115K853387K516798r44817k317090k96333J500107
38813B956868J001838J89548O01028R15059K99375J44363Q11032L04677j835770
$$ y = [10617298, 5583724, 3290683, 4391660, 5520731, 4394112, 2208875, 1390547, 2917466, 5847450, 8260354, 8837769, 8253386, 8397965, 9616992, 9861688, 7586282, 4229604, 2394215, 2608365, 3485406, 4190456, 4929122, 5565313, 5621560, 5437648, 5664043, 5735852, 4496324, 2389089, 1419982, 2557427, 4455915, 5254268, 4700008, 4020418, 4281008, 5194476, 5364013, 3873965, 1730427, 961278, 1910286, 2581249, 1487800, -184797, -522475, 443002, 1735082, 3599268, 6189678, 7317073, 4798271, 692931, -355184, 2498203, 5015001, 4070184, 1753094, 1456761, 2956868, 3958706, 4148254, 4749282, 5664341, 5963716, 6108079, 6919111, 7223788, 5388018]
38804E388018k695472m26182K368799K356588J87290j258625j279453j096741
38796C544222q31453J99502J203297Q16054l25917m56399M15335Q34447N60809
38787E959897M75885L55205o62305j679255q73308J195170J857261L63493j003740
38778E988303o03591L21107K36850j34911N42344J730955J827263L97438j630795
38769H674963l101807l092943j346587Q90965J598273M10098q08296n58495M96349
38760C162520J194437J673201K182554J733598k02689j855039j147562J100287
38752G841307K029376N89960j311098j611351m74696M83910K70215n45563m65116
38743F806944J185050K863068K145867q08331k574489q04857K114038K107220
$$ y = [5388018, 2692546, 2266364, 4635163, 6991751, 7179041, 5920416, 4640963, 3544222, 2712769, 2912271, 4115568, 4931622, 4605705, 4149306, 4564641, 5399088, 5959897, 6435782, 6790987, 6128682, 4449427, 3576119, 4771289, 6628550, 6992043, 5988303, 5384712, 5705819, 5942669, 5807758, 6350102, 8081057, 9908320, 10305758, 8674963, 5573156, 2480213, 1133626, 2024591, 3622864, 4032962, 3224666, 2666171, 3162520, 4356957, 6030158, 8212712, 9946310, 9743621, 7888582, 6741020, 7841307, 9870683, 10460643, 9149545, 7538194, 7063498, 7547408, 7817623, 7272060, 6806944, 7991994, 10855062, 13000929, 12192598, 9618109, 8813252, 10927290, 13034510]
38735A3034510p85764k623830j467806K21950J5348q04795J4206J669348J687738
38726A0960905Q212j033284l56281O38729O37481J58506J78160O24313J009942
38717A2826683J340067J556087J072684j95230j126246p78988O1720o0351r37589
38708A3758837q36893P94393K201590J738664K65858j47598P85366J418711Q29830
38699B0808758K5744J49623Q88066J355232J430105J348048Q45947l11151j515769
38690B5024603j881476j249198r0921J038859J505625Q93752p1483R7792J508769
38681B6776322K273879J238350J02956J055533L210442L662503J790180J47546
38673D0257711P25556K442020L104971K137515M98925o07661j20401K297960N095399
$$ y = [13034510, 12248746, 9624916, 8157110, 8379060, 8394408, 7589613, 7603819, 9273167, 10960905, 10969117, 9935833, 9579552, 10218281, 10855762, 11014268, 11192428, 11816741, 12826683, 14166750, 15722837, 16795521, 16600291, 15474045, 14695057, 14756777, 14696426, 13758837, 12921944, 13716337, 15917927, 17656591, 17922449, 17774851, 18560217, 19978928, 20808758, 20834502, 20984125, 21872191, 23227423, 24657528, 26005576, 26851523, 26540372, 25024603, 23143127, 21893929, 21803008, 22841867, 24347492, 25241244, 25169761, 25267553, 26776322, 29050201, 30288551, 30391507, 31447040, 34657482, 38319985, 40110165, 40257711, 40983267, 43425287, 46530258, 48667773, 49166698, 48559037, 48438636, 50736596, 55831995]
38664E5831995N682144L588843J451428J599151L052940L549294L223405L986228
38656H1965428N926820O944618O135207N145007N430976O292659O721988P246354
38648A31809057Q373714Q925313P992653P247007Q759993J1281097J1603338R535623
38640B05527795Q291242R217249R545927P127025M140740L331745L353726J580026
38632B52115475n92540P9830K240778R93466m086678p315353n265435k032563
38624B36136980k968057o944348q858935p277527n304952n143390n761012n706823
38616A88171936n086313m570844m619342n538299o711785o621206n294692n272901
38608A44456554p916505j0409357r341802n860564l890942m344547m871688m668374
$$ y = [55831995, 61514139, 65102982, 66554410, 68153561, 71206501, 74755795, 77979200, 81965428, 87892248, 94836866, 100972073, 106117080, 111548056, 117840715, 124562703, 131809057, 140182771, 149108084, 157100737, 164347744, 173107737, 184388834, 195992172, 205527795, 213819037, 223036286, 232582213, 239709238, 243849978, 247181723, 250535449, 252115475, 251522935, 251602765, 253843543, 254837009, 250750331, 243434978, 238169543, 236136980, 233168923, 226224575, 217365640, 210088113, 204783161, 199639771, 193878759, 188171936, 183085623, 178514779, 173895437, 168357138, 161645353, 155024147, 149729455, 144456554, 136540049, 126130692, 116788890, 110928326, 107037384, 102692837, 97821149, 93152775]
38600I3152775n286356o577810o144293l738739k284787l127254l836639k476970
38592E9679927q30147j256664l021594l990687l861862l542670l001515j787770
38584C8387018n00391r4922o05253j535911k434778k482067j024407Q86070J235416
38575C1830775m2657q48425k83393J5377j073623k073282j309614N63710J898263
38566B8677131K205340J725259N62621n89799o09132J71648J49120o46962k58582
38557C1386644J495792J882412m11795k644379k130103m78396q07235k681013
38549B5611927l068369j213913N44848M37655p84060j545199j298098o51827p02853
38540A7330111j871023k880708j983050L25835J514307O65933k30096K49757O58516
$$ y = [93152775, 87866419, 81288609, 75144316, 71405577, 69120790, 65993536, 62156897, 59679927, 58849780, 57593116, 54571522, 50580835, 46718973, 43176303, 40174788, 38387018, 37886627, 37791705, 37186452, 35650541, 33215763, 30733696, 29709289, 30595359, 31830775, 31788118, 30939693, 30656300, 30671677, 29598054, 27524772, 26215158, 26778868, 28677131, 30882471, 32607730, 33170351, 32580552, 31971420, 32143068, 32292188, 31645226, 31386644, 32882436, 34764848, 34353053, 31708674, 29578571, 29100175, 28292940, 25611927, 22543558, 21329645, 21874493, 22312148, 21528088, 19982889, 18684791, 18032964, 17330111, 15459088, 12578380, 10595330, 10921165, 12435472, 13101405, 12871309, 13121066, 13779582]
38531A3779582m54300j751121j364750K8744O21084K38801l48972j128126j855791
38522G765151j251212Q29672K373286K243560J882296K033872Q38774k118892
38514A4596507l271155l53861K834199J567743k359575l480301j167909L07024
38506H672672o49956j159239J45427Q77838j91463q31599L69519J503864R38508
38497I675571o6272j54541k76870j450918k577557k187904n23844J243889K209282
38488E890836J640199l65519j856822q62581J500150K092962J73278j743046j748122
38479D721335o77542R6581M52141M59742j42302q35837p24145k24549k89245k53364
38469B582815R79564K095872R26743j402842j571522M96378J280737m77935j690426
$$ y = [13779582, 13325282, 11574161, 10209411, 10238155, 10859239, 11098040, 10749068, 9620942, 7765151, 6513939, 7343611, 9716897, 11960457, 13842753, 15876625, 16715399, 14596507, 11325352, 10971491, 13805690, 15373433, 13013858, 9533557, 8365648, 8672672, 8022716, 6863477, 7008904, 7886742, 7695279, 6863680, 7233199, 8737063, 9675571, 9609299, 9454758, 9177888, 7726970, 5149413, 2961509, 2437665, 3681554, 5890836, 7531035, 7165516, 5308694, 4446113, 5946263, 8039225, 8212503, 6469457, 4721335, 4043793, 4140374, 4592515, 5052257, 4909955, 4074118, 3349973, 3125424, 2836179, 2582815, 3562379, 5658251, 6584994, 5182152, 3610630, 4107008, 5387745, 4909810, 3219384]
38460C219384j76799J843981J626424P718p20725m79237o20203j361899j871181
38451A467463j514983j7610K062193K695232M61766k551920k757784k63827J214396
38442G94926J42655r10346j49512O86793J19025m09126K28769N44740l42063o62959
38432D2902M03762N59921j478657l007507j502160J257649K283816J720187J014941
38423A294854k71011k371485k826909K8856L334164L325421Q26515o25260l55409
38414B359736l45573r03616n52891O20184J155401J114154J529350J691837J87757
38405F856339j974613k343411o64569J136738J925743J772524M33878j812757
38397E329872k886687j368699P79754Q90558k19748M4702J409184J512255M37566
$$ y = [3219384, 3042585, 4886566, 6512990, 6520708, 5799983, 5320746, 4700543, 3338644, 1467463, -47520, -65130, 1997063, 4692295, 5154061, 2602141, -155643, -419470, 794926, 937581, 27235, -122277, 564516, 683541, 274415, 503184, 1047924, 705861, 42902, 446664, 1006585, -472072, -3479579, -4981739, -3724090, -1440274, 279913, 1294854, 1023843, -1347642, -4174551, -4145695, -811531, 2513890, 3340405, 2715145, 2359736, 2014163, 1110547, 557656, 1177840, 2333241, 3447395, 4976745, 6668582, 6856339, 4881726, 2538315, 1873746, 3010484, 4936227, 6708751, 7142629, 5329872, 2443185, 1074486, 1854240, 2744798, 2525050, 2569752, 3978936, 5491191, 5928757]
38388E928757L97510J259266N69784j724298k653753j106027M20550J06758n71701
38379B626846o9189M14814o37965k066104j619571P11864K699359K609193Q54017
38370E523264p60729q78755J93420J079421J087040O97506K51959m91780j051953
38361E649393l02859J203459J069372j387352l542064l148359j378695k30116
38353b067221N91157J748158J886338K24284r44322K38646J557995L31974j761402
38344A805607j703188n96012j205134k170245l06983K849381K936145L66740l30647
38335A645664J462857J731073m42739j270991L27617N48633j941051l066173o40802
38326a645912J585469O00656r46260l43648K10563j306022j845092J311026M592269
$$ y = [5928757, 6326267, 7585533, 8155317, 6431019, 3777266, 2671239, 3091789, 3198547, 2626846, 2557657, 2972471, 2334506, 268402, -1351169, -639305, 2060054, 4669247, 5523264, 4762535, 3883780, 4077200, 5156621, 6243661, 6941167, 7193126, 6701346, 5649393, 5346534, 6549993, 7619365, 6232013, 2689949, -458410, -1837105, -2067221, -1476064, 272094, 2158432, 2382716, 1438394, 1677040, 3235035, 3567009, 1805607, 102419, -493593, -1698727, -3868972, -4175955, -1326574, 1609571, 1976311, 1645664, 3108521, 4839594, 4396855, 3125864, 3453481, 4002114, 2061063, -1005110, -1645912, -60443, 540213, -406047, -749695, -539132, -1845154, -3690246, -2379220, 2213049]
38317B213049L237450r85621k771397j383694k58786n13033l25268M43211J48096
38308a95993p65835l44921Q82462O59295o66604n76059J080074J821777Q30702
38299B724898j08296j40718m31849j337865j578163p81787j68206j76373J62147
38290a836212J038332J318614O69414K17207N87367R72855N69579m03525j290505
38281A843126j544653q95220R7901K71483m19439m48806R00498K110098J799384
38272C714372Q85944O17853K84677q82591j406227O9314J737739J096623q64940
38263E252764j281716j41741J57266p90883j177581p39548r21989j389174l20198
38254a352800J513347J041889j807262l036603l97881L100938L485160R07056
$$ y = [2213049, 5450499, 4464878, 1693481, 309787, 51001, -462032, -787300, -344089, -195993, -961828, -1306749, -424287, 235008, -431596, -1007655, 72419, 1894196, 2724898, 2616602, 2475884, 2044035, 706170, -871993, -1653780, -1821986, -1998359, -1836212, -797880, 520734, 1190148, 1407355, 1994722, 2967577, 3537156, 3133631, 1843126, 298473, -596747, -498846, -227363, -646802, -1095608, -195110, 1914988, 3714372, 4600316, 5218169, 5502846, 4620255, 3214028, 3283342, 5021081, 6117704, 5252764, 3971048, 3829307, 3986573, 3195690, 2018109, 1278561, 356572, -1032602, -1352800, 160547, 1202436, -604826, -3641429, -4039310, -938372, 2546788, 3453844]
38246C453844j550773k024930r39356M61101J056342M56242m06204l28062L28889
38237E07093L50146O902N00783J204482K28933j958045k509139n66189J328554
38228i06480J225133K28340k41109o36454j220956p67324Q82433J718274Q56420
38219A138277J42996N83690K91376j631113k451636k25577K155535J222016j208955
38210A6609q84042J831987K602635K05644j834113j110356N13990P76933K90483
38201B409770K53266n8824j467900k761228k397612q69886K99453P53446J040034
38192b799481J150954P67936L30655N36533J061689Q79321j69839j019103q50185
38183a11520k80516m62437j228266j086728M82924J778819J163711k08777M9942
$$ y = [3453844, 1903071, -121859, -1061215, -600114, 456228, 912470, 506266, 178204, 507093, 857239, 864141, 1364924, 2569406, 2798339, 840294, -1668845, -2235034, -906480, 318653, 546993, 305884, -330570, -1551526, -2318850, -1436417, 281857, 1138277, 1281273, 1864963, 2156339, 525226, -1926410, -2151987, 3548, 1225564, 16609, -867433, 964554, 3567189, 3772833, 1938720, 828364, 1342354, 2119287, 2409770, 2663036, 2604212, 1136312, -1624916, -4022528, -4892414, -4592961, -3839515, -2799481, -1648527, -880591, -549936, -13403, 1048286, 1927607, 1757768, 738665, -111520, -392036, -854473, -2082739, -3169467, -2686543, -907724, 255987, 47210, 97152]
38174I7152J597659J591009o54146k246578j341310n5782m35682n63095J788414
38165b22359M055879K046322k959814n187575k553347Q19945J247435J88800M08962
38156b155752J324555R27810m15979r20429l23009M38691J036914J371648Q40089
38147B124538l73231q10645r316N16786j0368j45789P75005P07091j507109l110599
38137a843637j330680J710524J908974l45228r58221J103886K414100R94632p25302
38128B929048l95588N22588k71961k017760k391277j029245N72451J310795R54002
38119A83053l36868j528413j087447Q35756K013389J227483J15118M15919J205177
38110C043167R02638L16029J042573K061282R55226j950518l687545k976368j614159
$$ y = [97152, 1694811, 3285820, 2631674, 385096, -956214, -1011996, -1447678, -2010773, -222359, 3833520, 5879842, 2920028, -2267547, -4820894, -4000949, -2753514, -2564714, -2155752, -831197, 96613, -319366, -1239795, -1562804, -1124113, -87199, 1284449, 2124538, 1751307, 940662, 931346, 1448132, 1437764, 1291975, 2066980, 2774071, 1266962, -1843637, -3174317, -1463793, 445181, 99953, -858268, 245618, 2659718, 3654350, 2929048, 2533460, 3056048, 2784087, 766327, -1624950, -2654195, -2081744, -770949, 183053, -153815, -1682228, -2769675, -1933919, 79470, 1306953, 1422071, 1837990, 3043167, 3945805, 4261834, 5304407, 7365689, 8320915, 6370397, 2682852, -293516, -1907675]
38101a907675j048346l96085J020123J751656O06106r57907q09044P47404J717425
38092G23657J316221K59316j049431k525055l000822j162502J808257K743246
38084h87113O05926j746410j351063P66836J229395p58909k373242j232670J496892
38075d250358K939724K045984J97518p85486j80764J396432K312428J155894j339107
38066C492265k428047o91541J663405J619086l35139j182693l33279l29221j885595
38057d10759j914834J231255L837964J843649k404305l018551N81409K727861
38049B473689K07095l028904k275901R41007K000085M21643m39049N05944Q50707
38040A656316m75742j313480k14049J102451P24436o89581j658119k021394j792356
$$ y = [-1907675, -2956021, -3352106, -2331983, -580327, 25779, -932128, -1741172, -993768, 723657, 2039878, 2299194, 1249763, -1275292, -4276114, -5438616, -3630359, -887113, -281187, -2027597, -3378660, -2611824, -1382429, -2141338, -4514580, -5747250, -4250358, -1310634, 735350, 932868, 147382, -33382, 1363050, 3675478, 4831372, 3492265, 1064218, 372677, 2036082, 3655168, 3320029, 2137336, 1804057, 1474836, -410759, -2325593, -1094338, 2743626, 4587275, 2182970, -835581, -254172, 2473689, 2680784, -348120, -2624021, -1683014, 317071, 738714, 299665, 805609, 1656316, 1180574, -132906, -346955, 755496, 1479932, 790351, -867768, -2889162, -4681518]
38031d681518k65465J845176J794247j190576l461457j585106K308532L419935
38023a816232J295580k56482K21848J50320j427407j562990R74349K456186J40032
38014A75204k401902n66955L394543L306848j305618m324422k236652J196378
38006b762576J343392q02959j434311J52877J756561K181189J776654M93000j662850
37997A040977l052604j910075R08432K722466K286734O05711r73232j777553j425491
37988a574635j54636P97853O35546L37133J094019K139607J865375M00097q53146
37979D687213j585315k315147k372266p44712J280529J150399r88941k130321
37971c018561q39229Q88645J157966Q20779J164523J479813P85016j03290j53490
$$ y = [-4681518, -4946983, -3101807, -1307560, -2498136, -5959593, -7544699, -5236167, -1816232, -520652, -777134, -555286, -404966, -1832373, -3395363, -2421014, 35172, 175204, -2226698, -2793653, 600890, 3907738, 2602120, -1722302, -3958954, -2762576, -1419184, -2222143, -3656454, -3503577, -1747016, 434173, 2210827, 2703827, 1040977, -2011627, -3921702, -3013270, -290804, 1995930, 2601641, 1628409, -149144, -1574635, -1729271, -931418, -295872, 41261, 1135280, 3274887, 5140262, 5540359, 4687213, 3101898, 786751, -1585515, -2330227, -1049698, 100701, -888240, -3018561, -3857790, -2969145, -1811179, -990400, 174123, 1653936, 2438952, 2335662, 2182172]
37962B182172N377l87528o34000m04088j110062l089116l515468l01402L549393
37953c704722L330103m35060k599586r84863R88523L67309q91236O7446K006682
37944a855404J928085J29747o09414K97772Q09717R6326l62751J92268M63628
37935A089974m20417j380781j362163r11960o79492q8706J166333J851756J007501
37926B72045k11638k44990L42340J007q85149n37390R81695J563470N19485k07473
37916A593402O09054J207342k47477k253171j935003N05539J971058J021541l38592
37907B133693j34428O36248M8017j420873j664081l50210N65276q9648r54369
37898a230375l65145R72019J008684m33449j129044M16485K589223K557939k3822
$$ y = [2182172, 2187549, 1800021, 1166021, 761933, -348129, -3437245, -6952713, -7254115, -3704722, -374619, -809679, -3409265, -4394128, -3405605, -3038296, -3929532, -3862086, -1855404, 72681, 202428, -406986, -109214, 700503, 796829, 434078, 626346, 1089974, 669557, -711224, -2073387, -2985347, -3664839, -3753545, -2587212, -735456, 272045, 60407, -184583, 157757, 158764, -726385, -1263775, -282080, 1281390, 1800875, 1593402, 2202456, 3409798, 3162321, 909150, -1025853, -520314, 1450744, 2472285, 2133693, 1999265, 2635513, 2683530, 1262657, -401424, -751634, -186358, -276006, -1230375, -1595520, -623501, 385183, -48266, -1177310, -760825, 1828398, 4386337, 4362515]
37889D362515k493905k442121m06292J178457R60617j16507l05559Q30758J939313
37880C507276J474132l09852j465584q49010K58457P2708q81727p04347M38291
37871A540344L13146j370067j770295O24806K968457K063865o77358j544107l37283
37862A811508r713j112595r39793J191296K094987n3177k339336j588522O97079
37853b48266J004756o86951j478592l69029R05527J351295J794517K339919J708392
37844F321568j94108j546418j404526j050979j433914j351421J89578J565160
37836A094940O73014j555019k203008o55776O47293K21840j92399J122362K446314
37827A599561J067435j890112k316265Q57798L643284K526448p11966k150979
$$ y = [4362515, 1868610, -573511, -979803, 198654, 1159271, 1042764, 737205, 1567963, 3507276, 4981408, 4671556, 3205972, 2356962, 2615419, 2688127, 1806400, 1102053, 1540344, 1853490, 483423, -1286872, -662066, 2306391, 4370256, 3692898, 2148791, 1811508, 1801795, 689200, -250593, 940703, 3035690, 2982513, 643177, -945345, -248266, 756490, 69539, -1409053, -1778082, -872555, 478740, 2273257, 4613176, 6321568, 6127460, 4581042, 3176516, 2125537, 691623, -659798, -470220, 1094940, 1767954, 212935, -1990073, -2645849, -1998556, -1776716, -1969115, -846753, 1599561, 2666996, 776884, -1539381, -681583, 2961701, 5488149, 4776183, 2625204]
37819B625204j530980j572370k739753k631627o38526P00258J25769p9601J778469
37810c963157L414398J992451j202475k533398j178631L93993M77168j22944l19164
37801c041759k72173k67587K7897O18527Q72889N96212L30493L74317M75198N22002
37791B36016N50678J65141r05083j736212j014992Q72628J826443O57043j235338
37782e83676j551476N9575J627263J362321p7794n22004N35230R33816q75822
37773I07433k753374j425908K219494L530916O59202k518379k040651N70327J376156
37764E25216J92558j78867O47930L89968j140169j342948M80041J627143M43829
37755A644701j068402p28930N32057P10195j60574p26905m17495O27695K089596
$$ y = [2625204, 1094224, -478146, -3217899, -5849526, -6488052, -5787794, -5662025, -5741626, -3963157, -548759, 1443692, 241217, -2292181, -3470812, -3076819, -2599651, -2722595, -3041759, -3313932, -3581519, -3553622, -2935095, -2062206, -1465994, -1135501, -761184, -285986, 236016, 786694, 951835, 46752, -1689460, -2704452, -1831824, -5381, 651662, -583676, -2135152, -2075577, -448314, 914007, 836213, 314209, 849439, 1783255, 907433, -1845941, -3271849, -1052355, 2478561, 3137763, 619384, -1421267, -850940, 525216, 717774, 538907, 1186837, 1576805, 436636, -906312, -426271, 1200872, 1644701, 576299, -152631, 379426, 1089621, 929047, 202142, -215353, 412342, 2501938]
37746B501938K738485J024005k274343l869664j995414J074945K108288Q97291
37738B205531m80930q44939n25697n4153M5571p65774j819460j303285R56892
37729b586244K347685R59847j314475j407668N30427J873958J603739Q90835K54366
37720C152470r29378k159339j869992j85241Q22606K35489n01189j52117N33566
37711a053125M74633o1541l52162l50805j45464L93202Q19093L72664m26179o1520
37701c91204J419970J925852M04702j379151j508717o49451m36105o90204l47835
37692a652143R0528m85569j188079k20146J672029J756373k65956j353926J92789
37683a454100J914158J019868j220162j551399K41229J325220K91377j202109
$$ y = [2501938, 5240423, 6264428, 3990085, 120421, -1874993, -800048, 1308240, 2205531, 1724601, 879662, 353965, 299812, 345383, -420391, -2239851, -3543136, -2586244, -238559, 721288, -593187, -2000855, -1470428, 403530, 2007269, 2898104, 3152470, 2223092, 63753, -1806239, -1991480, -1168874, -933385, -1434574, -1586691, -1053125, -578492, -640033, -992195, -1343000, -1488464, -1095262, -276169, 96495, -329684, -391204, 1028766, 2954618, 3359320, 1980169, 471452, -177999, -614104, -1304308, -1652143, -1561615, -2047184, -3235263, -3455409, -1783380, -27007, -292963, -1646889, -1454100, 460058, 1479926, 259764, -1291635, -1050406, 274814, 566191, -635918]
37675f35918j418351o79447O8140O99739J129286Q59121J00614k14126j03085
37666a94027n00862j115607n16886R26359Q69754r33319j363608J092568L115287
37657A379659J478519j438134j229810J344609J727617p17314j842392p8785Q92989
37648A516958j199608k933135q12352K769696L195685N88284j050784j77045P77992
37639B675691j94929k064768k830152j894365l1309J490005J714340R76417O25915
37630D66845R74841O35791r99028k163538j302060K37664K78362o16810j86720
37621b674653J616687K420849J071440q76449j635302j260163p64288n74977l85098
37612c061954K34022J219664J734293J066201J3346M9525O88038k50120k678007
$$ y = [-635918, -2054269, -2733716, -2665576, -1965837, -836551, 22570, 123184, -90942, -194027, -694889, -1810496, -2327382, -1401023, -531269, -1464588, -2828196, -1735628, 1379659, 2858178, 1420044, 190234, 1534843, 3262460, 2545146, 702754, 623969, 1516958, 317350, -2615785, -3428137, -658441, 2537244, 3125528, 2074744, 1897699, 2675691, 2480762, 415994, -2414158, -4308523, -4339832, -2849827, -1135487, -159070, 466845, 1441686, 2077477, 1078449, -1085089, -2387149, -2149485, -1871123, -2487933, -2674653, -1057966, 1362883, 2434323, 1557874, -77428, -1337591, -2101879, -2676856, -3061954, -2827932, -1608268, 126025, 1192226, 1205572, 1255097, 1943135, 1693015, -984992]
37603i84992l145639K07484M040472M029759P54351j825062k079064j347292k87598
37594f37581J388023K363941J042291r56764o69696J091113P85809j695683k631305
37585H0148q36414M41532o25287j444309M2649J726346J272542k7198j47501J51312
37575F33820m87393j115695m69474O17918J138405J723066K439921J652844p15046
37566E418366j919611q05164l5268j184275j504897Q27437K292863l80651l702878
37557i94078k253477K428597M011919J079642j641570j424071o89244j268817
37549g51099j284541M57218J694986N53098j420066j972119j037727M49161J935064
37540a376025K441393J074754q76246j047536L01036N95338p27975j498673q24903
$$ y = [-984992, -4130631, -3923147, 117325, 4147084, 4901435, 3076373, 997309, -349983, -637581, 750442, 3114383, 4156674, 3199910, 2530214, 3621327, 4407136, 2711453, 80148, -756266, -314734, -940021, -2384330, -2341681, -615335, 657207, 630009, 482508, 633820, 146427, -969268, -1438742, -820824, 317581, 2040647, 4480568, 6133412, 5418366, 3498755, 2693591, 2658323, 1474048, -30849, 796588, 3089451, 2708800, -994078, -3247555, -818958, 3192961, 4272603, 2631033, 1206962, 517718, -751099, -2035640, -1578422, 116564, 669662, -750404, -2722523, -3760250, -3311089, -1376025, 1065368, 2140122, 1263876, 216340, 517376, 1112714, 384739, -1113934, -1938837]
37531a938837k23427j39867P83044K109026J446104q85409j399444O66450J589970
37522B007610m49893j956799j70556K037251J254836n95269j16684J314876M17809
37513C743181j557924r55144J390471J209899j817974l350994j430510Q50608
37505a918387Q16751j39254j5179M51216q6262r48743r07226k31468L28337R52166
37495a698049J859052K345217J689165M1610j926928l223640k634829k03736J720974
37486b031164R00502j479731k063153J15334K559385K908363J314008r20648k645328
37477a342432k553458j55026K453036K339160j74480j727612p35359Q07189R46762
37468a42220J26034r14093k234999k607004q6693L652071L681401r39258m409231
$$ y = [-1938837, -2162264, -2302131, -1519087, 589939, 2036043, 1150634, -248810, 417640, 2007610, 1557717, -399082, -569638, 1467613, 2722449, 2127180, 2010496, 3325372, 3743181, 2185257, 1230113, 2620584, 3830483, 2012509, -1338485, -2768995, -1918387, -1101636, -1240890, -1256069, -804853, -891115, -1839858, -2747084, -2978552, -2650215, -1698049, 161003, 2506220, 4195385, 4236995, 2310067, -913573, -3548402, -3752138, -2031164, -1130662, -2610393, -4673546, -4558212, -1998827, 909536, 2223544, 1302896, -1342432, -3895890, -4050916, -1597880, 741280, 566800, -1160812, -1896171, -1088982, -142220, -16186, -930279, -3165278, -5772282, -5858975, -2206904, 1474497, 535239, -3873992]
37459c873992k168926K231173K713127k15716j415204J64079R39452q6250j1444
37450a723701J608729J297837j700234k903537M10413M243656L459797j005079
37442C687881m125144l597190j235955P55521J675480J446630N27809J44904P46572
37433B6508J081110K80112n56573m61091m29867j107925p32061J849630M041576
37424C991419K848135j13296r26214K44668l28347l083833l870795q70585J901190
37415b07658O59787k393314k773278l94310J214589O81759j046N61831J318616
37406a333024J067959J44626n54449n20654M06856J597732J539999k45480j804857
37397B98708j114461P78057J169932k04949j062277m60508K0772n04434o67449
$$ y = [-3873992, -6042918, -3811745, -1098618, -1314334, -2729538, -2565459, -1626007, -1712257, -1723701, -114972, 1182865, -517369, -3420906, -3010493, 1233163, 4692960, 3687881, -437263, -4034453, -5270408, -4514887, -2839407, -1392777, -864968, -720064, 26508, 1107618, 1387730, 831157, 370066, -59801, -1167726, -1899787, -50157, 3991419, 6839554, 6726258, 5800044, 6044712, 5716365, 2632532, -1238263, -2108848, -207658, 452129, -1941185, -4714463, -5108773, -3894184, -3212425, -3213471, -2651640, -1333024, -265065, -120439, -674888, -1195542, -788686, 809046, 2349045, 2103565, 298708, -815753, -37696, 1132236, 927287, -134990, -595498, -574726, -1079160, -1746609]
37388a746609L97300J297932R13010M44726J140410J882099J111376m00180r32227
37379D107837p32466j152025j748715r06893R30431J355396k31400j371704j55162
37370I5299J854190J871993j38902j590916j021550N7983l21468j510843j172947
37361a877161R40080J989540l6963k826469k381505J243807L589336J913380j092948
37352A461097j566553n1606Q7353j654751k372025o58636J347993J604193R23495
37343h79440P73398P41342m8498q46177n44935K57056L34744j3914K33758O33820
37333F41154j03423j627928k091441r04332M80503R89661J395741K437204K943086
37324D160225J348407j614395l332873k471742m51244O35620N29912M25784Q08190
$$ y = [-1746609, -1349309, -51377, 861633, 1306359, 2446769, 4328868, 5440244, 5040064, 4107837, 3375371, 2223346, 474631, -432262, 498169, 1853565, 1622165, 250461, 95299, 1949489, 3821482, 3682580, 2091664, 1070114, 1128097, 806629, -704214, -1877161, -937081, 1052459, 1015496, -1810973, -4192478, -2948671, 640665, 2554045, 1461097, -105456, -157062, -69709, -1724460, -4096485, -4755121, -3407128, -1802935, -879440, -106042, 635300, 586802, -259375, -804310, -547254, -212510, -226424, 7334, 641154, 537731, -1090197, -3181638, -4085970, -3605467, -2615806, -1220065, 1217139, 4160225, 5508632, 3894237, 561364, -1910378, -2361622, -1726002, -1196090, -770306, 37884]
37315C7884Q89170J71774n72358m23303L28146O38774J37942n31170n63088L03530
37305D17301J639899K399024J542484p06741k559365k434497q52475L04655K50875
37296A160o3566J83516M57004P0789m24908k2042J104928J679756R36970n51038
37286C372569j715426k093441j840144j036385M64076K376650L631939L218747
37278F378585J320365q64904k365279k890950k224059l07626J761619K173699
37270B981450O91873o59899k82278P56621N68167n50963q73500l27180n95748
37261A708543k156276l291729k508625l34011J702885K509809J668851k92981
37253i93534j681655j161995L75396R98607O79828J082449K339433K434943M52935
$$ y = [37884, 927054, 1098828, 526470, 103167, 431313, 1070087, 1208029, 676859, 113771, 417301, 2057200, 4456224, 5998708, 5291967, 2732602, 298105, -554370, -249715, 1160, -62406, 121110, 578114, 648903, 223995, 201953, 1306881, 2986637, 3923607, 3372569, 1657143, -436298, -2276442, -3312827, -2848751, -472101, 3159838, 6378585, 7698950, 6834046, 4468767, 1577817, -646242, -953868, 807751, 2981450, 3673323, 3013424, 2731146, 3487767, 4055934, 3504971, 2631471, 2304291, 1708543, -447733, -3739462, -6248087, -6582098, -4879213, -2369404, -700553, -993534, -2675189, -3837184, -3461788, -2463181, -1783353, -700904, 1638529, 4073472, 4526407]
37244D526407j808701k413856j504198j05025J233602J763132P32604p82966o29414
37235A011585Q37781O96819j657635k831815p77175J547846R37978p34007O2208
37226i06415K247876K046147l27200j019936P72582J564850l16366k121656j673316
37217B66566p47687j252478j592397K81777K764866K687897J50565j552868m26932
37208E79309J892591K409293J37338l005099m203266k626624j72321R72513P99539
37199c216727N42874K84631n92916j252396k75570J408268J359449j85447j79151
37190b106985K028032K770397l39950l881580l022444J463727M330489L168608
37182D410294P44462j77219n47211j970354k984978j251002K023483L020192P54458
$$ y = [4526407, 2717706, 303850, -1200348, -1305373, -71771, 1691361, 2423965, 1640999, 1011585, 1849366, 2546185, 888550, -1943265, -2720440, -1172594, -234616, -968623, -906415, 1341461, 3387608, 3060408, 2040472, 2813054, 4377904, 4061538, 1939882, 266566, -481121, -1733599, -3325996, -3044219, -279353, 2408544, 2559109, 1006241, 579309, 2471900, 4881193, 5018531, 2013432, -2189834, -4816458, -4988779, -4016266, -3216727, -2673853, -2389222, -2982138, -4234534, -4510104, -3101836, -1742387, -1927834, -2106985, -78953, 2691444, 2351494, -1530086, -4552530, -3088803, 1241686, 4410294, 5154756, 4977537, 4430326, 2459972, -525006, -1776008, 247475, 3267667, 4022125]
37173D022125j261415r7863K144825J446982j862518l327694j048170J462258
37165A478530P80374j334680j305248L92079P04796k42582L83105K253933J607242
37156D717549k042300l845264p78088L276680L053469o07828k729171j553580
37148e08533K15780N01047J32724M5102l09864j005969q19192N72562J510940
37139C34597N74483j373268k224179j011740J179218K264101J148650r84655j842283
37130a935076q49459J61912k02261p70239O7084J435979J278364k23396q60820
37121a897912J60575J239108J063904K78569m5180J03258L33213O08034P47648
37112B591217L46233l20356l45579M55927J179339J054591J69768j014914j862590
$$ y = [4022125, 2760710, 2662847, 4807672, 6254654, 4392136, 1064442, 16272, 1478530, 2258904, 924224, -381024, 11055, 715851, 473269, 856374, 3110307, 4717549, 2675249, -1170015, -1948103, 1328577, 4382046, 3774218, 1045047, -508533, -292753, 208294, 341018, 386120, 76256, -929713, -1748905, -1176343, 334597, 909080, -464188, -2688367, -3700107, -2520889, -256788, 891862, -92793, -1935076, -2784535, -2622623, -2824884, -3595123, -3528039, -2092060, -813696, -1037092, -1897912, -1737337, -498229, 565675, 844244, 799064, 902322, 1235535, 1843569, 2591217, 2937450, 2617094, 2271515, 2727442, 3906781, 4961372, 5131140, 4116226, 2253636]
37103B253636j489631J39586J243411O7793k284566k877999j116559M10966R0886
37094c562477k41376J299249L035982K125801q11090k376722j228688N74912J157318
37085b7091R81693O94046m95469k635228l370776q39397K889650L779778J037670
37076B014876j877104j840792K90643J541839P99220m30085m87620M97956J101412
37067A610345L92902q39193p79591R93112K194603L83577l129684m007389n11968
37058c693286L666238M014454Q93542j739176j940018j154208o54721R0889J189439
37049F73153J430320M88238l79023o11086j010161j421921l53422J996834K955043
37040C767975J149052j316103k112719j729669j373335l73555J759789K917562
$$ y = [2253636, 764005, 903591, 2147002, 2214795, -69771, -2947770, -4064329, -3653363, -3562477, -3803853, -2504604, 531378, 2657179, 1846089, -530633, -1759321, -1184409, -27091, 954602, 1648648, 1153179, -1482049, -4852825, -5692222, -2802572, 977206, 2014876, 137772, -1703020, -1412377, 129462, 928682, 498597, 10977, 508933, 1610345, 2003247, 1164054, 384463, 1377575, 3572178, 3955755, 826071, -3181318, -3693286, -27048, 3987406, 4880948, 3141772, 1201754, 47546, -607175, -516286, 673153, 2103473, 2591711, 2212688, 1601602, 591441, -830480, -1183902, 812932, 3767975, 4917027, 3600924, 1488205, -241464, -1614799, -1988354, -228565, 2688997]
37032B688997J161771j613515k012019j10720J073893L85727n18482p70199j416487
37023a131034k480180k101227J98250J984563J220601p70902j295477K1924J163349
37014c190133P43792l31599m19456M70274N83822j044262k671372j716760J487894
37005f087800L589126K589087M51508o1956O79289N00447p82618j475549j083430
36996a681896o38136l19541O91749J999467K013223M49450j202225j887105j796694
36987b371708j007491O21923K079622J827507J51277r38710m16090P80530J421145
36978B148005R44063q61011l090050l243827j15121L323772L044590k14840j849214
36969H6367l14243J035522Q3908o41045R52316K263961L92765k453677k168355
$$ y = [2688997, 3850768, 2237253, 225234, 114514, 1188407, 1574134, 1055652, 285453, -1131034, -3611214, -5712441, -5514191, -3529628, -2309027, -3079929, -4375406, -4353482, -3190133, -2446341, -2777940, -3197396, -2727122, -2143300, -3187562, -5858934, -7575694, -6087800, -2498674, 90413, 541921, 479965, 1159254, 1659701, 877083, -598466, -1681896, -2320032, -2639573, -1947824, 51643, 2064866, 2514316, 1312091, -575014, -2371708, -3379199, -2757276, -677654, 1149853, 1301130, 362420, -53670, 726860, 2148005, 3092068, 2231057, -858993, -4102820, -4217941, -894169, 2150421, 1935581, 86367, -227876, 807646, 891554, 250509, 1202825, 3466786, 3859551, 1405874, -762481]
36960g62481O83431J868262J09430j474873o15945J097728J351748M03767j21444
36951B539623J14752J49417m94602j035979l91007J282205K183704P57774j866987
36942C238900k674531p81975R33250k32115k701943k768622m1405K007019J084017
36933a937405r86148j372258j11279P64600N22111J61835J92065K934l79230K25173
36923b917602K039893L202762K191421L35725q677P93093K18565j959664k754590
36914A140926p75049J016375j90056k305113j574662J148591J626488p88266j925204
36905b625970O43491L902281L982876J181440j608781k798053k435461r90468
36897g48645K34403m07082k191339k037408Q78188L039673J573631j151672j088026
$$ y = [-762481, -79050, 1789212, 1898642, 423769, -192176, 905552, 2257300, 2661067, 2539623, 2654375, 2803792, 2309190, 1273211, 882204, 2164409, 4348113, 5105887, 3238900, 564369, -217606, 715644, 483529, -2218414, -4987036, -5028441, -3021422, -1937405, -2923553, -4295811, -4407090, -3642490, -3120379, -2958544, -2766479, -2763545, -3142775, -2917602, -877709, 2325053, 4516474, 4852199, 4843522, 5636615, 5855180, 3895516, 1140926, 365877, 1382252, 1192196, -1112917, -2687579, -1538988, 87500, -700766, -2625970, -1982479, 1919802, 5902678, 7084118, 5475337, 2677284, 241823, -748645, -514242, -921324, -3112663, -5150071, -4271883, -1232210, 341421, -810251, -1898277]
36888a898277J255098J861883m95537k804795k616921r08667N03820J559504K730647
36879h13245L226874J957908n63299k364936k000979j33387J003795Q6602j572887
36870a173554j749607m96187J70964j52961L86478K061158K158531m88439k518957
36861a802574p77817K288805J957932j429543k869894k05210L077311L334474
36853C573484J253496o16063j626468k335953k412074j410962k14478J24358Q626
36844c656034L82372J066913J287973J135259J217685J301629N47524q98330j614677
36835G70314o99361P68790R21235k83535p43867P61074K368357J588627p75157
36826D676477j580650j96630N16911j013907k371378j125820J170508J581169
$$ y = [-1898277, -643179, 1218704, 723167, -2081628, -4698549, -5607216, -5103396, -3543892, -813245, 2413629, 4371537, 3808238, 1443302, -557677, -691064, 312731, 399333, -1173554, -2923161, -3419348, -3248384, -3401345, -3014867, -953709, 1204822, 716383, -1802574, -2580391, -291586, 1666346, 236803, -2633091, -2838301, 239010, 3573484, 4826980, 4210917, 2584449, 248496, -2163578, -3574540, -3789018, -3664660, -3656034, -3273662, -2206749, -918776, 216483, 1434168, 2735797, 3283321, 2384991, 770314, 70953, 839743, 1760978, 1477443, 733576, 1494650, 3863007, 5451634, 4676477, 3095827, 2899197, 3416108, 2402201, 30823, -1094997, 75511, 1656680]
36818A656680K86845m22898r4222l6996m05929k36208L94073P59681J088104J412185
36808D401315L20371k373736l558814r88472K244188J750099j072515j202359
36800d79923J511410K047377j086762l139400j052195J756520J609016L98922
36792A564965J280041K763781J629058j283326k584697j572290j14406Q75926
36784B559052J327275K18318k475431l741819j242592K345335K623274m5410j505912
36775F2090m89626K14587p20239j102737K57581J147645o0799j413108o63548
36766b768154J035766J228735R2717k47004P25794J380600O25590o95203j194250
36757A84591n31898N51164J052095M89394o48357j256582p13236M98486J414447
$$ y = [1656680, 1943525, 1520627, 1426405, 1389409, 983480, 747272, 1141345, 1901026, 2989130, 4401315, 4721686, 2347950, -1210864, -2199336, 44852, 1794951, 722436, -479923, 1031487, 3078864, 1992102, -1147298, -2199493, -442973, 1166043, 1564965, 2845006, 5608787, 7237845, 5954519, 3369822, 1797532, 1683126, 2559052, 3886327, 4104645, 1629214, -2112605, -3355197, -1009862, 1613412, 1568002, 62090, -427536, -212949, -933188, -2035925, -1778344, -630699, -691498, -2104606, -2768154, -1732388, -503653, -410936, -657940, 67854, 1448454, 2074044, 1378841, 184591, -347307, 203857, 1255952, 1745346, 1096989, -159593, -872829, -374343, 1040104]
36748A040104J524746R05357j32597j126074j506384j054255k42716K36050K83808
36739g1961M08189Q36297R96411K89022p93813r79750Q4160J054560M43192j423833
36729H42474k749038k365485p03705J176229K521236K799553J790155J79404q02661
36720B688162p96127o24970q67034j011213n42546M3827L7797l84540n88072m35487
36710b480203j57365J79756M40735K33559l70702n03624L58618J427224J580312
36701G08310Q70626K03673r7145m05638o71443l05772O01413R19433q9783j548513
36691A85161j874616p41458N43097P61812K63685J86007O48007O38926l06349
36682C04272j347153j623106j355345j099821q07004l16627J18945N53185J530559
$$ y = [1040104, 2564850, 3470207, 3337610, 2211536, 705152, -349103, -591819, -355769, -71961, 336228, 1172525, 2168936, 2457958, 1664145, 684395, 768555, 1823115, 2266307, 842474, -1906564, -4272049, -4975754, -3799525, -1278289, 1521264, 3311419, 3490823, 2688162, 1892035, 1267065, 400031, -611182, -1153728, -1109901, -1072104, -1456644, -2044716, -2480203, -2637568, -2457812, -2017077, -1783518, -2154220, -2657844, -2299226, -872002, 708310, 1578936, 1782609, 1685464, 1279826, 608383, 302611, 904024, 1823457, 1733674, 185161, -1689455, -2430913, -1887816, -1126004, -862319, -676312, -28305, 610621, 304272, -1042881, -2665987, -4021332, -5121153, -5928157, -6244784, -6125839, -5572654, -4042095]
36673d042095K684479K497654P20566m83208M33296J763432J220046k78117m50767
36664D065286N5424r71521k439967j087561K236468K521314j527093m530460k304237
36655c982347J710769J908505j052942k109137J27076K250833K137154J268877
36647B258788Q56858j9622j478929j708880j85383Q76750j27765j645848j376021
36638b550052M47950J726537J347962R7700o44358k85496N06342M36138q12554
36629B70169j744178p04170J759158L264919K379386N3673j698809j624768R7098
36620B052478J935416J952765j56858k192996j898215j2442P08471n76386j753725
36611E8508j057785M77472Q51466p1290q30583o07451P197J29026l79743q86592
$$ y = [-4042095, -1357616, 1140038, 1860604, 1377396, 1810692, 3574124, 4794170, 4516053, 4065286, 4120710, 3149189, 709222, -378339, 1858129, 4379443, 2852350, -1678110, -3982347, -2271578, -363073, -1416015, -3525152, -3398076, -1147243, 989911, 2258788, 3115646, 3096024, 1617095, -91785, -277168, 599582, 471817, -1174031, -2550052, -2102102, -375565, 972397, 1070097, 425739, 140243, 646585, 1082723, 270169, -1474009, -2178179, -419021, 2845898, 5225284, 5278957, 3580148, 1955380, 2052478, 3987894, 5940659, 5783801, 3590805, 1692590, 1680148, 2388619, 1812233, 58508, -999277, -521805, 329661, 258371, -572212, -1179663, -1172466, -1043440, -1423183, -2309775]
36601b309775o13264N29597J593199J451599J41109j074442j100185j04803Q16421
36592f70544P19424l71705j350070r38043Q03111K163690J627565k31570j443108
36583C08750j032839J16123P10735M45902j92532p33206r83397r33812o52894
36574b947170j29796O68135J401608J411603N90848j82041l9533P32288J094001
36565B599943N52849m10275r57382n74019M93463J175533N00582j074278j922926
36556C83490j227397R9811Q79632J029264Q77438L11439n14248p88115m05590
36547F45724n43035j665794k215748q13601J360736K163684J529007R77851Q40762
36538B279586J39038j079421j428119l61381J027859J577572J095310j06479j415877
$$ y = [-2309775, -2923039, -2393442, -800243, 651356, 792465, -281977, -1382162, -1486965, -670544, 48880, -322825, -1672895, -2610938, -1807827, 355863, 1983428, 1751858, 308750, -724089, -607966, 102769, 548671, 356139, -377067, -1360464, -2294276, -2947170, -3076966, -2408831, -1007223, 404380, 995228, 813187, 773654, 1505942, 2599943, 3152792, 2742517, 1785135, 1211116, 1704579, 2880112, 3380694, 2306416, 383490, -843907, -744096, 135536, 1164800, 2042238, 2353677, 1839429, 1051314, 645724, 102689, -1563105, -3778853, -4592454, -3231718, -1068034, 460973, 1438824, 2279586, 2418624, 1339203, -88916, -450297, 577562, 2155134, 3250444, 3143965, 1728088]
36529A728088j841919j010211J7043J07825k53873N5319Q34887J106439Q89836
36520A633434P35858K63727r49776j841706j329934m44743n99746o68379J240515
36511a960750L728723L351276J72k508847j903698j31897M52771K73607M07912
36502A709269L18377l96604n41989M06495P98441m37685j554824o08036J373487
36493A066931J962305P84262n49620r37714n38095J03609L34714l16870j160810
36484G48712q08191N83869J114276J08964o54261K7894O80525j12715r41439Q0309
36474H27943J851603J906333L96939l96154M824k89077k002941l174862j993427
36465b868819O84251K650939K926440K005113M22772j584257l035290k200601
$$ y = [1728088, -113831, -1124042, -1106999, -999174, -1253047, -1197728, -362841, 743598, 1633434, 2369292, 2633019, 1683243, -158463, -1488397, -1933140, -2532886, -3201265, -1960750, 1767973, 5119249, 5119421, 2610574, 706876, 574979, 1027750, 1301357, 1709269, 2027646, 1631042, 1089053, 1495548, 2293989, 1856304, 301480, -306556, 1066931, 3029236, 3813498, 3263878, 2326164, 1788069, 1891678, 2226392, 1909522, 748712, -59479, 524390, 1638666, 1747630, 1093369, 1121263, 1801788, 1689073, 747634, 827943, 2679546, 4585879, 4982818, 4586664, 4591488, 4302411, 2299470, -875392, -2868819, -2184568, 466371, 3392811, 5397924, 5820696, 4236439, 1201149, -999452]
36457i99452J162655M123451L098205j311425m140186k365971P78363N93613j932064
36448i92811j973427J039085K423390Q3092k031792n92489J801117J371362p56450
36439C71077j254166k78469j54728o76420m8321J124803R42892K6502K44699P72579
36429A070448m70577k287423j413145J946067L874614K363467l87565j675413
36421C020473j156507K40826J322901N31126k232738l919573j648988K598924
36413a243556M093225J888451n72546j220875j357935j585515n28064J264165
36405G37350Q96568j590825k102913R53483L311648J129133l065773m192808j479298
36396e403435J897571L606033L348773J375504j061913j589113J56002J180258
$$ y = [-999452, 163203, 4286654, 7384859, 6073434, 1933248, -432723, 345640, 939253, -992811, -2966238, -1927153, 496237, 579329, -1452463, -2044952, -243835, 1127527, 371077, -883089, -1161558, -1316286, -1992706, -2041027, -916224, 26668, 53170, 297869, 1070448, 599871, -1687552, -3100697, -1154630, 2719984, 5083451, 4695886, 3020473, 1863966, 2104792, 3427693, 3958819, 1726081, -2193492, -3842480, -1243556, 2849669, 4738120, 4165574, 2944699, 1586764, 1249, -526815, 737350, 1633918, 43093, -2059820, -1106337, 2205311, 3334444, 268671, -3924137, -5403435, -3505864, 100169, 3448942, 4824446, 3762533, 2173420, 2329422, 3509680]
36388C509680m43874k166043j045107J230054J211693n10511p46408N16827M70594
36379B026905j056563j274000K98835Q54561n05678q91340J378857L537889K430249
36370F799715p96719k439364j086813J223471J805143L619k387782k917364j201658
36361i97752N40848O51095N16825J849171K909003R22405k466925k633262O82731
36352A974139K344275j58179k618309j128780J414858L27256k925039l296587
36344d066366n04040J079446J4357o01569N73889R36218n46605r06034J346285
36335b674419K963036J322191r21219k78754J707986J299575j099051j980489
36327C38856p06096J30392k83914l7234J315330J767968P19248o463J20601o46488
$$ y = [3509680, 3065806, 899763, -145344, 1084710, 2296403, 1785892, 1039484, 1556311, 2026905, 970342, -303658, -4823, 849738, 344060, -547280, 831577, 4369466, 6799715, 6002996, 3563632, 2476819, 3700290, 5505433, 5509052, 3121270, 203906, -997752, -456904, 194191, 711016, 2560187, 5469190, 6391595, 3924670, 1291408, 1974139, 4318414, 4160235, 1541926, 413146, 1828004, 2155260, -769779, -4066366, -4570406, -3490960, -3476603, -4078172, -3504283, -2568065, -3114670, -4020704, -2674419, 288617, 1610808, 689589, 410835, 2118821, 3418396, 2319345, 338856, -367240, -236848, -520762, -557996, 757334, 2525302, 3244550, 3238087, 3358688, 2712200]
36317B712200k406430k594847o59465J78110j659516k765975k69849K780795K053256
36308b631721p01985l56442K902824L611052J8506k938042j561989J044806O06825
36299f166j487805j307941O69302P24061j407397k051349J11220J896212J023866
36290a835997l17020M34395J751756Q12322j320254j047197J849846L364625J094112
36281D786588k236641k804943q50984N81292M59374L92543J034295R65875l00256
36272B027143r91067p6127O87009m24068k000359j536637N51087J466663J87206
36263a09150j380960j567692r76829o72367l13542P10493J681318J466995L10359
36254h51375m80789l39434l8426m58030j285447j237812L18032K131182K117252
$$ y = [2712200, 305770, -2289077, -2948542, -2770432, -4429948, -7195923, -7465772, -4684977, -2631721, -3333706, -3690148, -787324, 2823728, 2842234, -95808, -1657797, -612991, -6166, -1493971, -2801912, -2132610, -1408549, -2815946, -4867295, -4756075, -2859863, -1835997, -2153017, -1718622, 33134, 845456, -474798, -1521995, 327851, 3692476, 4786588, 2549947, -254996, -1105980, -524688, -65314, 327229, 1361524, 2327399, 2027143, 1036076, 959949, 1646958, 1222890, -777469, -2314106, -1763019, -296356, -109150, -1490110, -3057802, -4034631, -4706998, -5020540, -4310047, -2628729, -1161734, -851375, -1332164, -1671598, -1710024, -2168054, -3453501, -4691313, -4373281, -2242099, -124847]
36245a24847r310j980995j663965K69049J452841Q98157m16281j341878j297579
36236d214808J60720K473013L263865R10161k203848j954804J533306L450531
36228C418136J135798j995022j672175R90183J736580k82466j890390j073633
36220C67011O32206J105860K45941r09405j593256j357811l30664L47943k13169
36211a705344j043828n67798P18395P55221p96543j802684o82850J553760K898949
36202f72722K477791O12102j718151k920549j809681O90314K129483J436841K4550
36193B49978m99974l06637l05897m89528k83145L67718J025350J176554L40679
36184A275098j289578k277679j373210M38865J032828L68965L87689J324775J026328
$$ y = [-124847, -134157, -2115152, -3779117, -3510068, -2057227, -1159070, -1575351, -2917229, -4214808, -4054088, -1581075, 1682790, 2592951, 389103, -1565701, -32395, 3418136, 4553934, 2558912, 886737, 1876920, 3613500, 3331034, 1440644, 367011, 999217, 2105077, 2351018, 1441613, -151643, -1509454, -1840118, -1492175, -1705344, -2749172, -3316970, -2598575, -1843354, -2639897, -4442581, -5125431, -3571671, -672722, 1805069, 2417171, 699020, -2221529, -4031210, -3340896, -1211413, 225428, 249978, -249996, -556633, -862530, -1352058, -1635203, -1267485, -242135, 934419, 1275098, -14480, -2292159, -3665369, -3226504, -2193676, -1824711, -1437022, -112247, 914081]
36175I14081r00364j465766R10170K945965J108317k602972l447485j103129L90009
36166c251174n89139j179947M70990K061051J343446j69086j87069N76239L63061
36157e61628k35316J47138N08170p84910k296456j110307K191995L590264J219204
36148B668154k047834k673540p17602J266861J632040N04853j165940j979784
36140b512792p73155J673536K747315J170722j079891j483001l91895O5402o05587
36131a189346j232002j558423k146533j973614P00308M461411N009978R84012
36123C055791l257592l062091M55527K586798J640281O7549j99473M6751l7716
36114A295825K32376J008231R81007k42067j130939q55166o91546j391710j413426
$$ y = [914081, 13717, -1452049, -541879, 2404086, 3512403, 909431, -2538054, -3641183, -3251174, -3840313, -5020260, -4549270, -2488219, -1144773, -1313859, -1500928, -924689, -561628, -796944, -649806, -141636, -926546, -3223002, -4333309, -2141314, 1448950, 2668154, 620320, -2053220, -2770822, -1503961, 128079, 632932, -533008, -2512792, -3285947, -1612411, 1134904, 2305626, 1225735, -257266, -649161, -583759, -1189346, -2421348, -3979771, -6126304, -8099918, -7399610, -2938199, 2071779, 3055791, -201801, -3263892, -2808365, -221567, 1418714, 1486263, 1286790, 1333541, 1295825, 1528201, 2536432, 3517439, 3275372, 2144433, 1289267, 597721, -793989, -2207415]
36105b207415L23111J939118J191076r40121j667924l29903J372857K108181J662118
36096C451098m4716k301812k951858j020074R42625J10002j950990j466124J266797
36087c965052K126918j5730j478692j22934J218107J05609j146268P7357J715655
36078a485030P75885r79364O457K494974K150189j064909k536792l33688K040753
36069A068475J434330o77484j508915j014530m42822L65285J840673K762586J715345
36060E542943n69849j911585j119726R79170K271282J093881j694201k919149
36052A672766j048560J020641j83412l005594k743211P44029K377290j9109k101745
36043c286905j62792K868746K463181l57429j505680n45276J3405N2403J339548
$$ y = [-2207415, -1884304, 54814, 1245890, 305769, -1362155, -1692058, -319201, 1788980, 3451098, 3406382, 1104570, -1847288, -2867362, -1924737, -1814735, -3765725, -5231849, -3965052, -1838134, -1853864, -3332556, -3455490, -2237383, -2131774, -3278042, -3200685, -1485030, -709145, -1688509, -1682052, 812922, 2963111, 1898202, -638590, -972278, 1068475, 2502805, 1825321, 316406, -698124, -1140946, -775661, 1065012, 3827598, 5542943, 4973094, 3061509, 1941783, 2920953, 5192235, 6286116, 4591915, 1672766, 624206, 1644847, 1461435, -1544159, -4287370, -3543341, -1166051, -1185160, -3286905, -3449697, -580951, 1882230, 1524801, 19121, -526155, -512750, -460347, 879201]
36034H79201K866957J768477j445632l197645k404572j410156j223353k55986
36026d422709J568707J820010q8004j449612o56807M68465K57538k19367J89931
36017b531848O10931M42590Q02910J891908J820102m2435j416482q06660N8020
36008H29036l47935n04846R37935K040323P94260j128509j277785p07975j531366
35999h96862k284562k42020K937008K779643r21354l269940j329791K043081K852557
35990A667760J063041p33559j115651m20781O01032J136200O28109k51966k32094
35981B342091M49077K15454j083405j606388n18954N41959J46097p73515q21679
35972a109263l25139q578P17204K148937K507512K13010k949088l512111r96638
$$ y = [879201, 3746158, 5514635, 4069003, 871358, -1533214, -2943370, -4166723, -4422709, -2854002, -1033992, -1121996, -2571608, -3228415, -2759950, -2502412, -2721779, -2531848, -1920917, -1478327, -675417, 1216491, 3036593, 2994158, 1577676, 771016, 829036, 481101, -23745, 914190, 2954513, 3748773, 2620264, 1342479, 634504, -896862, -3181424, -3423444, -486436, 2293207, 1371853, -1898087, -3227878, -1184797, 1667760, 2730801, 1997242, 881591, 460810, 1061842, 2198042, 2826151, 2574185, 2342091, 2791168, 3006622, 1923217, 316829, -202125, 339834, 485931, -287584, -1109263, -1434402, -1442980, -725776, 1423161, 3930673, 4143683, 1194595, -2317516, -3314154]
35963c314154J444491J336118k50354q50518J25077J403389J924613J612087P03522
$$ y = [-3314154, -1869663, -533545, -783899, -1634417, -1509340, -105951, 1818662, 3430749, 4134271]
$$ [...]
##END NTUPLES=NMR SPECTRUM
##END=
