##TITLE=31Pdec_3PEPA0207
 D2O, 24 sc
 5.07.2021
##JCAMPDX= 6.0         $$ Bruker NMR JCAMP-DX V2.0
##DATA TYPE= NMR SPECTRUM
##DATA CLASS= NTUPLES
##ORIGIN= UXNMR, Bruker Analytische Messtechnik GmbH
##OWNER= root
$$ XWIN-NMR		Version 3.5
$$ Mon Jul  5 09:51:16 2021 Russian Standard Time (UT+4h)  she@DPX200
##.OBSERVE FREQUENCY= 81.013821
##.OBSERVE NUCLEUS= ^31P
##.ACQUISITION MODE= SIMULTANEOUS
##.ACQUISITION SCHEME= undefined
##.AVERAGES= 24
##.DIGITISER RES= 16
##SPECTROMETER/DATA SYSTEM= spect
##.PULSE SEQUENCE= zgpg30
##.SOLVENT NAME= D2O
##.SHIFT REFERENCE= (INTERNAL, D2O, 0, 248.564)
##AUDIT TRAIL= $$ (NUMBER, WHEN, WHO, WHERE, WHAT)
$$ ##TITLE= Audit trail, XWIN-NMR		Version 3.5
$$ ##JCAMPDX= 5.01
$$ ##ORIGIN= Bruker BioSpin GmbH
$$ ##OWNER= she
$$ F:/spectra/data/she/nmr/P31/1/pdata/1/auditp.txt
$$ ##AUDIT TRAIL=  $$ (NUMBER, WHEN, WHO, WHERE, WHAT)
(   1,<2021-07-05 09:49:35.70 +0400>,<she>,<DPX200>,
      <created by zg, POWCHK disabled, PULCHK disabled
       configuration hash MD5:
       00 E9 B6 7A A2 85 ED C7 34 08 36 98 17 FE 4E 26
       data hash MD5: 32K
       BE 0B 21 CB 8E E3 17 CA F7 39 A3 0A 21 13 F4 69>)
(   2,<2021-07-05 09:49:39.00 +0400>,<she>,<DPX200>,
      <Start of raw data processing
       efp BC_mod = 2 LB = 1 FT_mod = 6 PKNL = 1 PHC0 = -7185.396 PHC1 = -442.714 SI = 64K 
       data hash MD5: 64K
       04 6C 95 32 2A 7B 75 81 35 03 59 3C 14 EC 0B CC>)
(   3,<2021-07-05 09:50:07.14 +0400>,<she>,<DPX200>,
      <pk PHC0 = 134.5737 PHC1 = -323 
       data hash MD5: 64K
       3A E6 D8 88 58 DF 36 00 38 A4 F3 57 D4 03 C1 37>)
(   4,<2021-07-05 09:50:11.17 +0400>,<she>,<DPX200>,
      <abs ABSG = 5 
       data hash MD5: 64K
       C0 F6 E6 1C 81 7C 1D C4 D9 B3 71 41 9B 53 01 AA>)
$$ ##END=
$$ 
$$ hash MD5
$$ 9E 21 8C 47 DE 0A 7C 23 7B 9A 7E C7 97 BC EB 9F
##$RELAX= 
##$RELAX= 
##$RELAX= 
##$RELAX= 
##$RELAX= 
##$RELAX= 
##$RELAX= 
##$RELAX= 
$$ Bruker specific parameters
$$ --------------------------
##$DU= <F:/spectra>
##$EXPNO= 1
##$NAME= <P31>
##$PROCNO= 1
##$TYPE= <nmr>
##$USER= <she>
##$AMP= (0..31)
100 100 100 100 100 100 100 100 100 100 100 100 100 100 100 100 100 100 
100 100 100 100 100 100 100 100 100 100 100 100 100 100 
##$AQSEQ= 0
##$AQ_mod= 1
##$AUNM= <au_zg>
##$AUTOPOS= <>
##$BF1= 81.014009
##$BF2= 200.13
##$BF3= 200.13
##$BF4= 200.13
##$BF5= 200.13
##$BF6= 200.13
##$BF7= 200.13
##$BF8= 200.13
##$BYTORDA= 1
##$CFDGTYP= 0
##$CFRGTYP= 5
##$CHEMSTR= <none>
##$CNST= (0..31)
1 1 145 1 1 1 1 1 1 1 1 1 1 1 1 1 1 1 1 1 1 1 1 1 1 1 1 1 1 1 1 1 
##$CPDPRG= <waltz16>
##$CPDPRG1= <>
##$CPDPRG2= <waltz16>
##$CPDPRG3= <>
##$CPDPRG4= <mlev>
##$CPDPRG5= <mlev>
##$CPDPRG6= <mlev>
##$CPDPRG7= <mlev>
##$CPDPRG8= <mlev>
##$CPDPRGB= <>
##$CPDPRGT= <>
##$D= (0..31)
0 1 0 0 0 0 0 0 0 0 0 0.03 2e-05 3e-06 0 0 0 0 0 0 0 0 0 0 0 0 0 0 0 0 
0 0 
##$DATE= 1625464175
##$DBL= (0..7)
120 120 120 11 120 120 24 19 
##$DBP= (0..7)
150 150 150 150 150 150 150 150 
##$DBP07= 0
##$DBPNAM0= <>
##$DBPNAM1= <>
##$DBPNAM2= <>
$$ [...]
##$SUBNAM3= <"">
##$SUBNAM4= <"">
##$SUBNAM5= <"">
##$SUBNAM6= <"">
##$SUBNAM7= <"">
##$SUBNAM8= <"">
##$SUBNAM9= <"">
##$SW= 501.771253377433
##$SWIBOX= (0..15)
0 1 3 0 0 0 0 0 0 0 0 0 0 0 0 0 
##$SW_h= 40650.406504065
##$TD= 32768
##$TD0= 1
##$TE= 0
##$TE2= 300
##$TE3= 300
##$TEG= 300
##$TL= (0..7)
0 120 53 12 22 120 120 120 
##$TP= (0..7)
150 150 150 150 150 150 150 150 
##$TP07= 0
##$TPNAME0= <>
##$TPNAME1= <>
##$TPNAME2= <>
##$TPNAME3= <>
##$TPNAME4= <>
##$TPNAME5= <>
##$TPNAME6= <>
##$TPNAME7= <>
##$TPOAL= (0..7)
0.5 0.5 0.5 0.5 0.5 0.5 0.5 0.5 
##$TPOFFS= (0..7)
0 0 0 0 0 0 0 0 
##$TUNHIN= 0
##$TUNHOUT= 0
##$TUNXOUT= 0
##$USERA1= <user>
##$USERA2= <user>
##$USERA3= <user>
##$USERA4= <user>
##$USERA5= <user>
##$V9= 5
##$VALIST= <valist>
##$VCLIST= <CCCCCCCCCCCCCCC>
##$VD= 0
##$VDLIST= <DDDDDDDDDDDDDDD>
##$VPLIST= <PPPPPPPPPPPPPPP>
##$VTLIST= <TTTTTTTTTTTTTTT>
##$WBST= 1024
##$WBSW= 4
##$XGAIN= (0..3)
0 0 0 0 
##$XL= 0
##$YL= 0
##$YMAX_a= 3852
##$YMIN_a= -4124
##$ZGOPTNS= <>
##$ZL1= 120
##$ZL2= 120
##$ZL3= 120
##$ZL4= 120
##$ABSF1= 248.5645
##$ABSF2= -253.2056
##$ABSG= 5
##$ABSL= 3
##$ALPHA= 0
##$AQORDER= 0
##$ASSFAC= 0
##$ASSFACI= 0
##$ASSFACX= 0
##$ASSWID= 0
##$AUNMP= <proc_1d>
##$AZFE= 0.1
##$AZFW= 0.5
##$BCFW= 0
##$BC_mod= 2
##$BYTORDP= 0
##$COROFFS= 0
##$CY= -3
##$DATMOD= 1
##$DC= 0
##$DFILT= <>
##$DTYPP= 0
##$F1P= 0
##$F2P= 0
##$FCOR= 1
##$FTSIZE= 65536
##$FT_mod= 6
##$GAMMA= 0
##$GB= 0
##$INTBC= 1
##$INTSCL= 5.30512e-09
##$ISEN= 30
##$LB= 1
##$LEV0= 0
##$LPBIN= 0
##$MAXI= 10000
##$MC2= 0
##$MEAN= 0
##$ME_mod= 0
##$MI= 50
##$NCOEF= 0
##$NC_proc= -7
##$NLEV= 6
##$NOISF1= 182.463
##$NOISF2= 159.3651
##$NSP= 0
##$NTH_PI= 0
##$NZP= 0
##$OFFSET= 248.5645
##$PC= 4
##$PHC0= -7050.822
##$PHC1= -765.714
##$PH_mod= 1
##$PKNL= yes
##$PPARMOD= 0
##$PSCAL= 0
##$PSIGN= 0
##$REVERSE= no
##$SF= 81.014009
##$SI= 65536
##$SIGF1= 159.3651
##$SIGF2= -187.1042
##$SINO= 113.3802
##$SIOLD= 16384
##$SREGLST= <1H.CDCl3>
##$SSB= 0
##$STSI= 65536
##$STSR= 0
##$SW_p= 40650.406504065
##$SYMM= 0
##$S_DEV= 0
##$TDeff= 32768
##$TDoff= 0
##$TI= <>
##$TILT= no
##$TM1= 0
##$TM2= 0
##$TOPLEV= 0
##$USERP1= <user>
##$USERP2= <user>
##$USERP3= <user>
##$USERP4= <user>
##$USERP5= <user>
##$WDW= 1
##$XDIM= 65536
##$YMAX_p= 462364751
##$YMIN_p= -33639752
$$ End of Bruker specific parameters
$$ ---------------------------------
##NTUPLES= NMR SPECTRUM
##VAR_NAME=  FREQUENCY,     SPECTRUM/REAL,   SPECTRUM/IMAG
##SYMBOL=    X,             R,               I
##VAR_TYPE=  INDEPENDENT,   DEPENDENT,       DEPENDENT
##VAR_FORM=  AFFN,          ASDF,            ASDF
##VAR_DIM=   65536,         65536,           65536
##UNITS=     HZ,            ARBITRARY UNITS, ARBITRARY UNITS
##FACTOR=    0.620285442955139, 1,           1
##FIRST=     20137.2065510759, 0,            0
##LAST=      -20513.1999529892, 0,           0
##MIN=       -20513.1999529892, -33639752,   0
##MAX=       20137.2065510759, 462364751,    0
$$ Real data points
##PAGE= N=1
##DATA TABLE= (X++(R..R)), XYDATA
$$ [...]
41621A498153m65668k84362r41119j562443p05126J574745L047045J763188j129325
41612B795088k420571r13578J001539O89979j119141j591189O0837J603657J118463
41603A225084m69567j042304j71559Q24218R21170K55487o63832j414252j382758
41594a918313j28163J659989K358134J110772j000170j957945r71976O64620J091838
41585I08786J00260p20753k78252M12999j29348j267856r79599Q38171J809112
41576F93520N81988j062791j014600p628l903p36597m01108Q34312Q02389r27034
41566a241452j882136l00992K082344K339624K38856j641928j220542P94937J978708
41557A147419J043014o73827q63877O68807J606311M65450r99329m13235J253929
$$ plain form
41621 1498153 1032485 748123 -192996 -1755439 -2460565 -885820 2161225 3924413 2795088
41612 2795088 374517 -539061 462478 1152457 33316 -1557873 -1497036 106621 1225084
41603 1225084 755517 -286787 -458346 365872 1287042 1542529 878697 -535555 -1918313
41594 -1918313 -2046476 -386487 1971647 3082419 2082249 124304 -847672 -183052 908786
41585 908786 1009046 288293 10041 423040 293692 -974164 -1953763 -1115592 693520
41576 693520 1275508 212717 -801883 -809511 -813414 -1550011 -1951119 -1116807 -314418 -1241452
41566 -1241452 -3123588 -3424580 -1342236 997388 1236244 -405684 -1626226 -831289 1147419
41557 1147419 2190433 1516606 652729 1321536 2927847 3393297 2393968 1980733 3234662
41548C234662R04783j665917k883456n00782K918802L394424O97456j882739k017410
41539B199823o68070j48474j315878k968010l353319k052224l66819L69032M98482
41530g805457J197012K232526K046900K83270j356895j418691m21694N04609J299884
41521c438536K223281K630681J780355J29375j197702j685209j505368j003170
41513b066293o29594o50347o19081m1807M46880m0893o95931M1506J467254J189081
41503a599225o66331r78956J254873K779726J346342l53010O35831K079519K62083
41494D760852l183428l441977l88519J291738j37168j185689K69493J504261K75780
41485b34657j142106k93205J089833O06092k09655J157362L068521J927892j801913
$$ plain form
41548 3234662 4139445 2473528 -409928 -910710 2008092 5402516 6099972 4217233 2199823
41539 2199823 1531753 1383279 67401 -2900609 -6253928 -8306152 -8672971 -8303939 -7805457
41530 -7805457 -6608445 -4375919 -2329019 -2045749 -3402644 -4821335 -5243029 -4738420 -3438536
41521 -3438536 -1215255 1415426 3195781 3325156 2127454 442245 -1063123 -2066293
41513 -2066293 -2695887 -3346234 -3965315 -4007122 -3560242 -3601135 -4297066 -4255560 -2788306 -1599225
41503 -1599225 -2265556 -3244512 -1989639 790087 2136429 1783419 2419250 4498769 4760852
41494 4760852 1577424 -1864553 -2253072 -961334 -1098502 -2284191 -2014698 -510437 -234657
41485 -234657 -1376763 -1669968 -580135 25957 -183698 973664 4042185 5970077 4168164
41476D168164l968693k698687k99646Q58447J009036J019963P02495J8642k96792
41467E12929j94490n28181j205989j018845O4936M20314n59895j241755l40954
41458d091930J019998J232221O71634O65970J168938J126666L30517o39842j595704
41449a11532k359592j980213o0514J754233J575920J77994m7424J109832J389940
41440A448644q4547j358654j066026o23133j271394j406134O37502L069981K942118
41431B288357O76071r09980j187679j692435j987750O7240L287610L134603j194981
41422B481056m096505j402040K868405K270330k187291l633825R5669L514654
41414h9547K151943j281034k006876k01084O78989k49711r68892o11519l05713
$$ plain form
41476 4168164 199471 -2499216 -2798862 -1940415 -931379 88584 791079 809721 512929
41467 512929 318439 -209742 -1415731 -2434576 -2369640 -1949326 -2509221 -3750976 -4091930
41458 -4091930 -3071932 -1839711 -1168077 -502107 666831 1793497 2124014 1484172 -111532
41449 -111532 -2471124 -4451337 -4511851 -2757618 -1181698 -1003704 -1051128 58704 1448644
41440 1448644 1364097 5443 -1060583 -1683716 -2955110 -4361244 -3723742 -653761 2288357
41431 2288357 2964428 2054448 866769 -825666 -2813416 -2746176 541434 3676037 2481056
41422 2481056 -1615449 -3017489 -149084 2121246 -66045 -3699870 -3604201 -89547
41414 -89547 2062396 781362 -1225514 -1426598 -747609 -997320 -1966212 -2577731 -2883444
41405b883444n04125l95212J36964L52789L62939Q19840J063790q6039j633382
41396b765880j071433J620156L151114J368095j573363k193931k90660J366216
41388c89686R47434p27813j907983j666903j90148J293977J150930p15560j923808
41379d129560k62598K923666L938037J544493j448624k097102q07871K61551M54958
41370C76950N33104O53239L99948R3112K48956K50703p18208j869043j743809
41361a775048o14027n100l0806O00195J773488J562533o07117k554236k270386
41352c920504m98615Q18210J071221O89465j68755j135845j098050L37118J834019
41343b071736K113607J662288J361042P45619o88697j713763r61094O20173J037319
$$ plain form
41405 -2883444 -3387569 -3782781 -3645817 -3293028 -2930089 -2110249 -1046459 -1132498 -2765880
41396 -2765880 -3837313 -2217157 933957 2302052 728689 -1465242 -1755902 -389686
41388 -389686 557748 -170065 -2078048 -3744951 -3935099 -2641122 -1490192 -2205752 -4129560
41379 -4129560 -4392158 -1468492 2469545 4014038 2565414 468312 -339559 -78008 376950
41370 376950 910054 1563293 1963241 2056353 2305309 2556012 1837804 -31239 -1775048
41361 -1775048 -2389075 -2394175 -2424981 -1824786 -51298 1511235 904118 -1650118 -3920504
41352 -3920504 -4419119 -3600909 -2529688 -1840223 -2008978 -3144823 -4242873 -3905755 -2071736
41343 -2071736 41871 1704159 3065201 3810820 3122123 1408360 447266 1067439 2104758
41334B104758L13747O8795N11103K07623j197446k263894k034803j164058n02355
41325c956530k06926l60443q50478p00752P36115K140291J789439M64075L26833
41316f18376J058453J74097k357039l200366p02667K293426K624848J055240O9275
41307C96891j19991o77307j250553q62697k20837l43900k26234J226418K222681
41298A44471M26740k564766k830833r1328J747658O05901r51406k83891J334291
41289b463163J425251K89259k93320l89175j195940k186163j654536L36345J869878
41280d261564J975825J553002J352093Q61918k49887j062320o54397M38873Q82379
41271H35922K48517o07984p68118l03238Q3302J33304K02690K80324l48931j736198
$$ plain form
41334 2104758 2418505 2487300 2998403 3206026 2008580 -255314 -2290117 -3454175 -3956530
41325 -3956530 -4163456 -4523899 -5374377 -6075129 -5339014 -3198723 -1409284 -945209 -618376
41316 -618376 440077 614174 -1742865 -4943231 -5645898 -3352472 -727624 327616 396891
41307 396891 276900 -400407 -1650960 -2513657 -2734494 -3078394 -3304628 -2078210 144471
41298 144471 571211 -1993555 -4824388 -4915716 -3168058 -2562157 -3513563 -3797454 -2463163
41289 -2463163 -1037912 -748653 -1041973 -1431148 -2627088 -4813251 -6467787 -6131442 -4261564
41280 -4261564 -2285739 -732737 619356 1481274 1231387 169067 -485330 -46457 835922
41271 835922 1084439 476455 -291663 -594901 -511599 -378295 -175605 104719 -244212 -1980410
41261a980410k332426q67372J175319R74984j370764k355400j19316K361696J547578
41252b966111j043168r40751K211443L709017Q39935k782014k286331J626684
41244a631296L999183K458606m41167j587248j086531p18369q08995m29253K85423
41235D0353n1957j715074k756303j368825J273610K107481L62689j127866m9044
41226c284936J693512Q23678j844650k242873N66292K721848J639252j41331K63615
41217A94407J109341l35458k152690p85371K094220J475341k505762l889619P753
41208d787838M256917L604442m27106k948223k591026j374898l72818P65512J616009
41199b259029J480231R29900N29502m35102j891214j847651J84417J167703r00460
$$ plain form
41261 -1980410 -4312836 -5180208 -4004889 -3029905 -4400669 -6756069 -6875385 -4513689 -2966111
41252 -2966111 -4009279 -4950030 -2738587 970430 1810365 -971649 -3257980 -1631296
41244 -1631296 2367887 4826493 4385326 2798078 1711547 993178 184183 -245070 40353
41235 40353 -11604 -1726678 -4482981 -5851806 -4578196 -2470715 -2108026 -3235892 -3284936
41226 -3284936 -1591424 -767746 -2612396 -4855269 -4288977 -1567129 72123 -69208 194407
41217 194407 1303748 968290 -1184400 -1969771 124449 1599790 -905972 -4795591 -4787838
41208 -4787838 -530921 3073521 2646415 -301808 -2892834 -4267732 -4640550 -3875038 -2259029
41199 -2259029 -778798 151102 680604 245502 -1645712 -3493363 -3308946 -2141243 -3041703
41190c041703k941188j246914K251839K873589P12460p4780J243391J054184j510073
41181f79195k411708M26376L178924J921511j592246l118333j867210j41995O86262
41172c597614Q89831O53668J03446q3991J94486O8797l94083J52157J503812J279025
41162G69534j055667k270553l9182L001820L022369P17625m43123j55098j183601
41153B364124l748524m366575j278748K475693L126461Q98178j111854j141769
41145b783014j22345K66934n28922j689658j814598k18677K104677L192003K210869
41136F17269M91847l7838P86176J254900K01308j249196j240009o9034R4541j259754
41126d09790j769044O3091J942285J153719p33213j23134K368942K327733j246101
$$ plain form
41190 -3041703 -5982891 -7229805 -4977966 -2104377 -1391917 -1466697 -223306 830878 -679195
41181 -679195 -3090903 -2664527 514397 2435908 843662 -2274671 -4141881 -4283876 -3597614
41172 -3597614 -2707783 -2054115 -1950669 -2034660 -1840174 -1771377 -2165460 -2013303 -509491 769534
41162 769534 -286133 -2556686 -2595868 405952 3428321 4145946 3702823 3547725 2364124
41153 2364124 -1384400 -5750975 -7029723 -4554030 -1427569 -529391 -1641245 -2783014
41145 -2783014 -2905359 -2638425 -3167347 -4857005 -6671603 -6890280 -4785603 -1593600 617269
41136 617269 1109116 1071278 1857454 3112354 3313662 2064466 824457 755423 849964 -409790
41126 -409790 -2178834 -2115743 -173458 980261 247048 123914 2492856 4820589 3574488
41117C574488l743390j934269J059121Q52429j563543k097310p5369J587139J371157
41108i69547M89956r5870o43990r06018k72743N95009O29183K85164M12132K17786
41098b58938j142263k183256j243735K14341j45778j128822J41688K703813K694536
41089c48414j18771j565236K20954K044661J335850R3328N96165J190343l24564
41080C124316k275350j817364J53877N50647q37050j420545k77262P98225O56531
41071a343975K66751L60568R6836r47629j332961K77728K631752K812981k16454
41062B605597l852336m346548r97018K929614L854071J682102p86609j394420
41054c05547l54255R07618J137180j50707j984987k231514j07811K164954K063982
$$ plain form
41117 3574488 -168902 -2103171 -1044050 -191621 -1755164 -3852474 -3927843 -2340704 -969547
41108 -969547 -479591 -575461 -1219451 -2125469 -2398212 -1803203 -1174020 -888856 -476724 -258938
41098 -258938 -1401201 -3584457 -4828192 -4613851 -4759629 -5888451 -5746763 -3042950 -348414
41089 -348414 -467185 -2032421 -1811467 233194 1569044 1662372 2258537 3448880 3124316
41080 3124316 848966 -968398 -814521 -263874 -1100924 -2521469 -2798731 -2000506 -1343975
41071 -1343975 -1077224 -716656 -619820 -1567449 -2900410 -2622682 9070 2822051 2605597
41062 2605597 -1246739 -5593287 -6590305 -3660691 193380 1875482 1088873 -305547
41054 -305547 -659802 247816 1384996 1234289 -750698 -2982212 -3090023 -925069 1138913
41045A138913M01466j35452N63103J91021j408670j501468P96347K589989J694680
41036D329929j15016m43296j3360n60383j399555r41381J52468J75410n27489
41027F57327l36042O80587J026680L76001k64307n10418q21914j125348q12003
41018a129437J38705J088934J324452K04317k105393l649403k356456O20142J728457
41009d135682K52041m10861J501373K758653O06854j972470q62279K095404J891975
41000A725008j421522l003338j197006N01256j2526m50102Q07473J613384K76105
40991a161268j291064j154781n36011q34274p33083R05820K104228P94631j460365
40982c366167j793845k64083J100657J809954K484431K345098L68962j869861
$$ plain form
41045 1138913 1540379 1404927 1968030 2159051 750381 -751087 45260 2635249 4329929
41036 4329929 4214913 3771617 3758257 3197874 1798319 856938 1009406 1184816 657327
41027 657327 321285 1001872 2028552 2404553 2140246 1629828 807914 -317434 -1129437
41018 -1129437 -990732 98202 1422654 1626971 -478422 -4127825 -6484281 -5864139 -4135682
41009 -4135682 -3883641 -4294502 -2793129 -34476 572378 -1400092 -2262371 -166967 1725008
41000 1725008 303486 -2699852 -3896858 -3395602 -3408128 -3858230 -3050757 -1437373 -1161268
40991 -1161268 -2452332 -3607113 -4143124 -4977398 -5710481 -4804661 -2700433 -1905802 -3366167
40982 -3366167 -5160012 -5424095 -4323438 -2513484 -29053 2316045 2685007 815146
40974H15146j704569N19464J724340N65713j033590j192239m37850K3094K90730
40965d29761Q75694J333940R96442J04058p22708j379044j845964j592597l25197
40956b985137J124606J594064J115765Q03263J156473J339582N70729n16892p62300
40947C440153l06129l32618r47459p85499N60031J221253l06112k276464j618141
40938a350985J489464L291986J366330k129142l331612j348529J420390K643441
40930B051343K040977L80215j759148l677072m140591k346263P83423K988542
40922c678574K787647R55848n47469q49464n70187j63177P09797J702109J388304
40913A734834m21510j533280l59804J253535N48984j755280k458081q54366M99019
$$ plain form
40974 815146 -889423 -369959 1354381 1920094 886504 -305735 -743585 -720491 -429761
40965 -429761 445933 1779873 2776315 2880373 2157665 778621 -1067343 -2659940 -2985137
40956 -2985137 -1860531 -266467 849298 1652561 2809034 4148616 4719345 4202453 3440153
40947 3440153 3134024 2801406 1853947 1068448 1628479 2849732 2543620 267156 -1350985
40938 -1350985 138479 3430465 4796795 2667653 -663959 -2012488 -592098 2051343
40930 2051343 4092320 4472535 2713387 -963685 -5104276 -7450539 -6667116 -3678574
40922 -3678574 -890927 64921 -482548 -1332012 -1902199 -2065376 -1355579 346530 1734834
40913 1734834 1313324 -219956 -579760 673775 1222759 -532521 -2990602 -3844968 -3345949
40904c345949K98939L82040J917420K900626J471105p76877j198518k8348M83716
40895B104154l87643j405155j620663j126249k23458N56695L70929n54478m65391
40886b751259J411269L022844K063076n60822j942525j182261n651K01908k14052
40877D2527o26877q75444m55345J079074K607418K155863l36342k460963k206122
40868a076211k79247R82180K37080j667267k618067j356030R82280J967988R69872
40859a857422K6977O96682J541584N57349j260975j372595O9625M92464o07864
40850a714175p19180J220610K465702M80086k877903l562325o54349K668014L197301
40841E03781J114956q79199q71329L67445O85897n96892j854576j506401j86255
$$ plain form
40904 -3345949 -3047010 -2664970 -747550 2153076 3624181 2847304 1648786 1620438 2104154
40895 2104154 1716511 311356 -1309307 -2435556 -2659014 -2102319 -1731390 -2285868 -2751259
40886 -2751259 -1339990 1682854 3745930 3185108 1242583 60322 54671 256579 42527
40877 42527 -584350 -1459794 -1915139 -836065 1771353 3927216 3590874 1129911 -1076211
40868 -1076211 -1355458 -373278 -136198 -1803465 -4421532 -5777562 -4795282 -2827294 -1857422
40859 -1857422 -1830445 -1133763 407821 965170 -295805 -1668400 -1598775 -1106311 -1714175
40850 -1714175 -2433355 -1212745 1252957 1733043 -1144860 -4707185 -5361534 -2693520 503781
40841 503781 1618737 739538 -131791 235654 921551 324659 -1529917 -3036318 -3222573
40832c222573N22890N57205Q67754J160053L85689p41162l16956J290600J287701
40823A791201j190630l181800k063827N75206J420838J55666p69324j61610O03143
40814b821137J85663q13221r53675K46181J903258K507819J225888r66747j924636
40805a410607q04512O89324L88986j551299k922813k159954J08314J979568K095160
40796c587833P72836k95735R9929J046931O81822q28418j075222J004719L075727
40787H94756K490646L4020j389890q46342N7909K07667K48901O41056N07204q23358
40777B022569k494256l085088k111507k47044J286462J548147Q03236L95867R34866
40768i46748J183478n4317j592897j184388J047501K505528J739029K09999k41132
$$ plain form
40832 -3222573 -2699683 -2142478 -1274724 -114671 271018 -470144 -787100 503500 1791201
40823 1791201 600571 -2581229 -4645056 -4069850 -2649012 -2493346 -3262670 -3424280 -2821137
40814 -2821137 -2635474 -3448695 -4402370 -4156189 -2252931 254888 1480776 514029 -1410607
40805 -1410607 -2215119 -1525795 -1136809 -2688108 -5610921 -7770875 -7662561 -5682993 -3587833
40796 -3587833 -2814997 -3110732 -3010803 -1963872 -1282050 -2110468 -3185690 -2180971 894756
40787 894756 3385402 3419422 2029532 1183190 1241099 1448766 1697667 2338723 2845927 2022569
40777 2022569 -471687 -3556775 -5668282 -5915326 -4628864 -3080717 -2277481 -1881614 -946748
40768 -946748 236730 182413 -1410484 -2594872 -1547371 958157 2697186 2907185 2666053
40759B666053J22547M7343o12538j175984j407557j304233n61015N65034P96014
40750h64336l86057j320887k08760J921192K223072Q5157j840426j404595Q1046
40741a714594J42549r13940m93937K169483M577967M251834J701189r03836k528898
40732F287817l311541l072931j758369o52911r98447j679880n78043J768085K493437
40723a502783R46502m8539J147319K051042K14974k217706j542440J430843K228489
40714B707701o29603l544908l145268n06478J294831J330454P68215M42571L33607
40705i48878M89308R30787J125209O04060k42893o74867n49775l24440m57713
40696d9202j041362j673960j717026j058181k97861L05835J303285K553915K372796
$$ plain form
40759 2666053 2788600 2835943 2223405 1047421 -360136 -1664369 -2225384 -1660350 -864336
40750 -864336 -1250393 -2571280 -2780040 -858848 1364224 1449381 -391045 -1795640 -1714594
40741 -1714594 -1572045 -2485985 -2979922 -810439 3767528 8019362 9720551 8816715 6287817
40732 6287817 2976276 -96655 -1855024 -2507935 -3506382 -5186262 -5764305 -3996220 -1502783
40723 -1502783 -556281 -604820 542499 2593541 2808515 590809 -951631 479212 2707701
40714 2707701 2078098 -1466810 -4612078 -5118556 -3823725 -2493271 -1725056 -1282485 -948878
40705 -948878 -459570 471217 1596426 2200486 1957593 1282726 732951 408511 -49202
40696 -49202 -1090564 -2764524 -4481550 -5539731 -5837592 -5531757 -4228472 -1674557 698239
40687F98239j13890k655889k243922N91496K395887J694795M89900M23979M90620
40678A771215k68572o67121K30166J008712K43064j024872j190503p06543o97115
40669a301569o06202M71549J518294J075723j06574l12412J82122j61374j195599
40660d36042j380513n60473p107K6063L97418Q83433L30320q95266r80591M31870
40650b190888J585399J339452N30591L6723n36100j439081j822977j148891j52921
40641c798693M16026P58947J057953Q76500K87542L02183J230266J704881M18083
40632C253688j884973l137235k327462m34324Q95223J164442J324874K107297
40624I61530K417713N76266k571666l647793j235023J475332R16967j474898j433870
$$ plain form
40687 698239 584349 -2071540 -4315462 -3723966 -1328079 366716 856616 1280595 1771215
40678 1771215 1502643 835522 1065688 2074400 2317464 1292592 102089 -604454 -1301569
40669 -1301569 -1907771 -1436222 82072 1157795 1051221 738809 920931 759557 -436042
40660 -436042 -1816555 -2377028 -2384135 -2358072 -1960654 -1077221 -746901 -1642167 -2622758 -2190888
40650 -2190888 -605489 733963 1264554 1301277 765177 -673904 -2496881 -3645772 -3798693
40641 -3798693 -3382667 -2623720 -1565767 -689267 -401725 -99542 1130724 2835605 3253688
40632 3253688 1368715 -1768520 -4095982 -4530306 -3635083 -2470641 -1145767 961530
40624 961530 3379243 3955509 1383843 -2263950 -3498973 -2023641 -1106674 -2581572 -4015442
40615d015442J356754K717066O68999j518354p47228J151261Q45515j120856j693483
40606b355768k91004R06045P86345M16905N68418O61555K77069k53649q10465
40597i4549j381898j160427N57542K650801L022098J248980j025582k288785k351383
40588h23203j562796m61080j25610j126024k022557p89814J907910K893563Q14025
40579a295586j618433j236007J181708K158857N47988j003487j49531J558002
40571A43511R02057k017859l406898j072272K070876J897707q48489j528429J340581
40562b519215L624315J750616j954659l010328j343046k95783o19397N9921K036657
40553b270919K440895M01434r50291L88799J870594P74672j159869q31404R14722
$$ plain form
40615 -4015442 -2658688 58378 727377 -790977 -1538205 -386944 458571 -662285 -2355768
40606 -2355768 -2646772 -1740727 -954382 -537477 30941 692496 969565 715916 -94549
40597 -94549 -1476447 -2636874 -2079332 571469 3593567 4842547 3816965 1528180 -823203
40588 -823203 -2385999 -2847079 -2972689 -4098713 -6121270 -6911084 -5003174 -2109611 -1295586
40579 -1295586 -2914019 -4150026 -2968318 -809461 -261473 -1264960 -1414491 143511
40571 143511 1045568 -972291 -4379189 -5451461 -3380585 -1482878 -2331367 -3859796 -2519215
40562 -2519215 1105100 2855716 901057 -2109271 -3452317 -3748100 -4367497 -4307576 -2270919
40553 -2270919 169976 571410 -378881 9918 1880512 2655184 1495315 663911 1578633
40544A578633R39362p04209j039092N14523J078147q36775k878601k573405p93004
40535d714421J57720m3956j1168Q74878J816688J848740P78749o60474j180363
40526a133607j71281J218357J224416j40821j096736p42007j49368k85407n16536
40517a792990j00204M00779L30424J68795L70040L57626n7392K55178J713790
40508A646046K533733J157918j083353j838300j170693q33647j025794m74972
40500a089062P28717J028715N3345r80843j392316j294252j63263K152098L444657
40491B487796J499982j657831j736484J155081K199895m56990k526474o71390
40483B93585J864339P52528k102682j877610J008435J695215j076396l191372
$$ plain form
40544 1578633 2517995 1813786 774694 1289217 2367364 1530589 -1348012 -3921417 -4714421
40535 -4714421 -4556701 -4600657 -4611825 -3736947 -1920259 -71519 707230 46756 -1133607
40526 -1133607 -1304888 -86531 1137885 997064 -99672 -841679 -991047 -1276454 -1792990
40517 -1792990 -1893194 -1492415 -1161991 -993196 -623156 -265530 -322922 -67744 1646046
40508 1646046 4179779 5337697 4254344 2416044 1245351 411704 -614090 -1089062
40500 -1089062 -360345 668370 721715 -259128 -1651444 -2945696 -3108959 -956861 2487796
40491 2487796 3987778 2329947 593463 1748544 3948439 3491449 964975 293585
40483 293585 2157924 2910452 807770 -1069840 -61405 1633810 557414 -2633958
40475b633958j849528P07051J437195O73785L51114Q51651J298409J146810L71827
40466B354356n81304p21179J80623N40880q55516k262706j139141J585685K471573
40457A573271O55464j280142j599049j085899j88877J615260K939128J205417
40449C834573k466095l434319m59169J967728P00957j171089K9915K268931J647284
40440B918716p71406j091834O74843J182327j90684p81597L23279J095256L70968
40431C729868q65995j884175k561882j872071N50670K118229M23492k138993j322010
40422c822867J948184K612511k92873k081471l52038J241578k87038j995572k20787
40413c250373L065627L457848Q78275j120486j022763m17732m49053n85407m57786
$$ plain form
40475 -2633958 -4483486 -3776435 -2339240 -1665455 -1314341 -462690 835719 1982529 2354356
40466 2354356 1773052 1051873 1232496 1773376 917860 -1344846 -2483987 -898302 1573271
40457 1573271 2228735 948593 -650456 -1736355 -1925232 -309972 2629156 3834573
40449 3834573 1368478 -2065841 -2525010 -557282 143675 -1027414 -997499 1271432 2918716
40440 2918716 2147310 1055476 1730319 2912646 2721962 1940365 2263644 3358900 3729868
40431 3729868 2863873 979698 -1582184 -3454255 -2903585 -785356 -361864 -2500857 -3822867
40422 -3822867 -1874683 737828 444955 -1636516 -1988554 -746976 -1034014 -3029586 -3250373
40413 -3250373 -184746 3273102 4151377 3030891 2008128 1590396 1141343 555936 98150
40404I8150l32614j72079q2804q21475k220932k491043q78324O67092N46868K73900
40394e413261J566041K674846J006830k037865k675265m83760J276751R02402
40386c183281K7067q2148k41833n75318L62399K351138K684621L25927j980753
40377c12181j707345j06865L50860k07417k51632P6189k35523o22616k0834O77541
40367b359823q842j105779m09859J617004K233557Q50908o4547O69386Q35794
40358B257799j255818l427916k738766r1773J135573P6437r80989o51335j20658
40349e797446k21353K78347K063408L302437K231978k3682j361245j988950l210978
40340d727484l916596j563480L161635N900505M107912M03450j281034p57802
$$ plain form
40404 98150 -234464 -406543 -489347 -1310822 -3531754 -6022797 -6901121 -6234029 -5687161 -5413261
40394 -5413261 -3847220 -1172374 -165544 -2203409 -4878674 -5362434 -4085683 -3183281
40386 -3183281 -3156214 -3238362 -3480195 -4055513 -3693114 -1341976 1342645 1668572 -312181
40377 -312181 -2019526 -2126391 -1775531 -1982948 -2234580 -2158391 -2393914 -3016530 -3037364 -2359823
40367 -2359823 -2368665 -3474444 -3884303 -2267299 -33742 817166 752619 1422005 2257799
40358 2257799 1001981 -2425935 -5164701 -5256474 -4120901 -4044464 -5025453 -5676788 -5797446
40349 -5797446 -6018799 -5740452 -3677044 -374607 1857371 1833689 472444 -1516506 -4727484
40340 -4727484 -8644080 -10207560 -7045925 -1145420 2962492 3365942 2084908 1327106
40332A327106n87236j631927k277277j460178k418J102863J731864J742512P72425
40323G17734p18190j614042j635464j414789j047094m4072J158771J334444M66720
40314b795982o0056K51418L18090k90961m17246L73175O13514m26136r60758L85564
40304c009378J703985N49183j754115j768009O55426K097488R77511k90956K29021
40295f09844O91143j051032l183962k299969J188809L214019J646145r92400j288482
40286b685573N89646J680319M96238j178202r48884Q98272J814197N05720j224552
40277e2819r45068J052197K297270J563631l2996j277249k081346k069333l73133
40268a918846K027727K231247m68382k651323j398067J212406J331947o31635
$$ plain form
40332 1327106 739870 -892057 -3169334 -4629512 -4631930 -3529067 -1797203 -54691 717734
40323 717734 -456 -1614498 -3249962 -4664751 -5711845 -5755917 -4597146 -3262702 -2795982
40314 -2795982 -2856038 -2604620 -2286530 -2577491 -2994737 -2621562 -2008048 -2434184 -3394942 -3009378
40304 -3009378 -1305393 -756210 -2510325 -4278334 -3622908 -1525420 -547909 -838865 -609844
40295 -609844 81299 -969733 -4153695 -6453664 -5264855 -2050836 -404691 -1397091 -2685573
40286 -2685573 -2095927 -415608 80630 -1097572 -2046456 -1148184 666013 1171733 -52819
40277 -52819 -997887 54310 2351580 3915211 3882215 2604966 523620 -1545713 -1918846
40268 -1918846 108881 2340128 1871746 -779577 -2177644 -965238 366709 -264926
40260b64926j098334N21068J204864k390l03242J582262K768254J063767j210537
40251D260786j122491J81177p0487j500455j756764p75068l64395o35113k22593
40242b005403N97553K61687r36889j100415l6538N28946N0601k84267j49456m24665
40232c498846p97959O6103J641145J866599Q76153J068405K498020J858239k038928
40223C538931n219405l826754K35277K234525J238683K08774O31160R19613J33866
40214I4670k94692M93918R91111j8456j126235m86597J050471J063558p13896
40205A053852j820654n71487J517404J859746K89142j098184j158153q94668j090905
40196a913907p31944R18255K294574J554557l86715j057787j15461N05588q5016
$$ plain form
40260 -264926 -1363260 -842192 362672 360282 57040 1639302 4407556 5471323 4260786
40251 4260786 3138295 3319472 3248985 1748530 -8234 -783302 -1147697 -1782810 -2005403
40242 -2005403 -1407850 -1146163 -2083052 -3183467 -3220005 -2691059 -2640458 -2924725 -3074181 -3498846
40232 -3498846 -4296805 -4230702 -2589557 -722958 153195 1221600 3719620 5577859 3538931
40223 3538931 -1680474 -5507228 -5271951 -3037426 -1798743 -1589969 -958809 -39196 94670
40214 94670 -200022 293896 1285007 1266551 140316 -346281 704190 1767748 1053852
40205 1053852 -766802 -1338289 179115 2038861 2328003 1229819 71666 -823002 -1913907
40196 -1913907 -2645851 -1727596 566978 2121535 1734820 677033 561572 1067160 982144
40187I82144p30281o89092n83197m67124M43242J463743O85803j426327j708739
40178b029828P84776K597622R67016j734641j740822K67326P46157q48441j760314
40169b751149q19359K21743K58892K39075N61682K66768m90857j12515J383022
40160a242698J732448L7179j527213j047449K86263L37584p23923j074551l653
40151c226013J407476J683469K75633j719171j996951M13141L030880K439298
40143B307762p77708k320483l45179J788520R07259r74544k52708K087946K070635
40134D491500o53821k270376j019354L30354n51320j935436j525046m28860p49211
40125d311570j438746R654K846349L558512J093875j542765j669615k07876O65406
$$ plain form
40187 982144 251863 -437229 -1020426 -1487550 -1044308 419435 1105238 -321089 -2029828
40178 -2029828 -1245052 1352570 2319586 584945 -1155877 -888551 -142394 -990835 -2751149
40169 -2751149 -3570508 -3348765 -3089873 -2850798 -2289116 -2022348 -2513205 -2625720 -1242698
40160 -1242698 489750 526929 -1000284 -2047733 -1761470 -1423886 -2147809 -3222360 -3226013
40151 -3226013 -1818537 -135068 140565 -1578606 -3575557 -3162416 -131536 2307762
40143 2307762 1530054 -790429 -1135608 652912 1560171 585627 332919 2420865 4491500
40134 4491500 3837679 1567303 547949 878303 326983 -1608453 -3133499 -3562359 -4311570
40125 -4311570 -5750316 -5740662 -2894313 664199 1758074 215309 -1454306 -1662182 -996776
40116i96776P35345P55350J87136j571510k863942j493493J500554K531891L99363
40107h16082j961370j658206M60370J793715J766926J554422J284864o4413k242517
40098A17709l271031j901912O54036J926894O69510j809005k627943l12709L011445
40089c543006L654426J064732j337745j072342K4312n94209j646079m70107J733463
40080b186555J409482j231519k191793j47354J671990J216212O07564J392269
40072E40296J361360q26837j994154N02916L386636J956193k281652l686311j048555
40063b090108J188588K42207j492104j238211J89781Q79066Q08685N91853Q6952
40054h33291j99868R29685K546324J693956j835508l875868j608343J806007J580744
$$ plain form
40116 -996776 -261431 493919 681055 -890455 -3754397 -5247890 -3747336 -1215445 -816082
40107 -816082 -2777452 -4435658 -3975288 -2181573 -414647 1139775 2424639 2360226 117709
40098 117709 -3153322 -5055234 -4401198 -2474304 -1804794 -3613799 -6241742 -6554451 -3543006
40089 -3543006 111420 1176152 -161593 -1233935 -1209623 -1803832 -3449911 -3920018 -2186555
40080 -2186555 -777073 -2008592 -4200385 -4347739 -2675749 -1459537 -851973 540296
40072 540296 1901656 1074819 -919335 -416419 2970217 4926410 2644758 -1041553 -2090108
40063 -2090108 -901520 -659313 -2151417 -3389628 -3199847 -2320781 -1512096 -920243 -833291
40054 -833291 -1033159 -103474 2442850 4136806 2301298 -1574570 -3182913 -1376906 203838
40045B03838j743868l444270j569523J150240K145707J954752J618042N77804
40037H92722j250821k050616q10994N42653O557j025479J65588K840749L175746
40028B486105j13410l366204k834727J45877J288879m39103j707744j12719K337247
40019b315799K515163P52083k01059M47262Q34288j32606j183390j024103j79235
40010d87396L44599M99053L57810n25409j784590j819451j12011J438467J135151
40001i53777J23183M04885J364666Q45368q95426j270711L44634J366113R5357
39992A424292j600270j393769m9189L23453j53653J35314J080065J112021J92058
39983A070322k14779n3700p19207j871962j344375P49442J098948j569955l424521
$$ plain form
40045 203838 -1540030 -4984300 -6553823 -5403583 -3257876 -1303124 314918 892722
40037 892722 -358099 -2408715 -3219709 -2677056 -2670499 -3695978 -3530390 -689641 2486105
40028 2486105 2372695 -993509 -3828236 -3682359 -2393480 -2832583 -4540327 -4653046 -2315799
40019 -2315799 199364 951447 750388 1197650 2031938 1899332 715942 -308161 -487396
40010 -487396 -142797 356256 714066 188657 -1595933 -3415384 -3527395 -2088928 -953777
40001 -953777 -830594 -425709 938957 1784325 888899 -381812 -37178 1328935 1424292
39992 1424292 -175978 -1569747 -1618936 -1295483 -1449136 -1313822 -233757 878264 1070322
39983 1070322 855543 801843 82636 -1789326 -3133701 -2384259 -1285311 -2855266 -6279787
39974f279787q56120L462467L934912K48595k336381r54159J264083R04232p18828
39965a330986p76673L63603Q53182J066194J998830K067225m66057l241013k370680
39956a836375J206445K439405l35189k997387k057886O15049J605610R47431N27270
39947A14373K56404j004294k485530k417053p79569J123607K605768L133208J681090
39938B228004j079069j931308N20586K543310J38812m255604m573818j07434L412028
39929c104493K383588j34624l53342N64638j27857j532473j144983M32481P77618
39920b239447K2366J64981J027909O03600r29122j058093Q63373K315872J320192
39911B091631r48325k166173j626047j86544J022346J162686J99017o98740l29803
$$ plain form
39974 -6279787 -7135907 -3673440 261472 510067 -1826314 -2780473 -1516390 -612158 -1330986
39965 -1330986 -2107659 -1744056 -890874 175320 2174150 4241375 3775318 534305 -1836375
39956 -1836375 -629930 1809475 1474286 -1523101 -3580987 -2965938 -1360328 -412897 114373
39947 114373 370777 -633517 -3119047 -5536100 -6315669 -5192062 -2586294 546914 2228004
39938 2228004 1148935 -782373 -261787 2281523 2420335 -1835269 -6409087 -6516521 -3104493
39929 -3104493 -720905 -855529 -1208871 -644233 -772090 -2304563 -3449546 -3017065 -2239447
39920 -2239447 -2217081 -2052100 -1024191 -420591 -1349713 -2407806 -1544433 771439 2091631
39911 2091631 1143306 -1022867 -2648914 -2835458 -1813112 -650426 -451409 -1150149 -1479952
39902a479952Q58879J429125J090573O76986K40492q74757k041305j676172j2434
39893a788565P22666l04609j202581n04392N70451M93808r541L36929Q79126M12594
39883c94114l86527k12095L48565k7774o69050j2650J192283P68342r06945r82821
39873a282786J174510K507824R22425j347716j194949O24539Q87942j111593k772870
39864a592674k193909n03455L50662J99316K9725J16986Q7848J79409J025669
39855b300423K128445J818848m35523k509812j866607P47927J698201n58491k826171
39846d103606j570873J597540K134381l08625j207488J347414L082533M33014
39838A404290l049971j956938K027265K461263j457271l475540m38019K650481
$$ plain form
39902 -1479952 -621073 808052 1898625 2575611 2816103 1941346 -99959 -1776131 -1788565
39893 -1788565 -1065899 -1370508 -2573089 -3077481 -2507030 -2013222 -2022763 -1685834 -806708 -394114
39883 -394114 -780641 -992736 -644171 -671945 -1340995 -1353645 -161362 606980 -299965 -1282786
39873 -1282786 -108276 2399548 3321973 1974257 779308 1403847 2291789 1180196 -1592674
39864 -1592674 -3786583 -4290038 -3939376 -3740060 -3710335 -3593349 -3505501 -3326092 -2300423
39855 -2300423 -171978 1646870 1211347 -1298465 -3165072 -2417145 -718944 -1277435 -4103606
39846 -4103606 -5674479 -4076939 -1942558 -2251183 -3458671 -2111257 971276 1404290
39838 1404290 -1645681 -3602619 -1575354 885909 -571362 -4046902 -4484921 -1834440
39830a834440R43189k440069j817293J859674L058368O52941j208447n12648K00896
39821a097829n78634p12499R59545J991947O81526q07923l56265M01796o44583
39812a62919j882731o19293K011654K500520L00412j738343j839114j045258m86562
39803b961634K01875J216101J691560J188560L55285l06406q04619o78591N85617
39794D87748J939310J443196q96176k628704j911876L03469J777322J450942j43530
39785A821701j767104k188351j031101O09380J245395Q24355M45095L56034k31331
39776H4073j185628j119733L58568J685579J461766J44296j142103k070967k553302
39767d337451k120025q33569M08854J259379K214017K843100J635553j193364
$$ plain form
39830 -1834440 -891251 -3331320 -5148613 -3288939 -230571 422370 -786077 -1298725 -1097829
39821 -1097829 -1676463 -2388962 -1429417 562530 1244056 436133 79868 481664 -162919
39812 -162919 -2045650 -2664943 -653289 1847231 2147643 409300 -1429814 -2475072 -2961634
39803 -2961634 -2759759 -1543658 147902 1336462 1691747 1385341 580722 -97869 487748
39794 487748 2427058 3870254 2974078 345374 -1566502 -1263033 514289 1965231 1821701
39785 1821701 54597 -2133754 -3164855 -2555475 -1310080 -485725 -40630 315404 84073
39776 84073 -1101555 -2221288 -1862720 -177141 1284625 1428921 286818 -1784149 -4337451
39767 -4337451 -6457476 -7291045 -6882191 -5622812 -3408795 -565695 1069858 -123506
39759a23506k772564j282536J151232J455816R500n30303L11090N20875o13637
39750a874033j400853p79255J49903L33122K57519L58738j5387r50304j088347
39741e008897K56101J576653J230870r9318m80251N41712J699878J927283J159427
39732B803458l53759k098157k794240j342995J357023K751445J481877r26849
39724H77803k005735j324027m80057m17920k11543R12691J688020M54489j883275
39715b389554k503483o09247J239780Q55765l51600J25505J537845R26489j765665
39706b934165k917584o10196K181733J894866m03062j001409O09295J317741l38337
39697b201118j920109j137186P51653J407148J048929J279954J766697Q01465
$$ plain form
39759 -123506 -2896070 -4178606 -3027374 -1571558 -1562058 -2092361 -1781271 -1260396 -1874033
39750 -1874033 -3274886 -4054141 -3904238 -3571116 -3313597 -2954859 -2970246 -3920550 -5008897
39741 -5008897 -4752796 -3176143 -1945273 -2044591 -2524842 -1983130 -283252 1644031 2803458
39732 2803458 2449699 351542 -2442698 -3785693 -2428670 322775 1804652 877803
39724 877803 -1127932 -2451959 -2932016 -3349936 -3561479 -2648788 -960768 -506279 -2389554
39715 -2389554 -4893037 -5502284 -4262504 -3406739 -3758339 -3632834 -2094989 -1168500 -2934165
39706 -2934165 -5851749 -6461945 -4280212 -2385346 -2788408 -3789817 -3180522 -1862781 -2201118
39697 -2201118 -4121227 -5258413 -4506760 -3099612 -2050683 -770729 995968 1797433
39689A797433j369593k366927j044636J032065J916771J345240K3528j412469
39681g8588k088262j211426M56481R76806k4771n78374N88633J920234J458817
39672A419550j16693p68339k32683K01459J94307M43270P67300K69142p67238
39663A410075j110743o15450j94593K4173N70808Q82361j17656j675113j744666
39654b570804j66675R32058L52923p25077r92489n50058K57389J288977J471529
39645g02227k33174k197115j409522J715883L075797Q42796j751438j674799o05855
39636b939654j209490k129920o38729K045887K474688O98268m8672J115650J623072
39627I91100J07024j524815j416077j81051Q21968J203913Q99056m4527o41980
$$ plain form
39689 1797433 427840 -1939087 -2983723 -1951658 -34887 1310353 1333881 -78588
39681 -78588 -2166850 -3378276 -2921795 -1944989 -1969760 -2548134 -1959501 -39267 1419550
39672 1419550 1302857 534518 301835 503294 697601 1140871 1908171 2177313 1410075
39663 1410075 299332 -316118 -510711 -486538 84270 966631 848975 -826138 -2570804
39654 -2570804 -2737479 -1805421 -1452498 -2177575 -3170064 -3720122 -3462733 -2173756 -702227
39645 -702227 -935401 -3132516 -4542038 -2826155 249642 1092438 -659000 -2333799 -2939654
39636 -2939654 -4149144 -6279064 -6917793 -4871906 -2397218 -1698950 -1747622 -631972 991100
39627 991100 1098124 -426691 -1842768 -2023819 -1201851 2062 901118 856591 214611
39618B14611p987O72513m90428k663514k858235l66810K057367K254532J289867
39609A01916Q98202P74843K3992o92637l25517N69511P12579J24301j46708K12669
39599B253151M12379k47503j439520k006568j120379M82672R70862j48703r40597
39590a784206K55759J959001J468410q87555k010091o31897J061735J124836N12746
39581A068738P10133J005333M7624j441507j571781j56995J021386O34215o52587
39572F64559j134287p9486J286970J028478r42908k243545r80372J385932J795715
39563G81056j91195j943536j557770N28J000140J181758J088251P97119K07155
39554A363506n41289j363367j922168j255633P37659J937190M19160k064666j964193
$$ plain form
39618 214611 206624 879137 388709 -2274805 -5133040 -5499850 -3442483 -1187951 101916
39609 101916 1000118 1774961 1798953 1106316 780799 1350310 2062889 2187190 2040482 2253151
39599 2253151 2665530 2418027 978507 -1028061 -2148440 -1665768 -694906 -843609 -1784206
39590 -1784206 -1528447 430554 1898964 1011409 -998682 -1630579 -568844 555992 1068738
39581 1068738 1778871 2784204 2831828 1390321 -181460 -338455 682931 1317146 664559
39572 664559 -469728 -549214 737756 1766234 823326 -1420219 -2400591 -1014659 781056
39563 781056 589861 -1353675 -2911445 -2910917 -1910777 -729019 359232 1156351 1363506
39554 1363506 822217 -541150 -2463318 -3718951 -2981292 -1044102 -624942 -2689608 -4653801
39545d653801N35991J346766j127767l107496j137042K499929L137519L69689
39537b136212j982443j485599L76444J129954L99427l54195J22056J426254J778216
39528g26098J54012j909309j904156J32781J542059R72535J43887O22893J224703
39519B53307L92962q72746o58246P55599J575726J240270N61642O389m52179n43130
39509B259594k37687k81508r51286j261178n55948K77129L26758M0178p3287n49600
39499a006835j450307j428677J22917J613714J534380N58069j53931q15830j483231
39490b509731q56743J254117K468187J258202l57526k15243K89709q55800k022165
39481a546993o93805J398140O17475k178877k592947J90064K274666J633050Q51250
$$ plain form
39545 -4653801 -4117810 -2771044 -3898811 -7006307 -8143349 -5643420 -2505901 -2136212
39537 -2136212 -4118655 -5604254 -5227810 -4097856 -3698429 -4052624 -3930568 -2504314 -726098
39528 -726098 -572086 -2481395 -4385551 -4252770 -2710711 -1738176 -1594289 -971396 253307
39519 253307 646269 -226477 -884723 -129124 1446602 2686872 3248514 3254903 2802724 2259594
39509 2259594 2021907 1740399 789113 -472065 -1028013 -750884 -424126 -383948 -457235 -1006835
39499 -1006835 -2457142 -3885819 -3762902 -2149188 -614808 -56739 -210670 -1026500 -2509731
39490 -2509731 -3366474 -2112357 355830 1614032 1256506 1041263 1330972 475172 -1546993
39481 -1546993 -2240798 -842658 -225183 -2404060 -4997007 -4806943 -2532277 -899227 -47977
39472d7977J822881K308830K43248k230245j994273L23500J679434R31643n67242
39463B469799j417017j199075m2287J234707J405467M39887k01156J53810K06935
39454C051070r75080j964051j066757P27465R87835m93358j402012l98626J024435
39445e09079R76333m1125j64715P68800R10293o80846k392329k270207o85742
39436d088617N60662Q95397R87286P61427l60097j403852o22664J262946J354186
39427f53326r23445k432769j018878J140980J050250o69634j438445p78245O5263
39418e658249Q26744J661268J455662k47633j112287Q21456L075299J682658k471161
39409C3757m346183j903507J379145J965169O63254J14103P31386J011251J30428
$$ plain form
39472 -47977 1774904 4083734 4326982 2096737 102464 425964 2105398 3037041 2469799
39463 2469799 1052782 -146293 -188580 1046127 2451594 2891481 2690325 2844135 3051070
39454 3051070 2075990 111939 -954818 -227353 760482 267124 -1134888 -1533514 -509079
39445 -509079 467254 426129 261414 1030214 1940507 1259661 -1132668 -3402875 -4088617
39436 -4088617 -3527955 -2632558 -1645272 -883845 -1243942 -2647794 -3270458 -2007512 -653326
39427 -653326 -1576771 -4009540 -5028418 -3887438 -2837188 -3506822 -4945267 -5723512 -5658249
39418 -5658249 -4831505 -3170237 -1714575 -1962208 -3074495 -2253039 822260 2504918 33757
39409 33757 -4312426 -6215933 -4836788 -2871619 -2208365 -2094262 -1362876 -351625 -221197
39400b21197j284593k033599j289045N55035J947222J920511J219059O77141k87841
39391A202693j886927k231234p04K412656J688408j125367j637549J447011M319974
39382D188961L314924o11157l660825l401008m38102K503471K847505P74729p80935
39373D737563O3216J616486J660850J094335J754634K534146J345828n38315l12973
39364A3955770J240103R36095j175962k054019j216510j178921k303610k191376
39356F011570n84050J01642l61476K63228J495341K24477k997325l579881m48049
39347A25477J850822O64476r85077o21006l37655j500422j340246J341084K641472
39338A838925O1868k612199j559261P87150O07560p35272k79878O27356l77682
$$ plain form
39400 -221197 -1505790 -3539389 -4828434 -4273399 -2326177 -405666 813393 1490534 1202693
39391 1202693 -684234 -2915468 -2916172 -503516 1184892 59525 -1578024 -131013 4188961
39382 4188961 7503885 6892728 3231903 -169105 -607207 1896264 4743769 5518498 4737563
39373 4737563 4800779 6417265 8078115 9172450 10927084 13461230 14807058 14268743 13955770
39364 13955770 15195873 16131968 14956006 12901987 11685477 10506556 8202946 6011570
39356 6011570 5427520 5529162 5167686 5430914 6926255 7150732 4153407 573526 125477
39347 125477 1976299 2640775 1655698 1034692 697037 -803385 -2143631 -802547 1838925
39338 1838925 1900793 -711406 -2270667 -1483517 -875957 -1611229 -1891107 -1263751 -1641433
39329a641433j310699M07265K316384J080827r58327J57803K282848N83553l371549
39320d53328l446635R42628L827132K088560p62009j192900j50421M86289Q88014
39311B227330J128182K78026j024086p97197N96863O08377r89483j470602J56488
39302G13898J478770P54743o26175q97600l08050K30619M87108K49166n86472
39293A496007j099516n04580K14233q742l4246J324993K157623L0759l252724
39284C23807l519149m30587K243624K439600J770129J525933Q77846k95510o30863
39275D304830j48002m76102j605741j710767n98145J5365j38556J93911M39928
39266B76721j238431l734947l593951n09926J953109J997076J706568K468835
$$ plain form
39329 -1641433 -2952132 -2544867 -228483 852344 -105983 51820 2334668 2918221 -453328
39320 -453328 -3899963 -2957335 869797 2958357 2196348 1003448 853027 1339316 2227330
39311 2227330 3355512 3633538 2609452 1812255 2409118 3017495 2028012 557410 713898
39302 713898 2192668 2947411 2321236 1423636 1115586 1346205 1833313 2082479 1496007
39293 1496007 396491 -108089 106144 97402 63156 1388149 3545772 3576531 323807
39284 323807 -3195342 -3625929 -1382305 1057295 2827424 4353357 5231203 4935693 4304830
39275 4304830 4156828 3680726 2074985 364218 -233927 -218562 -357118 -163207 276721
39266 276721 -961710 -4696657 -8290608 -8800534 -6847425 -4850349 -3143781 -674946
39258f74946K604786J074223m53255p92638q23059o81898O82593K098058P73549
39249C807413k322364k568361Q93591K927003K64251l331648l149090k98641J415238
39240b362608J463667J406720J106736Q9677k65082M91214j5369k558527l513365
39231d156937n40559K581339J635076r72234m93197J765664R63563k218440k310300
39222c746025J439521L462369R84335j787217r52453J250349J156072l38331l51402
39213A117218O92815L79269j111025j492055m24618K08497k78736n27526J10983
39204a325178M12428m02365j098109l29597J174273J705349J105276O60489P17367
39195B619933J61218j261901j846817l82445J620819J798590J60777j252150j226691
$$ plain form
39258 -674946 1929840 3004063 2550808 1758170 935111 253213 935806 3033864 3807413
39249 3807413 1485049 -1083312 -189721 2737282 3001533 -330115 -3479205 -3777846 -2362608
39240 -2362608 -898941 507779 1614515 1704192 1439110 1930324 1914955 -643572 -4156937
39231 -4156937 -4697496 -2116157 -481081 -1453315 -1946512 -180848 782715 -1435725 -3746025
39222 -3746025 -2306504 1155865 2140200 352983 -599470 650879 1806951 1468620 1117218
39213 1117218 1810033 2189302 1078277 -413778 -838396 -629899 -908635 -1436161 -1325178
39204 -1325178 -912750 -1315115 -2413224 -2742821 -1568548 136801 1242077 1902566 2619933
39195 2619933 2781151 1519250 -327567 -710012 910807 2709397 2870174 1618024 391333
39186C91333q8958J666019L271820K894462l84367m058613m535608j966266K71459
39177b538719Q66820J650465K956980K350722m49943j826500l628J576136r5849
39168D486484k375823j482652J029527J146671o53107o41413J316113J635262
39160D461062m82370j633560q3140J546720R09156n98714q17651j49277P8877
39151C231103J25881P28471J239122O33488p97894k019105k513467k140670q30989
39142b344060P79319J403483N64967p01136j070992k35832J170724K213217K144314
39133C924004R77393l95572j171874j427906j453458j017653p8851O37344P60869
39124G54296J031348J813512J991093P34476q18505j277981j157706j446052j365731
$$ plain form
39186 391333 302375 1968394 5240214 8134676 7750309 3691696 -843912 -2810178 -2538719
39177 -2538719 -1671899 -21434 2935546 5286268 4836325 3009825 3006197 4582333 4486484
39168 4486484 2110661 628009 1657536 2804207 2151100 1509687 2825800 4461062
39160 4461062 3978692 2345132 2261992 3808712 4717868 4119154 3301503 3152226 3231103
39151 3231103 3356984 4085455 5324577 5958065 5160171 3141066 627599 -1513071 -2344060
39142 -2344060 -1564741 -161258 403709 -297427 -1368419 -1604251 -433527 1779690 3924004
39133 3924004 4901397 4505825 3333951 1906045 452587 -565066 -643917 -6573 754296
39124 754296 1785644 3599156 5590249 6324725 5506220 4228239 3070533 1624481 258750
39115B58750J12944J687454J330789l26514r49934j90792L52494K57849M19306
39106B952346N84485j19535o68830M40818J690380L78610k173584j822281J413373
39097B675782K549737n36627l426191k028458J283803J966200J04666j079830
39089A509082p56221m06157k55479K99547L13237r61877j479753O61717L123144
39080B047240K279843q27424j948111m11409L32048r30858j292625O38793J980138
39071A867635N89574j213981o46940J130226J514133O30918l968o20364j759423
39062A487810j734551Q77557L645569K995228k58246j917171o97003M29782l74283
39053D454692j070290K08454J903012J907243Q50969K11438l89415j482483j596861
$$ plain form
39115 258750 371694 2059148 3389937 3063423 2113489 1922697 2275191 2533040 2952346
39106 2952346 3536831 3417296 2748466 3189284 4879664 5258274 3084690 1262409 2675782
39097 2675782 5225519 4688892 1262701 -765757 518046 2484246 2588912 1509082
39089 1509082 752861 346704 91225 390772 704009 -257868 -1737621 -1075904 2047240
39080 2047240 4327083 3499659 1551548 1140139 1472187 541329 -751296 -112503 1867635
39071 1867635 2457209 1243228 596288 1726514 3240647 3871565 3867597 3247233 1487810
39062 1487810 -246741 630816 4276385 7271613 7013367 5096196 4399193 4828975 4454692
39053 4454692 3384402 3592856 5495868 7403111 8254080 8465518 8076103 6593620 4996759
39044D996759K38188J715807L88344j799556j004293K163686L089264L14630k116771
39035G986058r79160J450515J505792l25866j124253m35348J1240l7106N12426
39026H564298J126558K59083j292172j014411R89266J568879n67920k525718j507381
39017E600482J006091J620088m2793j255526l32242J441237K104244J419768L92772
39008A1954121l43107p66403p15761J22750J367876J782756O40644q78005n64703
38999A2600168K011258M339483L664112N14641j715908q54297J631396K856701
38991B5047554K134012J370380K265494M066396M424557K321642j53090L92954
38983D1869899M537731Q478324Q032965M084679K115203N537952J1399666J4433147
$$ plain form
39044 4996759 5234947 6950754 7339098 5539542 4535249 6698935 9788199 10102829 7986058
39035 7986058 7006898 8457413 9963205 9637339 8513086 8077738 8088978 8051872 8564298
39026 8564298 9690856 9949939 8657767 7643356 8632622 10201501 9633581 7107863 5600482
39017 5600482 6606573 8226661 8183868 6928342 6596100 8037337 10141581 11561349 11954121
39008 11954121 11611014 10844611 10128850 10251600 11619476 13402232 14042876 13164871 12600168
38999 12600168 14611426 18950909 22615021 23129662 21413754 20559457 22190853 25047554
38991 25047554 27181566 28551946 30817440 34883836 39308393 41630035 41476945 41869899
38983 41869899 46407630 54885954 62918919 67003598 69118801 74656753 86056419 100489566
38975A00489566J3931335J3972979J7212854K1509655K3825705K4881075K7567378
38968B43390547L2102427L5540136L5924065L4271987L1671921K6738039J7617099
38961D57256221N108530p915607j9209463k7657297l2231298l2830995l1769708
38954C10750383l1868899l2717047l1112868k5857884j9795348j6004296j4192033
38947A39202008j2441666j0543429r483781r060816q295119p362943p052784o959326
38939F8002144o152322m987026m274310l359029j317749M44173n39237l848721
38931D3967923o087776n254314k887813j217453m93783j25173k67596r29533j262428
38922B5442054j064111j378676k334614k163617m6598J718004O26085j987139
$$ plain form
38975 100489566 114420901 128393880 145606734 167116389 190942094 215823169 243390547
38968 243390547 275492974 311033110 346957175 381229162 412901083 439639122 457256221
38961 457256221 462364751 454449144 435239681 407582384 375351086 342520091 310750383
38954 310750383 278881484 246164437 215051569 189193685 169398337 153394041 139202008
38947 139202008 126760342 116216913 106733132 97672316 89377197 82014254 74961470 68002144
38939 68002144 61849822 56862796 52588486 49229457 47911708 48355881 47816644 43967923
38931 43967923 37880147 32625833 29738020 28520567 28026784 27901611 27634015 26704482 25442054
38922 25442054 24377943 22999267 20664653 18501036 18454438 20172442 20798527 18811388
38914A8811388k295980P95322M000554L773995N34839k107871j564424J158270
38906B3106093L036344K656869J623034K043058L500119L900953K998384L011585
38898D5876439N127898P448724P838889P169360P816691R990373J1526003J0725394
38890A13519771P614580K932010k231977o139294p739487q260952r633840j1386739
38882G8674072j1155963q460309n711502m766761m621619l678337k403283k153989
38874C5722309k772553l062797k765876k495782k335288j920852j496880j636424
38866A7235857k207092k577268k439559j670391j62146J292929J084984q65924
38858I691390k035127m69752J999193K116332p480j401679j187247j448682k631376
$$ plain form
38914 18811388 16515408 17310730 21311284 25085279 25620118 23512247 21947823 23106093
38906 23106093 26142437 28799306 30422340 32465398 35965517 39866470 42864854 45876439
38898 45876439 51004337 58453061 66291950 73461310 81278001 91268374 102794377 113519771
38890 113519771 121134351 124066361 121834384 115695090 107955603 99694651 90060811 78674072
38882 78674072 67518109 59057800 53346298 48579537 43957918 40279581 37876298 35722309
38874 35722309 32949756 29886959 27121083 24625301 22290013 20369161 18872281 17235857
38866 17235857 15028765 12451497 10011938 8341547 8179401 9472330 10557314 9691390
38858 9691390 7656263 7186511 9185704 11302036 11294556 9892877 8705630 7256948 4625572
38849D625572k051446J164130L351462J494232j809560k205632j76470M56040
38841D848328p86283o66303J593453K615787N37068j863907j716370k46790K1461
38832D336444o12075m68382J61630Q740m08060K01386J244166J212181M09948
38823F085978K17396L79754m28075j816750j957948m66356J192062J948263J733571
38814F887895L77505j678104k150565N65280L808849L072698j443572m373496
38806E066490k600452N79062R50195n12759m66927O51096j82140k516761k433112
38797a465308R80062L518084J923716j392140k153425k53772R54848m4131j457744
38788F10190j598447r03328j67045P62248J638767J300721k36104r82554J55345
$$ plain form
38849 4625572 2574126 3738256 7089718 8583950 6774390 4568758 4392288 4848328
38841 4848328 4062045 3395742 4989195 7604982 8142050 6278143 4561773 4314983 4336444
38832 4336444 3724369 3255987 3417617 3426357 3018297 3219683 4463849 5676030 6085978
38823 6085978 6303374 6683128 6255053 4438303 2480355 2013999 3206061 5154324 6887895
38814 6887895 7265400 5587296 3436731 4002011 7810860 10883558 9439986 5066490
38806 5066490 2466038 3045100 3995295 3482536 3015609 3666705 3484565 967804 -1465308
38797 -1465308 -485246 3032838 4956554 3564414 1410989 1157217 2112065 2067934 610190
38788 610190 -988257 -1891585 -2058630 -1296382 342385 1643106 1407002 424448 579793
38779E79793J326938N24554r88603o03198J189856J395445n12112j558699q5763
38770A268211J612891J151825l10591o17645l46311j088516j883174p48357J328827
38761C67160J474417l64287j229700J23939J582479J405598N48591J96649k02055
38752C902791j043430j232328l62286K6082q73029j328350K318J326422M19208
38743H37398j442960j157260J348708K859389J495385r93436k108001j593959
38735g54736o30126K09316Q64403P86617m83174k044847k143750k17817K183265
38726b230849K913006J423174q76570k268015k185790j014316O65216J968058
38718a606086J692172k98780k047528j394276J027965K296236J133541l49477
$$ plain form
38779 579793 1906731 2431285 1442682 839484 2029340 3424785 2912673 1353974 1268211
38770 1268211 2881102 4032927 3722336 3104691 2758380 1669864 -213310 -961667 367160
38761 367160 1841577 1477290 247590 371529 1954008 3359606 3908197 4104846 3902791
38752 3902791 2859361 1627033 1264747 1290829 417800 -910550 -908232 418190 837398
38743 837398 -605562 -1762822 -414114 2445275 3940660 2947224 839223 -754736
38735 -754736 -1384862 -1175546 -311143 475474 -7700 -2052547 -4196297 -4414114 -2230849
38726 -2230849 682157 2105331 1228761 -1039254 -3225044 -4239360 -3574144 -1606086
38718 -1606086 86086 -212694 -2260222 -3654498 -2626533 -330297 803244 453767
38710D53767J95862K002613K486179R17544q58394j028935K08215J210522N47618
38701F134991j667910l404442k295731J380475M040740K652508j150770k738569
38693B951292m72161K094009J131706k153412l275820p71925J863540J212982
38685B580211j353038j913340L17452K148993J292345n66172q05431J52521L3403
38676A886944j357915j874681m43651J432291J864879O12730j323647k671315
38668a874365k331422l52373J489756J621739R96906J541463K546841J371852
38660E010397j873364l532105j624551J134207J532325L48582O4709M52467l35556
38651A177111j840695j887049l44269Q29701R14296Q66771P09168m70096j794869
$$ plain form
38710 453767 649629 2652242 5138421 6055965 5197571 4168636 4376851 5587373 6134991
38701 6134991 4467081 1062639 -1233092 147383 4188123 6840631 5689861 2951292
38693 2951292 2479131 4573140 5704846 3551434 275614 -496311 1367229 2580211
38685 2580211 1227173 -686167 -368715 1780278 3072623 2506451 1701020 1853541 1886944
38676 1886944 529029 -1345652 -1789303 -357012 1507867 2120597 796950 -1874365
38668 -1874365 -4205787 -4558160 -3068404 -1446665 -449759 1091704 3638545 5010397
38660 5010397 3137033 -395072 -2019623 -885416 646909 995491 1060200 1512667 1177111
38651 1177111 -663584 -2550633 -2894902 -2065201 -1150905 -284134 425034 -45062 -1839931
38642a839931j021755J597980K780816P87239j926659k243820o10776J91040p40858
38633c026724j438976k6034K729089M151036K536653r19685l304585l134707j580275
38624d014208j61248J353407L376020M298967K331619j131186k744451j758091
38616A550829n54352m77547k78918N31472K13156j654367k328287k6019K734757
38607b89276K705807O42316n64342o00041j109144j757697p86640J116868J387429
38598G45280L679m59955M19624O5207k193169l347402j635362N22229R29598J344438
38588c605833L503571M660663J511878l536597m970263k127248M15368L60739
38580c787722L98070K268342L283010J366762p67135o6045J549034M66803k319657
$$ plain form
38642 -1839931 -2861686 -1263706 1517110 2304349 377690 -1866130 -2476906 -2285866 -3026724
38633 -3026724 -4465700 -4491734 -1762645 2388391 4925044 4005359 700774 -2433933 -4014208
38624 -4014208 -4175456 -2822049 553971 4852938 7184557 6053371 3308920 1550829
38616 1550829 996477 518930 240012 771484 984640 -669727 -2998014 -3024033 -289276
38607 -289276 2416531 3058847 2494505 1894464 785320 -972377 -1759017 -642149 745280
38598 745280 748959 289004 708628 773835 -1419334 -4766736 -6402098 -5879869 -4950271 -3605833
38588 -3605833 -102262 4558401 6070279 2533682 -2436581 -4563829 -4148461 -3787722
38580 -3787722 -3389652 -1121310 2161700 3528462 2761327 2695282 4244316 4711119 2391462
38571B391462k725291k17257J569472P38678n52503l86539Q2205n00372j111689
38562g11834n16811L34727K1902r05167r52361L3391J007210J210965N48901n23041
38552d52118q71948K56001J613986J127661p97509j398857J10815J023904m29805
38543A82130j954516r82617R60268R63274j93184M30952K512358K802264O36061
38534E356990j055803p34541k78163r37711j091229J76473P21766r68881k590349
38525a401448j407500J320311K339587J229014J04881l23861j050819j702372
38517h92207p19783J149072R95137j559840k948384p09445K697514L503175J920119
38508C435358Q23259N94706r43821l580227l709934J53614M090409L641835j07390
$$ plain form
38571 2391462 -333829 -551086 1018386 1757064 1204561 818022 900227 399855 -711834
38562 -711834 -1228645 -893918 -872016 -1777183 -2729544 -2696153 -1688943 -477978 70923 -452118
38552 -452118 -1324066 -1068065 545921 1673582 876073 -522784 -411969 611935 182130
38543 182130 -1772386 -2755003 -1794735 -831461 -1024645 -593693 1918665 4720929 5356990
38534 5356990 4301187 3566646 3288483 2350772 1259543 1436016 2157782 1188901 -1401448
38525 -1401448 -2808948 -1488637 850950 2079964 2184845 1860984 810165 -892207
38517 -892207 -1611990 -462918 532219 -1027621 -3976005 -4685450 -1987936 1515239 3435358
38508 3435358 4258617 4853323 3909502 329275 -3380659 -3227045 863364 4505199 4397809
38499D397809k328932j123531Q87700J312437Q93701R14500P62986l04492j280140
38490D132038j142961p16006r34986q45869N96720K062070J525529m44570j452841
38481B779124q23032o9003j10779l57671n52048j194585j848681j257357L28448
38472c105584J039084K67167l58725L13654J253007J254735P65924N01991K1876
38463A953129r34442j352146p34777m01706j211686j535634K32956K354251J714893
38454H4838j302244k832578q90415J872518J970733l42663j982779j288828M62250
38445d249168J387197J199807Q00930P70813Q72961N96879k15866j062695r66835
38436h65977N59003K409423K359559m65469l808328m182908r82703K445965K738406
$$ plain form
38499 4397809 2068877 945346 1833046 3145483 4039184 4953684 5716670 5412178 4132038
38490 4132038 2989077 2273071 1338085 492216 1088936 3151006 4676535 4231965 2779124
38481 2779124 1956092 1887089 1776310 1418639 866591 -327994 -2176675 -3434032 -3105584
38472 -3105584 -2066500 -1799333 -2158058 -1844404 -591397 663338 1429262 1931253 1953129
38463 1953129 1018687 -333459 -1068236 -1469942 -2681628 -4217262 -3984306 -1630055 84838
38454 84838 -1217406 -4049984 -4940399 -3067881 -1097148 -1439811 -3422590 -4711418 -4249168
38445 -4249168 -2861971 -1662164 -861234 -90421 782540 1379419 1163553 100858 -865977
38436 -865977 -306974 2102449 4462008 3996539 188211 -3994697 -4977400 -2531435 206971
38427B06971N49283p33340L31332J760499J462655q751r84083j272171j608007
38418b95612j573072r5739K155743K827752R28494j624102k429842j505034n69543
38409b180955k43749L66213J394456J427814j55958j584672r19382J053855J922795
38400A080417J132448L61967M93215M83446j82724k65392P73399J224928j87507
38391D914197j876129j719500l42709K17262j80635l58027n39033j530994k038094
38382c453662j94819K541579K698234K34224j134417J26781J097029l27897j834074
38373b47022r14119P50028M08763r39853n41509J178216J472767j2430j026794
38364A28047p26760n28093j001611j011671k81306r5875q62027j233594l15584
$$ plain form
38427 206971 756254 22914 354246 2114745 3577400 3568649 2584566 1312395 -295612
38418 -295612 -1868684 -1964423 191320 3019072 3947566 2323464 -106378 -1611412 -2180955
38409 -2180955 -2424704 -2058491 -664035 763779 607821 -976851 -1896233 -842378 1080417
38400 1080417 2212865 2574832 3068047 3551493 3368769 3103377 3876776 5101704 4914197
38391 4914197 3038068 1318568 975859 1193121 1012486 654459 115426 -1415568 -3453662
38382 -3453662 -3648481 -1106902 1591332 1825556 691139 817920 1914949 1587052 -247022
38373 -247022 -1161141 -411113 -2350 -942203 -1483712 -305496 1167271 1154841 128047
38364 128047 -598713 -1126806 -2128417 -3140088 -3421394 -3517269 -4379296 -5612890 -5928474
38355e928474J091534J921999J947742J238488M8986o84294k19072P07072Q87721
38346A011702N06997L55937o0516j476087k630783j726872L18919J002236L64818
38337b333649O92016K016611J744353m56924j420776K67772J671597M34301j325791
38328A289510r79572L4045q38298k401636j807938M07727J469984J137706J203271
38319d85201J301094l20289k331392j385801J964950L135151N11309j892778q16350
38310c19307J366074J070969o78111o33632Q62508O90635j411050k138875N8114
38301a132675K312313J400979j658419k884206m42499L001349L393157J21075
38293D111074l199132l165305p29115O33095J42781L89862K335504K925365j41138
$$ plain form
38355 -5928474 -4836940 -2914941 -967199 271289 320275 -364019 -583091 123981 1011702
38346 1011702 1518699 1874636 1814120 338033 -2292750 -4019622 -3700703 -2698467 -2333649
38337 -2333649 -1641633 374978 2119331 1662407 241631 509403 2181000 2615301 1289510
38328 1289510 309938 343983 -494315 -2895951 -4703889 -4296162 -2826178 -1688472 -485201
38319 -485201 815893 495604 -1835788 -3221589 -1256639 1878512 2389821 497043 -319307
38310 -319307 1046767 2117736 1439625 805993 1668501 2359136 948086 -1190789 -1132675
38301 -1132675 1179638 2580617 922198 -1962008 -2404507 596842 3989999 4111074
38293 4111074 911942 -2253363 -2982478 -2349383 -2206602 -1816740 518764 3444129 3302991
38284C302991l891256l666287J28848K475428P14977k310440k715362l00719K306517
38275c955303L026580J607778p66833k084890j127036P70129J052891m57310j252721
38266c186715j14663J005373M52992k62010P18386J998832J066179j267094j794431
38257a383151J02698J561820P09945q29436r41408j65236k32608j028703q27641
38248c033720J002810K889341K709347O1522l072180l979475j969140P27031J516915
38239c147549N60941J29172J082039J775255R30763k61645j30103Q00958P50097
38230B489928m92600j375998j009405k43907j10431m11761m22865j56607j77084
38221a910730m83558l29080O40849J536824J126340l88180j250016l68390J002842
$$ plain form
38284 3302991 -588265 -4254552 -4125704 -1650276 -935299 -3245739 -5961101 -6261820 -3955303
38275 -3955303 -928723 679055 -87778 -2172668 -3299704 -2529575 -1476684 -1933994 -3186715
38266 -3186715 -3301378 -2296005 -1843013 -2105023 -1386637 612195 1678374 411280 -1383151
38257 -1383151 -1280453 281367 991312 161876 -779532 -944768 -1177376 -2206079 -3033720
38248 -3033720 -2030910 858431 3567778 3629300 557120 -3422355 -5391495 -4664464 -3147549
38239 -3147549 -2586608 -2457436 -1375397 399858 1330621 1068976 938873 1739831 2489928
38230 2489928 1997328 621330 -388075 -631982 -742413 -1154174 -1577039 -1733646 -1910730
38221 -1910730 -2394288 -2723368 -2082519 -545695 580645 192465 -1057551 -1425941 -423099
38212d23099Q53152o74241j377052j47193J495984J695823O72948k41725p75098
38203A079499j381400j552709l52945J459632J699358k48149k107711j438331
38195b842756J119674K494493R44147j824252k727340r52348J266900J619288
38187i02194N73607L54258J509766K036607M35045j800492k075428k58353J299013
38178A171829J113268K27518Q1526K90877l20642j456007j620224m92684L74187
38169f30352k73467j539833j626041l63108P02827O88665M63428Q58601J195374
38160e23906P28894L09109Q55541J141303m97419k673445k196785P46406K048014
38151f2288j54169k180727m66039K486992J862997j695104k983441m14657J830503
$$ plain form
38212 -423099 430053 -244188 -1621240 -1768433 -272449 1423374 2096322 1854597 1079499
38203 1079499 -301901 -1854610 -2207555 -747923 951435 703286 -1404425 -2842756
38195 -2842756 -1723082 771411 1715558 -108694 -2836034 -3788382 -2521482 -902194
38187 -902194 -328587 25671 1535437 3572044 4007089 2206597 131169 -127184 1171829
38178 1171829 2285097 2512615 2594141 2885018 2564376 1108369 -511855 -1004539 -630352
38169 -630352 -903819 -2443652 -4069693 -4432801 -3729974 -3041309 -2577881 -1719280 -523906
38160 -523906 204988 514097 1369638 2510941 2013522 -659923 -2856708 -2110302 -62288
38151 -62288 -216457 -2397184 -2863223 -376231 1486766 -208338 -3191779 -3606436 -1775933
38142a775933P79706j034116m64934J180588J128573N1236L17529J433597J045011
38133B661257o75853j307878l82439J07878n27120o10408N46336J080150l60502
38124E31421k147865j843669M34225K196545J583101o58975k022889r08516J432147
38115a404475K178463O16945o82089M05778K118345J389328j156031j901076J62969
38106A728157J882770Q25965j401398k219511j693239j101855k54370J338158
38098h95323K355739J324541p10282j518914q82616k73055q4912M90192J249250
38089A054620J002459j45110o52730Q51N73266K42578j37096K97053Q29273K25007
38079C290171j354458k374517j720301l9574Q67016J09058j068665p76830Q95866
$$ plain form
38142 -1775933 -996227 -2030343 -2495277 -1314689 -186116 -134880 182649 1616246 2661257
38133 2661257 1985404 677526 295087 402965 -124155 -734563 -188227 891923 531421
38124 531421 -1616444 -3460113 -3025888 -829343 753758 94783 -1928106 -2836622 -1404475
38115 -1404475 773988 1390933 708844 1114622 3232967 4622295 3466264 1565188 1728157
38106 1728157 3610927 4436892 3035494 815983 -877256 -1979111 -2233481 -895323
38098 -895323 1460416 2784957 2074675 555761 -326855 -599910 -684822 -194630 1054620
38089 1054620 2057079 1911969 1259239 1260090 1833356 2075934 1938838 2235891 3065164 3290171
38079 3290171 1935713 -438804 -2159105 -2198679 -1331663 -1222605 -2291270 -3068100 -2172234
38070b172234J913592J225183J49484O991j0928j142700k552623k394252o01921
38061e579408J141078J703606J241889K27104p12681n67504Q57783K034939J455536
38052A802342l18770j665027k020287j579703k15246J467380J521322n36370j834141
38043c378500Q1431K993052K929265K05027j354811n63050O4356o21869p24465
38034c69564N66646J308768M35189o00049q04168p35965r449K234153L785502
38025E811063J200439l651885m409960K52046L709485J270355k779058k543767
38017a141282L07968N20409j670353j904774M08367J854648J240940M55145R7070
38008A68138o93604r93975N14804J933520O90136j429796q24070J468375J389510
$$ plain form
38070 -2172234 -258642 966541 1116025 1123016 1112088 -30612 -2583235 -4977487 -5579408
38061 -5579408 -4438330 -2734724 -1492835 -1265731 -1978412 -2545916 -1688133 346806 1802342
38052 1802342 1483572 -181455 -2201742 -3781445 -3996691 -2529311 -1007989 -1544359 -3378500
38043 -3378500 -3297069 -304017 2625248 2830275 1475464 912414 976770 354901 -369564
38034 -369564 197082 1505850 1941039 1340990 536822 -199143 -208592 2025561 5811063
38025 5811063 7011502 3359617 -1050343 -798297 2911188 4181543 1402485 -1141282
38017 -1141282 -833314 -312905 -1983258 -3888032 -3479665 -1625017 -384077 71068 168138
38008 168138 -525466 -1519441 -1004637 928883 1619019 189223 -634847 833528 2223038
37999B223038p83707p50502K049582L133489M78036k416379k597737j544225j021718
37990a230123J1205J957195K417034J89147k108305j887510q1022J154515J306320
37981A728456N22616j164491k276593q47023J820068K008366n21236j691857J84452
37972b37242J575500R0108j231176L88767J987433j95084l804292l774336m28256
37963e628578J299750k17566j397417K10526K212270J542651p96093j333877R18003
37954c190331L058135K077128r59370j972105M46661K508358O11812k703489k210852
37945b334053J520055K442928j367161m203977j474231L242535L885456N88843
37937B300395j942165j758359o48993J66834Q43625P34616o19340j410665O126
$$ plain form
37999 2223038 1439331 688829 2738411 5871900 6349936 3933557 1335820 -208405 -1230123
37990 -1230123 -1218918 738277 3155311 3344458 1236153 -651357 -732379 422136 1728456
37981 1728456 2251072 1086581 -1190012 -2037035 -216967 1791399 1270163 -421694 -237242
37972 -237242 1338258 1428366 197190 585957 2573390 2378306 -1425986 -5200322 -5628578
37963 -5628578 -4328828 -4546394 -5943811 -5733285 -3521015 -1978364 -2774457 -4108334 -3190331
37954 -3190331 -132196 1944932 985562 -986543 -539882 1968476 2580288 -123201 -2334053
37945 -2334053 -813998 1628930 261769 -3942208 -5416439 -2173904 1711552 2300395
37937 2300395 358230 -1400129 -2049122 -1882288 -1038663 -304047 -923387 -2334052 -2327926
37928b327926J806471J263500o35871p50667J079151K115842J240634q4874q64013
37919B842247j332322j136002J89790J352713P89591n18967n28749K89352j29579
37910A818074j549373j659172m221J307005R53998o8824m59148j39859K48867
37901D47347L1551q25146r51246Q85851K746193J046723l300920m338828L46130
37892c912345M856224L305974j253360k136731L00199N55393j797393k002263
37884b084302M46510O94895k209286k960921Q52486M424439L584818P24197m65438
37875C007398n67400j214655j312951j46977J84975j086267j096514J393557K785964
37866A947130M72692k310816j674913O89339J032671n6034K60820J241127M2932
$$ plain form
37928 -2327926 -521455 742045 106174 -644493 434658 2550500 3791134 3706260 2842247
37919 2842247 1509925 373923 563713 1916426 2706017 2187050 1658301 1947653 1818074
37910 1818074 268701 -1390471 -1394692 -87687 866311 797487 338339 198480 447347
37901 447347 478898 -346248 -1297494 -411643 2334550 3381273 80353 -4258475 -3912345
37892 -3912345 943879 4249853 2996493 859762 1159961 1715354 -82039 -2084302
37884 -2084302 -1637792 -942897 -3152183 -6113104 -5260618 -836179 2748639 3472836 3007398
37875 3007398 2439998 1225343 -87608 -234585 -49610 -1135877 -2232391 -838834 1947130
37866 1947130 2419822 109006 -1565907 -876568 156103 100069 360889 1602016 1644948
37857A644948k600197l119378p98640J440973J590430M89461m38935o09358N7041
37848b343655O85954k64807k285038k187944J361208M823736M340346J255775
37840E385575m26725j99291n04452j456348q63924Q57377N89237j996463l173225
37831a788239q75672J943117J732511o40560j707636m63210Q76799N47716m72961
37822h48135l07251R51924J365373P1012j163913l52971J573926J816314l06674
37813B799605k432858k481685q47819J098156K409721K004194n57407k951956
37805i60049j912858J612600K700743l08917k800305r57887K192236J893375p16636
37796G42302j209647M51456N74102j274527j780247j51404O31908n83859j271025
$$ plain form
37857 1644948 -955249 -4074627 -4873267 -3432294 -1841864 -1352403 -1791338 -2400696 -2343655
37848 -2343655 -1657701 -1922508 -4207546 -6395490 -5034282 -210546 4129800 5385575
37840 5385575 4958850 4759559 4255107 2798759 1934835 2792212 3381449 1384986 -1788239
37831 -1788239 -2663911 -720794 1011717 371157 -1336479 -1799689 -922890 -375174 -848135
37822 -848135 -1155386 -203462 1161911 1232923 69010 -283961 1289965 3106279 2799605
37813 2799605 366747 -2114938 -2962757 -1864601 545120 2549314 1991907 -960049
37805 -960049 -2872907 -1260307 1440436 1131519 -1668786 -2626673 -434437 1458938 742302
37796 742302 -467345 -15889 558213 -716314 -2496561 -2647965 -2016057 -2599916 -3870941
37787c870941l5991J185283J059309Q90324J269670N75429j441873k154876j79290
37778b702956K058473J932492J93484r50488r67886m67148L23991R72507O80178
37769A072647j28018j13502L53166m66362j990317j384473J356564K252852m89802
37760D62755k984156j503711J619990J902921k62775j048797K22105Q12211M0474
37751g38983J90372J796342K374191P04685j247657j690317j120931k34765J118580
37742A151517J938314L93323k490615k917233n2166J807730l72013l025480j045809
37733d612432M041128N811594K197948j891423k042493j4048J81202j571578k311270
37724b11372r76765N67660P49065k798o25376o21320P9983R92167R70769m10542
$$ plain form
37787 -3870941 -3906932 -2721649 -1662340 -772016 497654 1073083 -368790 -2523666 -2702956
37778 -2702956 -644483 1288009 1481493 531005 -436881 -904029 -580038 392469 1072647
37769 1072647 944629 831127 1184293 717931 -1272386 -2656859 -1300295 952557 462755
37760 462755 -2521401 -4025112 -2405122 -502201 -764976 -1813773 -1591668 -779457 -738983
37751 -738983 -548611 1247731 3621922 4326607 3078950 1388633 267702 32937 1151517
37742 1151517 3089831 3483154 992539 -1924694 -1976860 -169130 -541143 -3566623 -4612432
37733 -4612432 -571304 5240290 7438238 5546815 3504322 3490274 3671476 2099898 -211372
37724 -211372 -1188137 -620477 128588 125790 -499586 -1120906 -1040923 -48756 922013 511471
37714E11471j697793j233925L27649Q55397j04227q83676n00266J06030J20959
37705b498381J59622O65086Q18867J78463k27965K25343L09633r75282k122406
37696c467020r88333J689364K789196R23963j709665k167757k02992J892961K159722
37687I19439Q24956n69184j109037r76790k77421J351715L253184L179279J2184
37678F608325l611530l782695n40691J934231J065199q83059p77547P74825J102039
37669A889097k43340j558178j991076j788729o14480J586485K855163J343182
37661A478124j278375j661277Q3155N10440j398876k306700K4772K674368J754608
37652a19761j549101k525581K38240K886220J814324j389774k307612K58424K844806
$$ plain form
37714 511471 -1186322 -2420247 -2092598 -1237201 -1341428 -2225104 -2725370 -2619340 -2498381
37705 -2498381 -2338759 -1673673 -854806 -676343 -904308 -678965 -369332 -1344614 -3467020
37696 -3467020 -4455353 -2765989 23207 947170 -762495 -2930252 -3133244 -1240283 919439
37687 919439 1744395 1175211 66174 -910616 -1188037 163678 3416862 6596141 6608325
37678 6608325 2996795 -785900 -1326591 607640 1672839 789780 12233 787058 1889097
37669 1889097 1645757 87579 -1903497 -3692226 -4306706 -2720221 134942 1478124
37661 1478124 199749 -1461528 -1378373 -867933 -2266809 -4573509 -4548737 -1874369 -119761
37652 -119761 -1668862 -4194443 -3956203 -1069983 744341 -645433 -2953045 -2694621 150185
37643A50185K195526m23746j362551J14435J144697l0734j427510p43980R33719
37634E50041J134206M7223j93435O68499Q56715l1929l64201M60944R05861l9377
37624C994547j324524j765077j535456j029871j41188O56467M45210k97677j09987
37615a107556N99696l05816k646884l009559J37839L210462K290614j008105k002367
37606c841676L3517J314988p2026j286517L98523L080140L017810J11364k060921
37597F95202j165101J166400J939956N60720j002051j106357l35425k77661j170749
37588f95066j592998n20134J092919J405963O9462j257722r54794N85662J543673
37579c23035R69617j78608m40370L27519J045439R43522K95759k82716n60946
$$ plain form
37643 150185 2345711 1921965 559414 673849 1818546 1787812 360302 -383678 550041
37634 550041 1684247 1731470 1538035 2206534 3063249 3031320 2667119 3128063 4033924 3994547
37624 3994547 2670023 904946 -630510 -1660381 -1801569 -1145102 -699892 -997569 -1107556
37615 -1107556 -507860 -813676 -3460560 -6470119 -6332280 -3121818 -831204 -1839309 -3841676
37606 -3841676 -3808159 -2493171 -2565197 -3851714 -3453191 -373051 2644759 2756123 695202
37597 695202 -469899 696501 2636457 3197177 2195126 1088769 753344 475683 -695066
37588 -695066 -2288064 -2808198 -1715279 -309316 -239854 -1497576 -2452370 -1866708 -323035
37579 -323035 646582 467974 27604 355123 1400562 2344084 2639843 2357127 1796181
37570A796181o06684n68021o54962q32823o26964P3860K95506p60646j874381
37561c758934r33054J722768L045343J405596r14119r57022P78808J493757K44355
37552B127498j286109j590273q40371J49759P39140N05625r9111K41688J614486
37543A562332J889406k45009k529939k013396L62992J176315j29883q72055k2779
37534h22016L65657o71345j176878O414J040562M01728n35046j91574M60107j01188
37524a223579j264118j483606m50693J261038K832153K639590l22767l524353
37516a536335k760309J529825L629008N73623l214634k638482O74023K037902
37508a705379J293764J342836J707103k86400l208323k761613P90650K485022
$$ plain form
37570 1796181 1189497 621476 -33486 -866309 -1493273 -1419413 -1123907 -1884553 -3758934
37561 -3758934 -4691988 -2969220 76123 1481719 567600 -389422 389386 1883143 2127498
37552 2127498 841389 -748884 -1589255 -1439496 -700356 -194731 -293842 -52154 1562332
37543 1562332 3451738 3206729 676790 -1336606 -973614 202701 72818 -799237 -822016
37534 -822016 -456359 -1127704 -2304582 -2298168 -1257606 -855878 -1390924 -1582498 -1122391 -1223579
37524 -1223579 -2487697 -3971303 -4421996 -3160958 -328805 2310785 1988018 -1536335
37516 -1536335 -4296644 -2766819 862189 1435812 -1778822 -4417304 -3743281 -1705379
37508 -1705379 -411615 931221 2638324 2351924 -856399 -3618012 -2827362 -342340
37500c42340O36477q66421L54610J469651J62607j147723j927J553614P81464
37491B600012r16747q40782J88537j55761j090380k57061J590837J528769o10740
37482B036684k034259j555963q91389j074095p90050P85642K116464J626511J06232
37473C25777n50268P8047P56414M62434l59755m29770O34362J482464O23595j197500
37463A825800j611082j12603R14995p0760j082735J38578K005026J365593j225085
37454B147727k276550j110190o96477k042225k068307R10619L506373K193385
37446E64355j077619j965483l49579L30972p62581q43602J193923K597387J160676
37437H48449j469338k574193j891806o31615Q17736K259302K573008J282521j20980
$$ plain form
37500 -342340 294137 -572284 -217674 1251977 1414584 266861 264934 1818548 2600012
37491 2600012 1683265 842483 1031020 875259 -215121 -472182 1118655 2647424 2036684
37482 2036684 2425 -1553538 -2444927 -3519022 -4309072 -3523430 -1406966 219545 325777
37473 325777 -224491 -146444 609970 1072404 712649 282879 917241 2399705 3023300 1825800
37463 1825800 214718 102115 1017110 946350 -136385 2193 2007219 3372812 2147727
37454 2147727 -128823 -1239013 -1935490 -3977715 -6046022 -5135403 -1629030 564355
37446 564355 -513264 -2478747 -2828326 -2497354 -3259935 -4103537 -2909614 -312227 848449
37437 848449 -620889 -3195082 -5086888 -5718503 -4900767 -2641465 -68457 1214064 1093084
37428A093084l12642k73733j293931k184876j027749J207109J722809L53083j31076
37419h47922J284194J941656j66413k751434k311870P23955K648117J652897k95314
37410A877866r55495o71968o61361n20232O20434J643462N59618k021030k911624
37401c040330p34444J727263J240091j266468k099258j51610J795114J393443
37393a136199k40627r41881p23630q28575j145295o24246O28252J541820J779575
37384a690806J638021R25967l63138r59507J42195J567167J141430o98472j413186
37375B89671k82412O90388K14798n17086m08205l35132j063925j497997p73860
37366c683760k19531j132566k115734j033931J354325K321771J376838Q71359
$$ plain form
37428 1093084 780442 506709 -787222 -2972098 -3999847 -2792738 -1069929 -716846 -847922
37419 -847922 436272 2377928 2211515 -539919 -2851789 -2127834 520283 2173180 1877866
37410 1877866 922371 250403 -410958 -931190 -310756 1332706 1892324 -128706 -3040330
37401 -3040330 -3774774 -2047511 -807420 -2073888 -4173146 -4324756 -2529642 -1136199
37393 -1136199 -1376826 -2318707 -3042337 -3870912 -5016207 -5640453 -5012201 -3470381 -1690806
37384 -1690806 -52785 873182 510044 -449463 -307268 1259899 2401329 1702857 289671
37375 289671 7259 697647 912445 395359 -12846 -347978 -1411903 -2909900 -3683760
37366 -3683760 -3903291 -5035857 -7151591 -8185522 -6831197 -4509426 -3132588 -2261229
37358b261229J961716K479376L09041k807530l039131K96699L352811K509962
37350B801715q94941k352679k72156J948285Q18832k288522l141996n22870K411149
37341a493183K547799L03423j776112j931413o6686K488665L349562R70364k880416
37332A512003m188342j360484K619967L833146J818696q71542k124313j775212
37324e36081o90017J59500K13585j35068n4272L09511K9434p14701o37150K49157
37314a806102L23971o84453q64243M43487J072954j68544r68052N06686J819353
37305c24943J17196k411831j410221K472641M071923J375824j862195k066982
37297c8588l01444P48087P24755N18703j2281j053490j508589n88851O75916R70860
$$ plain form
37358 -2261229 -299513 2179863 2488904 -318626 -3357757 -3061058 291753 2801715
37350 2801715 1906774 -445905 -718061 1230224 2049056 -239466 -3381462 -3904332 -1493183
37341 -1493183 1054616 1358039 -418073 -2349486 -2416172 72493 3422055 4392419 1512003
37332 1512003 -2676339 -4036823 -1416856 2416290 4234986 3363444 1239131 -536081
37324 -536081 -1226098 -1066598 -853013 -988081 -1042353 -732842 -703408 -1418109 -2055259 -1806102
37314 -1806102 -1482131 -2166584 -3030827 -2587340 -1514386 -1682930 -2650982 -2144296 -324943
37305 -324943 -207747 -2619578 -4029799 -1557158 2514765 3890589 2028394 -38588
37297 -38588 -340032 408055 1132810 1651513 1639232 585742 -922847 -1511698 -835782 135078
37287A35078M92929J23862R2594L54314R48613J208147P8845j997534l031262
37278a594414k104654n61117J37859J69113K18566K23725Q5644J41479K29056
37269c054743k16184o90396n2142J212362J344034L75223K25626J064265O87273
37260H95318j267423j945320n3736J550926P71326J76869K238583L900694R60226
37251G227463m185540m972972m36101L185105J648427j646282j568727J284686
37243E36059K375013N2607k749119k866925m88374J743755J889247N57760k42235
37234H07788Q7152K856j404564k376253j110262Q63603P91702n32602K76037L239653
37224F45110M048947N78368l324752l150888J8061J667751L23020j402161j224030
$$ plain form
37287 135078 628007 751869 844463 1198777 2147390 3355537 3434382 1436848 -1594414
37278 -1594414 -3699068 -4260185 -4122326 -3953213 -3734647 -3510922 -3425278 -3283799 -3054743
37269 -3054743 -3270927 -3961323 -4013465 -2801103 -1457069 -1081846 -856220 208045 895318
37260 895318 -372105 -2317425 -2371161 -820235 -48909 127960 2366543 6267237 7227463
37251 7227463 3041923 -1931049 -2367150 817955 2466382 820100 -748627 536059
37243 536059 2911072 2963679 214560 -2652365 -3140739 -1396984 492263 1050023 807788
37234 807788 894940 897796 -506768 -2883021 -3993283 -3129680 -2337978 -2870580 -2594543 645110
37224 645110 4694057 5272425 1947673 -1203215 -1185154 482597 805617 -596544 -1820574
37215a820574L04945J418801J029496p58216k334642j477707J703947L763010
37207A829060K050502j182086j615914Q74443K181842L52806j621197p29923J524575
37198C664108J781390k54348k138084k534431k118531j351523P2143J564009J680301
37189C65034L17961r01551j048255j053550j644757j722506j69947J918115K526314
37180a413142J556190N87031K00129m17098j188225q27102N21544P69125o08071
37171h19619r99022J182045L042110J190871k403342k679187Q62155L309371J860106
37162D545488m22366k75521O99587k55893j920046j631218l55851q77380k592875
37153c086075k494899m20794R13663O79957O24854J125957O94508l58712M0004
$$ plain form
37215 -1820574 -1515629 -96828 932668 174452 -2160190 -3637897 -1933950 1829060
37207 1829060 3879562 2697476 1081562 1956005 4137847 4490653 2869456 2139533 3664108
37198 3664108 5445498 5191150 3053066 518635 -1599896 -2951419 -2879276 -1315267 365034
37189 365034 682995 -218556 -1266811 -2320361 -3965118 -5687624 -5857571 -3939456 -1413142
37180 -1413142 143048 730079 930208 513110 -675115 -1502217 -980673 -211548 -819619
37171 -819619 -1818641 -636596 2405514 3596385 1193043 -1486144 -623989 2685382 4545488
37162 4545488 4123122 3847601 4547188 4291295 2371249 740031 384180 -493200 -3086075
37153 -3086075 -5580974 -6001768 -5088105 -4408148 -3783294 -2657337 -1962829 -2321541 -2281537
37144b281537J408887P29097k074234k999653j53160K985968K847054O65305n61820
37135E65907o18190n65561J60914J727350J713560j259602l945608k534793J397730
37126c358293L134886J749109M53298O72970K93475j814330l599270l244615j532307
37117g245077L22706K340202M060751L778903J084291j732159k311260r51162
37109f52805L95102O77606L05708O097r666n5404m05147o29228o0177P42471K39278
37098E53835j466206j896522K54294K536920K049055k03007j179322p78438j325337
37089a454728k720466k175259Q38508L235074K927291J394281M63289j96863r19273
37080A391854n57851R64235J429400k78839j977251j455954K60978J021375P97779
$$ plain form
37144 -2281537 -872650 -143553 -2217787 -5217440 -5370600 -2384632 462422 1127727 565907
37135 565907 -52283 -617844 -456930 1270420 2983980 1724378 -2221230 -4756023 -3358293
37126 -3358293 -223407 1525702 1979000 2651970 2945445 1131115 -2468155 -5712770 -7245077
37117 -7245077 -6922371 -4582169 -521418 3257485 4341776 2609617 298357 -652805
37109 -652805 -257703 419903 725611 731708 722042 666638 261491 -367737 -427914 314557 553835
37098 553835 -912371 -2808893 -2554599 -17679 2031376 1828369 649047 -129391 -1454728
37089 -1454728 -4175194 -6350453 -5511945 -2276871 650420 2044701 2507990 2311127 1391854
37080 1391854 834003 1798238 3227638 2948799 971548 -484406 -223428 797947 1595726
37071A595726N89074M0407j323946k098865q98556Q85079Q47676o67360j133209
37062b163974K06727J425058J092091J74435R4364N71156M46581k95003n10293
37053A041142K67529R80046N26135n88812j093879j045808j483993j992983r22031
37044d312654J202278J374696r49174j791471J339767M425701K456120k336644
37036A408619l415011O9288K501998J054573q48611n50326j96464j419144j933622
37027c328700m36887M95921m21211m12890J586357J923338r98261k601677K75218
37018c918792L182738J351292j924633j106852J778356J032924k281032k320159
37010d206158J012041K163844j6423p66078J503280K621955P14421n76426P33708
$$ plain form
37071 1595726 2184800 2225207 901261 -1197604 -2096160 -1211081 -363405 -1030765 -2163974
37062 -2163974 -1957247 -532189 559902 734337 828701 1399857 1846438 1551435 1041142
37053 1041142 1308671 2288717 2814852 2226040 1132161 86353 -1397640 -3390623 -4312654
37044 -4312654 -3110376 -1735680 -2684854 -4476325 -3136558 1289143 3745263 1408619
37036 1408619 -2006392 -1937104 564894 1619467 770856 220530 24066 -1395078 -3328700
37027 -3328700 -3765587 -3269666 -3690877 -4103767 -2517410 -594072 -1592333 -4194010 -3918792
37018 -3918792 -736054 615238 -1309395 -2416247 -637891 395033 -1885999 -4206158
37010 -4206158 -3194117 -1030273 -1046696 -1812774 -309494 2312461 3026882 2450456 3184164
37001C184164J275504j148057l145626j392237J917528K761835Q84498j268379
36993C069230k273983k015389p71137K92617R4094j42918J459124L376970K192298
36984E280906j423333k846240o52244J285193M52221o61144J08159O84973p25858
36975A502633j834216n61981R59935M74533j36483J233554K259711O0156l108226
36966H49616k928045J57907J941501R48514n55887j222041j898917k427901j185197
36957f320450J557080K964004J285357j870723l500566k108785J295889L942309
36949b755885L488488N48090j723812j454725j22007K77401J93083Q29452J363528
36940F43613L69364j244950j380805j31420M59486k90582q76702j71957R75434
$$ plain form
37001 3184164 4459668 3311611 165985 -1226252 691276 3453111 4337609 3069230
36993 3069230 795247 -1220142 -1991279 -1698662 -1604568 -1747486 -288362 3088608 5280906
36984 5280906 3857573 1011333 359089 1644282 2096503 1435359 1543518 2228491 1502633
36975 1502633 -331583 -893564 66371 540904 404421 1637975 3897686 3957842 849616
36966 849616 -2078429 -1920522 20979 969493 413606 -808435 -2707352 -5135253 -6320450
36957 -6320450 -4763370 -1799366 -514009 -2384732 -5885298 -7994083 -6698194 -2755885
36949 -2755885 732603 1280693 -443119 -1897844 -2019851 -1742450 -1549367 -719915 643613
36940 643613 1012977 -231973 -1612778 -1744198 -1284712 -1575294 -2451996 -2623953 -1648519
36931a648519J076947j28823j410981j322226O5752R59491L06063j95782J419477
36922h78601L424110K185697j760073l463225r17184J601372L14252k047195j089664
36913b630511J758810J791044r90166k025480K26032K198436J333226l70459l66855
36904I24077O31977P22043j29238r10543j359144j346596k09435J800755K767474
36895B891370J313627j269551k385239j265571K54621J89249j042155j229200
36887b542849L58299J486235R1239k047237j341547J953437L447340J094080j599980
36878H99017j168626M57105k42365k040100j151950J825206K414525m20394k515952
36869a943534j137683J143970J156165j25851k02959N04265L805j279166j098672
$$ plain form
36931 -1648519 -571572 -700395 -2111376 -3433602 -3367850 -2408359 -2102296 -2298078 -878601
36922 -878601 2545509 4731206 2971133 -492092 -1409276 192096 506348 -1540847 -2630511
36913 -2630511 -871701 919343 -70823 -2096303 -1870271 328165 1661391 1290932 924077
36904 924077 1556054 2278097 2148859 1238316 -120828 -1467424 -1676859 123896 2891370
36895 2891370 4204997 2935446 550207 -715364 -460743 -271494 -1313649 -2542849
36887 -2542849 -2184550 -698315 -607076 -2654313 -3995860 -2042423 1404917 2498997 899017
36878 899017 -269609 187496 -54869 -2094969 -3246919 -1421713 992812 572418 -1943534
36869 -1943534 -3081217 -1937247 -781082 -906933 -1109892 -605627 -601822 -1880988 -2979660
36860b979660O93658J690052O03945q70074p22257M58049N56934q88061k102691
36851c560105j618898O6633J849537L438459M251425K613850j628809m881730
36843E30362l411328J037846K839937K90210k129030q44453J578836J202063r20182
36834A74261j160385M36755Q13385o05519j425423o87612J68414M87949R30059
36825h68116R81703m78867k128357j343309J273342K123036P1898j818860j124767
36816c312297O55047J154544O16571M79625P25038M83919k49088r12077j182661
36807a541379p25204M75654J141049r2433k048420j829783R24356K939118J737329
36798I80287r85884k063907j094043j0069K66891O03444J556807K273321J677774
$$ plain form
36860 -2979660 -2286002 -595950 7995 -862079 -1584336 -1126287 -569353 -1457414 -3560105
36851 -3560105 -5179003 -5112370 -3262833 175626 4427051 7040901 5412092 530362
36843 530362 -2880966 -1843120 996817 1287027 -842003 -1686456 -107620 1094443 174261
36834 174261 -986124 -549369 264016 -341503 -1766926 -2454538 -2286124 -1798175 -868116
36825 -868116 113587 -365280 -2493637 -3836946 -2563604 -440568 -368670 -2187530 -3312297
36816 -3312297 -2657250 -1502706 -886135 -406510 318528 802447 553359 -358718 -1541379
36807 -1541379 -2266583 -1790929 -649880 -742313 -2790733 -4620516 -3696160 -757042 980287
36798 980287 -5597 -2069504 -3163547 -3173616 -2906725 -2303281 -746474 1526847 3204621
36789C204621j18221j755192j772172q3610J686616J894024P94764p312J23443
36780C966961K10392n55353j536753j560224l32168J305736J993310Q59874j395243
36771B956532k724477j850915J94278J464349J412233Q06763J49497m33249m32127
36762A542884L06415O50698l48526j605360j374832L8970Q36232N06921N7445
36753F10847j10883l85912l57243O30956J551734P68190j037005j572714o23945
36744e25975k22383q38961n22442J267838K134431O94130p44405K62332K208377
36735C712942J821867r25420k788595j938069j55339K54850k50521K72499J728567
36726A732781J798204l81316k339451j652144L03945N15453o60443j66392K032347
$$ plain form
36789 3204621 3086400 1331208 -440964 -524574 1162042 3056066 3850830 3843518 3966961
36780 3966961 4177353 3622000 2085247 525023 192855 1498591 3491901 4351775 2956532
36771 2956532 232055 -1618860 -1424582 39767 1452000 2258763 2408260 1975011 1542884
36762 1542884 1849299 2499997 2151471 546111 -828721 -789751 46481 553402 610847
36753 610847 499964 114052 -243191 387765 1939499 2707689 1670684 97970 -525975
36744 -525975 -748358 -1587319 -2109761 -841923 1292508 1986638 1242233 1504565 3712942
36735 3712942 5534809 4609389 1820794 -117275 -272614 -17764 -268285 4214 1732781
36726 1732781 3530985 3149669 810218 -841926 -537981 -22528 -682971 -849363 1182984
36717A182984K212362o65610k335556P279K577022R23389k548205k375854J042733
36708B0544K349883n7106k263683j793006n95135k86990L36413J689713J962030
36699A362663Q07123K75819O92929k11516k586696l162385n68738K061447J979032
36690F49678O36112L56343O25684J56074l67963o3012J73524l82807o38028K00608
36680A346213J050602R61277N09101J45382m56797p21851L71054J658892Q69931
36671E733804j252523j652956k28609j1864j396816j218885J107730J956459n0020
36662B986320j512139o69276n25924k394653k374970J478286M278108J816700
36654C082452k208953k284668K19860P99757K07570J959981M402505K799491k118574
$$ plain form
36717 1182984 3395346 2729736 394180 401459 2978481 3901870 1353665 -1022189 20544
36708 20544 2370427 2313321 49638 -1743368 -2338503 -2625493 -2289080 -599367 1362663
36699 1362663 2169786 2445605 3138534 2927018 340322 -2822063 -3390801 -1329354 649678
36690 649678 1285790 1642133 2267817 2423891 2055928 1992916 2166440 1783633 1145605 1346213
36680 1346213 2396815 3358092 3867193 4012575 3555778 2833927 3204981 4863873 5733804
36671 5733804 4481281 2828325 2599716 2587852 1191036 -27849 1079881 3036340 2986320
36662 2986320 1474181 804905 278981 -2115672 -4490642 -3012356 1265752 3082452
36654 3082452 873499 -1411169 -1191309 -391552 -183982 1775999 6178504 8977995 6859421
36645F859421m754831l268459j240953q27268k48689J345336J939330P09347l77054
36636A36180j46910J42046m29108j043194j047584p61383k99838L17245M00009
36627b732537j65722q4871J023481J359356J94975j50946J619543K694885O82261
36618D440425j790588j245242P41614O10700q46721n80175N65269m06141k436167
36609i47026j916598P57032J951595J152298Q05082Q15967p53657k337298o10819
36600a083424K803075K870242o23660k811573j845063o96693n91776M87027K080988
36591E89143J132240j359762q19497K343293K298884j963435l943028m20472K869442
36582G26808Q02835k951361k619999P34010K516990J964849Q76725p61917k886216
$$ plain form
36645 6859421 2104590 -1163869 -2404822 -3232090 -3480779 -2135443 -196113 513234 136180
36636 136180 -10730 131316 -297792 -1340986 -2388570 -3149953 -3449791 -3132546 -2732537
36627 -2732537 -2898259 -2983130 -1959649 -600293 -405318 -556264 1063279 3758164 4440425
36618 4440425 2649837 1404595 2146209 2756909 1910188 1330013 1895282 1489141 -947026
36609 -947026 -2863624 -2106592 -154997 997301 1802383 2618350 1864693 -472605 -1083424
36600 -1083424 1719651 4589893 3966233 1154660 -690403 -1387096 -1978872 -1491845 589143
36591 589143 1721383 361621 -457876 1885417 4184301 2220866 -1722162 -2142634 726808
36582 726808 1529643 -1421718 -4041717 -3307707 -790717 1174132 2050857 1288940 -1597276
36573a597276k978606k91047J331302o85337k893343j519519J186507J346159
36565f101160K35297J070884K503060J356878q84231n03216J575257J385359j022129
36556c84001j932895m48743Q77678J242844K109219K855389J156850k046198k835504
36547E94639k99562J995869J381144p67177k080137k073570j122638N01366J738039
36538a32027J359990P7606j65727P41958R28381l43040j554663j287885N7739
36529c17668J134840R57278m45252j660806j013189R13585J354824o27412k192486
36520a896286q07986J817727K521818J399095O01072K47359q10707j536638o8978
36511A466476K183328J870321r74254k722949j528418N64307J324600R24423J94423
$$ plain form
36573 -1597276 -4575882 -4866929 -3535627 -4220964 -7114307 -8633826 -7447319 -6101160
36565 -6101160 -5865863 -4794979 -2291919 -935041 -1819272 -2322488 -747231 638128 -384001
36556 -384001 -2316896 -2765639 -1887961 -645117 1464102 4319491 5476341 3430143 594639
36547 594639 295077 2290946 3672090 2904913 824776 -1248794 -2371432 -1870066 -132027
36538 -132027 1227963 1305569 1139842 1881800 2810181 2467141 912478 -375407 -317668
36529 -317668 817172 1774450 1329198 -331608 -1344797 -431212 923612 296200 -1896286
36520 -1896286 -2704272 -886545 1635273 3034368 3635440 3882799 3072092 1535454 1466476
36511 1466476 3649804 5520125 4545871 1822922 294504 858811 2183411 3107834 3302257
36502C302257p65161j460081r98030J43865N03622M1848k6979K03261n63295k003133
36492a621826k025802P4981K487185L257501J999907n90475k956158k934407j47196
36483b456290K440905J944415j71044k41290J891018K927878J558778j03178p29004
36474G062188j345086k042429j230410P02627J012163o51351j087650J039008
36466C459060K594611J104469j285272j739220j103657j169563q43050J211276
36458B228654K853669J558354q43565q21100R74448J004031q87510j295268O14872
36449E386585J589342j0228j418450m48170N89919r93538l113208j788020K196485
36440A990717L654789L62887l542417l219997L92805K361447P24539j404911r37928
$$ plain form
36502 3302257 2537096 1077015 78985 222850 726472 768320 741341 944602 381307 -1621826
36492 -1621826 -3647628 -3572647 -1085462 2172039 4171946 3581471 625313 -2309094 -2456290
36483 -2456290 -15385 1929030 1757986 1516696 3407714 6335592 7894370 7791192 7062188
36474 7062188 5717102 3674673 2444263 3146890 4159053 3507702 2420052 3459060
36466 3459060 6053671 7158140 5872868 4133648 3029991 1860428 1017378 2228654
36458 2228654 5082323 6640677 5797112 4976012 5950460 6954491 6066981 4771713 5386585
36449 5386585 6975927 6965699 5547249 5099079 5688998 4695460 1582252 -205768 1990717
36440 1990717 5645506 6008393 2465976 -754021 -361216 2000231 2724770 1319859 381931
36431C81931Q89017J012503n81231j069650O11814J972229N42202k568025m083451
36422b892661k670434k16802Q84049N52196N16627J521603K088771O21081j937338
36413a532908k833843j033171J353855J886077P73895j36469k83925o15916j414949
36404c837354j698477q85099L37277J051629J011175M49385j18213o1497N08405
36395c242769M77816n99078j241870j3075J842857J784411j51492j147692K83990
36386b006902K173649K014161K5095j665229j773461p01282L88769M77964n03763
36377a570999j266220m99092J121556J580881M64834m50136j31168J62744o28205
36368a215805j314218n88586M91170K92462m16134K22512J630827J383143p01147
$$ plain form
36431 381931 1270948 2283451 1702220 632570 1244384 3216613 3758815 1190790 -2892661
36422 -2892661 -5563095 -5779897 -4895848 -4343652 -3827025 -2305422 -216651 404430 -1532908
36413 -1532908 -4366751 -5399922 -4046067 -2159990 -1386095 -1522564 -1806489 -2422405 -3837354
36404 -3837354 -5535831 -6420930 -6083653 -5032024 -4020849 -3571464 -3689677 -3751174 -3242769
36395 -3242769 -2764953 -3364031 -4605901 -4618976 -2776119 -991708 -1143200 -2290892 -2006902
36386 -2006902 166747 2180908 2206003 540774 -1232687 -1933969 -1545200 -1067236 -1570999
36377 -1570999 -2837219 -3336311 -2214755 -633874 -169040 -619176 -750344 -587600 -1215805
36368 -1215805 -2530023 -3118609 -2627439 -2334977 -2751111 -2528599 -897772 485371 -215776
36359b15776j890599p75001M53288m16456j881289j017539J718370K889038J182855
36350D6891p63642n54977N79325M01881m98577j45753R55219O15954q64810q35209
36340a063698R81339J439014r97289l434363k827141k55461J521493K216616K817823
36331C98333K540393M53823j548046j112625M45641J59077j459553j427883J96208
36322a354632M17124j012673q94945J440664K345314K4197k004411n47125J932836
$$ plain form
36359 -215776 -2106375 -2881376 -2428088 -2844544 -4725833 -5743372 -4025002 -1135964 46891
36350 46891 -716751 -1271728 -692403 -290522 -789099 -934852 20367 636321 -228489 -1063698
36340 -1063698 -82359 1356655 359366 -3074997 -5902138 -6157599 -4636106 -2419490 398333
36331 398333 2938726 3392549 1844503 731878 1177519 1336596 -122957 -1550840 -1354632
36322 -1354632 -937508 -1950181 -2845126 -1404462 940852 965049 -1039362 -1586487 346349
$$ [...]
##END NTUPLES=NMR SPECTRUM
##END=
