##TITLE=31Pdec_3PEPA0107
 , 24 sc
 2.07.2021
##JCAMPDX= 6.0         $$ Bruker NMR JCAMP-DX V2.0
##DATA TYPE= NMR SPECTRUM
##DATA CLASS= NTUPLES
##ORIGIN= UXNMR, Bruker Analytische Messtechnik GmbH
##OWNER= root
$$ XWIN-NMR		Version 3.5
$$ Fri Jul  2 08:54:01 2021 Russian Standard Time (UT+4h)  she@DPX200
##.OBSERVE FREQUENCY= 81.013821
##.OBSERVE NUCLEUS= ^31P
##.ACQUISITION MODE= SIMULTANEOUS
##.ACQUISITION SCHEME= undefined
##.AVERAGES= 24
##.DIGITISER RES= 16
##SPECTROMETER/DATA SYSTEM= spect
##.PULSE SEQUENCE= zgpg30
##.SOLVENT NAME= CDCl3
##.SHIFT REFERENCE= (INTERNAL, CDCl3, 0, 248.564)
##AUDIT TRAIL= $$ (NUMBER, WHEN, WHO, WHERE, WHAT)
$$ ##TITLE= Audit trail, XWIN-NMR		Version 3.5
$$ ##JCAMPDX= 5.01
$$ ##ORIGIN= Bruker BioSpin GmbH
$$ ##OWNER= she
$$ F:/spectra/data/she/nmr/P31/1/pdata/1/auditp.txt
$$ ##AUDIT TRAIL=  $$ (NUMBER, WHEN, WHO, WHERE, WHAT)
(   1,<2021-07-02 08:52:14.17 +0400>,<she>,<DPX200>,
      <created by zg, POWCHK disabled, PULCHK disabled
       configuration hash MD5:
       00 E9 B6 7A A2 85 ED C7 34 08 36 98 17 FE 4E 26
       data hash MD5: 32K
       32 76 A6 3B 9A 26 12 33 75 3C 7A D3 2E 49 30 B3>)
(   2,<2021-07-02 08:52:54.10 +0400>,<she>,<DPX200>,
      <Start of raw data processing
       efp BC_mod = 2 LB = 1 FT_mod = 6 PKNL = 1 PHC0 = -7431.035 PHC1 = 192.2861 SI = 64K 
       data hash MD5: 64K
       04 8F 96 45 20 39 AC 3D 32 7D 39 8E 86 31 3E E4>)
(   3,<2021-07-02 08:53:23.62 +0400>,<she>,<DPX200>,
      <pk PHC0 = 48.81891 PHC1 = -130 
       data hash MD5: 64K
       42 24 29 83 85 26 C3 10 99 3A 04 E4 87 2E AE 6D>)
(   4,<2021-07-02 08:53:26.76 +0400>,<she>,<DPX200>,
      <abs ABSG = 5 
       data hash MD5: 64K
       A2 30 C6 8E 1C 95 CF 43 72 6E BB 0C 35 E8 76 42>)
$$ ##END=
$$ 
$$ hash MD5
$$ 48 FA D4 E5 18 30 42 D2 FB F7 A8 37 90 33 90 EC
##$RELAX= 
##$RELAX= 
##$RELAX= 
##$RELAX= 
##$RELAX= 
##$RELAX= 
##$RELAX= 
##$RELAX= 
$$ Bruker specific parameters
$$ --------------------------
##$DU= <F:/spectra>
##$EXPNO= 1
##$NAME= <P31>
##$PROCNO= 1
##$TYPE= <nmr>
##$USER= <she>
##$AMP= (0..31)
100 100 100 100 100 100 100 100 100 100 100 100 100 100 100 100 100 100 
100 100 100 100 100 100 100 100 100 100 100 100 100 100 
##$AQSEQ= 0
##$AQ_mod= 1
##$AUNM= <au_zg>
##$AUTOPOS= <>
##$BF1= 81.014009
##$BF2= 200.13
##$BF3= 200.13
##$BF4= 200.13
##$BF5= 200.13
##$BF6= 200.13
##$BF7= 200.13
##$BF8= 200.13
##$BYTORDA= 1
##$CFDGTYP= 0
##$CFRGTYP= 5
##$CHEMSTR= <none>
##$CNST= (0..31)
1 1 145 1 1 1 1 1 1 1 1 1 1 1 1 1 1 1 1 1 1 1 1 1 1 1 1 1 1 1 1 1 
##$CPDPRG= <waltz16>
##$CPDPRG1= <>
##$CPDPRG2= <waltz16>
##$CPDPRG3= <>
##$CPDPRG4= <mlev>
##$CPDPRG5= <mlev>
##$CPDPRG6= <mlev>
##$CPDPRG7= <mlev>
##$CPDPRG8= <mlev>
##$CPDPRGB= <>
##$CPDPRGT= <>
##$D= (0..31)
0 1 0 0 0 0 0 0 0 0 0 0.03 2e-05 3e-06 0 0 0 0 0 0 0 0 0 0 0 0 0 0 0 0 
0 0 
##$DATE= 1625201533
##$DBL= (0..7)
120 120 120 11 120 120 24 19 
##$DBP= (0..7)
150 150 150 150 150 150 150 150 
##$DBP07= 0
##$DBPNAM0= <>
##$DBPNAM1= <>
##$DBPNAM2= <>
$$ [...]
##$SUBNAM3= <"">
##$SUBNAM4= <"">
##$SUBNAM5= <"">
##$SUBNAM6= <"">
##$SUBNAM7= <"">
##$SUBNAM8= <"">
##$SUBNAM9= <"">
##$SW= 501.771253377433
##$SWIBOX= (0..15)
0 1 3 0 0 0 0 0 0 0 0 0 0 0 0 0 
##$SW_h= 40650.406504065
##$TD= 32768
##$TD0= 1
##$TE= 0
##$TE2= 300
##$TE3= 300
##$TEG= 300
##$TL= (0..7)
0 120 53 12 22 120 120 120 
##$TP= (0..7)
150 150 150 150 150 150 150 150 
##$TP07= 0
##$TPNAME0= <>
##$TPNAME1= <>
##$TPNAME2= <>
##$TPNAME3= <>
##$TPNAME4= <>
##$TPNAME5= <>
##$TPNAME6= <>
##$TPNAME7= <>
##$TPOAL= (0..7)
0.5 0.5 0.5 0.5 0.5 0.5 0.5 0.5 
##$TPOFFS= (0..7)
0 0 0 0 0 0 0 0 
##$TUNHIN= 0
##$TUNHOUT= 0
##$TUNXOUT= 0
##$USERA1= <user>
##$USERA2= <user>
##$USERA3= <user>
##$USERA4= <user>
##$USERA5= <user>
##$V9= 5
##$VALIST= <valist>
##$VCLIST= <CCCCCCCCCCCCCCC>
##$VD= 0
##$VDLIST= <DDDDDDDDDDDDDDD>
##$VPLIST= <PPPPPPPPPPPPPPP>
##$VTLIST= <TTTTTTTTTTTTTTT>
##$WBST= 1024
##$WBSW= 4
##$XGAIN= (0..3)
0 0 0 0 
##$XL= 0
##$YL= 0
##$YMAX_a= 6805
##$YMIN_a= -7749
##$ZGOPTNS= <>
##$ZL1= 120
##$ZL2= 120
##$ZL3= 120
##$ZL4= 120
##$ABSF1= 248.5645
##$ABSF2= -253.2056
##$ABSG= 5
##$ABSL= 3
##$ALPHA= 0
##$AQORDER= 0
##$ASSFAC= 0
##$ASSFACI= 0
##$ASSFACX= 0
##$ASSWID= 0
##$AUNMP= <proc_1d>
##$AZFE= 0.1
##$AZFW= 0.5
##$BCFW= 0
##$BC_mod= 2
##$BYTORDP= 0
##$COROFFS= 0
##$CY= -3
##$DATMOD= 1
##$DC= 0
##$DFILT= <>
##$DTYPP= 0
##$F1P= 0
##$F2P= 0
##$FCOR= 1
##$FTSIZE= 65536
##$FT_mod= 6
##$GAMMA= 0
##$GB= 0
##$INTBC= 1
##$INTSCL= 5.30512e-09
##$ISEN= 30
##$LB= 1
##$LEV0= 0
##$LPBIN= 0
##$MAXI= 10000
##$MC2= 0
##$MEAN= 0
##$ME_mod= 0
##$MI= 50
##$NCOEF= 0
##$NC_proc= -6
##$NLEV= 6
##$NOISF1= 182.463
##$NOISF2= 159.3651
##$NSP= 0
##$NTH_PI= 0
##$NZP= 0
##$OFFSET= 248.5645
##$PC= 4
##$PHC0= -7382.216
##$PHC1= 62.2861
##$PH_mod= 1
##$PKNL= yes
##$PPARMOD= 0
##$PSCAL= 0
##$PSIGN= 0
##$REVERSE= no
##$SF= 81.014009
##$SI= 65536
##$SIGF1= 159.3651
##$SIGF2= -187.1042
##$SINO= 113.3802
##$SIOLD= 16384
##$SREGLST= <1H.CDCl3>
##$SSB= 0
##$STSI= 65536
##$STSR= 0
##$SW_p= 40650.406504065
##$SYMM= 0
##$S_DEV= 0
##$TDeff= 32768
##$TDoff= 0
##$TI= <>
##$TILT= no
##$TM1= 0
##$TM2= 0
##$TOPLEV= 0
##$USERP1= <user>
##$USERP2= <user>
##$USERP3= <user>
##$USERP4= <user>
##$USERP5= <user>
##$WDW= 1
##$XDIM= 65536
##$YMAX_p= 364773938
##$YMIN_p= -16308012
$$ End of Bruker specific parameters
$$ ---------------------------------
##NTUPLES= NMR SPECTRUM
##VAR_NAME=  FREQUENCY,     SPECTRUM/REAL,   SPECTRUM/IMAG
##SYMBOL=    X,             R,               I
##VAR_TYPE=  INDEPENDENT,   DEPENDENT,       DEPENDENT
##VAR_FORM=  AFFN,          ASDF,            ASDF
##VAR_DIM=   65536,         65536,           65536
##UNITS=     HZ,            ARBITRARY UNITS, ARBITRARY UNITS
##FACTOR=    0.620285442955139, 1,           1
##FIRST=     20137.2065510759, 0,            0
##LAST=      -20513.1999529892, 0,           0
##MIN=       -20513.1999529892, -16308012,   0
##MAX=       20137.2065510759, 364773938,    0
$$ Real data points
##PAGE= N=1
##DATA TABLE= (X++(R..R)), XYDATA
$$ [...]
47025 -161308 -1000328 -1612511 -1005567 354141 1134422 956806 509830 13612 -1041425
47016 -1041425 -2443883 -2956084 -2023995 -675658 -74670 -128126 -201124 -321968 -828440
47007 -828440 -1443261 -1563336 -1140649 -635770 -357690 -310216 -382386 -325248 56358 350841
46997 350841 -263219 -1772958 -2858499 -2373194 -914348 -162788 -849324 -2066881 -2515820
46988 -2515820 -1806129 -522406 465296 683189 426163 447361 985092 1280727 500836
46979 500836 -1042494 -2158655 -2182277 -1490595 -619405 405376 1592804 2469947 2493459
46970 2493459 1651815 371871 -833717 -1418085 -1016921 -31781 450580 -149909 -1135558
46961 -1135558 -1468886 -1081658 -582172 -81995 706890 1405257 1182997 198335 -354534
46952 -354534 -40388 136277 -528143 -1213069 -1068390 -817962 -1490364 -2393233 -2056494 -748029
46942 -748029 -157136 -579604 -420756 954976 1798622 549070 -1644570 -2465738 -1579576
46933 -1579576 -690663 -890725 -1445674 -1308209 -648239 -394020 -860739 -1349039 -1067951
46924 -1067951 -248355 -10435 -838663 -1603564 -911029 796704 1683429 1160040 612116
46915 612116 943498 998404 -424836 -2370685 -3093608 -2629498 -2288771 -2282969 -1706122 -551763
46905 -551763 87961 -135225 -386342 -175748 110563 301208 618170 648171 -363425 -1952805
46895 -1952805 -2656207 -2104675 -1439794 -1323386 -1126538 -562361 -416658 -918396 -1050435
46886 -1050435 -418747 -177155 -937936 -1354946 -261144 1166931 1100653 -153541 -874837
46877 -874837 -650189 -504535 -796188 -832964 -409548 -42669 285797 1050122 1823769 1572877
46867 1572877 500770 91097 921631 1780933 1457900 244537 -845970 -1309563 -1123367
46858 -1123367 -470422 68754 -6164 -130644 707501 2032329 2023773 327262 -860677
46849 -860677 186020 1984351 1925411 174702 -675461 422443 1626007 1275599 211711
46840 211711 -75134 88948 -432021 -1192107 -684899 1079465 2322949 2028903 1148126
46831 1148126 754082 479071 -232678 -578054 401304 1790496 1724993 238613 -554332
46822 -554332 452411 1729070 1518513 466447 360122 1153124 1112172 -252160 -1264101
46813 -1264101 -589252 859264 1415919 921841 381511 192890 43437 145093 1128508
46804 1128508 2617390 3202081 2298135 1022321 619827 888869 929661 693986 753771
46795 753771 1009054 817379 257128 45512 109532 -458134 -1590884 -1745556 -141138
46786 -141138 1610008 1451111 -222036 -1142099 -376736 685986 760817 442789 770171
46777 770171 1276187 663733 -1206054 -3069612 -3729285 -2965455 -1253330 623073 1797761
46768 1797761 1901539 1439121 1081968 727214 -134606 -1265704 -1698352 -1035499 -21985
46759 -21985 476005 491070 583090 895950 1043527 707348 -39187 -893835 -1525633 -1690487
46749 -1690487 -1393744 -918304 -522596 -128180 555292 1579753 2512439 2692518 1809356
46740 1809356 315074 -808010 -892057 -230290 294699 241960 1016 55449 237695 80933
46730 80933 -329111 -377897 205220 994148 1504757 1686256 1541397 823563 -376404 -1181332
46720 -1181332 -785312 427935 1336018 1531846 1521269 1494137 915184 -345948 -1462726
46711 -1462726 -1807411 -1807172 -1947649 -1753126 -706494 483896 692979 99910 -33824 817194
46701 817194 1839788 2055836 1267069 -44953 -992606 -766111 285323 545706 -771177
46692 -771177 -2038170 -1309554 520407 770219 -904002 -1914878 -817968 604252 559326
46683 559326 99399 857419 1956510 1613713 480795 759407 2608922 3867362 3208828
46674 3208828 1512325 89842 -590758 -359432 703122 1569275 1106591 -186189 -740912
46665 -740912 -284963 -62122 -570524 -832526 -323613 68849 -356409 -1075454 -1577435 -2193662
46655 -2193662 -2927567 -2866366 -1697918 -587573 -556249 -1053617 -1089704 -734159 -491034 -224823
46645 -224823 135341 -247674 -1935080 -3862530 -4520928 -4030122 -3710787 -3876055 -3448010
46636 -3448010 -1871569 -171039 382928 -129697 -581880 -335076 43822 -323601 -1276156
46627 -1276156 -1609150 -692722 399169 178437 -1062195 -1464690 -189153 1413895 1738405
46618 1738405 903098 16993 -510395 -886175 -955350 -499992 -60787 -345297 -1053271 -1223750
46608 -1223750 -567285 330492 894632 929786 417311 -339577 -741659 -772516 -1311112 -2684996
46598 -2684996 -3554416 -2486295 -210569 1136580 870264 349703 615948 1011343 636102
46589 636102 -254950 -1088988 -1998830 -3024507 -3247889 -1915120 111639 1169354 845242
46580 845242 224147 165093 323720 113113 -222763 -42043 675538 1343511 1615975 1668233
46570 1668233 1624867 1240336 390780 -521507 -1036850 -1240565 -1451970 -1524203 -1043728 -181196
46560 -181196 314314 127791 -206189 -154513 82041 6412 -475785 -1142203 -1829626 -2394734
46550 -2394734 -2674313 -2758276 -2905763 -2989277 -2553644 -1673377 -1106356 -1215058 -1375332 -913890
46540 -913890 -30982 650444 815095 334600 -777544 -1791192 -1580377 -198467 845939
46531 845939 675538 285638 674991 1006011 144749 -1060646 -958375 161376 564651
46522 564651 -58307 -348008 176765 457981 -4380 -453750 -676647 -1457445 -2608091
46513 -2608091 -2570679 -940226 442701 66732 -1188304 -1786109 -1832410 -2224464 -2754273
46504 -2754273 -2600116 -1850572 -1195133 -823453 -761486 -1444869 -2755704 -3347881 -2244091
46495 -2244091 -363811 808835 1253972 1677719 1606840 88922 -2114550 -2984914 -1977227
46486 -1977227 -600425 -13474 356200 1257666 2094776 1850158 658227 -388461 -561861
46477 -561861 -50951 526706 744339 569129 115471 -683483 -1830451 -2645668 -2129584
46468 -2129584 -476653 513593 -517351 -2514434 -3176102 -1834016 -22330 746588 559269
46459 559269 239873 22537 -386164 -1099116 -1858568 -2231173 -1947929 -1421399 -1637565 -2837385
46449 -2837385 -3656949 -2639365 -432693 820921 405593 -106881 564197 1407321 759789
46440 759789 -1062066 -2100567 -1314967 348012 1376505 1286943 666987 262023 265621
46431 265621 244899 -323577 -1333616 -1978542 -1578434 -360110 765422 1119457 842036
46422 842036 650773 1051478 1716885 1785138 972746 116707 140632 715631 698261 -103508
46412 -103508 -514596 289487 1465639 1584550 516375 -531034 -643182 -162622 -658
46403 -658 -537881 -1400185 -2016367 -2172048 -2074592 -1986518 -1889734 -1589174 -1057613 -487739 -57241
46392 -57241 118260 -124478 -766579 -1225744 -667518 1016420 2795164 3343256 2226564
46383 2226564 191955 -1503604 -1963857 -1166716 92480 844113 733979 220753 -9735
46374 -9735 230099 481581 158163 -782754 -1724867 -2072838 -1937243 -1796217 -1571116 -727764
46364 -727764 510157 945080 60984 -901988 -554378 518187 520642 -892464 -2153082
46355 -2153082 -2151371 -1670893 -1861678 -2448751 -2385886 -1574936 -960429 -1164669 -1758328 -1913946
46345 -1913946 -1424584 -977895 -1373596 -2404015 -2868217 -2094779 -976803 -739640 -1122709
46336 -1122709 -885335 138028 829866 638966 206335 -59992 -526075 -1062158 -843117
46327 -843117 -53422 -138530 -1458118 -2334847 -1578399 -297295 224404 743949 2228308
46318 2228308 3318973 2115729 -400193 -1373730 -197171 922130 571413 -208426 -370372
46309 -370372 -583093 -1510472 -2333341 -2221693 -1766477 -1712060 -1514947 -438883 880669
46300 880669 1221615 466726 -552415 -1342906 -1897422 -2023401 -1523932 -842239 -720394
46291 -720394 -1256588 -1802316 -1710779 -902678 84764 413857 -330969 -1527195 -1995153 -1244289
46281 -1244289 146628 1357474 1919668 1565074 421598 -506906 -130158 1097319 1437338
46272 1437338 294465 -785854 -354624 835806 1112393 378817 -59636 307347 563988
46263 563988 -130226 -1506518 -2714733 -3071825 -2337411 -1010778 -266685 -836832 -2021258
46254 -2021258 -2499153 -1958246 -1151533 -540689 125373 845688 998922 294659 -630745
46245 -630745 -947458 -479144 391318 1173331 1444198 1052663 360170 -75022 -140136 -139012
46235 -139012 -176791 -94030 -33 -226201 -603773 -422000 600861 1807508 2382691 2259893
46225 2259893 1967234 1890120 1940352 1730117 938163 -282336 -1272138 -1562546 -1515809 -1787707
46215 -1787707 -2229077 -1995301 -831878 475488 1141487 1131651 609968 -468668 -1666821
46206 -1666821 -1838952 -480832 1274078 1939067 1541674 1251030 1489213 1563568 1108552
46197 1108552 681645 650664 561325 99716 -225222 11879 311737 48855 -453764 -426687
46187 -426687 164154 698941 872806 827061 547906 -55684 -602592 -604981 -342286 -485992
46177 -485992 -807726 -287116 1186696 2260676 1876382 708751 69986 128638 198376
46168 198376 229311 795170 1759175 2143142 1527282 641364 264478 330751 472246 702885
46158 702885 1069041 1204637 810060 217095 -19919 151732 370716 425540 302682 -147926
46148 -147926 -1100581 -2248665 -2763810 -2008507 -287439 1239987 1578085 874596 171316
46139 171316 95165 199178 -107865 -525624 -432528 -75612 -232346 -842779 -1062331 -755827
46129 -755827 -779693 -1444863 -1871548 -1473928 -991153 -1206930 -1600608 -1304965 -665546 -707021
46119 -707021 -1523820 -2277690 -2462680 -2200672 -1611049 -857457 -500891 -812261 -1051430 -464698
46109 -464698 368898 385309 -129295 -19101 596300 388815 -738083 -1090902 208504
46100 208504 1681025 1637461 558023 44035 393893 634968 318097 -131337 -503530
46091 -503530 -938303 -1132010 -629707 110073 105346 -576543 -767064 -6631 700818 501143
46081 501143 87809 621386 1858832 2336638 1239053 -715285 -2231414 -2591410 -1807065
46072 -1807065 -377494 784722 823117 -115138 -786519 -281136 734659 861767 -124615
46063 -124615 -1016938 -872180 -105340 415382 541976 573483 497665 206748 -14915 91513
46053 91513 260309 263441 482429 1153469 1573756 1062548 298960 528542 1681770 2544962
46043 2544962 2662851 2633231 2467167 1339024 -536536 -1437672 -484984 915627 1104121
46034 1104121 449085 277600 527333 85497 -1072555 -1732664 -1347947 -681149 -393136
46025 -393136 -198862 243738 593931 467050 184423 434989 1456909 2708051 3191552
46016 3191552 2284695 539772 -665738 -721216 -598745 -1419571 -2647143 -2700612 -1242105
46007 -1242105 202140 142410 -1150459 -2161903 -1850609 -590445 274490 -246624 -1670072
45998 -1670072 -2462710 -1925019 -1130021 -1299907 -1878180 -1411258 34814 896502 615918
45989 615918 434456 1115137 1501212 476518 -882307 -605250 1355980 3050748 3079276
45980 3079276 2008755 1184123 1120641 1347345 1194270 465835 -346379 -517542 -23640
45971 -23640 232541 -428952 -1420851 -1648225 -1044459 -514693 -475165 -456443 -291443 -579348
45961 -579348 -1428171 -1743911 -706238 719733 880910 -256060 -1088155 -685827 124538
45952 124538 385754 481185 1075606 1558006 889132 -460983 -935748 -279796 24761 -798981
45942 -798981 -1412101 -425843 1260593 1627626 430257 -622059 -447324 144550 57922
45933 57922 -523517 -793033 -559679 -98963 519213 1190060 1361221 621040 -582582 -1463484
45923 -1463484 -1940674 -2548114 -3407457 -3910276 -3538337 -2565186 -1736804 -1463701 -1474107 -1186356
45913 -1186356 -355827 649860 1237647 1203973 852970 544868 308613 -92075 -873121
45904 -873121 -1980064 -2941088 -3080813 -2200002 -993330 -427053 -699609 -1174439 -1298248
45895 -1298248 -1115290 -855759 -574165 -346774 -297168 -228831 225671 842370 785489 -252957
45885 -252957 -1418066 -1693915 -1126283 -521690 -279084 -121119 207251 560504 701910
45876 701910 593452 394937 432996 1020946 1996296 2592784 2138575 825223 -482166
45867 -482166 -1101521 -972718 -430470 111517 321536 113705 -313230 -746216 -1203550 -1779099
45857 -1779099 -2353253 -2632099 -2438094 -1884770 -1304173 -971379 -796076 -392111 373938
45848 373938 1095450 1362770 1313906 1229718 939835 299892 -79291 475445 1448124 1671724
45838 1671724 1088672 728552 821734 419989 -668600 -1161623 -361949 545959 387114
45829 387114 -134099 220043 1148339 1540452 1308858 996433 455786 -502260 -1002712 -351982
45819 -351982 419890 85965 -545125 -23444 910311 430535 -912346 -746438 1055918
45810 1055918 1927722 840426 -51081 825021 1896072 1329713 -11434 -500370 -517061
45801 -517061 -1094822 -1562571 -869056 144286 127687 -299207 184049 887308 221386 -1186948
45791 -1186948 -1161602 501827 1737739 1479729 812082 596819 311716 -183620 55652
45782 55652 1115885 1497794 390153 -911197 -920724 54972 876252 1251532 1348818 818185
45772 818185 -563895 -2001489 -2514254 -2166748 -1674700 -1377886 -1365367 -1975577 -3258663
45763 -3258663 -4357555 -4267450 -3022791 -1591045 -845854 -1007568 -1668232 -1991016 -1370634
45754 -1370634 -255004 234812 -200123 -659534 -550460 -536228 -1273682 -2080928 -1870371
45745 -1870371 -833787 -157474 -369749 -870515 -903429 -268397 698767 1247290 696861
45736 696861 -552944 -1016490 65476 1446470 1408748 110953 -781253 -499384 126796
45727 126796 308724 260197 298235 256809 204374 621347 1383688 1608108 1032988 532671
45717 532671 654215 699881 73930 -474518 -47416 751604 643012 -315920 -861364 -499561
45707 -499561 -88413 -358719 -1010682 -1558101 -2024253 -2348323 -2023684 -975291 -122124
45698 -122124 -354783 -1372716 -2151268 -2219899 -1883851 -1480528 -1087011 -830950 -856633 -982819
45688 -982819 -919124 -823910 -1126860 -1760517 -2120140 -1934742 -1665078 -1796989 -2171929 -2297155
45678 -2297155 -1967699 -1327234 -661340 -384070 -837685 -1768456 -2362193 -2176345 -1682793
45669 -1682793 -1476089 -1367980 -870208 -232400 -217627 -951666 -1752706 -2134909 -2273742 -2378135
45659 -2378135 -2305750 -2004667 -1704275 -1440519 -985674 -447989 -283102 -471925 -422909 -7872
45649 -7872 150070 -93242 171173 1439655 2603826 2342723 1122735 521482 859997
45640 859997 920282 85450 -663658 -413542 171213 -162396 -1438737 -2452139 -2287758
45631 -2287758 -1250760 -408777 -555316 -1506527 -2268275 -2080143 -1280369 -785885 -818592
45622 -818592 -777142 -391938 -174420 -432931 -684253 -542104 -411476 -653487 -797008 -415081
45612 -415081 -147139 -796423 -1805439 -1783900 -447141 1066069 1855238 2143127 2274152
45603 2274152 1960339 1131762 662782 1400500 2891631 3793324 3354801 1976134 496372
45594 496372 -552580 -1054833 -1125834 -923662 -503899 80502 505642 319367 -421712 -970872
45584 -970872 -699310 116310 661815 571107 172363 -121521 -247262 -322523 -403920 -475357
45574 -475357 -436890 -120851 423935 725315 327455 -530773 -1062796 -901003 -558143 -669992
45564 -669992 -1065756 -976806 -74163 1095643 1806648 1979083 2058727 2219073 2044715 1144911
45554 1144911 -158925 -1053812 -1125564 -794838 -795752 -1368941 -2026894 -2010593 -999246 457366
45544 457366 1253131 748690 -498046 -1329790 -1329497 -1127502 -1281199 -1453125 -1085070 -376542
45534 -376542 -49251 -476686 -1523434 -2833868 -3719889 -3298088 -1610628 -196404 -440448
45525 -440448 -1559458 -1490805 204532 1753723 1798032 1065978 688462 367927 -518714
45516 -518714 -1221498 -658415 587277 1013267 546704 434996 936464 941467 159015 -108887
45506 -108887 900707 2015848 1855565 755161 -141814 -731169 -1584542 -2376711 -2089154
45497 -2089154 -655863 760371 1271384 1179671 1195328 1414880 1379386 779578 -111640 -611034
45487 -611034 -314478 293883 259008 -572181 -1152841 -571816 644879 1204424 703913 -122354
45477 -122354 -659889 -1152624 -2121126 -3628942 -5213764 -6141909 -5840164 -4568887 -3493006
45468 -3493006 -3464696 -3887090 -3508707 -2220304 -1163369 -1000560 -1070083 -582818 246389
45459 246389 777873 908675 832616 407262 -559577 -1710123 -2377346 -2246831 -1467842 -413183
45449 -413183 389148 499210 117940 33671 661007 1504561 1904569 1854910 1685501 1450106
45439 1450106 1158968 1135372 1498911 1684428 1154271 258082 -320478 -638109 -1167853 -1634880
45429 -1634880 -1200567 90637 991272 551936 -724429 -1624649 -1607559 -1029778 -380317
45420 -380317 208562 765862 1146591 1052742 408866 -357735 -636900 -328123 32951 -40405
45410 -40405 -505631 -1129430 -1792633 -2174289 -1777126 -773652 -150726 -329830 -396596 346348
45400 346348 874684 -100967 -1773957 -2136982 -1048089 -392689 -935962 -1164467 -73431
45391 -73431 989743 658869 -70548 365701 1292816 943398 -413008 -787771 311211
45382 311211 1193961 799777 208023 608236 1354578 1092514 -193675 -1279095 -1304414
45373 -1304414 -543379 121436 42098 -623206 -989950 -395988 756367 1562328 1855272
45364 1855272 2163577 2530973 2323405 1346280 228145 -553797 -1137338 -1501886 -1214222
45355 -1214222 -372775 145580 -67256 -325816 -55500 253613 -18896 -584214 -945385
45346 -945385 -1365136 -2214044 -2993185 -2977821 -2336120 -1675816 -956274 152341 1220411
45337 1220411 1434288 829040 226621 120749 432878 1066538 1795804 1941673 1198944
45328 1198944 495176 893392 1907013 2208621 1828648 2081938 3186135 3661189 2672654
45319 2672654 1393602 1108704 1287406 700928 -555590 -1422838 -1571669 -1495160 -1324290
45310 -1324290 -716034 240863 977395 1260497 1318254 1232810 855844 246168 -339288 -758848
45300 -758848 -908232 -701061 -579253 -1443683 -3305124 -4559221 -3665009 -1250814 562308
45291 562308 802358 447789 562925 904563 791968 291280 -85404 -112390 248249 1030836
45281 1030836 1887432 2152362 1726686 1264403 1072458 621531 -253945 -540679 598152
45272 598152 2247487 2637221 1351407 -375997 -1400886 -1645774 -1380148 -708997 -93013
45263 -93013 -320298 -1369528 -2079800 -1584865 -461830 166862 75699 -262365 -764292 -1624843
45253 -1624843 -2381395 -2211288 -1271990 -711139 -973985 -1041019 15385 1491415 1966328
45244 1966328 1294482 670279 830241 1198633 1012666 399620 -110289 -436976 -718803
45235 -718803 -732472 -242703 321860 217467 -625234 -1472197 -1635895 -1028560 60707 1226629
45225 1226629 1958262 1905569 1288276 667805 254099 -155866 -574263 -764537 -888259 -1470251
45215 -1470251 -2387531 -2646907 -1733863 -494539 83819 329674 1067893 1796316 1098706
45206 1098706 -1027394 -2653825 -2310295 -792680 147682 -38521 -756681 -1604198 -2417314
45197 -2417314 -2556951 -1584390 -478555 -727867 -2064261 -2544346 -1330104 49462 22150
45188 22150 -791178 -902693 -434257 -623546 -1456280 -1630369 -822433 -176149 -159912 289469
45178 289469 1626284 2304477 935442 -1271273 -1916476 -718755 300987 -143525 -1055407
45169 -1055407 -1024052 -167771 573423 969209 1330879 1548500 1332796 1009497 1119779 1460823
45159 1460823 1423221 1155529 1441142 2336742 2886502 2532843 1973390 2065347 2562680 2672232
45149 2672232 2371945 2274829 2385739 1974497 840227 -185563 -431392 -358656 -693280
45140 -693280 -1113595 -689897 517825 1224354 545954 -829452 -1567991 -1341093 -984462
45131 -984462 -1195046 -1657007 -1602410 -873074 -143503 -152633 -875929 -1515203 -1289839 -206743
45121 -206743 949159 1313899 607296 -735208 -1907658 -2310619 -2029315 -1711648 -1769131
45112 -1769131 -1815060 -1223850 -121243 707967 915113 947954 1112673 999822 350644 -136221
45102 -136221 345353 1380671 1697783 805371 -471573 -1174638 -1273649 -1336168 -1652455 -1981639
45092 -1981639 -1894066 -1217890 -338931 -9063 -550049 -1344954 -1535556 -1139319 -958160 -1393252
45082 -1393252 -1929514 -1906228 -1271044 -413924 285301 617700 684784 911420 1433148 1557265
45072 1557265 573391 -887036 -1252742 -54999 1384334 1761354 1320747 930587 616396
45063 616396 14163 -476973 -218802 394395 409264 -84258 -4283 952248 1663837 1123490
45053 1123490 -125671 -620811 281098 1643290 1892972 525826 -1169101 -1464345 -340846
45044 -340846 469665 -28978 -616575 154798 1480280 1429400 42562 -650641 185483
45035 185483 956795 262611 -979873 -1130219 -188855 713666 1162629 1411871 1223813
45026 1223813 227829 -903931 -1012084 -163658 315950 -357606 -1508401 -2040887 -1645633
45017 -1645633 -784788 -85569 68610 -218130 -436536 -319094 -266204 -700163 -1233592 -1120731
45007 -1120731 -428147 -48099 -476655 -1206748 -1501501 -1256244 -884997 -719970 -695201 -418618
44997 -418618 418515 1488612 1896120 1192692 110439 -236723 258272 661419 264803
44988 264803 -665284 -1350297 -1203414 -203916 895259 978136 -124067 -1024278 -406682
44979 -406682 977246 1169587 -121374 -972695 -50966 1462728 1691660 673345 -56961
44970 -56961 263247 1053277 1678919 2062624 2087351 1469509 390342 -502040 -864986 -890421
44960 -890421 -769128 -486823 -155977 -31630 -171940 -461026 -833979 -1080119 -719700 333750
44950 333750 1269079 1272261 728330 692485 1271744 1513162 1004897 544335 797048 1190761
44940 1190761 800602 -250926 -938945 -561909 660418 1956239 2599818 2391497 1839080
44931 1839080 1631568 1785313 1701631 1214926 981284 1439745 1965282 1654985 581315
44922 581315 -345947 -516339 -55815 656091 1328670 1746188 1928755 2193295 2593602 2525396
44912 2525396 1507883 186078 -237860 365327 773473 29853 -1333743 -2073913 -1689703
44903 -1689703 -681920 143260 132342 -989855 -2664267 -3520783 -2636262 -814573 55446
44894 55446 -871568 -2438653 -2909560 -1847339 -188305 1101319 1816870 2131068 2067291
44885 2067291 1504574 347015 -1357906 -3127704 -3961055 -3166927 -1422256 -331522 -579812
44876 -579812 -1181116 -1065084 -648125 -912521 -1527146 -1230196 12500 652582 -256544
44867 -256544 -1759477 -2507641 -2451214 -2188399 -1671300 -731957 -120468 -615240 -1501572 -1371546
44857 -1371546 -312837 147955 -591194 -1376162 -1272926 -956059 -1295240 -1730960 -1182816
44848 -1182816 194889 1322485 1776969 1942175 1863269 1106216 -200394 -1169881 -1250709
44839 -1250709 -801535 -350052 110172 824726 1753511 2566108 2833992 2209554 867943
44830 867943 -255377 -314995 234768 15860 -1352470 -2445338 -1768623 223630 1626854
44821 1626854 1352769 123349 -756532 -837779 -497919 -116264 210650 411678 401890 299557
44811 299557 341102 487857 374878 -166429 -721798 -746941 -386802 -447696 -1332913 -2349792
44801 -2349792 -2508443 -1812001 -1173807 -1060665 -919360 -264239 306246 -164482 -1532826
44792 -1532826 -2508170 -2097676 -618162 822040 1469116 1413497 1211462 1208586 1200975 789636
44782 789636 77472 -260376 175704 890716 1123931 865030 721826 909247 989407 646342
44772 646342 100388 -413247 -1014886 -1771981 -2396278 -2644865 -2640755 -2530110 -2187473 -1542209
44762 -1542209 -891939 -645094 -983990 -1847484 -2854811 -3209390 -2285576 -543435 723711
44753 723711 845523 412727 213828 275050 363647 608047 943814 680590 -541135 -1913369
44743 -1913369 -2380184 -1879614 -937431 279463 1569361 2120342 1585777 1141205 2031894
44734 2031894 3482337 3615501 2199182 776517 125127 -551404 -1647224 -2289157 -2087940
44725 -2087940 -2006538 -2599017 -2906262 -2078614 -757108 98747 450476 359779 -586519 -1933857
44715 -1933857 -2001030 -287278 1197723 647881 -828306 -1069056 -179255 224454 84922
44706 84922 623894 1478591 897883 -1024042 -1932196 -750782 608691 132200 -1514157
44697 -1514157 -2285002 -1474365 10057 1060362 1071360 64473 -1070430 -1158871 -175310
44688 -175310 616761 407262 -108779 107748 1062609 1991097 2235486 1507099 85948
44679 85948 -982666 -798147 117966 494574 274878 467966 934714 264851 -1517488
44670 -1517488 -2258920 -932617 394065 -408005 -2209612 -2456675 -1036487 85180 272677
44661 272677 678774 1493121 1266053 -525286 -2269657 -2379791 -1209406 -136488 80612
44652 80612 -525445 -1510028 -2010739 -1292223 226433 1286234 1389054 1148206 837969
44643 837969 -161605 -1893902 -3003745 -2364696 -720004 335858 482245 703850 1424585
44634 1424585 1720027 706678 -994453 -1764733 -802711 1007003 2158538 2128672 1564283
44625 1564283 1093692 628453 -9675 -506834 -577689 -464360 -331850 243083 1431693
44616 1431693 2360495 2113711 1116127 460805 198557 -451872 -1354436 -1384352 -330176
44607 -330176 562333 496172 281239 786228 1372210 997265 119436 180967 1395516 2215104
44597 2215104 1288721 -770907 -2052307 -1532383 -167164 366376 -253716 -751052 -222719
44588 -222719 449270 -83792 -1519728 -2320290 -2061094 -1966935 -2797963 -3533163 -2892946 -1178510
44578 -1178510 255507 650187 191504 -639566 -1252446 -1021600 -9692 787119 667117
44569 667117 274572 629672 1524597 1833079 1171603 240868 -456246 -1227488 -2277965
44560 -2277965 -3031092 -2844358 -1918200 -1054409 -750364 -830326 -844940 -631127 -465879 -666673
44550 -666673 -1071968 -1152333 -764393 -465772 -753531 -1277222 -1292719 -731335 -235731 -126453
44540 -126453 43912 649483 1216535 980094 1854 -790846 -752549 -274440 -113091 -291317
44530 -291317 -209779 199488 150841 -773988 -1692083 -1454040 -302960 383066 -38931 -788252
44520 -788252 -1005182 -810628 -594728 -202474 428289 603364 -158905 -1007131 -733618 340209
44510 340209 645292 -332499 -1176845 -504715 1076440 1801854 1085175 136425 266621
44501 266621 1307648 2034031 1721995 809096 89434 -272615 -669886 -1256216 -1661504
44492 -1661504 -1564221 -1195738 -1038358 -1209763 -1388812 -1236816 -656420 263965 1242849 1738072
44482 1738072 1276079 105055 -723132 -335648 889703 1633975 1195182 349787 282863
44473 282863 996704 1426872 1019974 369317 74401 -176563 -819776 -1383624 -1031726 220187
44463 220187 1544749 2299368 2354171 1772728 915117 542774 966146 1345958 774290 -199912
44453 -199912 -233214 772344 1571803 1553414 1387114 1412776 915318 -321205 -1161089 -778247
44443 -778247 29674 232097 131980 334686 266169 -714668 -1561077 -723006 1306779 2458242
44433 2458242 2004975 1186784 754799 -103438 -1658806 -2368057 -1108508 692167 907812
44424 907812 -130579 -283092 854986 1207590 -388251 -1996957 -1253760 1060800 2052514
44415 2052514 817326 -589747 -531502 -32295 -581336 -1431607 -828908 1081584 2474657
44406 2474657 2521176 2038925 1626335 961035 131438 -60695 448940 791914 867969 1611709
44396 1611709 2962037 3326543 2042189 699788 739130 1234818 622214 -675635 -1165050
44387 -1165050 -875949 -1073964 -1871076 -2010936 -962319 350845 1008574 1054468 959532
44378 959532 1137060 1886447 2918168 3221820 2307119 1105124 657764 602836 197462
44369 197462 18328 939994 2047752 1620490 -28527 -833081 -207979 170362 -708593
44360 -708593 -1613055 -1336087 -687002 -974304 -1885920 -2177398 -1530209 -624326 -61928 -68494
44350 -68494 -634458 -1310097 -1491783 -1340637 -1628218 -2341663 -2484261 -1712865 -995060 -991870
44340 -991870 -987959 -278353 516986 556505 226270 367385 829217 895394 514909 67089
44330 67089 -508483 -1304548 -1699694 -1082788 70827 798308 917501 796233 376658 -483999
44320 -483999 -1128824 -809620 -98415 -318395 -1484593 -2023563 -927930 798023 1446621
44311 1446621 714167 -177522 -193622 325522 355787 -308355 -767392 -372947 202352 -81403
44301 -81403 -935988 -1016225 59611 1091018 1107232 690600 792851 1260822 1496161 1673368
44291 1673368 2085077 1979586 530384 -1342255 -1666289 -85336 1513157 1451206 207678
44282 207678 -694587 -804107 -856627 -1289282 -1607571 -1280886 -600559 -295480 -563315 -878053
44272 -878053 -764408 -361575 25851 526795 1291663 1749902 1127610 -241323 -1040201
44263 -1040201 -722116 -226384 -411381 -693463 -119614 918475 1170004 421035 -168557
44254 -168557 346602 1574682 2369127 2001820 754677 -244902 60886 1475739 2536778
44245 2536778 2154842 889519 -1242 -287409 -649457 -1208757 -1337837 -929364 -702771
44236 -702771 -951455 -993245 -371188 224645 -85036 -1021869 -1480849 -993890 -251584 -121050
44226 -121050 -545951 -648120 158735 1367659 1878064 1230151 7985 -1043999 -1800502
44217 -1800502 -2340433 -2309182 -1368084 -1746 865731 1020125 1080402 1452571 1784458 1587845
44207 1587845 861645 -65467 -839570 -1081971 -577696 303115 793390 615782 343089
44198 343089 586556 1117767 1162731 427440 -534062 -1011749 -934165 -798444 -917793 -1003698
44188 -1003698 -615115 182521 857722 985003 483371 -547297 -1737475 -2276456 -1529886
44179 -1529886 -29315 834705 501006 23387 657191 2173695 3213565 2966358 1848842
44170 1848842 717819 16680 -343796 -686342 -1145514 -1398083 -1070359 -496675 -501529 -1159627
44160 -1159627 -1506035 -999389 -500980 -996723 -2002441 -2262459 -1629067 -1188911 -1682378
44151 -1682378 -2701255 -3350363 -2974753 -1498815 181614 541879 -888273 -2567699 -2720111
44142 -2720111 -1621581 -832545 -617048 118793 1403479 1747448 632790 -447330 -392410
44133 -392410 -265245 -1359997 -2860343 -3018525 -1802949 -759637 -693704 -976517 -983730
44124 -983730 -873955 -866022 -862714 -971950 -1466685 -2007167 -1738296 -495155 728591 885741
44114 885741 36708 -860273 -1013376 -464589 83792 5005 -565670 -858699 -428213 296746
44104 296746 734228 1027672 1582829 2027195 1546683 301851 -452376 -31851 718035
44095 718035 675500 -78519 -773143 -1311237 -2095191 -2797539 -2483532 -1112848 94114
44086 94114 192256 -383134 -705586 -606514 -426584 -163326 347222 802729 772302 424794
44076 424794 232838 181671 -41509 -311110 -263998 -33387 -11605 -101016 -46162 -242429
44066 -242429 -1165469 -2191933 -2234416 -1508843 -1275913 -1702799 -1561876 -457565 347687
44057 347687 100003 -127380 592299 1281021 706650 -498409 -976452 -812048 -822528 -654042
44047 -654042 392554 1299010 347191 -1950567 -3119547 -2165973 -754418 -449675 -678343
44038 -678343 -305020 374591 418556 -48784 -111832 490654 1102606 1065588 346680 -536098
44028 -536098 -945330 -727650 -436199 -619275 -1031081 -1058082 -692469 -372499 -83251 500326
44018 500326 1105836 1074140 481439 113768 278305 537691 632830 722646 682206 148094
44008 148094 -645438 -986409 -690754 -170170 336879 683883 353116 -714740 -1287504
43999 -1287504 -417850 532216 -558774 -3077887 -4048320 -2403176 -493731 -423095 -1187721
43990 -1187721 -872679 330928 1068529 1204597 1382419 1355935 593785 -252295 -131714
43981 -131714 732548 1318719 1345310 1121233 588239 -226401 -549857 2326 318131 -793625
43971 -793625 -2659700 -3598064 -3211601 -2468965 -1973085 -1574484 -1381893 -1738217 -2291484
43962 -2291484 -2279582 -1666309 -1041988 -639931 -362321 -398835 -852525 -1175689 -955115 -770245
43952 -770245 -1269652 -1967174 -2021249 -1551992 -1020196 -79322 1536746 2731744 2319608
43943 2319608 1015579 411530 447014 -193576 -1507127 -2096605 -1619908 -1192476 -1167964
43934 -1167964 -670711 223534 16238 -1696308 -3205333 -3216164 -2616932 -2538282 -2309563
43925 -2309563 -886936 919044 1330601 61359 -1518323 -2264483 -2143264 -1541395 -769509
43916 -769509 -210753 -194636 -628371 -1083037 -1168190 -750597 -131705 21982 -528143 -963660
43906 -963660 -374169 726338 939538 115583 -391012 60391 431565 -31104 -435615
43897 -435615 -28486 82813 -1316021 -3018587 -2611363 29737 2269365 1988889 -96630
43888 -96630 -1809181 -1975673 -891748 719988 2257520 3045693 2420378 361220 -2075513
43879 -2075513 -3296116 -2557327 -857725 26351 -435841 -1059013 -792269 -196437 -292181
43870 -292181 -678808 -76781 1501182 2508162 2044990 1079982 938192 1563548 2046554
43861 2046554 2112569 2129642 2090517 1636892 1024080 1090369 1991472 2684958 2141687 682246
43851 682246 -330050 16894 1244448 1909310 860506 -1647935 -3891800 -4034995 -1922439
43842 -1922439 633057 1656255 940919 -103234 -238627 489145 1266733 1463115 934222
43833 934222 -65454 -999436 -1412081 -1358190 -1213827 -1049491 -602059 97215 594047 665167
43823 665167 591689 578298 406257 -88726 -670932 -1071144 -1214939 -912753 40000 1174635
43813 1174635 1483915 706402 -175964 -236579 252900 566670 718032 1095634 1429447 1056022
43803 1056022 10979 -896277 -1009422 -332845 664847 1339468 1302421 942211 1054781
43794 1054781 1619159 1649224 733080 -197874 -390514 -581913 -1690535 -3024092 -3148429
43785 -3148429 -2033003 -998223 -856971 -1324261 -1924277 -2249453 -1678993 -153566 1082501
43776 1082501 854350 -156757 -418895 57202 24460 -573884 -470000 532978 1058523
43767 1058523 503723 -26361 181089 219055 -629233 -1448623 -1187475 -326038 64858 -85478
43757 -85478 -212398 -212758 -274008 -317472 -311768 -473941 -709440 -645758 -494111 -844492 -1392683
43746 -1392683 -1201938 -525385 -734186 -1881585 -2169665 -757430 747744 827292 268074
43737 268074 323610 429616 -305090 -840026 271011 2143714 2706975 1884528 1305653
43728 1305653 1342223 908457 81522 357212 1863370 2652835 1642117 328371 501325
43719 501325 1791264 2668446 2661682 2326744 1868366 1080829 254484 41095 458359 778453
43709 778453 498819 -33281 -88562 583377 1480557 1884815 1563688 842778 119447 -372080
43699 -372080 -400303 91317 563637 327267 -338825 -298689 794808 1822931 1767452 1056364
43689 1056364 572023 284502 -71960 74648 1084272 1701842 442064 -1916397 -2985327
43680 -2985327 -1967772 -516593 -89486 -110801 509536 1404764 1356634 100773 -1380044
43671 -1380044 -2012568 -1557770 -648077 -140352 -185889 -57104 655222 1066365 141453 -1454953
43661 -1454953 -1922937 -823658 317023 264855 -365479 -437366 8181 251027 172484 105403
43651 105403 75495 40178 307929 923417 1196627 696552 221604 832682 2232368 3062002
43641 3062002 2682493 1751826 1012738 412672 -260101 -593226 -23749 1139874 1744751
43632 1744751 1067455 -165214 -431723 753771 2029034 1661781 -329513 -2137530 -2278574
43623 -2278574 -1084325 121323 619632 576191 302212 -29743 -175777 -15693 84278
43614 84278 -312569 -908683 -883183 -107012 423806 -167043 -1331708 -1706222 -964520 -296543
43604 -296543 -682165 -1382094 -944224 644735 1854368 1712530 915750 403945 -81701
43595 -81701 -1098101 -1967288 -1427509 429705 2063464 2406924 1893726 1365392 903572
43586 903572 221074 -472602 -629323 -148473 419195 477666 109798 113808 1043438 2170399
43576 2170399 2001925 210882 -1650838 -2063129 -1444523 -1120579 -1077046 -282472 1029404
43567 1029404 1245510 -98243 -1365849 -1168554 -230756 94154 -53260 315256 1097169
43558 1097169 1196714 234062 -972746 -1532611 -1269982 -526309 134087 175285 -351581 -683188
43548 -683188 -278077 438371 793999 884344 1124861 1192873 404167 -961793 -1725273 -1401481
43538 -1401481 -887515 -1151157 -1871398 -1953211 -1072347 -106786 7708 -586569 -959515 -600065
43528 -600065 120547 717406 1209392 1566417 1169749 -311392 -1856423 -2028151 -970138
43519 -970138 -304201 -814525 -1480673 -1293748 -720647 -529665 -390410 196596 590617 4679
43509 4679 -934789 -1048589 -443225 -15260 349204 1362603 2416567 2004976 212409
43500 212409 -1091089 -990076 -665323 -1103874 -1454114 -779996 86891 -103459 -947462
43491 -947462 -1192442 -799236 -644476 -710689 -182147 831137 1147186 221923 -1155597
43482 -1155597 -2028640 -2164480 -1725476 -1017253 -614857 -763346 -635335 711209 2560927
43473 2560927 3036982 1716933 375898 423552 902973 108311 -1841105 -3355601 -3643082
43464 -3643082 -3264029 -2756546 -2038211 -1176516 -622345 -487040 -424411 -326559 -372268 -387923
43454 -387923 -13139 471844 422610 47398 321591 1389825 2089182 1588756 584324
43445 584324 180849 341768 217214 -541181 -1524336 -2190763 -2119967 -1107698 320237
43436 320237 925002 32193 -1497553 -2229445 -1788989 -918161 -285933 -14158 -100024 -444279
43426 -444279 -527820 192898 1532597 2735163 3277005 3086675 2325044 1530796 1501508 2229082
43416 2229082 2479554 1491736 563637 1453119 3422652 3726345 1444354 -968330 -936283
43407 -936283 893061 1892224 1019019 -387975 -870647 -390604 398898 1147650 1672195
43398 1672195 1654977 1028213 321330 231150 871997 1580260 1537908 661263 -248502 -465360
43388 -465360 -253289 -348020 -715272 -648197 -158022 -205571 -1080205 -1628597 -997645 -253141
43378 -253141 -987218 -2798427 -3591774 -2382720 -477303 464259 367244 139946 96863
43369 96863 -100063 -438389 -445393 -13686 373911 362065 173261 177135 387682 612670 827753
43358 827753 1110143 1333308 1222364 708133 12031 -610651 -991058 -950324 -432859 187226
43348 187226 333193 -30696 -269701 15154 362268 151603 -457032 -825717 -737260 -381094
43338 -381094 201143 889241 1045020 294209 -458877 4886 1234268 1444635 139819
43329 139819 -1043058 -753128 232929 589233 536321 939813 1320198 505232 -1185071
43320 -1185071 -2097597 -1537877 -456885 192356 395041 221411 -550122 -1546638 -1798817
43311 -1798817 -1160693 -615842 -625957 -344527 784148 1793370 1602359 727281 359264
43302 359264 418573 -80341 -1079339 -1371101 -520056 425468 491418 -57903 -589663 -1118626
43292 -1118626 -1751450 -1937353 -1178599 -19840 515457 190882 -472454 -1169548 -1881856
43283 -1881856 -2172342 -1448958 -62656 793710 570486 -82311 -529978 -965774 -1494299
43274 -1494299 -1412570 -308576 876886 950854 137003 -408548 -332201 -180468 -77908 374561
43264 374561 955342 934583 466533 534978 1248327 1567547 1140275 930419 1365021 1389031
43254 1389031 372193 -498101 -70041 794060 688109 31052 85840 439284 -311659
43245 -311659 -1694672 -1587307 396318 1992197 1529000 111074 -498016 -395138 -544419
43236 -544419 -757097 -385502 4936 -495811 -1235080 -850463 239925 160448 -1396099
43227 -1396099 -2346629 -1160880 935378 1807371 1302139 938676 1391779 1749874 1186710
43218 1186710 139060 -467914 -340250 161267 540449 457969 -47775 -488480 -488981 -406479
43208 -406479 -798057 -1305616 -953540 210607 771577 -170689 -1657534 -2207258 -1708702
43199 -1708702 -988595 -204801 980790 1986423 1604198 -102917 -1471567 -1222898 160457
43190 160457 1338184 1490657 571439 -802307 -1403240 -416859 1153907 1202054 -820597
43181 -820597 -3067571 -3758244 -3232143 -2643763 -1923897 -477317 1012547 1173662 9760
43172 9760 -1073937 -1208568 -834538 -645747 -878022 -1571942 -2486943 -2820042 -2030430 -862663
43162 -862663 -519244 -917006 -875382 33768 1061940 1764075 2555882 3468313 3642868 2674296
43152 2674296 1416017 784401 607704 307458 -29241 33220 423823 656013 443926
43143 443926 -150913 -840353 -1174590 -936232 -564939 -603325 -716459 -127408 866706 962137
43133 962137 -117961 -872498 -172440 886755 505901 -1130925 -2102321 -1456977 -279969
43124 -279969 165044 114071 439434 962604 670928 -566367 -1502377 -1152208 -250879 -265388
43114 -265388 -1229223 -1642469 -764257 163256 -217693 -1280082 -1429868 -569793 -18559
43105 -18559 -241858 -331614 128414 343564 -76515 -320058 128842 598451 616506 809536
43095 809536 1488340 1711004 896312 51847 55094 5654 -1066984 -2050403 -1374022 36518
43085 36518 -200388 -2189483 -3460902 -2660623 -1288206 -1071687 -1640446 -1869564 -1834324
43076 -1834324 -2066490 -2097313 -1183690 238012 1025438 758157 -220402 -1596348 -2978170
43067 -2978170 -3562336 -2962534 -2035191 -1928249 -2566529 -2937611 -2582835 -1892879 -1202042
43058 -1202042 -621742 -613394 -1569947 -2746570 -2778794 -1608121 -802643 -1395842 -2400347
43049 -2400347 -2311308 -1309240 -863991 -1516089 -2206567 -1885570 -827844 -6257 154421
43040 154421 -37881 -135571 121272 785380 1600592 2056331 1838899 1151509 444165 3788
43030 3788 -81741 128376 307348 51436 -508778 -681879 -198927 229758 -65720 -576582
43020 -576582 -344294 451607 681456 21383 -599284 -532205 -260949 -274832 -215767 175364
43010 175364 318465 -145187 -565285 -577330 -1115289 -2726582 -3840101 -2614701 10801
43001 10801 1281217 602448 246497 1567026 2862915 2240405 565349 -208428 -120567
42992 -120567 -538129 -1407959 -1400559 -394569 288562 152848 147043 764287 1250103 1160266
42982 1160266 1142260 1565463 1788609 1466429 1244662 1397959 1120211 114526 -414579
42973 -414579 444757 1670332 1857788 1458793 1868792 2980167 3431241 2971989 2756809
42964 2756809 3224789 3431687 2874731 2386310 2533486 2488584 1397202 -162133 -1045211
42955 -1045211 -1108815 -975191 -804568 -271163 520166 955594 738953 235445 -28757 130902
42945 130902 509153 734288 609126 326635 215960 316654 469897 700772 1065114 1255302
42935 1255302 959806 496968 356845 256321 -363360 -973621 -430240 942160 1284375
42926 1284375 -57011 -1251440 -624475 767385 797457 -461923 -997096 58568 1438854
42917 1438854 1852986 1438166 824357 160320 -445041 -611352 -332972 -139352 -272114
42908 -272114 -406710 -356200 -272615 -38249 652949 1440425 1483867 791333 414730 938270
42898 938270 1689087 1911348 1794322 1701538 1248121 28673 -1308620 -1657223 -896617
42889 -896617 14135 296231 80044 -116459 -66257 187870 625209 1162624 1393562 833733
42879 833733 -318557 -971354 -257472 1169015 1667434 656351 -652300 -959067 -406653
42870 -406653 271581 1108193 2260479 2885105 2228226 1378914 2218754 4721627 7012463
42861 7012463 8226369 9462917 11366505 12564907 11588871 9042267 6701489 5348476
42853 5348476 4522328 3719108 2878208 2115725 1653056 1634498 1680227 1238152 620553 795104
42843 795104 1777555 2272704 1489085 298464 -105496 245435 624802 757088 612603
42834 612603 -90399 -1310868 -2301962 -2507363 -2139258 -1395161 -153484 984880 749547
42825 749547 -728296 -1325770 225740 2177197 2088338 258740 -1031325 -917630 -533287
42816 -533287 -587561 -456089 219490 830705 1020145 1129017 1136921 503877 -594717 -1108924
42806 -1108924 -604627 110559 232387 -24731 37291 747938 1894857 2785744 2568108
42797 2568108 1199276 -99502 -183618 466044 463846 -493352 -1441557 -1725993 -1559362 -1103517
42787 -1103517 -231407 750060 1283523 1511113 1958075 2333166 1846293 681301 -129981
42778 -129981 -296470 -386753 -397256 231328 1043312 755661 -548470 -1126572 -156076 1005403
42768 1005403 993512 365296 334727 929669 1537434 2097043 2547963 2141248 592705 -895410
42758 -895410 -1012869 -107256 503755 302462 -412446 -1495589 -2642634 -2758972 -1159297
42749 -1159297 899986 1402013 302619 -337563 723543 2128342 1790447 -267944 -1862925
42740 -1862925 -1240467 977371 2649873 2534833 1361573 507300 312092 276892 341480
42731 341480 862866 1463323 1187020 120323 -347230 533403 1745370 2060702 1699784
42722 1699784 1516537 1466924 1056498 614170 822490 1375774 1364029 810376 650646 1209562
42712 1209562 1780327 1822646 1610595 1493693 1358735 1089577 864596 724489 407931 -149977
42702 -149977 -626129 -785658 -726791 -541793 -167913 300664 549014 422413 63228 -375438
42692 -375438 -823678 -1087988 -919309 -356723 295622 854486 1320022 1579446 1439700 1034865
42682 1034865 838956 1091222 1439473 1338634 692823 -27475 -272356 54296 565400
42673 565400 838644 728483 169549 -978101 -2459145 -3255282 -2450215 -587471 585736
42664 585736 116248 -1029589 -1314010 -525187 308890 446532 76456 -370170 -752525
42655 -752525 -964629 -745159 -9953 890880 1416472 1278002 683312 189032 167099 407220
42645 407220 498774 545207 998462 1735653 1998780 1537483 1068608 1107845 1096389 432214
42635 432214 -283863 -30284 977040 1468092 877888 -34668 -400936 -224470 29092
42626 29092 74902 -222719 -899709 -1589666 -1638101 -814590 414980 1489811 2259722 2714353
42616 2714353 2596782 1632827 44577 -1363882 -1714114 -798510 573066 1199184 711387
42607 711387 -26032 -11997 683831 1236623 1305395 1303422 1485856 1467288 878438 -2302
42597 -2302 -592215 -667899 -396682 85862 810189 1687961 2319801 2291166 1700102 1178342
42587 1178342 1144247 1223557 876819 498676 1145359 2947827 4609056 5038610 4793592
42578 4793592 5131065 6227683 7375047 8581426 10656241 13451226 15113730 13805485
42570 13805485 9749209 5123577 2142568 1402681 1791988 1779881 932831 200222 575712
42561 575712 1703643 2261478 1617438 520725 39255 343528 789307 814843 467979
42552 467979 254648 640641 1557084 2364164 2500998 2126407 1828157 1784663 1675333 1440272
42542 1440272 1520327 2038674 2293490 1667293 764598 871114 2155630 3169147 2701667
42533 2701667 1592792 1698780 3134555 3803087 2285141 50978 -458717 771427 1517963
42524 1517963 721606 -175847 204514 1048832 895867 -25245 -415512 -27661 248074
42515 248074 -29108 -401652 -372221 284150 1709655 3488222 4381875 3590129 1934667
42506 1934667 783912 240604 -440600 -1088426 -720328 723989 2153011 2859326 3022571
42497 3022571 2711666 1777204 837997 914874 1763020 1929440 868975 -309991 -658093
42488 -658093 -597335 -723741 -715591 -249177 128482 -50419 -271280 45693 531368 623684
42478 623684 627853 1159579 2071164 2697395 2761781 2468947 2109080 1959424 2062022 1849762
42468 1849762 731616 -690689 -961402 226719 1406094 1325875 520561 116838 127174
42459 127174 -44135 -256156 50555 740765 1189128 1161878 708526 -267144 -1552383 -2379014
42449 -2379014 -2445656 -2510124 -3119871 -3520146 -2816226 -1483161 -640333 -524864 -788540 -1514835
42439 -1514835 -2624613 -3019747 -1854529 -113878 621952 457144 555528 794523 99688
42430 99688 -1119255 -1173944 17982 549995 -338296 -1004822 -350560 134417 -1097986
42421 -1097986 -2805475 -2674838 -808905 603420 581535 298758 737820 1208266 722778
42412 722778 -426911 -1158272 -916229 7373 948006 1285800 809077 -16455 -421356
42403 -421356 -153071 344625 630016 733899 780390 602373 110770 -252554 84781 1030036
42393 1030036 1847644 2037062 1807866 1529599 1130571 432787 -217383 -237193 335491 880900
42383 880900 1180414 1694498 2564334 3017924 2371781 1168450 607356 1061285 1808767
42374 1808767 2115064 1938932 1582568 1241333 1020260 972338 1021519 1107519 1321117 1627944
42364 1627944 1728282 1625848 2007449 3403017 5180443 6130155 5980809 5591757 5660447
42355 5660447 6020433 6276245 6311029 5984234 5117927 4061841 3559190 3748976 3965855
42346 3965855 3815459 3726868 4029092 4148287 3283786 1490602 -308771 -1101782 -455799
42337 -455799 1084796 2148868 1703806 246234 -788880 -861280 -716301 -844666 -699245
42328 -699245 119894 1053840 1618686 2175108 2935701 3363295 3454347 4289226 5962810 6273553
42318 6273553 3454141 -569144 -1932276 229063 2751888 2739413 904522 -191753
42310 -191753 425964 1670530 2262795 1889908 1062465 657531 1198438 2104062 2206765
42301 2206765 1361364 732837 1017587 1346509 730421 -286830 -462008 259013 792491
42292 792491 539735 -65554 -486014 -609606 -334125 545582 1832110 2835394 2950796
42283 2950796 2108576 845375 211496 1115043 3110907 4266307 3147490 769846 -406292
42274 -406292 535052 1956082 1893826 359385 -1121192 -1542061 -1250079 -1048835 -1143050
42265 -1143050 -1074631 -445080 448545 828240 377510 -298545 -468992 -203071 46523 433158
42255 433158 1391554 2462068 2575638 1715088 1097556 1206555 894440 -654495 -2227447
42246 -2227447 -2207545 -1089082 -718425 -1371173 -1388128 71449 1643999 1863641 1241172
42237 1241172 1153879 1648693 1627380 714965 -267439 -545823 -114225 739825 1702018 2155197
42227 2155197 1559069 391062 -87858 571708 1326496 1088109 247886 -381 504263
42218 504263 655885 -259147 -1464345 -1624692 -397639 1337525 2501000 2697888 2276765
42209 2276765 1857469 1751842 1674344 1147283 279320 -201604 67174 517283 551206 552135
42199 552135 1197753 2070793 2060858 1208042 900701 1761015 2566993 2174275 1397689 1630861
42189 1630861 2390305 1981488 372980 -470130 515587 1992814 2443368 2385084 3152524
42180 3152524 4651401 5919991 7232451 9797115 13311632 15461305 14513266 11381298
42172 11381298 8423957 6908284 6337449 5727786 4716119 3539149 2587474 2124321 2097448
42163 2097448 2085939 1601120 549653 -626999 -1284040 -1076447 -239070 600577 983276
42154 983276 1032680 1234874 1799525 2364254 2397196 1814580 1119253 915945 1287300 1676284
42144 1676284 1467659 688943 16000 75999 916537 2149098 3274853 3747103 3174040
42135 3174040 1873158 912577 1081866 1970912 2531081 2342924 1741463 917343 -190546
42126 -190546 -1030409 -535974 1334203 2986129 2960281 1792866 1204178 1773365 2490052
42117 2490052 2590211 2658634 3408957 4285241 4139834 2883544 1624404 1264256 1667314
42108 1667314 2266111 2798581 3172010 3177795 2821027 2581399 2829349 3204463 3148853 2946250
42098 2946250 3507944 4941659 6037571 5679600 4277629 3136960 2689106 2155712 1014578
42089 1014578 -1093 187945 1549706 2916303 3296018 2839956 2483740 2842142 3547087
42080 3547087 3685848 2911844 1987967 2003556 3123626 4434758 5010915 4716807 3912154
42071 3912154 2936402 2186464 2176343 3015474 4159458 5132459 6120018 7285809 7931324
42062 7931324 7219575 5589256 4484204 4553723 5039945 5213719 5418637 6101884 6719304
42053 6719304 6548310 6020247 6182379 7079173 7715293 7639523 7576602 8231731 9308434 10121147
42043 10121147 10517887 10739303 10927905 11303135 12358147 14259142 16331729 17777053 18792899
42034 18792899 20412727 23211052 26665029 29941285 32953661 36446661 41249050 47635970
42026 47635970 55349302 64110271 74062877 85733321 99714573 116655048 137616661
42019 137616661 164196335 197976871 239336785 285648913 329515103 359400979 364773938
42012 364773938 343269365 303189399 257860775 216942799 182936715 154518160 130848407
42005 130848407 112090397 97664031 85902668 75403045 65895518 57769853 51180556
41998 51180556 45639698 40397048 35340173 31278282 28774277 26943040 24406403 21407561
41990 21407561 19589463 19256931 18477500 15978152 13420435 13058531 14203007 14199676 12478970
41981 12478970 11227040 11742180 12446825 11535108 9712443 8835854 9142693 9459702 9370280
41972 9370280 9516790 10001203 9922054 8693149 6917405 5774867 6042406 7553780 9119650
41963 9119650 9355237 8234253 7345602 7808741 8574785 8026689 6722347 6763162 8401213
41954 8401213 9269298 7773797 5516466 5026653 6390099 7737005 8182430 8416749 8711153
41945 8711153 8263001 6856037 5608984 5412820 5774375 5901074 5951247 6394212 6893427
41936 6893427 6744423 6006609 5459452 5733106 7013581 9145938 11384762 12517663 12059989
41927 12059989 11032746 10753953 11133396 11073075 10353320 9982322 10506680 11077765 10757405
41918 10757405 9978876 9996617 11246595 12831254 13522530 12947291 11827674 11182711 11273236
41909 11273236 11446306 11122004 10551846 10212998 9934752 9354120 8826449 8879027 9026539
41900 9026539 8355918 7190180 6717146 6833976 6069703 4178195 2958975 3463231 4175664
41891 4175664 3494026 2394348 2620516 3512823 3100639 1622033 1260579 2459071 3159418
41882 3159418 2205965 1045725 1104447 1649498 1532104 1191483 1412055 1612373 1044005
41873 1044005 507525 1103147 2096507 1808317 179711 -1171226 -1217777 -389476 683563
41864 683563 1855222 2827912 3130481 2962532 3010709 3258815 3004127 2238162 1940838 2631973
41854 2631973 3556712 3742396 3065621 1866837 349025 -1060630 -1495212 -591859 734866
41845 734866 1160534 413163 -630093 -1098610 -867369 -279501 312588 642012 551925 103874
41835 103874 -498821 -1141550 -1776946 -2151989 -1840128 -789798 299994 530440 -156228
41826 -156228 -819302 -674127 -92621 20113 -400176 -573311 -242516 -105374 -490821 -549385
41816 -549385 433627 1647063 1763027 916348 449555 801124 972436 357979 -188137
41807 -188137 210241 983025 1015071 313086 -249092 -413613 -656903 -927827 -389332 1219798
41797 1219798 2772610 2905035 1621650 265508 41201 934202 2016276 2463456 2171862
41788 2171862 1576608 1059826 589789 -64031 -825679 -1197554 -810713 -15342 361348
41779 361348 -13708 -485247 -198006 718147 1182013 510837 -673573 -1222139 -838052
41770 -838052 -184466 246745 721516 1510575 2117157 1794165 627081 -434559 -662033
41761 -662033 -228377 319821 807692 1282374 1465834 982435 136205 -149147 560325 1616653
41751 1616653 2155940 2124483 1952749 1616536 772298 -347250 -1036554 -1217840 -1614767
41742 -1614767 -2528151 -3192007 -2827832 -1739944 -812975 -378009 -118563 258601 743214
41733 743214 1095813 869751 -151700 -1200272 -944679 740687 2245563 2305873 1746633
41724 1746633 1952710 2448040 1733597 91051 -549337 288411 795573 -108415 -950770
41715 -950770 -188812 1172090 1182960 -5603 -631219 -153238 380059 533143 1070160
41706 1070160 2109196 2482976 1608288 591373 617432 1276141 1380921 702090 9580
41697 9580 -115403 257210 805279 1195014 1179230 943773 1085405 1826796 2573621 2665591
41687 2665591 2207903 1721842 1388706 1166817 1210046 1482419 1337654 315138 -883449
41678 -883449 -1117537 -394866 237063 390140 807099 1857309 2721441 2707257 2372600 2475055
41668 2475055 2640565 2144789 1390508 1354394 1898681 1970625 1446597 1419202 2359853 3263952
41658 3263952 3187916 2527696 2018434 1455481 418270 -476120 -245743 882803 1724680
41649 1724680 1866848 2075509 2861300 3638491 3695615 3246417 3025761 3350123 4049688 4973532
41639 4973532 6074761 7135668 7802506 7954686 7893219 8087626 8677722 9226417 9179363
41630 9179363 8703243 8744301 9902508 11542272 12547992 12752324 12935596 13485879 13902976
41621 13902976 13843631 13808629 14235451 14531157 13778551 12160120 10953293 11037008 11897738
41612 11897738 12308945 11711380 10684747 10119656 10128577 9970444 9096566 8016965 7790451
41603 7790451 8692913 9780610 9951998 9189773 8489044 8615263 9171596 9095463 8093160
41594 8093160 7231443 7630544 8754114 8894368 7620390 6622954 7223970 8076998 6935535
41585 6935535 4195391 2665161 3569642 4805575 4125962 2328760 1768460 2898701 4089155
41576 4089155 4280689 4029133 3990060 3973366 3817579 3924526 4428908 4796694 4757505 4865543
41566 4865543 5613021 6612184 7218427 7516616 8114645 9185909 10209157 10639461 10567003
41557 10567003 10691382 11701564 13544924 15211246 15416622 13752313 11210163 9417966
41549 9417966 9160236 9654283 9542183 8667796 8367006 9558146 11138167 11290241 10120907
41540 10120907 9606520 10679146 11913596 11930175 11628211 12607984 14440365 15301318 14834928
41531 14834928 14587258 15647393 17512823 19514947 21852383 24742867 27823435 30973795
41523 30973795 34765113 39646361 45534720 52434152 60482946 69294734 78573605 89710971
41515 89710971 105331699 126664840 152669896 182015992 213510790 242889516 261329797
41508 261329797 260567418 240076585 207756120 173499538 143210173 118300137 98243288
41501 98243288 82166278 69140791 58474491 49910216 43279230 38149372 33899171 29901086
41493 29901086 25768696 21814055 19002824 17835342 17430973 16377840 14340899 12125183
41485 12125183 10343323 8915530 7817244 7293435 7149169 6764174 6093706 5803351 6119606
41476 6119606 6413652 6272856 6081384 6079773 5775025 4916552 4197290 4199649 4368667 3875370
41466 3875370 2871172 2038008 1573218 1622472 2964706 5808023 8327747 8158575 5493716
41457 5493716 3059561 2561654 2804874 2174410 1297419 1686910 2934029 3268983 2471873
41448 2471873 2157867 2959700 3355676 2109507 329665 -102957 881465 1823831 1925888
41439 1925888 1628404 1341801 899791 273478 -265111 -802614 -1660547 -2512036 -2580188 -1877995
41429 -1877995 -1253795 -949311 -195851 1294387 2531245 2656241 2173880 1897173 1567300
41420 1567300 650930 -204573 102623 1265837 1816118 1253319 694073 1165107 2325918
41411 2325918 3247702 3567741 3493193 3431199 3933292 5215077 6404910 6146844 4406898
41402 4406898 2772788 2340269 2251666 1261969 -91907 -224233 988680 1893341 1402164
41393 1402164 377201 171168 802690 1349247 1476748 1658853 2124932 2424953 2124224
41384 2124224 1347682 460421 -360238 -1017216 -1308893 -1163098 -876367 -833605 -1058942 -1246772
41374 -1246772 -1146453 -699535 88295 1083124 1844144 1877100 1199353 385011 -72799 -182650
41364 -182650 -150515 -33717 83747 -38571 -402230 -578429 -328064 -92542 -338371 -700381
41354 -700381 -478651 158241 315216 -180152 -354953 471505 1574221 1776630 995485
41345 995485 115905 -328912 -537805 -616693 -253123 539268 1061699 804463 242832 209021
41335 209021 724765 1084950 1045519 1204350 1923587 2534771 2236442 1368593 979407 1268633
41325 1268633 1390412 925759 515333 544420 246567 -936131 -1921017 -1249750 591204
41316 591204 1590038 1006890 288267 749953 1741464 1977655 1551916 1428316 1672188 1524904
41306 1524904 936115 738609 1235540 1686652 1451950 781753 163879 -335789 -672327
41297 -672327 -456348 436351 1366602 1659434 1548393 1798229 2524663 2981002 2567181 1563312
41287 1563312 705806 406904 580557 923255 1118893 991169 700386 617878 803592 843483
41277 843483 466870 32684 -983 186502 110520 -203884 -450498 -873719 -1883247 -2842601
41267 -2842601 -2481474 -881889 270196 126102 -25388 964848 1939925 1308614 -29350
41258 -29350 38398 1168859 879784 -1234780 -2402105 -883052 1195588 1027190 -728364
41249 -728364 -1189251 497976 2400532 2807048 1990441 1027651 520796 659132 1271693
41240 1271693 1646794 1266074 670736 679871 990705 641172 -355089 -1029549 -976799 -619360
41230 -619360 -61145 952036 1880718 1698430 699274 552001 1895838 3116969 2386441
41221 2386441 21724 -2042774 -2511571 -1698229 -696446 -252331 -262819 -44486 741239
41212 741239 1461477 1254742 285855 -439911 -474982 -322197 -425606 -698813 -1109274 -1668079
41202 -1668079 -1713221 -446960 1484725 2271824 1347941 213148 163770 577836 416323
41193 416323 53790 289320 684329 436499 29246 341653 783474 159628 -956537
41184 -956537 -690736 1168947 2557374 2039431 713552 344523 913844 1186112 847940
41175 847940 775022 1441693 2205482 2394516 2358743 2953188 4271312 5458542 5945376 6377351
41165 6377351 7699796 9494695 10158247 9037585 7431107 6741591 6505460 5399715 3605259
41156 3605259 2660228 3029980 3362659 2591533 1433156 1009963 1047097 509262 -592965
41147 -592965 -1165146 -634863 324224 767953 516545 29745 -264283 -244797 20024 382202
41137 382202 647344 654232 385703 -4796 -317979 -489307 -589692 -602254 -328347 326168
41127 326168 1068686 1444304 1310126 885877 392889 -82534 -380398 -273825 171141 514864
41117 514864 447037 213846 310629 806877 1197870 981977 239101 -479800 -756807 -621372
41107 -621372 -263773 285372 968160 1395290 1122510 256058 -534427 -696990 -270156 328690
41097 328690 707077 699458 512355 665598 1374685 1999409 1668003 547566 -170870 181547
41087 181547 899314 1004390 526234 105099 -68983 -164330 -5358 670862 1453235 1547134
41077 1547134 801220 -162832 -779517 -934501 -636666 75941 878650 1330919 1365969 1249476
41067 1249476 1116412 902976 609584 299504 63171 307416 1636042 3860586 5536323
41058 5536323 5282596 3417178 1600312 1010538 1516585 2401899 3087667 3247694 3023114
41049 3023114 3108711 3906470 4682515 4342672 2954391 1655222 1129491 1127406 1479225 2445337
41039 2445337 3741761 4248207 3283535 1546457 326725 210032 777604 1109712 482988
41030 482988 -883166 -1721616 -966795 863124 2171455 2123829 1250174 324470 -390136
41021 -390136 -741086 -583733 -312578 -553944 -1092937 -1014320 -97050 899624 1495958 1928389
41011 1928389 2106376 1403132 -40684 -1000257 -748571 91856 764507 1278461 1557046
41002 1557046 1019638 -175822 -718345 59807 1068369 1117510 613843 534294 733138
40993 733138 469347 -216769 -804757 -1228172 -1476605 -1073478 28021 914167 1124234
40984 1124234 1576497 2881072 3842371 3153631 1623159 1049695 1663952 2358429 2683817
40975 2683817 2809381 2246675 671352 -531196 235208 2021740 2362840 983311 92006
40966 92006 759064 1454343 830344 -343883 -965630 -1235385 -1402790 -787524 639403
40957 639403 1379853 570281 -394218 98278 1416277 1833133 1159028 600002 650086 684386
40947 684386 306605 -221108 -691354 -1045088 -1008394 -550355 -353523 -919472 -1593533 -1415086
40937 -1415086 -531753 228690 764001 1493218 2043528 1511216 100324 -798734 -521151
40928 -521151 1603 -192551 -650242 -409097 335533 429315 -596750 -1910332 -2484518
40919 -2484518 -2193837 -1580904 -1038558 -647620 -533962 -838926 -1348919 -1641906 -1706187 -1933538
40909 -1933538 -2309665 -2173676 -1184882 337 610041 872283 1483826 2269015 2311403
40900 2311403 1409975 481517 270822 416288 160842 -568408 -1173336 -1135351 -504787 143410
40890 143410 211350 -230837 -421762 76629 669746 596094 112566 6199 269380 305179
40880 305179 219864 628383 1167377 653079 -902687 -1828339 -1012456 617332 1634379
40871 1634379 2055221 2813099 4210976 5928539 7823498 9607262 10239535 8815703 5926888
40862 5926888 3262035 1891145 1535642 1359480 863055 99565 -436878 -122642 1229585
40853 1229585 3050347 4346092 4334974 2982772 1263968 592532 1336383 2142479 1577840
40844 1577840 148263 -498249 -168545 -296542 -1326557 -1800306 -837887 234835 -14334
40835 -14334 -828503 -533345 958335 2375948 3007167 3016139 2560423 1902730 1763177 2320649
40825 2320649 2504543 1467968 34140 -565504 -566285 -881349 -1292942 -1067284 -634319 -838942
40815 -838942 -1098896 -269625 1046471 1143113 19499 -595467 -141739 26218 -771848
40806 -771848 -1326489 -711778 200104 417756 408508 827354 1040575 279776 -697732 -503514
40796 -503514 809002 1740958 1283008 35295 -637489 -110912 931968 1358353 960672
40787 960672 615697 836032 851230 -112624 -1308239 -1418227 -612202 -243516 -661289 -855224
40777 -855224 -367984 13404 -164776 -240070 221027 625607 527815 389059 512412 361028
40767 361028 -346890 -894425 -637672 86378 746226 1387821 2008077 2090598 1438535 653635
40757 653635 216333 -85294 -341625 -100939 709975 1445608 1878522 2609592 3716122
40748 3716122 4147664 3314257 2219521 2027987 2377921 2130805 1122098 227317 155157
40739 155157 835654 1534806 1219666 -462843 -2306267 -2613788 -1377879 -139764 547944
40730 547944 1742368 3552671 4075653 2309172 277724 330166 1710226 1942167 649000
40721 649000 -249170 342645 1476363 1991169 1834176 1473653 1307884 1612104 2040963
40712 2040963 1567066 -17584 -1193140 -613283 802234 1218990 624428 389935 675389
40703 675389 418969 -274707 -13686 1319849 2004873 1129242 -30026 -114133 400827
40694 400827 397179 -18376 49969 756026 1353763 1191947 335905 -529604 -664621 -88735
40684 -88735 291252 -145134 -784598 -725015 -182298 50927 56080 414050 786222 408477
40674 408477 -202007 258145 1613897 2192426 1377166 460593 423749 533959 -66192 -857640
40664 -857640 -986824 -621301 -331625 -81993 331164 633648 526099 76653 -696752 -1741665
40654 -1741665 -2242788 -1194559 885120 2110579 1659600 756463 622678 871386 765048
40645 765048 622368 854061 843971 28943 -918518 -1144174 -881541 -565038 240712 1723930
40635 1723930 2687139 2091335 951363 1039986 2246484 2903846 2426344 1909988 2109412
40626 2109412 2432903 2272950 1975975 1953894 1862250 1272794 458833 -68522 -376818 -949312
40616 -949312 -1849695 -2439020 -2109367 -1213122 -852875 -1401676 -1694185 -529712 1300648
40607 1300648 1761972 486526 -535756 204988 1651123 1961830 1138583 530894 660199
40598 660199 1004109 1316512 1704208 1772495 1037766 -38773 -564909 -466408 -182489 385379
40588 385379 1388561 2012092 1412402 341171 282666 1172635 1610748 1251896 1153799 1537772
40578 1537772 1153081 -440956 -1711120 -1281381 191429 1352350 2048888 2602412 2344763
40569 2344763 598630 -1469353 -1765610 -73053 1566314 1619839 905160 982017 1785246
40560 1785246 1992325 1242860 702711 1251609 2164804 2207315 1372225 762845 1082591 1975794
40550 1975794 2681880 2660118 1768385 601958 441300 1860516 3467460 3212566 1076151
40541 1076151 -821963 -1048041 -330990 265266 943522 1955385 2423037 1848418 1466223
40532 1466223 2396172 3539680 3195208 1890686 1518048 2221254 2388335 1546814 976149
40523 976149 1206556 1097201 52651 -737451 -195782 968499 1422674 959534 315952
40514 315952 127755 626007 1583091 2222003 1970950 1388792 1385481 1668674 1317887 788218
40504 788218 1526408 3304166 3932925 2430160 613658 417374 1262513 1450618 758498
40495 758498 95690 -330198 -859593 -1085928 -258151 1337152 2583501 2896128 2511018
40486 2511018 1763379 842497 -67867 -921665 -1602757 -1365648 487619 2937553 3644344
40477 3644344 1932763 38560 172365 1634409 2359822 2141212 2379364 3369699 3913524
40468 3913524 3441573 2710050 2329342 2135497 2120409 2600524 3305932 3501865 3142191 2882840
40458 2882840 2997157 3274841 3759232 4441865 4548001 3498179 2328400 2592515 3949869
40449 3949869 4549155 3921526 3666250 4819906 6333029 6928799 6868547 6866393 6613775 5571724
40439 5571724 4248639 3563711 3619521 3973228 4452001 4944719 5098200 4955095 5177361
40430 5177361 5946518 6438783 6122265 5683933 5785522 5807653 4929800 3681202 3194415
40421 3194415 3534680 4016645 4598207 5576756 6410012 6450423 6540948 8005109 9956928
40412 9956928 9667032 6372853 2947405 2532222 4802539 6953067 7369981 6692065 5830822
40403 5830822 4811410 3747871 3415805 4172469 5223249 5585844 5203279 4663975 4361917
40394 4361917 4363078 4613833 4810468 4434649 3370619 2222627 1660459 1702208 1928009 2080858
40384 2080858 2148343 2187275 2367209 2800001 3050379 2392758 1021234 365912 1479436
40375 1479436 3607457 5163129 5665166 5812033 6095285 6454924 6985699 7719886 7868444
40366 7868444 6639009 4786031 3875810 3898172 3272490 1604782 599200 1395749 2773740
40357 2773740 3224809 3212143 3818196 4517855 4172239 3274219 3222447 3947965 4208353 3904948
40347 3904948 4176235 5262132 6111326 6217117 6124269 5955785 5198246 4251524 4354676
40338 4354676 5390106 5561792 4148633 2924560 3644593 5474800 6283109 5453690 4027622
40329 4027622 2856478 2100428 2061699 2977275 4011769 3758302 2054506 430356 402537
40320 402537 1871088 3458153 4030625 3632402 3111618 3067317 3296631 3324919 3191542 3267952
40310 3267952 3459652 3289871 2854726 2898032 3607939 4102560 3637427 2678374 2151810 2187852
40300 2187852 2340803 2623608 3453566 4702545 5589913 5659342 5368767 5549469 6555003
40291 6555003 8072598 9708639 11698233 14745638 18735757 21838026 21811171 18513226
40283 18513226 14315938 11523658 10130274 8787119 7168969 6213063 6314484 6501425
40275 6501425 5687546 4034009 2748540 2838383 4102536 5136899 4560368 2579482 981128
40266 981128 1047346 1890627 1661670 116585 -1101786 -813161 215541 648583 495020
40257 495020 754036 1667013 2364254 2268525 1975738 2342092 3255765 3896029 3942829 3829517
40247 3829517 3756257 3238852 2109986 1309503 1794816 2950467 3133988 1906966 675751
40238 675751 692530 1400394 1506070 909467 569395 911777 1445299 1819411 2239003 2676190
40228 2676190 2524945 1425419 -69357 -983814 -841607 -14648 605131 346460 -492088
40219 -492088 -744026 341269 2022600 2811209 2253356 1348546 1098176 1312522 1193057
40210 1193057 563425 21528 105151 705398 1231902 1139308 374889 -555458 -1052945 -1012322
40200 -1012322 -813849 -757823 -784499 -793460 -852918 -861841 -343833 1001232 2647007 3560319
40190 3560319 3275115 2381492 1820799 1957784 2592776 3630436 5195635 7041608 8506627
40181 8506627 9559310 11430443 15388230 20896001 25687000 27793810 26896789 23668353
40173 23668353 18835546 13459770 9204922 7213641 6943642 6893352 6287473 5390675 4510361
40164 4510361 3632301 2933815 2668967 2429822 1461496 -13129 -687145 127192 1447697
40155 1447697 1907906 1510249 1340887 1877288 2390142 2029867 893809 -144289 -300138
40146 -300138 516999 1641434 2082436 1316646 -137601 -1069321 -656898 845148 2525154
40137 2525154 3714069 4280358 4225093 3442104 2058017 693390 43693 277953 1044429
40128 1044429 1879341 2331335 1969202 830415 -232013 -302078 416920 816440 437101
40119 437101 83830 559792 1528438 2163705 2276092 2159036 1927234 1762611 2260461 3621311
40109 3621311 4910085 5073649 4352473 3669293 2996776 1661893 139862 -40479 1428426
40100 1428426 2891303 2974795 2336065 2243042 2503077 2072816 1037754 559345 1022377
40091 1022377 1499885 1234613 629150 373831 364452 53760 -541326 -767880 -231875 599300
40081 599300 861554 320546 -209343 322611 1913351 3267496 3087266 1489720 -105724
40072 -105724 -434964 541569 2001271 3268335 4134651 4385492 3601653 1791440 -83834
40063 -83834 -814766 -277056 429498 416651 110508 499678 1669661 2671360 2671135 1691467
40053 1691467 338690 -663277 -790494 -190207 193702 -424597 -1592367 -2116819 -1642243
40044 -1642243 -1000380 -891449 -1028358 -884005 -523833 -234804 71734 586241 1158853
40035 1158853 1533094 1664891 1545835 1111864 511357 6982 -451908 -943832 -923983 141040
40025 141040 1388128 1155557 -527582 -1511549 -498253 1032503 1210961 661340 1081623
40016 1081623 2044729 1682300 139271 -318651 1035736 2154116 1518112 385646 357226
40007 357226 680318 -152790 -1561021 -1772458 -775695 -269252 -926325 -1614819 -1429445
39998 -1429445 -811329 -315059 253825 952216 1211291 858994 580491 724365 621785
39989 621785 -185314 -946547 -824046 -276889 -305835 -818928 -844216 -156086 354943 -18152
39979 -18152 -981073 -1850640 -2276592 -2207643 -1782640 -1441614 -1587407 -1967597 -1903796 -1242729
39969 -1242729 -520129 -104805 128768 147338 -340634 -969758 -663211 805909 2033635
39960 2033635 1720585 560983 275557 1164937 1899786 1644091 1049630 872403 832892
39951 832892 438053 -41177 -151749 -100931 -253092 -301854 297697 1390851 2263984 2488756
39941 2488756 2117387 1354920 597181 467397 1135701 1795027 1488515 349824 -632223
39932 -632223 -992547 -1188362 -1562007 -1699562 -1182488 -407656 -166640 -657850 -1281364 -1321064
39922 -1321064 -636137 257904 724216 687052 707435 1213324 1820119 1777188 1013218 289383
39912 289383 261665 812637 1408775 1694802 1588266 1210298 925917 1057284 1346199 1129943
39902 1129943 314662 -305739 -102260 473006 583667 286104 423999 1368613 2541008
39893 2541008 3245797 3382616 3158301 2610286 1720822 707367 -41798 -186328 393864
39884 393864 1344210 1818889 1226932 79922 -460593 -63010 375769 132396 -266257
39875 -266257 11389 718168 1000654 864500 1080181 1687718 1735376 835723 3549 320745
39865 320745 1407876 1898382 1109118 -265668 -927692 -167182 1428198 2298912 1412168
39856 1412168 -399228 -1248918 -603760 26696 -610216 -1551437 -1092302 518808 1371263
39847 1371263 682906 -219796 20720 1059195 1773181 1888482 1903045 2026820 1943920 1372877
39837 1372877 433452 -374910 -458342 259402 1008321 943873 191623 -498748 -980725 -1653673
39827 -1653673 -2244205 -1922989 -934498 -721848 -1735546 -2424584 -1410134 474277 1519700
39818 1519700 1545131 1569150 1844015 1792372 1474965 1556135 1977661 2112659 2133118 2741089
39808 2741089 3518602 3120406 1428282 51050 156752 1083014 1677038 1807369 1858782
39799 1858782 1832992 1735721 1892394 2087605 1320612 -685867 -2554416 -2813566 -1746422
39790 -1746422 -727424 -297197 70088 696675 1254253 1434525 1254447 838865 518785
39781 518785 811254 1625343 1925770 1018562 -246487 -532330 67634 292417 -286989
39772 -286989 -794067 -700350 -719921 -1576484 -2814603 -3427496 -3056844 -2115408 -1212498 -798004
39762 -798004 -923800 -1105278 -844647 -395127 -452151 -1021287 -1337178 -1110499 -1025868 -1587020
39752 -1587020 -2224591 -2105443 -1233774 -225384 455441 536852 -159723 -1238370 -1699266
39743 -1699266 -1068221 -89506 352100 457908 872188 1338340 1048456 113856 -370146
39734 -370146 202542 1258688 1965899 2149922 2143644 2263868 2532607 2547930 1808322 620059
39724 620059 259596 1431268 2924925 2884348 1276053 -77627 15299 806703 1014432
39715 1014432 330509 -859765 -2082265 -2586492 -1712414 -77166 700705 114142 -550863
39706 -550863 -335402 -14759 -376681 -610713 62624 506755 -622610 -2292763 -2470992
39697 -2470992 -1440057 -1235142 -2000042 -1681893 209547 1352787 309895 -1023881 -442205
39688 -442205 1108810 1292926 201234 -64543 1045308 1822139 1192568 216549 159000
39679 159000 671860 675058 -27714 -759235 -926939 -435472 391262 977685 984201 763234
39669 763234 898045 1294540 1310960 793820 287090 108458 -37300 -300225 -289382 177620
39659 177620 556255 272195 -522911 -1289051 -1759234 -1891749 -1618030 -1085335 -762359 -832992
39649 -832992 -812212 -225368 655029 1252291 1538995 1820115 1883103 1117267 -468498 -1993623
39639 -1993623 -2662725 -2494143 -1936536 -1263331 -623573 -263618 -305813 -538491 -735250 -992359
39629 -992359 -1474463 -2003116 -2179660 -1805093 -1003336 -143230 182178 -508701 -1845063
39620 -1845063 -2538672 -1687674 11439 1024637 877161 504834 648280 856644 522139
39611 522139 17382 33921 396054 419259 95245 19068 285665 330613 -86016 -494243
39601 -494243 -468221 -161344 76631 126464 24225 -129065 -169763 -183965 -652440 -1689897
39591 -1689897 -2346142 -1564822 112622 785993 -509051 -2564723 -3483027 -2658449 -829970
39582 -829970 1075961 2477139 3058842 2902934 2483717 2127351 1749744 1328062 1081523
39573 1081523 907152 359963 -355588 -198609 1183166 2489870 2279560 891450 -169813
39564 -169813 -344994 -342841 -564730 -518946 -8829 282156 -63267 -359852 143571 967636
39554 967636 972175 24310 -706983 -323750 558604 698476 57950 -81888 972569 2168951
39544 2168951 2135892 1076025 209593 -161308 -644363 -1018581 -232764 1515547 2460201
39535 2460201 1840478 1155684 1690684 2332598 1435893 -392647 -1259238 -871616 -471480
39526 -471480 -421231 52911 857595 836284 -143850 -682596 105106 1475714 2381916 2559799
39516 2559799 1955193 466451 -1255216 -2014399 -1586373 -915905 -492606 191008 1204293
39507 1204293 1675593 1370544 1368591 2293298 3091074 2568416 1144601 61306 -353223
39498 -353223 -665278 -1187791 -1676818 -1743004 -1070361 228482 1200517 831667 -452487
39489 -452487 -1085499 -540670 -10342 -375490 -883084 -713771 -517603 -1206375 -2316562
39480 -2316562 -2832616 -2724857 -2447379 -1808143 -659186 115643 -246696 -889683 -460436
39471 -460436 750186 1248835 593131 -203364 -334518 25579 502022 890225 830481 174983
39461 174983 -435489 -329658 90857 -8873 -484483 -541389 -156117 31954 -7029 212345
39451 212345 512312 274404 -251576 -172675 520297 928784 760231 566144 436699 -138423
39441 -138423 -921946 -869615 185174 1065951 937552 319721 -13111 -42923 21289 216674
39431 216674 312626 -160958 -934937 -1051588 -307743 375946 429794 372844 595129 571024
39421 571024 -37738 -546986 -290098 361119 701568 662959 555200 634151 1291709 2680584
39411 2680584 3823237 3382039 1801167 1157987 2121850 2765736 1582367 -77105 -307441
39402 -307441 145215 -765853 -2836488 -3907590 -3310081 -2549131 -2478634 -2177076 -1193043
39393 -1193043 -739375 -1625372 -2705303 -2595440 -1667283 -1137607 -1182755 -1174931 -1024863 -1018625
39383 -1018625 -779695 341747 1921711 2571138 1614050 -55153 -1066638 -1057542 -781823
39374 -781823 -1033534 -1780790 -2341678 -2194775 -1430893 -438023 553382 1382801 1674649 1092286
39364 1092286 -120987 -1212978 -1598159 -1230751 -390970 522010 1003466 706696 -129671
39355 -129671 -776227 -646911 291112 1618217 2685792 2894129 2174501 1145922 433279
39346 433279 -13835 -487520 -699811 -134184 903907 1454311 1193366 714641 421123
39337 421123 116459 -74280 454339 1473284 1633560 416117 -676663 -111439 1303272
39328 1303272 1544978 425499 -199598 667919 1742178 1529290 445891 -119769 73993
39319 73993 107291 -424772 -840677 -539081 95045 318459 132670 290429 1209922 2247192
39309 2247192 2387756 1568107 793335 725744 728445 -131748 -1591800 -2529336 -2562005 -2355385
39299 -2355385 -2336195 -2128992 -1542999 -1129960 -1248396 -1399585 -1106800 -762882 -947917 -1487003
39289 -1487003 -1830881 -1833801 -1532349 -757756 295071 718097 7510 -956338 -1000735 -303208
39279 -303208 95474 14543 109558 330972 -152153 -1304764 -1865733 -1120834 102235 792543
39269 792543 1084705 1523192 1899593 1702988 1114223 700233 533353 356440 264182 487364
39259 487364 756710 582783 30528 -380168 -428328 -300895 -58158 441931 1075674 1397167
39249 1397167 1158647 588806 118622 47765 398913 816023 680779 -317927 -1671480
39240 -1671480 -2377461 -1928946 -891019 -387717 -972444 -2012609 -2308712 -1407352 -105804
39231 -105804 565166 589200 716722 1134542 1111931 180819 -958368 -1155323 -112108 1375436
39221 1375436 2261570 2117001 1373386 867756 977734 1236767 1078894 747879 868655
39212 868655 1274838 1168808 556895 481549 1383934 2232165 1996519 1157374 853814 1170690
39202 1170690 1270272 822659 290199 -60339 -528934 -1318101 -2138777 -2544490 -2289647 -1494986
39192 -1494986 -740823 -612916 -807577 -307000 978578 1514295 82148 -2179684 -2977734
39183 -2977734 -1843044 -515138 -307663 -572054 -277982 241117 109089 -434014 -404071
39174 -404071 255349 538772 21370 -362179 281595 1297756 1262072 93965 -641726
39165 -641726 66316 1139936 1006219 33519 -29072 1158140 1961985 1401935 671954
39156 671954 1033825 1590042 666347 -1422283 -2637612 -2002548 -709219 -360639 -1174102
39147 -1174102 -2138677 -2253029 -1477459 -817649 -1246391 -2285878 -2338414 -938761 270102
39138 270102 -242456 -1601612 -1765065 -414892 835960 765324 -315901 -1512151 -2149178
39129 -2149178 -1842144 -943659 -607203 -1243045 -1477914 -60396 1897633 2394907 1646835
39120 1646835 1517959 2209290 2086313 937645 650831 1889367 2683024 1548576 -225882
39111 -225882 -845576 -606248 -673122 -958351 -857590 -690216 -803042 -471383 772303 1859420
39101 1859420 1736271 1110735 1170575 1634489 1627141 1469311 1938503 2610476 2585361 2108310
39091 2108310 1875790 1509208 398411 -671002 -550596 178708 4462 -1028639 -1479750
39082 -1479750 -901157 -227889 99452 586662 1232632 1365242 1069745 1144039 1482341 1166540
39072 1166540 385989 512626 1812163 2794545 2536980 2062230 2472948 3093532 2628630
39063 2628630 1180335 -64145 -532184 -623122 -737666 -796425 -578025 -6883 759698
39054 759698 1262272 1042137 229884 -506808 -768697 -781457 -794882 -588010 166735 1371040
39044 1371040 2528870 3090048 2754448 1718921 587174 -214710 -743652 -1002540 -597410
39035 -597410 449704 1064881 307114 -1059884 -1340865 -279857 551749 47920 -933281
39026 -933281 -1013792 -270757 153203 -166752 -541919 -407231 -79069 -40589 -56675 461970
39016 461970 1326542 1415624 90730 -1590166 -1865026 -503050 856082 929814 366357
39007 366357 401336 928260 1040955 787534 977776 1550801 1546936 703607 -198321 -688569
38997 -688569 -1083499 -1420962 -1169760 -380972 43319 -244951 -438079 -7458 273075 -405425
38987 -405425 -1378621 -1285393 32556 1330522 1574508 1023823 577863 558194 480798 -91482
38977 -91482 -834129 -1070929 -728581 -362918 -188541 203612 852363 1005394 355098 -127297
38967 -127297 450728 1421511 1598455 1180379 1208116 1585831 1332657 666210 982087 2447654
38957 2447654 3375564 2645811 1214575 401593 81599 -399673 -712986 -194598 784045
38948 784045 1304439 1320579 1573863 2319248 2964337 2943990 2403207 1924602 1764758 1438994
38938 1438994 320676 -1163647 -1541397 -168078 1551412 1909596 1296873 1370495 2206028
38929 2206028 2157127 611955 -1085909 -1861709 -2086794 -1948245 -748550 1179048 1900401
38920 1900401 591692 -956383 -1013098 -385998 -588249 -1194987 -1003241 -428775 -570763
38911 -570763 -973587 -558722 61453 -494287 -1724165 -1816332 -559752 504667 652296
38902 652296 555010 402983 -347838 -1238197 -984468 273979 924244 456113 90938 390760
38892 390760 339181 -484300 -885610 -204753 434386 210646 153681 1183747 2199140 1798473
38882 1798473 649492 325304 687622 321637 -918009 -1650658 -1209378 -518043 -430584
38873 -430584 -470430 232886 1569516 2580982 2606015 1941242 1443714 1554865 1777982 1358753
38863 1358753 437898 1862 545813 1424610 1844976 1821730 1690683 1388241 879994 668794
38853 668794 1049278 1344413 796463 -114071 -193300 786357 1857940 2267158 2190433 1952988
38843 1952988 1439865 613691 -106682 -420748 -594921 -937771 -1224773 -1052112 -498874
38834 -498874 -57881 -23567 -208401 -211878 164512 702670 926454 608956 127658 91971
38824 91971 568276 956727 794332 412319 501098 1153744 1699531 1561081 985319 676601
38814 676601 847823 1013065 808838 586433 771549 946735 329618 -764299 -835703 819892
38804 819892 2720275 2746484 823616 -982936 -1091448 -51136 771017 1035494 1157422
38795 1157422 1062584 398065 -389544 -376510 451084 1166994 1356976 1560906 2014471 2052809
38785 2052809 1326045 616711 650633 915410 622055 175216 533597 1508937 1936829 1421098
38775 1421098 718126 339206 -25535 -440308 -298765 466408 785810 -118368 -1407056
38766 -1407056 -1575734 -343284 1101710 1497896 637542 -676097 -1382474 -1060937 -304694
38757 -304694 62702 149214 763922 1955611 2721902 2567228 2302610 2563429 2567534 1458999
38747 1458999 55561 -153075 711355 1113567 447807 -259704 -118060 510306 1000715
38738 1000715 1350106 1554558 1175003 184981 -601753 -634525 -464274 -822261 -1476991 -1695885
38728 -1695885 -1319236 -650421 279171 1502241 2405045 2105159 669384 -678481 -860731
38719 -860731 -117657 413262 151182 -216571 332544 1665996 2436872 1796869 669440
38710 669440 599930 1573288 1960714 814442 -801098 -1350551 -844936 -408926 -391207 -79367
38700 -79367 746388 1132692 341744 -829042 -898248 362001 1572596 1490953 549369 178067
38690 178067 853519 1503590 1048399 -72817 -490883 260531 1199071 1232464 440465 -237567
38680 -237567 -166622 471722 1090090 1296566 1137068 906348 759336 585585 324554 158805
38670 158805 132037 -135467 -858836 -1415533 -923044 512307 1780895 2085736 1623000
38661 1623000 887333 134399 -214056 424715 1795344 2581245 1909166 487160 -475179
38652 -475179 -884312 -1432081 -2149523 -2333968 -1686923 -545132 860371 2345176 3053674
38643 3053674 2030276 -160517 -1462394 -608097 1331113 2250885 1313561 -572321 -2032648
38634 -2032648 -2372940 -1825270 -1285383 -1620271 -2725850 -3382762 -2461563 -215627 1883936
38625 1883936 2475523 1319905 -660259 -2009665 -1732095 -158512 1249934 1286703 100074
38616 100074 -1222774 -1780248 -1246017 332484 2422038 3955481 4167412 3457083 2813738
38607 2813738 2494025 1989368 1226600 874067 1243328 1749120 1840588 1718798 1702635 1625660
38597 1625660 1400526 1464441 1980540 2227591 1584540 606551 247669 438908 405340 64953
38587 64953 -5994 124404 -299972 -1264521 -1628083 -722851 590881 1082676 695255 308810
38577 308810 470159 987642 1473231 1706808 1565870 969134 -104317 -1560046 -2933236
38568 -2933236 -3325605 -2200818 -344698 646373 134064 -903650 -1279927 -956188 -519085
38559 -519085 -50458 663315 1230572 870345 -492408 -1952542 -2514671 -1963243 -948732
38550 -948732 -431255 -835968 -1598447 -1842873 -1531246 -1326706 -1233070 -393955 1212850 1985416
38540 1985416 683714 -1573335 -2612671 -2060720 -1483698 -1834395 -2268179 -1812066 -875904
38531 -875904 -386636 -313842 109322 1115322 2026825 2077474 1269999 378666 117760 317185
38521 317185 167153 -625633 -1403385 -1554911 -1291287 -893469 21599 1560584 2607386
38512 2607386 2113132 874118 559597 1226570 1453716 925554 978819 2108122 2829550
38503 2829550 2011459 703816 340325 454975 -234263 -1405467 -1540893 -358577 763786
38494 763786 804005 231687 -69297 33906 177313 172042 40060 -211821 -617743 -1232381
38484 -1232381 -2046208 -2738282 -2726056 -1751547 -234427 1157634 1992278 2004348 1145888
38475 1145888 72615 -93499 864231 1652349 985877 -690733 -1798854 -1639158 -958396
38466 -958396 -654817 -774631 -878179 -747117 -551992 -647283 -1152144 -1531895 -990817 335878
38456 335878 1150995 604212 -444407 -648482 -135697 -111751 -864043 -1511223 -1688472 -2059762
38446 -2059762 -2869597 -3307120 -2838385 -2047385 -1559773 -1152785 -560704 -147632 -47356
38437 -47356 355851 1213073 1491865 587769 -279097 297982 1574153 1629188 326601 -549863
38427 -549863 -164573 315935 68133 55096 987555 1546831 355801 -1446281 -1613900
38418 -1613900 -174113 730844 268705 -42607 780989 1425789 586544 -720968 -805883
38409 -805883 -33442 -28875 -863575 -1010347 72734 1169789 1331424 1041635 933381 794948
38399 794948 460176 423803 874507 1190179 1033943 887746 883727 321849 -854092 -1405544
38389 -1405544 -713591 -87922 -789775 -1904328 -1871320 -1155109 -1347880 -2256943 -2213052 -1105823
38379 -1105823 -643341 -1257664 -1261819 30258 789291 -223449 -1203375 -71806 1924136
38370 1924136 1934385 -74287 -1346719 -627347 268533 -243037 -1065164 -576316 585812
38361 585812 630914 -550579 -1424846 -1261681 -956511 -1337324 -1922388 -1795697 -941748 -243609
38351 -243609 -491088 -1591493 -2567661 -2407535 -1181690 -95551 -44622 -462149 -225081
38342 -225081 643908 1111582 833477 593115 864162 1095193 897958 814303 1133008 972747
38332 972747 -377331 -1964883 -2268602 -1338738 -605011 -795722 -1285086 -1438858 -1382219
38323 -1382219 -1323194 -1260561 -1557130 -2685342 -4126596 -4620634 -3849573 -2775553 -1959122
38314 -1959122 -846428 657476 1322111 397285 -849985 -752673 402705 1051115 784534
38305 784534 553245 687253 334103 -917540 -2227789 -2778623 -2765649 -2581909 -1958111
38296 -1958111 -645459 679674 992082 184720 -789334 -991205 -402233 221193 249342
38287 249342 -74766 117430 1182401 2282359 2231825 929419 -546095 -1295256 -1499427
38278 -1499427 -1752029 -2032890 -1868904 -1302241 -1112692 -1864902 -3030956 -3434062 -2604743
38269 -2604743 -1385662 -942384 -1382363 -1751654 -1333250 -465684 37591 -156282 -714860
38260 -714860 -1037212 -656661 380658 1374441 1602555 1231210 1125631 1625530 2101261
38251 2101261 1925706 1212985 330998 -545848 -1056904 -740967 -14905 -82689 -1175078
38242 -1175078 -1925047 -1391285 -569581 -667733 -1014893 -365867 612300 230520 -1276186
38233 -1276186 -1898104 -978752 -35335 -75847 -196946 407921 994295 859494 670410 971507
38223 971507 894035 -221487 -1225274 -808522 235687 126510 -1178672 -2099263 -1939999
38214 -1939999 -1603521 -1783235 -1949280 -1446232 -438372 591450 1366013 1570893 972224
38205 972224 90573 -78113 564857 859002 -67438 -1455106 -1763725 -562685 1048262
38196 1048262 1831550 1666049 1254902 1022265 732106 95649 -730420 -1453065 -2059324
38187 -2059324 -2540435 -2499467 -1596456 -266957 611251 773933 693478 647164 430165 166633
38177 166633 513556 1542615 2153282 1322869 -492220 -1863066 -2013804 -1400349 -922107
38168 -922107 -1046041 -1502364 -1466675 -313883 1476765 2543891 2147412 1024767 332029
38159 332029 246614 187669 -75212 -264993 -219651 25276 520212 1151453 1434217 1211464
38149 1211464 1165142 1827488 2451299 1853822 192449 -1150367 -1416908 -1133878 -820449
38140 -820449 -190100 929202 1857058 1881400 1160912 268131 -563325 -1174947 -1078729 -124803
38130 -124803 731907 214129 -1592562 -2965756 -2352978 -194591 1496352 1423357 445608
38121 445608 339115 1440202 2340099 2039362 1399717 1748422 2830036 3233802 2456439
38112 2456439 1364749 713596 354478 3089 -308116 -738748 -1523165 -2103191 -1546389
38103 -1546389 -200446 361508 -343467 -830151 -41605 772237 45710 -1358939 -1342059
38094 -1342059 67589 682454 -443144 -1676214 -1532692 -895391 -1292575 -2298245 -2190121
38085 -2190121 -549891 1235788 1900363 1554658 977835 640185 680569 1109853 1663293
38076 1663293 1874125 1549959 907943 180079 -553802 -1090046 -1103501 -599427 125 389922
38066 389922 644070 779974 510177 -227324 -870237 -844181 -354603 -65138 -110808 2910
38056 2910 491201 880963 756574 404273 298699 326482 82447 -244179 55394 1125935
38046 1125935 2099724 2055031 1048703 -160758 -1088430 -1732605 -2022228 -1709049 -932055
38037 -932055 -368620 -527322 -1162333 -1576631 -1271327 -240853 973826 1431604 576441
38028 576441 -836888 -1271919 -374177 330072 -457416 -1701020 -1359990 510573 1639472
38019 1639472 765933 -686127 -954977 -458001 -655785 -1516314 -1792280 -1306345 -1227091
38010 -1227091 -2021083 -2636874 -2146677 -1034545 -277113 -917 316556 851010 1188441
38001 1188441 853896 -133536 -1066614 -1073341 -247646 96750 -909994 -2107614 -1590990
37992 -1590990 441838 1596069 492142 -1378678 -1889902 -1079202 -460696 -542756 -598769
37983 -598769 -394245 -511049 -981482 -1044096 -529369 -281459 -778653 -1351507 -1299327 -919211
37973 -919211 -786346 -704855 -130539 794497 1378827 1351996 1048785 711114 236561 -288704
37963 -288704 -381195 196761 938314 1129105 716003 235277 -67206 -529176 -1283410 -1675932
37953 -1675932 -1002349 396240 1380662 1367233 873507 593032 503943 211931 -274647 -526875
37943 -526875 -206420 671742 1705274 2127551 1295397 -479929 -1963432 -2272577 -1787042
37934 -1787042 -1376235 -1154196 -621666 276883 998194 1212861 1101104 865329 589000
37925 589000 572300 1103579 1785931 1809689 1154679 839307 1547168 2582474 2776464 2043754
37915 2043754 1340089 1194545 1018409 142607 -968390 -1108645 102195 1561020 1916306
37906 1916306 1159385 449249 432947 488208 -38987 -604198 -285208 580866 637935 -541614
37896 -541614 -1714372 -1578070 -413787 399144 -1530 -1330602 -2685649 -3157755 -2321382
37887 -2321382 -778744 59380 -557369 -1640797 -1596497 -316159 746551 627896 -74855
37878 -74855 -532694 -935535 -1584614 -1719157 -544759 1094553 1543718 741342 292514
37869 292514 864480 1055469 -352826 -2353636 -3135938 -2612957 -2128310 -2184854 -1977631
37860 -1977631 -1102868 -329402 -358394 -866846 -1168494 -1018655 -436304 538960 1547429
37851 1547429 1962471 1589108 903051 462365 505463 1067714 1863850 2101477 1186083 -323667
37841 -323667 -1218150 -1123103 -680257 -318555 79107 233985 -484341 -1691449 -1977339 -912716
37831 -912716 109704 -174532 -1162229 -1458778 -760694 226211 899863 911311 25827 -1250044
37821 -1250044 -1653574 -644467 830496 1765717 2317715 2807841 2752637 2029612 1726766
37812 1726766 2351949 2410450 582713 -1725336 -2152833 -967704 -491760 -1280381 -1451787
37803 -1451787 -94968 1114392 565047 -973533 -1740755 -1233502 -103771 1004974 1642054
37794 1642054 1504534 898790 498784 317436 -179492 -797455 -667574 158205 509857
37785 509857 -71989 -659396 -608329 -500276 -731000 -578672 381988 1174691 792923 -308243
37775 -308243 -1064316 -1245583 -1161317 -857029 -532142 -815713 -1617477 -1623239 -70971 1789086
37765 1789086 2248980 1479854 980973 1183100 1064854 77758 -897204 -872949 -141508 162749
37755 162749 -481777 -1310663 -1112321 229617 1290419 699488 -980009 -1796247 -902827
37746 -902827 483544 931964 545275 252991 286041 173292 -329020 -974889 -1289418 -779020
37736 -779020 526826 1600883 1366677 277624 -173773 276335 323237 -575146 -1253598
37727 -1253598 -1034542 -1057971 -2173564 -3192878 -2815191 -1820668 -1602951 -1848369 -1567140
37718 -1567140 -1191118 -1530278 -1738969 -679610 566597 142122 -1214078 -1023962 871151
37709 871151 1986275 1203290 242978 381521 450043 -602090 -1554377 -1036499 57506
37700 57506 129412 -517830 -501010 153575 174905 -743284 -1492799 -1254810 -459170 64059
37690 64059 73877 -66326 132487 836243 1666507 2021457 1718088 1088816 462171 -42957
37680 -42957 -250627 -28724 292703 165911 -461965 -1175384 -1686770 -1783425 -990622 750689
37670 750689 2264405 2168837 761028 -268915 -53553 756396 1553798 2511285 3418925
37661 3418925 3388570 2394802 1649481 1643472 1266777 -132121 -1257574 -766683 522586
37652 522586 826159 -64851 -947947 -1265883 -1441214 -1503320 -882882 407257 1538889
37643 1538889 1890080 1463469 414633 -973748 -1972550 -1921243 -1045829 -114333 549117
37634 549117 1048800 1203342 681501 -237776 -762030 -444590 499167 1496915 1804830 868503
37624 868503 -837937 -1802244 -1109116 288526 739422 -67394 -1124603 -1738453 -2039367
37615 -2039367 -2118348 -1843560 -1522342 -1655050 -1961959 -1678685 -898684 -554014 -876894 -977426
37605 -977426 -338006 254761 -182066 -1506292 -2714271 -2967893 -2069889 -554979 414741
37596 414741 -54926 -1453656 -2284999 -1930801 -1352485 -1559203 -2237860 -2516155 -2280384
37587 -2280384 -1904178 -1313078 -320356 502214 359646 -475388 -913661 -659124 -582197 -1193328
37577 -1193328 -1703054 -1252387 -366130 -257564 -999836 -1398503 -779011 62291 184458
37568 184458 -6714 528827 1650002 1994339 868769 -730154 -1381724 -830562 153469
37559 153469 856372 931378 172699 -1192055 -2239337 -2173319 -1331554 -699493 -536895 -240091
37549 -240091 458820 1008565 947538 522010 76498 -467856 -1084882 -1230027 -587006 165980
37539 165980 6694 -1142516 -2304488 -2599348 -2092486 -1477830 -1276523 -1455047 -1601899
37530 -1601899 -1350383 -724679 -134353 16856 -284165 -722125 -1080606 -1487469 -2125800
37521 -2125800 -2742345 -2678995 -1607104 -98004 895387 1127299 1182448 1387276 1202421
37512 1202421 161213 -1110323 -1561252 -1142121 -738532 -761150 -719537 -358132 -244650
37503 -244650 -718955 -1076130 -582469 228336 193385 -751324 -1387637 -849566 341797 1162021
37493 1162021 1335625 1225348 980973 506333 89408 280711 945131 1078841 23860
37484 23860 -1567240 -2537074 -2681165 -2684443 -2744501 -2190254 -749609 649895 952450 288158
37474 288158 -421738 -737015 -878344 -956434 -788834 -375374 76607 497857 784558 525744
37464 525744 -427038 -1385093 -1630196 -1551122 -1993977 -2674790 -2483147 -1406322 -728117 -940106
37454 -940106 -938704 -33082 709542 268034 -461918 -127633 682379 302036 -1211874 -2027804
37444 -2027804 -1307279 -243179 54308 59906 470199 753312 158247 -804272 -1079124 -684106
37434 -684106 -507563 -835856 -1117425 -1043275 -895078 -791238 -468420 6858 102958 -270004
37424 -270004 -401785 183167 867888 769025 122678 85555 1108462 2209124 2235229 1372822
37414 1372822 833125 1232021 1898723 1871897 1026787 -47250 -805688 -972186 -421920
37405 -421920 545292 1058381 558093 -181757 244541 1866157 2870208 1822663 -254512
37396 -254512 -1011766 198452 1475732 853941 -1243397 -2696750 -2329162 -1014131 -236567
37387 -236567 -371946 -755900 -909377 -1016872 -1232626 -1141911 -325604 789293 1173694 413164
37377 413164 -716563 -1185786 -933032 -708053 -855408 -879738 -366981 266942 369974 -21397
37367 -21397 -376603 -518005 -680311 -855391 -722222 -286361 -5651 -104606 -236799 -12547
37357 -12547 541188 1163746 1568620 1419832 675864 33614 287145 1054200 1043917 -35338
37347 -35338 -903418 -719576 -504815 -1424143 -2668039 -2584519 -1231469 -55645 552020
37338 552020 1427629 2463505 2408306 1190259 311986 243822 -401655 -2020316 -2592403
37329 -2592403 -825359 1240595 1002946 -805434 -1492806 -629143 -131567 -652750 -766404
37320 -766404 146869 932220 1083805 1566163 2394918 1892249 -376633 -2165064 -1671945
37311 -1671945 -235990 -87523 -993543 -1187620 -432956 42974 -74331 -24509 193330
37302 193330 -156302 -804497 -644145 273801 655113 103324 -319082 -69855 -75604 -1058906
37292 -1058906 -2300193 -2854702 -2836377 -2633742 -1873674 -199682 1608805 2325702 1761765
37283 1761765 804532 242905 172752 330776 431365 275892 -56156 -212089 -22506 208560
37273 208560 80123 -429229 -1024026 -1427732 -1558363 -1584566 -1781681 -2022633 -1587426 -90899
37263 -90899 1482640 1553007 -274 -1418313 -1179206 215113 1164264 992350 283355
37254 283355 -258536 -373711 38494 866079 1501007 1378759 830994 719371 1171329 1408032
37244 1408032 1033016 746074 1262457 2053848 1927823 739842 -269102 -160769 322377
37235 322377 -190645 -1545839 -1997251 -589725 1390782 2146597 1777231 1778416 2553968
37226 2553968 2886166 1987450 651420 -139981 -490076 -732627 -463760 522539 1198271
37217 1198271 425686 -1343574 -2591059 -2662607 -2182670 -1766602 -1351179 -820444 -420932
37208 -420932 -372476 -620006 -1026229 -1401965 -1460671 -1140610 -771033 -586774 -459983 -447626
37198 -447626 -955845 -1826025 -2070968 -1339800 -793113 -1421482 -2341435 -2203962 -1556692 -1955143
37188 -1955143 -3115529 -3086377 -1400243 63719 -31945 -656150 -390092 445316 802730
37179 802730 699903 757053 942176 877488 596716 188485 -383757 -461695 976355 3259468
37169 3259468 3879601 1829185 -393169 8645 2113089 2726405 1068822 -517226 -390160
37160 -390160 399458 439147 55514 121612 456063 506446 418380 457360 317674 -185221
37150 -185221 -558742 -422613 -69710 240452 633272 838041 203726 -907311 -1036111
37141 -1036111 172084 997970 111977 -1209225 -947287 521322 1104842 303956 -317255
37132 -317255 -11611 -18042 -1186848 -2361544 -2274190 -1529703 -1279650 -1097400 100707 1687245
37122 1687245 1755794 -95775 -2042646 -2424875 -1495100 -329083 640641 1220864 840438
37113 840438 -464808 -1311682 -577727 764649 836216 -415920 -1229567 -782621 -200349
37104 -200349 -285388 22210 1728668 3640650 3731505 1986019 325639 -42470 245953
37095 245953 253854 70840 248221 893455 1704467 2217147 1889511 680267 -453490 -555579
37085 -555579 -180369 -758183 -2282347 -3004307 -1983177 -545545 -252987 -635882 -221598
37076 -221598 1112624 2266269 2761538 2929459 2629786 1427392 21601 -138674 976238
37067 976238 1648648 838269 -364898 -502321 191921 549876 427429 647841 1409757
37058 1409757 1957769 1797792 1283156 909377 816948 1104221 1857797 2608087 2447932 1155189
37048 1155189 -244831 -518774 401307 1463241 1732250 1186998 361374 -360633 -910081
37039 -910081 -1247591 -1224338 -801690 -282905 -150460 -578967 -1176640 -1348981 -921722 -265339
37029 -265339 207075 445027 549042 414722 -94253 -737365 -1059518 -989824 -870518 -773638
37019 -773638 -283887 712258 1513476 1459082 941355 802677 938405 497010 -462561 -706347
37009 -706347 241728 1037451 395562 -823211 -742275 765609 1917795 1565240 415173
37000 415173 -539487 -1305517 -1943122 -1717167 -295805 1164834 1356129 631809 326859
$$ [...]
##END NTUPLES=NMR SPECTRUM
##END=
