##TITLE=31Pdec_3PBDP2310
 CDCl3, 24 sc
 26.10.2020
##JCAMPDX= 6.0         $$ Bruker NMR JCAMP-DX V2.0
##DATA TYPE= NMR SPECTRUM
##DATA CLASS= NTUPLES
##ORIGIN= UXNMR, Bruker Analytische Messtechnik GmbH
##OWNER= root
$$ XWIN-NMR		Version 3.5
$$ Mon Oct 26 11:34:41 2020 Russian Standard Time (UT+4h)  she@DPX200
##.OBSERVE FREQUENCY= 81.013821
##.OBSERVE NUCLEUS= ^31P
##.ACQUISITION MODE= SIMULTANEOUS
##.ACQUISITION SCHEME= undefined
##.AVERAGES= 24
##.DIGITISER RES= 17
##SPECTROMETER/DATA SYSTEM= spect
##.PULSE SEQUENCE= zgpg30
##.SOLVENT NAME= CDCl3
##.SHIFT REFERENCE= (INTERNAL, CDCl3, 0, 182.463)
##AUDIT TRAIL= $$ (NUMBER, WHEN, WHO, WHERE, WHAT)
$$ ##TITLE= Audit trail, XWIN-NMR		Version 3.5
$$ ##JCAMPDX= 5.01
$$ ##ORIGIN= Bruker BioSpin GmbH
$$ ##OWNER= she
$$ F:/spectra/data/she/nmr/P31/1/pdata/1/auditp.txt
$$ ##AUDIT TRAIL=  $$ (NUMBER, WHEN, WHO, WHERE, WHAT)
(   1,<2020-10-26 11:33:26.26 +0400>,<she>,<DPX200>,
      <created by zg, POWCHK disabled, PULCHK disabled
       configuration hash MD5:
       00 E9 B6 7A A2 85 ED C7 34 08 36 98 17 FE 4E 26
       data hash MD5: 32K
       4D 72 87 87 4F 55 27 B8 5E 70 9A 29 09 14 18 EF>)
(   2,<2020-10-26 11:33:31.90 +0400>,<she>,<DPX200>,
      <Start of raw data processing
       efp BC_mod = 2 LB = 1 FT_mod = 6 PKNL = 1 PHC0 = -2387.144 PHC1 = 73.00069 SI = 64K 
       data hash MD5: 64K
       1C CC 56 E3 06 F5 9E B8 F5 A0 5A 68 26 47 E1 FA>)
(   3,<2020-10-26 11:33:59.50 +0400>,<she>,<DPX200>,
      <pk PHC0 = 4.247924 PHC1 = 0 
       data hash MD5: 64K
       5E BC 04 EC 4C A7 D9 C1 E5 DA 0E 4B FB F1 58 EB>)
(   4,<2020-10-26 11:34:02.65 +0400>,<she>,<DPX200>,
      <abs ABSG = 5 
       data hash MD5: 64K
       22 4A 65 0B F9 C4 B7 C9 12 C5 1E 19 B2 7C 34 06>)
$$ ##END=
$$ 
$$ hash MD5
$$ 6C 40 39 20 71 FE 4F 11 73 6A 42 0B 2F 58 F0 55
##$RELAX= 
##$RELAX= 
##$RELAX= 
##$RELAX= 
##$RELAX= 
##$RELAX= 
##$RELAX= 
##$RELAX= 
$$ Bruker specific parameters
$$ --------------------------
##$DU= <F:/spectra>
##$EXPNO= 1
##$NAME= <P31>
##$PROCNO= 1
##$TYPE= <nmr>
##$USER= <she>
##$AMP= (0..31)
100 100 100 100 100 100 100 100 100 100 100 100 100 100 100 100 100 100 
100 100 100 100 100 100 100 100 100 100 100 100 100 100 
##$AQSEQ= 0
##$AQ_mod= 1
##$AUNM= <au_zg>
##$AUTOPOS= <>
##$BF1= 81.014009
##$BF2= 200.13
##$BF3= 200.13
##$BF4= 200.13
##$BF5= 200.13
##$BF6= 200.13
##$BF7= 200.13
##$BF8= 200.13
##$BYTORDA= 1
##$CFDGTYP= 0
##$CFRGTYP= 5
##$CHEMSTR= <none>
##$CNST= (0..31)
1 1 145 1 1 1 1 1 1 1 1 1 1 1 1 1 1 1 1 1 1 1 1 1 1 1 1 1 1 1 1 1 
##$CPDPRG= <waltz16>
##$CPDPRG1= <>
##$CPDPRG2= <waltz16>
##$CPDPRG3= <>
##$CPDPRG4= <mlev>
##$CPDPRG5= <mlev>
##$CPDPRG6= <mlev>
##$CPDPRG7= <mlev>
##$CPDPRG8= <mlev>
##$CPDPRGB= <>
##$CPDPRGT= <>
##$D= (0..31)
0 1 0 0 0 0 0 0 0 0 0 0.03 2e-05 3e-06 0 0 0 0 0 0 0 0 0 0 0 0 0 0 0 0 
0 0 
##$DATE= 1603697605
##$DBL= (0..7)
120 120 120 11 120 120 24 19 
##$DBP= (0..7)
150 150 150 150 150 150 150 150 
##$DBP07= 0
##$DBPNAM0= <>
##$DBPNAM1= <>
##$DBPNAM2= <>
$$ [...]
##$SUBNAM3= <"">
##$SUBNAM4= <"">
##$SUBNAM5= <"">
##$SUBNAM6= <"">
##$SUBNAM7= <"">
##$SUBNAM8= <"">
##$SUBNAM9= <"">
##$SW= 369.568048894756
##$SWIBOX= (0..15)
0 1 3 0 0 0 0 0 0 0 0 0 0 0 0 0 
##$SW_h= 29940.119760479
##$TD= 32768
##$TD0= 1
##$TE= 0
##$TE2= 300
##$TE3= 300
##$TEG= 300
##$TL= (0..7)
0 120 53 12 22 120 120 120 
##$TP= (0..7)
150 150 150 150 150 150 150 150 
##$TP07= 0
##$TPNAME0= <>
##$TPNAME1= <>
##$TPNAME2= <>
##$TPNAME3= <>
##$TPNAME4= <>
##$TPNAME5= <>
##$TPNAME6= <>
##$TPNAME7= <>
##$TPOAL= (0..7)
0.5 0.5 0.5 0.5 0.5 0.5 0.5 0.5 
##$TPOFFS= (0..7)
0 0 0 0 0 0 0 0 
##$TUNHIN= 0
##$TUNHOUT= 0
##$TUNXOUT= 0
##$USERA1= <user>
##$USERA2= <user>
##$USERA3= <user>
##$USERA4= <user>
##$USERA5= <user>
##$V9= 5
##$VALIST= <valist>
##$VCLIST= <CCCCCCCCCCCCCCC>
##$VD= 0
##$VDLIST= <DDDDDDDDDDDDDDD>
##$VPLIST= <PPPPPPPPPPPPPPP>
##$VTLIST= <TTTTTTTTTTTTTTT>
##$WBST= 1024
##$WBSW= 4
##$XGAIN= (0..3)
0 0 0 0 
##$XL= 0
##$YL= 0
##$YMAX_a= 89927
##$YMIN_a= -84960
##$ZGOPTNS= <>
##$ZL1= 120
##$ZL2= 120
##$ZL3= 120
##$ZL4= 120
##$ABSF1= 182.463
##$ABSF2= -187.1042
##$ABSG= 5
##$ABSL= 3
##$ALPHA= 0
##$AQORDER= 0
##$ASSFAC= 0
##$ASSFACI= 0
##$ASSFACX= 0
##$ASSWID= 0
##$AUNMP= <proc_1d>
##$AZFE= 0.1
##$AZFW= 0.5
##$BCFW= 0
##$BC_mod= 2
##$BYTORDP= 0
##$COROFFS= 0
##$CY= -3
##$DATMOD= 1
##$DC= 0
##$DFILT= <>
##$DTYPP= 0
##$F1P= 0
##$F2P= 0
##$FCOR= 1
##$FTSIZE= 65536
##$FT_mod= 6
##$GAMMA= 0
##$GB= 0
##$INTBC= 1
##$INTSCL= 5.30512e-09
##$ISEN= 30
##$LB= 1
##$LEV0= 0
##$LPBIN= 0
##$MAXI= 10000
##$MC2= 0
##$MEAN= 0
##$ME_mod= 0
##$MI= 50
##$NCOEF= 0
##$NC_proc= -4
##$NLEV= 6
##$NOISF1= 182.463
##$NOISF2= 159.3651
##$NSP= 0
##$NTH_PI= 0
##$NZP= 0
##$OFFSET= 182.463
##$PC= 4
##$PHC0= -2382.896
##$PHC1= 73.00069
##$PH_mod= 1
##$PKNL= yes
##$PPARMOD= 0
##$PSCAL= 0
##$PSIGN= 0
##$REVERSE= no
##$SF= 81.014009
##$SI= 65536
##$SIGF1= 159.3651
##$SIGF2= -187.1042
##$SINO= 113.3802
##$SIOLD= 16384
##$SREGLST= <1H.CDCl3>
##$SSB= 0
##$STSI= 65536
##$STSR= 0
##$SW_p= 29940.119760479
##$SYMM= 0
##$S_DEV= 0
##$TDeff= 32768
##$TDoff= 0
##$TI= <>
##$TILT= no
##$TM1= 0
##$TM2= 0
##$TOPLEV= 0
##$USERP1= <user>
##$USERP2= <user>
##$USERP3= <user>
##$USERP4= <user>
##$USERP5= <user>
##$WDW= 1
##$XDIM= 65536
##$YMAX_p= 389669230
##$YMIN_p= -2543984
$$ End of Bruker specific parameters
$$ ---------------------------------
##NTUPLES= NMR SPECTRUM
##VAR_NAME=  FREQUENCY,     SPECTRUM/REAL,   SPECTRUM/IMAG
##SYMBOL=    X,             R,               I
##VAR_TYPE=  INDEPENDENT,   DEPENDENT,       DEPENDENT
##VAR_FORM=  AFFN,          ASDF,            ASDF
##VAR_DIM=   65536,         65536,           65536
##UNITS=     HZ,            ARBITRARY UNITS, ARBITRARY UNITS
##FACTOR=    0.456856943014862, 1,           1
##FIRST=     14782.0589164895, 0,            0
##LAST=      -15158.0608439895, 0,           0
##MIN=       -15158.0608439895, -2543984,    0
##MAX=       14782.0589164895, 389669230,    0
$$ Real data points
##PAGE= N=1
##DATA TABLE= (X++(R..R)), XYDATA
$$ [...]
42590h87178K50893J18453p4873o6172L5615P5370J54745L64030N02592L53206
42580H26681L2124j89945k46660k40135k25784k33230l08726l54639j64018J95130
42570i09202L31797J16808k6417K41571N84948M80869L0186k14465m6231K51113
42560H40977M01059L10527q2455o35766q44692m07520J93992K67060q5484k03485
42550b45787J1024K9723k38094k30697J99357M01162J6344l55488j33538K88756
42540b57238K21056k21501l93916j35025J65563K72816K67507J65603p0977k43239
42530b29351j10557J90775L08974J61383o8704k60476l49426j98095J52689L14692
42520h8096M7257k81948j84950J84475K71667q31j60519J5228J70753k9804l97523
$$ y = [-887178, -636285, -517832, -592705, -658877, -623262, -547892, -393147, -29117, 473475, 826681, 858805, 668860, 422200, 182065, -43719, -276949, -585675, -940314, -1104332, -909202, -577405, -460597, -487014, -245443, 339505, 820374, 850560, 636095, 589864, 840977, 1242036, 1552563, 1470108, 834342, -10350, -417870, -223878, 43182, -42302, -245787, -234763, -205040, -443134, -673831, -474474, -73312, -56968, -412456, -545994, -257238, -36182, -257683, -651599, -786624, -621061, -348245, -80738, 84865, 13888, -229351, -339908, -149133, 159841, 321224, 252520, -7956, -357382, -555477, -402788, -88096, -40839, -322787, -507737, -323262, -51595, -52426, -212945, -197717, -26964, -56768, -454291]
42509d54291m91682j46271L79201O24784L38991j89690l59728q192L18674J42982
42499A54778k21890j91791J42256K18770k0650r1045J20886J60052j30096k68221
42489a26951L5205L37590J66394k30456k98630J416K33371J30054j74256m16286
42479c42549m22882j72907J52221K97001K40465K07491K79262K41053m5607l81093
42469E2455n06105m02632j74174J02489K60112J00636k28383k59937J32174M47217
42459d76148K60075j25614j45875J78893L65192K53011J22419P7013j21931m90392
42449a03357n91640j44398M63889N87958J06966m50196n15344m9910M94160O71567
42439D69695M51736J46638q224q9397k57649m38041m06116j47172P9536R2103
$$ y = [-454291, -945973, -1092244, -713043, -88259, 250732, 61042, -298686, -306878, 11796, 154778, -67112, -258903, -116647, 102123, 81473, -9572, 111314, 271366, 141270, -126951, -91746, 245844, 412238, 181782, -116848, -115432, 117939, 247993, 73737, -342549, -765431, -938338, -786117, -489116, -248651, -41160, 238102, 479155, 433548, 52455, -453650, -856282, -1030456, -927967, -667855, -567219, -795602, -1055539, -923365, -476148, -216073, -341687, -487562, -308669, 56523, 309534, 431953, 508966, 387035, -103357, -694997, -839395, -375506, 212452, 319418, -130778, -646122, -696032, -201872, 469695, 921431, 1068069, 1059845, 970448, 712799, 274758, -131358, -278530, -198994, -106891]
42429a06891L2710J35090L41259L28483m8116m76688m89566k4654M53662M59876
42419F05165J1005m50380n63218l38760j5782J82519J49447n7324k16477j40860
42409h34665P3252J36574l8558j89123m2365L22424N73208N04948K06732j03663
42399F08764l02999m05380m36349l26981m018M09338O11004M44519J09271q9350
42389F17819j08148j14616j61794j54652j07659j67559l27637l51081q7093K86919
42379f75501M39789K31825j46243l37377j70019J07519Q0789k56657m15437q7081
42369a228393L72413M56476K30900J00954R6800l7672j98766m5054K57674J43961
42359A49293l80820o08952k09347K68767L08012J51461J74012J77993j03475l46170
$$ y = [-106891, -74181, 60909, 402168, 730651, 682535, 205847, -283719, -308373, 145289, 605165, 616170, 165790, -397428, -736188, -751970, -569451, -420004, -477328, -693805, -834665, -761413, -624839, -663397, -852520, -894885, -572461, 747, 505695, 712427, 608764, 305765, -99615, -535964, -862945, -866963, -457625, 153379, 597898, 707169, 617819, 509671, 395055, 233261, 78609, -29050, -196609, -524246, -875327, -962420, -675501, -235712, -3887, -150130, -487507, -657526, -550007, -469218, -725875, -1141312, -1228393, -855980, -399504, -168604, -67650, 29150, -8522, -207288, -252342, 5332, 149293, -231527, -840479, -1049826, -781059, -473047, -321586, -147574, 30419, -73056, -419226]
42349d19226j47024K07823J74853j33600j50377K04982M32318K38105j28491l11065
42339c1702j89621J54824M51406L38312j82071n55611l32906J87152L90951J95780
42329D26514k4668j29085k50726l16486j33996J26214J24003l6728K6697K53327
42319F5066K08038j31692l03805j36606L5563L2284P6835K40460K53919P0621
42309D10683K6229K02649K04347j56514m92689m64287k61375j45058o459K49975
42299d32499L54397J25736j23102p0554P1051n3285l04549k78547L2747K58200
42289d20405K07786L8719n7395k7285J11199K67012K89882J63474N3931K6812
42279F53730p4288k99076l98343j91364J14368K25486J64377J12507P9143Q508
$$ y = [-419226, -566250, -358427, -183574, -317174, -467551, -262569, 169749, 407854, 279363, -31702, -221323, -66499, 384907, 723219, 541148, -14463, -347369, -160217, 230734, 426514, 401846, 272761, 22035, -294451, -428447, -302233, -178230, -214958, -188261, 65066, 273104, 141412, -162393, -298999, -263436, -231152, -154317, 86143, 340062, 410683, 436912, 639561, 843908, 687394, 194705, -269582, -530957, -676015, -682474, -432499, -78102, 47634, -75468, -146022, -74971, -128256, -432805, -711352, -678605, -420405, -212619, -173900, -231295, -258580, -147381, 119631, 409513, 572987, 626918, 653730, 579442, 280366, -117977, -309341, -194973, 30513, 194890, 307397, 386540, 395048]
42269C95048K314J26720J80698k8594l32068m18506k62244m8375J56863L41958
42259A13814L27355j0211l87461l72012M0708M43211N72707N05863L20106l4471
42249A519609m31553n14917j69637J99328J16715l47270o39422l88662J71283
42240d84526N06827L85749L8836k19751l14399k79247n8354L21660N46079L18669
42230G61543j76470m59497l93247k71784k47039j04660K44954M79878L26677k4423
42220A35932k23409j94716l4959K17016M41346L67005n3044m46053m83275k86415
42210e60572j02679J11683M34334O05783L53393j08806l15473j45758J53178L54693
42200G79776L33593n017m96405o62073l09269P1720j3168k64240o6356M60056
$$ y = [395048, 397362, 524082, 704780, 676186, 344118, -74388, -336632, -385007, -228144, 113814, 441169, 430958, 43497, -328515, -287807, 155404, 728111, 1233974, 1554080, 1519609, 1088056, 573139, 403502, 602830, 719545, 372275, -267147, -655809, -484526, 22301, 408050, 446886, 227135, -87264, -366511, -424865, -103205, 442874, 761543, 585073, 125576, -267671, -539455, -786494, -891154, -646200, -166322, 160355, 135932, -87477, -282193, -317152, -100136, 341210, 708215, 655171, 209118, -274157, -560572, -663251, -551568, -117234, 488549, 841942, 733136, 417663, 271905, 425083, 779776, 1113369, 1108352, 611947, -50126, -359395, -287675, -300843, -565083, -631439, -171383]
42190a71383O01210J66932k66742k87054j24129o1198j6066P5027M2658r9006
42180a39751n1273K08049K82124K7286j70977q9049n8719k75534k94441K25530
42170c36755P55043N67082j21435m13752k8805L73426K20904k44218m71947l42293
42160d2750j09633M6642J05504M0233j46562l04821k54952o17K85848M48329M34599
42149E01820K58885j6809k75128l95043l33285j41313Q1730K40802K86581K38237
42139D46477J45026J2008j87118l89019m11941j61926J62399K29710j1825k35412
42129d01621j51744J19355K53326J71489O0161J4700n2731j41243r4101R8394
42119a24015J91394M0484j40581o5766K12514L55372J40212k92023n54502l74025
$$ y = [-171383, 429827, 596759, 330017, 42963, -81166, -142364, -158430, -83403, -40745, -139751, -191024, 17025, 299149, 326435, 155458, 66409, 7690, -267844, -562285, -336755, 418288, 985370, 863935, 450183, 421378, 794804, 1015708, 771490, 299543, -42750, -152383, -105741, -237, 39996, -106566, -411387, -666339, -666956, -381108, 67221, 501820, 760705, 743896, 468768, 73725, -259560, -400873, -319143, -78341, 208240, 446477, 591503, 603511, 416393, 27374, -384567, -546493, -384094, -154384, -166209, -401621, -553365, -434010, -180684, -9195, 50966, 65666, 12935, -128308, -222409, -124015, 67379, 107863, -32718, -98484, 114030, 469402, 609614, 317591, -236911, -610936]
42109f10936Q5386L33108J51505o1695J29289M36519K07033m67815o95979p6610
42099e70195O37714O15334Q1604k06600j23952j02069k31634k08469k5190j313
42089a34770j52621j47567R2251K73455K20354L7723j59405k66260r3889K93625
42079c7104L89829n7708m59409j82384L68836L39393j44545j83584L27745N17303
42069H78372P2168k46458q81J77473j82534m89078j60803L20126K71444m7919
42059E91910m6399J06950p8790m13140l79979p8696O0695J16761L65945N14926
42049G60183J76310k10034N4438O36025N12780m10149j066682p67811m6714L01942
42039e9712K25837J07911R3875R9435N1942j25028m20242n44871k40746K08319
$$ y = [-610936, -525550, -192442, -40937, -102632, 26657, 463176, 670209, 202394, -493585, -570195, 67519, 682853, 764457, 557857, 433905, 331836, 100202, -108267, -133457, -134770, -287391, -434958, -342707, -69252, 151102, 188825, 29420, -236840, -330729, -37104, 352725, 295017, -164392, -346776, 22060, 361453, 216908, 33324, 361069, 878372, 950540, 704082, 703201, 880674, 698140, 209062, 48259, 368385, 639829, 591910, 545511, 652461, 573671, 160531, -219448, -298144, -237449, -120688, 245257, 760183, 936493, 726459, 780897, 1416922, 1929702, 1519553, 452871, -314940, -361654, -59712, 166125, 274036, 367911, 467346, 519288, 394260, -25982, -570853, -811599, -603280]
42029f03280K61892o6241k28821j7428J78314Q2336r6201j52090j64247j17843
42019i23609J71966N62885N95533K23931m9274m732m0503l65923n32466k19219
42009e81411J29795J6777k72374j67344K44598M26400K65802J10664J07238Q9807
41999C69952K4291L7995Q3874M0419M7101K72370M56002J98825l46984o08509
41989E75336m14702j60497j05319o0425R4107J31468m2778j20816R0620L02077
41979B89071K33568R3909J65188K45926J056l74105l95038p2884J18032L9821
41969C44544M7807K34315J57982l52286o95875l12645M11140O52563L19780N4081
41959H61406J58254K18174r4405m75298n18967l02973j16423O951J51436K36849
$$ y = [-603280, -341388, -407629, -636450, -653878, -475564, -393228, -489429, -641519, -805766, -923609, -751643, -188758, 406775, 630706, 581432, 576700, 536197, 170274, -362192, -581411, -451616, -434839, -707213, -874557, -629959, -203559, 62243, 172907, 280145, 369952, 394243, 432238, 516112, 556531, 603632, 876002, 1332004, 1530829, 1183845, 575336, 160634, 137, -105182, -165607, -71500, 59968, 17190, -103626, -13006, 289071, 522639, 616548, 781736, 1027662, 1028718, 654613, 259575, 186691, 304723, 344544, 392351, 626666, 784648, 432362, -263513, -576158, -165018, 487545, 807325, 861406, 1019660, 1237834, 1143429, 668131, 149164, -153809, -270232, -263281, -111845, 125004]
41949A25004J99790J80279K32490J49357j13740j90183J17436L54316M2459m76144
41939F21064m65959N8798L12336q2247n51062m44815P6601L81740K37645j9264
41929A24837j3870K38426L90181J43503l86238p23767n71716j87081k084j2323
41919a000132J03996L49833L60276M0527k10253q3947K06604K85334R0770j92541
41909d9533l95377l74163l9551M18640N76824K62041j94587l61424j91463L7550
41899c11043R5434k1024j42305q2743J30479K10055n176k03002K1333M87230N83816
41888G63054J51647k85661l18736j77086k07113k98930j84684O1009J87566J63773
41878a45161R6795K663q4043l1839J30682J69797N5578N8877K32792K37817m0340
$$ y = [125004, 324794, 505073, 737563, 886920, 773180, 582997, 700433, 1054749, 1097208, 621064, 155105, 213903, 526239, 443992, -107070, -551885, -475284, -93544, 144101, 124837, 110967, 349393, 739574, 883077, 496839, -226928, -798644, -985725, -987809, -1000132, -896136, -546303, -186027, -145500, -355753, -439700, -233096, 52238, 143008, -49533, -444910, -819073, -858624, -439984, 136840, 398881, 204294, -157130, -348593, -311043, -215609, -236633, -378938, -461681, -331202, -121147, -126323, -329325, -307992, 179238, 763054, 914701, 629040, 310304, 133218, -73895, -372825, -557509, -496500, -308934, -145161, -48366, -45703, -129746, -161585, -30903, 138894, 194472, 253349, 486141, 723958, 683618]
41867F83618j97645j4377P3132k84090o21598l31857L08124N02938J10185k66406
41857c7976k39698k2292J17444J71310J47455K9165l0622P2594Q3400k16289m68418
41846c93927k00688L27286M51305J84510J58016M58151M26808j54746n72985k97428
41836C86302J81477J78378j51589k27255j8099N1049j19120k20456r5811Q8786
41826E3662J43488N293k69680m23409j52423L89025N64425Q2419m82991m39878
41816e30069N0491K77616M0069j99052j32560K1861M0564M7066J71180K67817
41806E4983J83298L901j35614k47128l47891l44770j98463j9522J09665K33234
41796g08307L53899L60420K28757J06544P5163R771j80694l46441l07049j32073
$$ y = [683618, 485973, 471596, 544728, 260638, -360960, -692817, -384693, 118245, 228430, -37976, -277674, -299966, -182522, -11212, 136243, 165408, 134786, 207380, 290780, 74491, -393927, -594615, -267329, 183976, 368486, 526502, 984653, 1411461, 1256715, 683730, 386302, 567779, 746157, 594568, 367313, 349214, 400263, 281143, 60687, -35124, 53662, 197150, 202443, -67237, -490646, -643069, -254044, 310381, 392800, -90191, -530069, -479578, -201962, -161893, -360945, -493505, -471644, -431080, -384014, -212834, 54983, 238281, 242182, 106568, -140560, -488451, -833221, -1031684, -1051206, -941541, -708307, -354408, 6012, 234769, 341313, 416476, 426247, 245553, -100888, -407937, -540010]
41786e40010j9012L879M5829J00097N5991n5642p0402J6526K421j73186k52380
41775h85889j7977L32629M10328J48232j54301k68125k44491j58055O8095M37361
41765c32193P03558O11654J90068l16666o51525n91568o0692N93288P15804R2684
41755I54412o09367n63476J58562O94036N28084L6852j97502j28490o7935j50795
41745F54381k77139l37754k44854N3600L84466M06140P0362k17206j41666P2892
41735D23222N9468r8767o1076J62496K39815P9830p9954j56065l36502o06746
41725c74279n96484j47239L06590K67586j10905k18584J53538N22706L99295l9334
41715A62890k30783l2375J22537p2668l07893j41167K82211M15403J31198j16240
$$ y = [-540010, -559022, -555143, -509314, -409217, -353226, -408868, -479270, -462744, -460323, -633509, -885889, -903866, -571237, -160909, -12677, -166978, -435103, -679594, -837649, -769554, -332193, 371365, 983019, 1173087, 856421, 204896, -386672, -447364, 145924, 861728, 954412, 345045, -218431, -59869, 634167, 1162251, 1199103, 1001601, 873111, 805176, 654381, 377242, 39488, -205366, -151766, 232700, 638840, 709202, 491996, 350330, 423222, 482690, 383923, 322847, 485343, 725158, 804988, 725034, 568969, 232467, -374279, -970763, -1118002, -811412, -543826, -654731, -873315, -719777, -197071, 202224, 162890, -67893, -100268, 22269, -50399, -358292, -499459, -217248, 198155, 329353, 213113]
41705B13113k9260J08200k6480k52877k41446o5349K8307J20096L83112N45433
41695G82849J91162m51478o55185k28027K01745J51209n2217P1315L53243L39213
41685G03829P5500m3850J3682m3249j94925j19608J53713K00862o1555j72372
41675E12027R6196K99720M2933l27513k66653P4276J12864j86713k78118J5688
41665I4707J92216q0036l97332k74186J04036K40190J04398M6547J34715J08869
41655B74124p7117j63244n6636L8823K5792M0124R6100K1973j27602l3506L08159
41644C46990M05142j5012m85562m06577J06463M32177L19083P3624m4781j22779
41634F08768k34199k22937j8470J41317Q178l29730n46460m20777j8629L66524
$$ y = [213113, 183853, 292053, 265573, 12696, -228750, -294099, -265792, -145696, 237416, 782849, 974011, 522533, -132652, -360679, -158934, -7725, -59942, 11373, 364616, 703829, 779329, 735479, 749161, 705912, 510987, 391379, 545092, 745954, 684399, 512027, 608223, 907943, 950876, 623363, 356710, 430986, 543850, 357137, 79019, 94707, 286923, 206887, -190445, -464631, -360595, -120405, -16007, 30540, 165255, 274124, 197007, 33763, -22873, 15950, 41742, 81866, 177966, 199939, 72337, 38831, 346990, 752132, 737120, 251558, -155019, -48556, 383621, 702704, 776328, 731547, 608768, 374569, 151632, 133162, 274479, 282657, -47073, -593533, -1014310, -1032939, -666415]
41624f66415M52887K62577J18117J98231K36160n6856m04034k54539L29326O07611
41614H23065J82402m12340m78221q8139J90712J77083J33422J37264j1331k80630
41604C73287l52598j52398M0778J00952J94917K94223Q4684l93760n58654j28340
41594d96909L27539J98548k03587j42870L37846M73406J793m30697k76255J60577
41584e0609L01007J03126r1424j28190o6034P0141K07719J49937j11363k74559
41574A09751k03279j80660l49898l21612J62186N78384L16186k68738l00145K50017
41564b07808N29434J96254r8231R5106K55673j36639o20857m75107J00350L09413
41554e2412k3723l23241k23383L0505J50985J80559J95164J16978m1782j15375
$$ y = [-666415, -213528, 49049, 167166, 365397, 601557, 544701, 140667, -113872, 215454, 823065, 1005467, 593127, 114906, 26767, 217479, 394562, 527984, 665248, 653917, 373287, 20689, -131709, -90931, 10021, 204938, 499161, 583845, 190085, -368569, -496909, -169370, 29178, -174409, -317279, 20567, 493973, 495766, 65069, -211186, -50609, 250398, 353524, 262100, 133910, 67876, 138017, 345736, 495673, 384310, 109751, -93528, -274188, -624086, -945698, -783512, -205128, 111058, -157680, -457825, -207808, 321626, 517880, 419649, 514755, 770428, 633789, 12932, -462175, -361825, -52412, -76135, -399376, -622759, -592254, -441269, -260710, -65546, 51432, 9650, -105725]
41544a05725p2308o3018j17512r1474L1131P2171l4896j31539r2572K1328J05774
41533d78640J10745J2081j07510k2127L21692N45722K57916l17983n52554k73500
41523e04158L7544J6212r1159O6010L58274M23530K13021k6731j24413p9255M5933
41512C34808J18990L718j97136j90944L3860Q3689k26360m51015j11856N09957
41502i2289O68813J68683l95104m55422j16176J55999J39579l7141j64928j26559
41492b54545O8857K78440L31508K17635Q2773R940o1974j61485j96852j37294
41482A77003j19411k25501k81611p8125K57630L40752M5102k63036j85652J34221
41472a98628J75707k00936m75652j66209M40731O29169K28611j95541j89202J5519
$$ y = [-105725, -178033, -241051, -358563, -450037, -418906, -346735, -381631, -513170, -605742, -584414, -478640, -367895, -355814, -463324, -485451, -163759, 381963, 639879, 321896, -230658, -504158, -466614, -450402, -541561, -475551, -117277, 306253, 519274, 492543, 368130, 288875, 334808, 453798, 457516, 260380, 69436, 103296, 186985, -39375, -490390, -602246, -92289, 576524, 745207, 350103, -105319, -221495, -65496, 74083, 36942, -127986, -254545, -185688, 92752, 424260, 641895, 724668, 734608, 672634, 511149, 314297, 177003, 57592, -167909, -449520, -527645, -270015, 70737, 115839, -147197, -332849, -198628, -22921, -223857, -699509, -865718, -424987, 204182, 432793, 237252, 48050, 63569]
41462F3569K203j70426j92141q2580q5173j51691j8415K68861L82584K70180K09460
41451D96431K49496R8783k73085m32015j60007J20453o647k60606j09650L54167
41441G7320N38484K47458q6652j09611k829q0685l04622m16949l21607j37485
41431e97178j4626k0358r7854q3709J08894L18723L13678J27088K531J0446j2389
41420E5246j16537j45955p0466p9049k01522j77930Q9148K83178J45263j04001
41410c22625j36409l7714p5450j67550k4486L06884M83006L88057K07028J7427
41400F38168k62651n13994m45014o5614K49969K70069J31198q708j64845k82027
41390d53449j92350M8309J57733R3757J20769K65810J81422k08903m19674j16534
$$ y = [63569, 65772, -104654, -296795, -379375, -464548, -616239, -634654, -365793, 16791, 286971, 496431, 745927, 844710, 571625, 139610, -20397, 100056, 93409, -167197, -276847, 77320, 615804, 863262, 776610, 666999, 664170, 583485, 278863, -138086, -459693, -597178, -611804, -632162, -730016, -813725, -704831, -386108, -72430, 54658, 57189, 67635, 55246, -61291, -207246, -277712, -356761, -558283, -736213, -647065, -363887, -218624, -322625, -459034, -496748, -572198, -739748, -764234, -457350, 25656, 413713, 620741, 638168, 375517, -138477, -583491, -649105, -399136, -129067, 2131, -6577, -171422, -453449, -645799, -597490, -439757, -346000, -225231, 40579, 222001, 13098, -406576, -523110]
41380e23110L19268L74873J66815J08177J40040r3706m78064m71557O3863O02872
41370B09471O32843K07317k60654m44625k81595L0518J62677k4836l10673m07067
41360d86624k86183l8352L26209O39734M83194j97209o95071l91663K46862K87848
41350a11255k00355k40247M27590Q53145L89163k91854l35380k2779j04959m52987
41340h9918l73484R6264K53511j8759p3907L13669N17148J24987l57878l43120
41330D8513n5681k7999j73656k1621L97222N69662L30385N3237m9361k35692o29097
41319B05912q19222m54936J17144K71769k6369k42392p5518K37412M30718N16433
41309A60951M64819J02693m11731n10826n601M82039L64222k1145K2241L97027
$$ y = [-523110, -203842, 171031, 337846, 446023, 586063, 492357, 14293, -457264, -393401, 209471, 842314, 1049631, 788977, 344352, 62757, 93275, 255952, 231116, -79557, -486624, -772807, -811159, -484950, 154784, 637978, 440769, -254302, -645965, -399103, -111255, -311610, -551857, -124267, 728878, 1118041, 826187, 490807, 468028, 363069, -89918, -463402, -367138, -113627, -132386, -206293, 107376, 624524, 749511, 391633, 48513, -7168, -35167, -208823, -230444, 166778, 736440, 1066825, 1120062, 1070701, 835009, 205912, -613310, -1068246, -951102, -679333, -705702, -948094, -1023612, -786200, -355482, 160951, 625770, 728463, 316732, -194094, -199695, 282344, 646566, 625421, 647662, 1044689]
41299A044689L97224q0663l61392j22077J27928k2169k34016j30242J0001j78632
41289D50651m16618k55845J00529J19966j67992k58192j4984J91037J55633Q0329
41279a5486J01227Q7998N635L1377J81634K02277j7425k32328j96179J5662J74700
41268C39092K03067J97793K70994M05265L92713J1326n91061q60019m61999J88434
41258I5605L89072N4018k60055k08666n2914q8465j68623o3257Q9481M0608j10220
41247b83416p6519J27099K03623N1595p2329O5060L36447M18870J97398j15857
41237H51971k52550j76709m7397K9323P9268J08334N2303n9855p6986K5451N6374
41226E89527o7681j12832J12464L64559K65502r5771k40174Q436K69455J58256
$$ y = [1044689, 1441913, 1361250, 999858, 877781, 1005709, 983540, 749524, 619282, 629283, 450651, 34033, -221812, -121283, -1317, -169309, -427501, -442485, -251448, -95815, -15486, 85741, 173739, 179374, 210751, 392385, 594662, 577237, 344909, 148730, 164392, 339092, 542159, 739952, 1010946, 1416211, 1808924, 1820250, 1229189, 369170, -92829, 95605, 484677, 538695, 278640, 69974, 17060, -71405, -240028, -303285, -213804, -173196, -283416, -359935, -232836, -29213, 22382, -49947, 15113, 351560, 770430, 967828, 851971, 599421, 422712, 375315, 404638, 483906, 592240, 644543, 584688, 507702, 533153, 589527, 521846, 409014, 521478, 886037, 1151539, 1055768, 815594, 824030, 1093485, 1251741]
41216A251741k06805m29953l66513k22048k08981k68305j62125J94253N49971
41207A31235N70430K71898J4258j3760l5381k24262l10567o221M09920L98808
41197A206358n5769m49632n01721l95373k60477L2579M15093M88423J25732k24546
41187C80667j56403J23089J81012K1078k9357R6439J35644l5807j94115r1805
41177D30442J94484L38379J55107j41861j84210J7211J1916m08054p39429m13742
41167g39757K74455M89259Q0968k05659P8579M12848K12775k32218k96926j3110
41157F1214J26350L5684L7201J63516J03209j89204l85041l19831j79504j04373
41147f50779j6213J05759J43475R6290J02318J64326J47034N8435L2792L1702
$$ y = [1251741, 1044936, 614983, 248470, 26422, -182559, -450864, -612989, -418736, 131235, 701665, 973563, 987821, 974061, 938680, 714418, 403851, 397630, 807550, 1206358, 1150589, 700957, 199236, -196137, -456614, -424035, -8942, 479481, 605213, 380667, 224264, 347353, 528365, 549443, 520086, 616525, 752169, 716362, 522247, 430442, 624926, 963305, 1118412, 976551, 792341, 809552, 821468, 413414, -326015, -739757, -465302, 23957, 104925, -100734, -22155, 390693, 603468, 371250, 74324, 61214, 187564, 223248, 260449, 423965, 527174, 337970, -47071, -366902, -546406, -650779, -666992, -561233, -417758, -321468, -219150, -54824, 92210, 150645, 183437, 215139]
41137B15139j14403l44177l74865j31232J37810K31351J93757Q8257j08815k95023
41127e02201k39875N4269K59394J62221l0538j4541J72830K51273J25301k005
41117B36128N9551K05624J47600k01881n33494m64418o1794J71452m4817l61334
41107h47383k93364Q4830K87107J37311n8633m9834M8214O0437K7087L9767O6497
41096d97964O0926M1495L184m4050M0164L24093N13665K48889k74348m32208n5980
41085g2134K95539J89206m8122O0820L26029K16905k56472n64018m56710k12684
41075e21641q3375J3014J57909K26322J68872J47189K16427J79973m6967k07104
41065B50619p4700J54731J19893j89249m30678l68186j01639J43733K52561K15575
$$ y = [215139, 100736, -243441, -618306, -749538, -611728, -380377, -186620, -98363, -207178, -502201, -742076, -687807, -428413, -266192, -296730, -311271, -138441, 112832, 238133, 236128, 295679, 501303, 648903, 447022, -86472, -550890, -612684, -441232, -486049, -847383, -1140747, -1055917, -768810, -631499, -690132, -739966, -691752, -631315, -604228, -564461, -497964, -437038, -395543, -392359, -436409, -396245, -72152, 441513, 690402, 416054, -16154, -72134, 223405, 412611, 364489, 425309, 751338, 968243, 711771, 147753, -308957, -521641, -605016, -592002, -434093, -207771, -38899, 108290, 324717, 504690, 457723, 250619, 175919, 330650, 450543, 261294, -169384, -537570, -639209, -495476, -242915, -27340]
41055b7340O5242j04140j52483j6777K03992L19813K08451p1927l09942l25896
41045b11007j60768j5565L4344J42497M03872O09217N02223J93142K4560L1972
41035A554487j11078m96239p00259l78497J47700K77749n5094l59663k99686j3079
41025d33659K74291N03073N49029J93607m32930p52549m11472K01527M32647J65781
41015B89345j74843k58846j21029J08775L55994M61617K43031j92408m51811l14223
41005e4398q499R4119o6520k31430j99674p1149p2365k08881k13939Q0115M26883
40994e25738M32967J27281k2899K16978M57918K29810l02464n24623k00764K39519
40984A27985K92050k6704k98691k38211L9675K20941J52180m2209j78207k29551
$$ y = [-27340, 37902, -66238, -218721, -235498, -31506, 288307, 496758, 424831, 114889, -211007, -371775, -387340, -352996, -210499, 193373, 802590, 1304813, 1497955, 1522515, 1554487, 1443409, 947170, 246911, -131586, 16114, 293863, 238769, -120894, -420580, -433659, -159368, 343705, 892734, 1086341, 653411, -99138, -510610, -309083, 123564, 289345, 114502, -144344, -265373, -156598, 199396, 661013, 904044, 711636, 259825, -54398, -62897, 31222, -35298, -266728, -466402, -537551, -609916, -818797, -1032736, -952621, -525738, -92771, 34510, 11611, 228589, 686507, 916317, 613853, 89230, -111534, 127985, 420035, 393331, 94640, -143571, -103896, 117045, 269225, 227016, 48809, -180742]
40974a80742k14055k817M67902Q51708O75525N0151l63304k81649j72292l78524
40964D51903m61475J9071N77851M37156k30387n54285l10936j08845k25734k06868
40954f12549J68095M12100K01244n6303K3507J56964Q645j62312k8077J70602
40944B81916R4869n9138N161O4214j67856l74611j47912J84706L8117l70665l00604
40933g51803K78198O10437L76972J34831L09813N18321K73347k32260m82039l54989
40923F80828j04072O5488P7837q2181k56189j80584J26294L14561K09471L9304
40913H90757k7539j70391m60313n34136j37752L44796L94037J36071Q5121K74825
40903G95476K50874r2742k88882n7999K48701K36648N6964N5580J65552O6605
$$ y = [-180742, -394797, -397614, 70288, 921996, 1597521, 1647672, 1284368, 1002719, 830427, 451903, -9572, 9499, 587350, 1024506, 794119, 239834, -71102, -179947, -405681, -612549, -444454, -32354, 168890, 112587, 136094, 293058, 301703, 139391, 111314, 281916, 376785, 317647, 322808, 387022, 219166, -155445, -303357, -118651, -80534, -451199, -751803, -473605, 136832, 513804, 648635, 958448, 1476769, 1750116, 1517856, 1035817, 680828, 576756, 642244, 720081, 637900, 381711, 201127, 327421, 641982, 851453, 890757, 863218, 692827, 232514, -301622, -439374, -94578, 299459, 435530, 520651, 795476, 1046350, 953608, 664726, 606727, 855428, 1092076, 1149040, 1204620, 1370172, 1436777]
40893A436777k35669m03993k82656o2376P1021J42958J96322J62861K0525j32119
40883I13651k44652l66541m53315l35706m952K72614K91613J91884K22604L64177
40873H51377L96235K43966M0499j00126j77420k08950k07414k12295k09207j08147
40863C08518N0847K7696k51300m29450j62629K92929L60503j5726k79675r7140
40853a95427J98947K02310L3747K9413J65210J67284j0125j64339j76124p9735
40843A71161Q7995K60339K72922N7363k00461l02922l08687l38009k74955L6872
40833e38382M11359M76141K06327p280J02156L09311K04664k51898o32894n27100
40823b47596n7673K25574N0976j81156J6288M15529L49807k23664n57150k18093
$$ y = [1436777, 1201108, 797115, 514459, 452083, 523104, 666062, 862384, 1025245, 1045770, 913651, 668999, 302458, -150857, -486563, -491515, -218901, 72712, 264596, 487200, 851377, 1247612, 1491578, 1532077, 1431951, 1254531, 1045581, 838167, 625872, 416665, 308518, 359365, 387061, 135761, -293689, -456318, -163389, 197114, 181388, -98287, -195427, 3520, 205830, 239577, 268990, 434200, 601484, 591359, 427020, 250896, 171161, 259156, 519495, 792417, 849780, 649319, 346397, 37710, -300299, -575254, -538382, -127023, 349118, 555445, 548165, 650321, 959632, 1164296, 912398, 279504, -247596, -305269, -79695, -28719, -209875, -193587, 221942, 571749, 348085, -209065, -427158]
40813d27158K67677K78495J7650L512J41726K9442j75373j1060L57601L22564
40803H05076j05862k83742n1984Q216l38037n03382r7117L53007K57431q3780
40793d0174m0447K99332L44255r020k73028j52773J34619L03255L04942J83864
40783A054825j1926j66665k10838k29938k29120R372M90466O73719J10557p07665
40773G82787p87448o72O37985L45579l62684m73914P2957L98708J9374n03093
40763A29579m29900J40234M98073L03067p5494j51533R0133L06094K76360J09985
40753A196598M6426J68013L09180K33207p9172l62567l73722k00806j09102j42509
40743F85546j32736q8556k16294m46404l53169J79533N91357L63434j84320l32615
$$ y = [-427158, -159481, 119014, 136664, 140176, 281902, 311344, 135971, 124911, 482512, 805076, 699214, 415472, 363488, 371704, 33667, -469715, -566832, -213825, 43606, -40174, -80621, 218711, 562966, 553946, 280918, 128145, 262764, 566019, 870961, 1054825, 1042899, 876234, 665396, 435458, 206338, 215710, 706176, 1379895, 1490452, 782787, -4661, -5333, 632652, 978231, 615547, 141633, 214590, 613298, 632672, 129579, -300321, -160087, 337986, 641053, 565559, 414026, 504159, 810253, 1086613, 1196598, 1243024, 1411037, 1720217, 1953424, 1874252, 1511685, 1137963, 937157, 828055, 685546, 552810, 464254, 247960, -198444, -551613, -372080, 219277, 582711, 398391, 65776]
40733F5776j9338J45786j09918l41233j67111J53040K27436J43211J80969K65191
40723E43809J33998j44175k37067n5025J42873J35594j9982j49594j79257j63108
40713H066j89612k60983k43618j5363L21493N03063M11066J70575p3138k70222
40703C61327l27418j27360J99899K96661M6132k14911j53142J08041K23738J30690
40693E43657N0163J01798J64265Q3155j44027l55225l30357k3932K77667K40597
40683F07761k8023q1551J69073K61078o9718l72111j40510L52026M41649R0377
40673A230051j17572M3873J25403j71265m44913k33769K14157K76036j34659m56301
40663C31041k87784Q2335J41445j07039j93171P2682K72141L889m42903m36758
$$ y = [65776, 46438, 192224, 82306, -258927, -426038, -272998, -45562, 97649, 278618, 543809, 677807, 533632, 296565, 241540, 384413, 520007, 500025, 350431, 171174, 8066, -181546, -442529, -686147, -701510, -380017, 123046, 534112, 704687, 631549, 361327, 33909, -93451, 106448, 403109, 449241, 234330, 81188, 189229, 412967, 543657, 593820, 695618, 859883, 943038, 799011, 443786, 113429, 89497, 367164, 607761, 579738, 498187, 667260, 928338, 858620, 486509, 345999, 698025, 1139674, 1230051, 1112479, 1156352, 1281755, 1110490, 665577, 431808, 645965, 922001, 787342, 331041, 43257, 125592, 267037, 159998, -33173, 39509, 311650, 315539, -127364, -564122]
40653e64122P0086M34062K31461j74369k18322R0840L14111K26711l6573k81685
40643I2200l63463j64084K09040L67658J15053j97358j38249J63772K59050Q5933
40633D29552m2173m6644j39235k88486j94021J21165K34647J4488j13962J53966
40623A29297M88295M14175J012k74013j57627J60598L39205K02110j38845l73536
40613G90671l14836j43545j48687k66471j93659M5118P3574j82421k88146N741
40603f22661L00650J44550k60722l70453p0952K80408M12673L28272P1838k65581
40593e1978l97017j18983K86143L31910J4230j99101j09424n9087k95840n04809
40583a103956k96173J52310L41882J85061P5381K31427L61281J40143k54739l55912
$$ y = [-564122, -494036, -59974, 171487, -2882, -221204, -130364, 183747, 410458, 373885, 92200, -271263, -435347, -226307, 141351, 256404, 59046, -79203, 84569, 343619, 429552, 387379, 340735, 201500, -86986, -281007, -159842, 74805, 89293, -24669, 129297, 617592, 1031767, 1032779, 758766, 601139, 761737, 1100942, 1303052, 1164207, 790671, 475835, 332290, 183603, -82868, -276527, -231409, -157835, -340256, -628402, -622661, -322011, -177461, -438183, -808636, -879588, -599180, -186507, 141765, 213603, -51978, -448995, -567978, -281835, 50075, 64305, -134796, -244220, -303307, -599147, -1103956, -1400129, -1247819, -905937, -720876, -645495, -414068, -52787, 87356, -167383, -523295]
40573e23295n1170K53167J66245j84982l31040n2030L71555N18538L06103J7216
40563D90307q7598n2101p4860j81724j88331M304K28283K69624J64666J13229
40553F85799J53165J24625l8150j94306k24996j62903l1004J97451L72547K06028
40543A088256k53650m85675j54870L43711L92724J2233k59236k23754k01506l22724
40533f4491k45383J88481N33047L59016o6085j57170J39127L25490J22298j66229
40523I68101j50267R4648J84539j3420k22336j81696k3583l8320j75938r8805
40513C42923K16051L10057o5246m38826k45732K68953L44260j57409n24274k34854
40503a84097L48561N88355L95089J06858p4873j60025j53842j02969j48032k64327
$$ y = [-523295, -574465, -321298, -155053, -340035, -671075, -723105, -351550, 166988, 473091, 490307, 402709, 350608, 275748, 94024, -94307, -90003, 138280, 407904, 572570, 685799, 838964, 963589, 925439, 731133, 506137, 343234, 312230, 509681, 882228, 1088256, 834606, 348931, 194061, 537772, 930496, 942729, 683493, 459739, 258233, -64491, -309874, -121393, 411654, 770670, 704585, 547415, 686542, 1012032, 1134330, 968101, 817834, 912482, 1097021, 1083601, 861265, 679569, 655986, 617666, 441728, 342923, 558974, 869031, 803785, 364959, 119227, 388180, 732440, 575031, 50757, -184097, 164464, 752819, 1147908, 1254766, 1179893, 1019868, 866026, 763057, 615025, 350698]
40493C50698j82941J78393M75320M10300J69547P1911O5106n7565k03017j69845
40483A107907p8596j51418k34948l9804K60716K07758j92265m26806k47837K0966
40473B25673P4178M0187R7718J08159p2083k41840j57339L2273p377k61643l53905
40462e15999o2935L85021N96548M27841N1892k78462m23466l57516j31150R4718
40452b13508J03472j20212k55537L063M66138O03266K49457j58368k12920o9705
40442C95146o9839j39006K2183L32748L84315O5553k76463l35737j69418K2955
40432B32437J34107J10995l8625j52995q0297N4714J9342j12265n5645J63129
40422B74897J96216j9986r5638J55220L17689L034m54330m09576J30836M74242
$$ y = [350698, 167757, 346150, 821470, 1231770, 1401317, 1473228, 1538334, 1480769, 1277752, 1107907, 1029311, 877893, 642945, 603141, 863857, 1071615, 879350, 452544, 204707, 225673, 299851, 340038, 437756, 545915, 473832, 231992, 74653, 106926, 99549, -162094, -515999, -578934, -193913, 402635, 830476, 882368, 603906, 180440, -177076, -308226, -213508, -110036, -230248, -485785, -482722, -16584, 586682, 836139, 677771, 464851, 395146, 325307, 186301, 208484, 541232, 925547, 991100, 714637, 378900, 209482, 232437, 366544, 477539, 438914, 285919, 205622, 260336, 279678, 167413, 111768, 274897, 471113, 451127, 355489, 510709, 828398, 831432, 377102, -32474, 98362, 572604]
40412E72604K16339k18137k45687K2271J3883l53829m77782J8220O25616O15640
40402G89138P8629k54734j19815J6399j18520j45183J67568L58846Q9544j31830
40392G30042K12396O08220K52170n15345o23341m268K80743j92885n37246r0894
40382A19592M95396M19997J6491j2711J23405j72038o21135m56393J98871M32647
40372E44122j2890m06587k56803L7783K7406r1979O17J64464J54168Q9231J64194
40361D13726K55410J78766L8859j552k9285j49758j99887j7421K03599J58360
40351H50817j02494k59805j90871o4388j9014r671K1721L9759K1311J4465M6630
40340C48460P3967N3792L492k6312l682M5444L6044q1135j98780j23031J60095
$$ y = [572604, 788943, 570806, 325119, 347390, 361273, 7444, -470338, -452118, 173498, 789138, 867767, 613033, 493218, 509617, 391097, 245914, 413482, 772328, 861872, 730042, 942438, 1550658, 1802828, 1287483, 664142, 659874, 940617, 747732, 210486, 119592, 614988, 1034985, 1051476, 1038765, 1162170, 990132, 368997, -87396, 111475, 544122, 531232, 124645, -132158, -94375, -66969, -158948, -158331, 6133, 160301, 249532, 413726, 669136, 847902, 886761, 885209, 855924, 706166, 506279, 488858, 692457, 850817, 748323, 488518, 297647, 233259, 214245, 204574, 226295, 266054, 287365, 301830, 348460, 422427, 476219, 479711, 453399, 449717, 495161, 531205, 450070, 251290, 128259, 288354]
40329B88354L77571K55990j17619l54131k05071J54265L36182J65866j70447l56637
40319C74323k42983O9641L38777L53014J05185j51497j34357J02115J81233o8605
40309I26846k87706o5735L91996M87331R6918k62121k45430j39444k36711k77365
40299C88579J9729L00491P9668l64307l12464K55722N72698K27951k77259l55578
40289E35230j08226P0726J48598K69150K94353J9530l71763m99533l05345l2166
40279B0554J81219L44932L67473J20309k68668m78950l66758o8315K22178L74523
40269D48497K88575k4755l42025l99405j66979J64013L92337L89651J21059k34481
40259F36487l35902p6018K15598K03878J3297l6264K3162o5065k17070o8245L65597
$$ y = [288354, 665925, 921915, 804296, 450165, 245094, 399359, 735541, 901407, 730960, 374323, 131340, 200981, 539758, 892772, 997957, 846460, 712103, 814218, 995451, 926846, 639140, 573405, 965401, 1452732, 1549650, 1287529, 1042099, 902655, 665944, 388579, 408308, 708799, 788467, 424160, 111696, 367418, 940116, 1168067, 890808, 535230, 427004, 497730, 646328, 915478, 1209831, 1229361, 857598, 358065, 52720, 20554, 201773, 546705, 914178, 1034487, 765819, 286869, -79889, -148204, 73974, 448497, 737072, 712317, 370292, -29113, -196092, -32079, 360258, 749909, 870968, 636487, 300585, 224567, 440165, 644043, 657340, 621076, 644238, 579173, 362103, 293858, 659455]
40248F59455N77998K94531j06118j47412P7999R2420k91389p37867p71478k58913
40238f10774M36080P49436M78048J9733j17325M0070P5934r3856j09538J42154
40228A009962K45885o8945m33271l97041j08037J2165l6349K5340J35446l329
40218C81826k78058k18471K29709N18687K80266j42725k19069L8634J86499J8284
40208G95582j91583j02946K32137M13730J75549k39418l10083J05488N30508M64138
40198A873102L4760k29494j49215k3116l9442l834K23045M15754L41386J29424
40188B572370L2109M0463n186r2726q3797K6144J19584J57820J79457J56607K9544
40177C132389j42957k13760j28844Q375M8716o2847k26860k68579j38701K297
$$ y = [659455, 1237453, 1531984, 1425866, 1278454, 1356453, 1448873, 1157484, 419617, -351861, -610774, -174694, 574742, 1052790, 1072523, 955198, 995268, 1071202, 977346, 867808, 1009962, 1255847, 1186902, 753631, 356590, 248553, 260718, 224369, 249709, 385155, 381826, 103768, -114703, 115006, 633693, 913959, 771234, 552165, 590799, 777298, 795582, 603999, 501053, 733190, 1146920, 1322469, 1083051, 772968, 878456, 1408964, 1873102, 1907862, 1678368, 1529153, 1506037, 1466595, 1462761, 1685806, 2101560, 2442946, 2572370, 2604479, 2644942, 2639756, 2547030, 2463233, 2489377, 2608961, 2766781, 2946238, 3102845, 3132389, 2989432, 2775672, 2646828, 2655203, 2703919, 2641072, 2414212, 2145633, 2006932, 2009229]
40167B009229P162k5049P2012J95329J03548j35100j87508j4144J8841k47968
40157A796352m51939k79004K6876Q9968J3018J06151K48441O2398l65878m95158
40147G51225j29448K65721K24966j07152k63296r3981J45822K30608K36189L42948
40137A603602N00323M20586l4018n50616o50598k97323K5134l9569k52362j81415
40127E43744J56794L72202K78223O2015o6607r6742r3651r4709j23190j27072
40117H11007L2455L52528N59681M20590O2773k24096l44522l29640j51289Q7514
40107A277001N2890l08095m34217J13387Q01670P06623j36579p20117m69839R6577
40097I79301L19860K59295K51289K74513K13810K17119L15250J57141l92244q25640
$$ y = [2009229, 2016391, 1991342, 2063354, 2258683, 2362231, 2227131, 2039623, 2025479, 2044320, 1796352, 1344413, 1065409, 1092285, 1182253, 1195271, 1301422, 1549863, 1612261, 1246383, 751225, 621777, 887498, 1112464, 1005312, 742016, 648035, 793857, 1024465, 1260654, 1603602, 2103925, 2524511, 2490493, 1939877, 1289279, 991956, 1017090, 977521, 725159, 543744, 700538, 1072740, 1350963, 1412978, 1346371, 1249629, 1155978, 1061269, 938079, 811007, 843462, 1195990, 1755671, 2176261, 2239034, 2014938, 1670416, 1340776, 1189487, 1277001, 1329891, 1021796, 587579, 700966, 1502636, 2209259, 2072680, 1352563, 882724, 979301, 1299161, 1558456, 1809745, 2084258, 2298068, 2515187, 2830437, 2987578, 2595334, 1769694]
40087A769694o81783k69212j52132k63325j37947K37652M54618L89674K58394
40078A605633P8774k75817n43871k85839K97548M39813p4821m91568j48024N51744
40068A153572P14289J72300m23021n76098m53669l54916j84672K39580O65857
40059I53222O29881J48968k13938j01651J72555J57477m3512q943K54419K98086
40049B246564m0425l74904l47971n7337K35929M25544M24838J34374k42236k79322
40039B125054J4805P9897l21452n99913j96506M85780O25967J65421k30099k25211
40029A923743j35288k08986k52905r9671Q8188J52639J56609J38002L4354n1680
40019A745005Q8841L46094L39327J8339k07660j15940j0937j64851l25632j45064
$$ y = [1769694, 1087911, 818699, 666567, 403242, 265295, 502947, 957565, 1347239, 1605633, 1684407, 1408590, 864719, 578880, 876428, 1316241, 1241420, 749852, 601828, 1153572, 1867861, 2040161, 1617140, 1041042, 587373, 232457, 47785, 287365, 953222, 1583103, 1732071, 1518133, 1416482, 1589037, 1746514, 1703002, 1694059, 1948478, 2246564, 2206139, 1831235, 1483264, 1425927, 1661856, 2087400, 2512238, 2646612, 2404376, 2125054, 2139859, 2219756, 1898304, 1298391, 1101885, 1587665, 2213632, 2379053, 2148954, 1923743, 1788455, 1579469, 1326564, 1226893, 1315081, 1467720, 1624329, 1762331, 1796685, 1745005, 1833846, 2179940, 2519267, 2537606, 2329946, 2214006, 2203069, 2038218, 1712586, 1567522]
40009A567522K05809K72263R028j73497l2558J91326J74295l1140j17820R200
39999B074428J02833m2174k52065k09038N1334J50354p3968l11404k50030k8046
39989A212224M0718l8950m7741K1199L119p1089j4761J47656J87597L0020j83864
39978A286128l41554l81934j77791K50975N11157K53833k33839l26553M5111L04339
39968A189872J09925j94055j88859M3278K12223K78071L18981K66852O9510j29081
39958A976717k08041k44448k91210k41214q5258j4846p9767n3625J49235K59517
39948A167060J15093q970J37379L10443J69454j26713j82840l4035l5904j82612
39938A328355q9438K87963M52959J06967l47069l79852j05629m3751k62576k76106
$$ y = [1567522, 1773331, 2045594, 2054622, 1881125, 1848567, 2039893, 2214188, 2183048, 2065228, 2074428, 2177261, 2135087, 1883022, 1673984, 1725318, 1875672, 1801704, 1490300, 1240270, 1212224, 1252942, 1213992, 1166251, 1187450, 1190569, 1119480, 1104719, 1252375, 1439972, 1469992, 1286128, 944574, 562640, 384849, 635824, 1146981, 1400814, 1166975, 840422, 885533, 1189872, 1299797, 1105742, 916883, 960161, 1172384, 1450455, 1769436, 2036288, 2105798, 1976717, 1768676, 1524228, 1233018, 991804, 906546, 891700, 811933, 758308, 907543, 1167060, 1282153, 1273183, 1410562, 1721005, 1890459, 1763746, 1580906, 1546871, 1510967, 1328355, 1238917, 1526880, 1979839, 2086806, 1739737, 1359885, 1254256, 1210505, 947929, 671823]
39928F71823J22190M25164J55113l21658k69032K73433M86093L4738l55543j6402
39918A205919N65497M53120k92455o85582k64802L27891L66730m5277l69214l86225
39908H75602k14460J9018J93478J91897J32079K87667N74990N03772q6339o27041
39898A850663n25211L9508M14471L42045J25628P1308J49038J76387N7493j61091
39888B540239l08640k17610N2431K26702J55075l554l9733L4254Q6384O8905R769
39877B604222l7396L5054K68607M43623K65153j85651m79259m11545k31213j76512
39867B095083j43646l532R8023N736j58497k11961j75298j24941l1361P5995M9450
39856A475051r2122r8146J10327K59764J43528n6272o7633J03327K76466L29502
$$ y = [671823, 794013, 1219177, 1374290, 1052632, 783600, 1057033, 1543126, 1577864, 1222321, 1205919, 1771416, 2224536, 1932081, 1246499, 981697, 1309588, 1676318, 1631041, 1261827, 875602, 661142, 680160, 873638, 1065535, 1197614, 1485281, 2060271, 2564043, 2477704, 1850663, 1325452, 1364960, 1779431, 2121476, 2247104, 2318412, 2467450, 2643837, 2701330, 2540239, 2231599, 2013989, 2066420, 2293122, 2448197, 2444643, 2404910, 2439164, 2525548, 2594453, 2604222, 2566826, 2601880, 2870487, 3314110, 3579263, 3393612, 2914353, 2502808, 2271595, 2095083, 1951437, 1947905, 2045928, 2051664, 1893167, 1681206, 1505908, 1380967, 1349606, 1425601, 1475051, 1382929, 1284783, 1395110, 1654874, 1798402, 1742130, 1674497, 1777824, 2054290, 2383792]
39846B383792K01213q2019l05669k69656r8464j9467P5699L68534N42553J62393
39836B958909m23195m05211J69061L55650j69995n84761l21150O0653L435q6761
39826A556635K14166M22857Q5450k55446m3787J84351j95222n82537j32201O36829
39816A891095O31874N6502l2219L37700J88749m81494n92938P8367M66770N7036
39806B601442l36445j13713J66240j166j48831J50764M29546K31498m3093N9043
39796B995285K07322k1985l36321l08248j29811j30652j36201O8122K02299L9299
39786B449109n8711K18482M56703J39704m73465p20182m46645j165L55782N24575
39776B444187L73558k6342k52525n6281K38970K41953O0276k9634j09526l49641
$$ y = [2383792, 2585005, 2502986, 2197317, 1927661, 1829197, 1809730, 1885429, 2253963, 2796516, 2958909, 2535714, 2130503, 2299564, 2655214, 2485219, 1900458, 1579308, 1639961, 1643396, 1556635, 1770801, 2193658, 2279108, 2023662, 1979875, 2164226, 1969004, 1386467, 1254266, 1891095, 2522969, 2579471, 2547252, 2884952, 3073701, 2592207, 1999269, 2077636, 2544406, 2601442, 2264997, 2151284, 2317524, 2316358, 2167527, 2318291, 2747837, 2979335, 2936242, 2995285, 3202607, 3180622, 2844301, 2536053, 2406242, 2275590, 2139389, 2207511, 2409810, 2449109, 2390398, 2608880, 3065583, 3205287, 2731822, 2011640, 1564995, 1563830, 1919612, 2444187, 2817745, 2791403, 2538878, 2482597, 2721567, 2963520, 3023796, 2994162, 2884636, 2534995]
39766B534995n22467k90527K05042M79855L31695K5178n9292K15941O05557O39044
39756D165021J47801l82421l44936J42906M19056K71009J12967J24591j4360l22777
39746D318857k67686K96542O79696L41012k96774n11127k09960K46587O03071
39737E200218O59410K45186l03473k26444O22263J387178J326758P23658K22344
39728I857098p7025l30078m34577m05677o03781r76669p94224J57010Q68551M57732
39718G718360m61140p12715k74388j4603j98520l52983l03557k81724k00003J96556
39708E115283O13153N54379K30141K26947M51447L13498j85626m79306m48457
39699F391459m78395n62973k96373K16088L55768J4381k02347N6706M31408M87577
$$ y = [2534995, 2012528, 1722001, 1927043, 2406898, 2738593, 2763771, 2704479, 2920420, 3525977, 4165021, 4312822, 3930401, 3585465, 3728371, 4147427, 4418436, 4531403, 4655994, 4641634, 4318857, 4051171, 4347713, 5027409, 5368421, 5071647, 4560520, 4350560, 4597147, 5200218, 5859628, 6104814, 5801341, 5574897, 6197160, 7584338, 8911096, 9634754, 9857098, 9780073, 9449995, 9015418, 8609741, 8005960, 7029291, 6235067, 6392077, 7260628, 7718360, 7257220, 6544505, 6270117, 6255514, 6056994, 5704011, 5400454, 5118730, 4918727, 5115283, 5728436, 6282815, 6512956, 6739903, 7191350, 7504848, 7319222, 6839916, 6391459, 5913064, 5350091, 5053718, 5269806, 5625574, 5639955, 5437608, 5494314, 5925722, 6413299]
39689F413299J87610l16386p58372o72500J17469R82112J128790O77132L94400
39680H153554M80318M29819P0556j26499J11235M64530O34280P16080Q39472R67455
39670A2740800J084381J096132O58002l37281j269418j417784r11777m33014k14650
39661A0995391k9450J10288L0110o8175Q5713K61390K08937K81763P35092R58269
39651A3569328M48387m6085L93961J204299J206071O15243N58217J008107J014415
39642A9971943O94763J036760J864688K072835J844130K437188L709502M239427
39634C7871236M101504M898643O628122P363318O740941O753076Q178876R560338
39626I2096054J0919138J4679070K1175654K7670130L4269579M4955329N7303075
$$ y = [6413299, 6600909, 6284523, 5526151, 4853651, 4971120, 5953232, 7082022, 7759154, 8153554, 8633872, 9063691, 9134247, 9007748, 9118983, 9583513, 10217793, 10933873, 11773345, 12740800, 13825181, 14921313, 15579315, 15242034, 13972616, 12554832, 11643055, 11210041, 10995391, 10965941, 11076229, 11106339, 11038164, 11123877, 11385267, 11594204, 11875967, 12611059, 13569328, 14017715, 13971630, 14365591, 15569890, 16775961, 17391204, 17949421, 18957528, 19971943, 20666706, 21703466, 23568154, 25640989, 27485119, 29922307, 33631809, 37871236, 41972740, 46871383, 53499505, 60862823, 67603764, 74356840, 82535716, 92096054, 103015192, 117694262, 138869916, 166540046, 200809625, 245764954, 303068029]
39619C03068029N6634267K9966934j4695417n1720795o2965043n3353581l9468441
39612A67465953l0095808k3217428j6259384j0915179q611914p685885o553850
39605F4126505n856719o157597o329769n485694m421738m026863l851152l218213
39597B4778760k452910k094416j910853j520107j191918j286830j496407j293291
39589A1532028p18965k19936k9182q9881k97882n09526n59471m99300n75152q02668
39579G230065q40672m66044P7370L80419L18184P5862p6402M3353L56984M78014
39569G577133J13068m33956n10201J6777N41766N89673M60292O26709Q85426O73132
39559A0539819J5590m71774m90745l47376k57752J242N18690R05831Q72890O68801
$$ y = [303068029, 359702296, 389669230, 374973813, 323253018, 260287975, 206934394, 167465953, 137370145, 114152717, 97893333, 86978154, 78366240, 70680355, 64126505, 58269786, 52112189, 45782420, 40296726, 35874988, 31848125, 27996973, 24778760, 22325850, 20231434, 18320581, 16800474, 15608556, 14321726, 12825319, 11532028, 10813063, 10593127, 10563945, 10474064, 10176182, 9666656, 9107185, 8607885, 8032733, 7230065, 6389393, 5923349, 6000719, 6381138, 6699322, 6775184, 6698782, 6742135, 7099119, 7577133, 7690201, 7256245, 6746044, 6762821, 7304587, 7894260, 8354552, 8981261, 9866687, 10539819, 10555409, 10083635, 9592890, 9245514, 8987762, 8989004, 9507694, 10413525, 11286415, 11955216]
39549A1955216N76187M46777J84168K02280Q02705J473426J489606R70904O77154
39540A8778423R43157J478261K047881K650171L138628L373018L658743M391835
39532D0460117N423303O371633P163058P488809O375236L538902O36869l51400
39524G7106527M63891J806681L911581P857722J2785119J7131845K2455159L1009199
39516A74527724L7739935L0664206M868242k7028795m5007258m1898506k8271905
39509A05593643j7551822j2759090r694725o479224m681948m422063l811385k504102
39501D3689284j964066k403581k375286j334531j93596O54224J776615L185952
39493D1035015M257825N120466O295518O925713N226912J056852l522997o612919
$$ y = [11955216, 12531403, 12978180, 13162348, 13364628, 14167333, 15640759, 17130365, 18101269, 18778423, 19721580, 21199841, 23247722, 25897893, 29036521, 32409539, 36068282, 40460117, 45883420, 52255053, 59418111, 66906920, 73282156, 76821058, 77457927, 77106527, 77570418, 79377099, 83288680, 91146402, 103931521, 121063366, 143518525, 174527724, 212267659, 242931865, 247800107, 220771312, 175764054, 133865548, 105593643, 88041821, 75282731, 65588006, 59108782, 54426834, 50004771, 46193386, 43689284, 41725218, 39321637, 36946351, 35611820, 35418224, 36072448, 37849063, 41035015, 45292840, 50413306, 56708824, 63634537, 68861449, 69918301, 66395304, 59782385]
39485E9782385q029976q243669p290096n396297l499441k373768j927868j752646
39477B1268624j662112j472752j043455p32678j001645j439380j132002j76685
39469A2607915K53936k95030q20572m76418J31422O2789m11138l55837K97577
39460A0994644P83010Q30612J069659K001892L128573L313228J891092n50099
39452B3462611k509104k946267k314910j856954j958150j864357j111067l51274
39444H550528k91011n65021l83638K31895O40282O67984P10451Q78979P75838
39435A1216287J80415n75548j020698r83215o02489j88093k6832r6227q3139J17439
39425G937900J71963j51398n33231n79309m21292l64536k63870J42147N41633
$$ y = [59782385, 51752409, 43508740, 36218644, 30822347, 27322906, 24949138, 23021270, 21268624, 19606512, 18133760, 17090305, 16357627, 15355982, 13916602, 12784600, 12607915, 12861851, 12566821, 11746249, 11269831, 11401253, 11464042, 11052904, 10697067, 10994644, 11777654, 12608266, 13677925, 15679817, 18808390, 22121618, 24012710, 23462611, 20953507, 18007240, 15692330, 13835376, 11877226, 10012869, 8901802, 8550528, 8259517, 7694496, 7310858, 7542753, 8183035, 8851019, 9561470, 10440449, 11216287, 11396702, 10821154, 9800456, 8817241, 8214752, 8026659, 7999827, 7903600, 7820461, 7937900, 8109863, 7958465, 7425234, 6845925, 6424633, 6060097, 5796227, 5938374, 6480007]
39416F480007M20964j8682r7804K21461K79164j24569l75134j02946K34749K29170
39406G146380J94376M37134N71474K34953j12792J14149N99012O30747L00474
39397A0115907K89386O69073Q69599P95837R93016J589953K085664K464368L415044
39388B3287847M775900M761252J907267k611506n763162n827896l937314k304585
39380A4287803j776278j620497j101140m32549k00797m64505p56806p46012n62354
39371F626865m62905m34302k97461p1261R731j56249l83101m59524l93188k94418
39361C684187j69982K3743K12920K41849P3054j24676j19690J23166L27492J71827
39351D443890k47377m07629k7352M52109M04670r2244l76523j78513P8365O8755
$$ y = [6480007, 6900971, 6882289, 6784485, 7005946, 7285110, 7160541, 6785407, 6682461, 6917210, 7146380, 7340756, 7777890, 8349364, 8584317, 8471525, 8585674, 9184686, 9815433, 10115907, 10405293, 11074366, 11943965, 12739802, 13732818, 15322771, 17408435, 19872803, 23287847, 28063747, 32824999, 34732266, 32120760, 26357598, 20529702, 16592388, 14287803, 12511525, 10891028, 9789888, 9357339, 9156542, 8692037, 7935231, 7189219, 6626865, 6163960, 5729658, 5432197, 5360936, 5370667, 5214418, 4831317, 4371793, 3978605, 3684187, 3514205, 3537948, 3750868, 3992717, 4065771, 3941095, 3821405, 3944571, 4272063, 4443890, 4196513, 3788884, 3761532, 4213641, 4618311, 4526067, 4149544, 3971031, 4049396, 4118151]
39341D118151N6309K92858M75869K71712k6040J02756N97978R29269Q64548O60138
39331H343548N71573N98424O75916P62330P73051P34357R31061J592174K510536
39322A7492970L297228L940760M754788N754456O380323N917492M060535J138886
39314E2737438k028590m565864o018375o432307o014583m955358l609507k464844
39306A6648010j721763j204306q44231q57356j216424j407094j069982n10454
39298G816400k01234j24796J8919K73839M61201M84772L42271J21758J18158N43020
39288I854308J066171J203223J129666J338428J580993J245319P49238J134794
39280A9302140K222389K969970L782537N904994P818071N530140j511473p881555
$$ y = [4118151, 4174460, 4467318, 4943187, 5214899, 5188859, 5291615, 5889593, 6818862, 7683410, 8343548, 8915121, 9513545, 10189461, 10951791, 11724842, 12459199, 13390260, 14982434, 17492970, 20790198, 24730958, 29485746, 35240202, 41620525, 47538017, 51598552, 52737438, 50708848, 46142984, 40124609, 33692302, 27677719, 22722361, 19112854, 16648010, 14926247, 13721941, 12877710, 12020354, 10803930, 9396836, 8326854, 7816400, 7615166, 7490370, 7509289, 7783128, 8244329, 8729101, 9071372, 9193130, 9311288, 9854308, 10920479, 12123702, 13253368, 14591796, 16172789, 17418108, 18167346, 19302140, 21524529, 24494499, 28277036, 34182030, 42000101, 47530241, 46018768, 38137213]
39272C8137213q541651n203857k888083k567545j653599L8350J38156j099384
39264A6359600q48369R04630J308402M06512J306896L832080M509022M495663
39256C2274436R639553J8647630J9412911M572445j5238831k2777625j5482147
39249C1048372o093114l789423m899560l395453o22348k67949j103494k73673
39241A0603358J057571N16899n18529M68832K151280J446560j188018k618080
39233A1919873j996347j209902j144943q39741l4041L13580L4575R433M93067
39224G545554J003858J522668K072069J685534l03441k462637k732714j339528
39216F991363l10441m02215n28905j12561R2606k55868m24447j23468o1031m86738
$$ y = [38137213, 29595562, 24391705, 21503622, 18936077, 17282478, 17320828, 17458984, 16359600, 15511231, 16415861, 17724263, 18130775, 19437671, 23269751, 27778773, 32274436, 41913989, 60561619, 79974530, 84546975, 69308144, 46530519, 31048372, 24955258, 21165835, 16266275, 12870822, 12248474, 11980525, 10877031, 10603358, 11660929, 12177828, 11659299, 12128131, 14279411, 15725971, 14537953, 11919873, 9923526, 8713624, 7568681, 6728940, 6694899, 7008479, 7043054, 7052487, 7545554, 8549412, 10072080, 12144149, 13829683, 13526242, 11063605, 8330891, 6991363, 6680922, 6278707, 5749802, 5637241, 5729847, 5473979, 5049532, 4926064, 4865033, 4378295]
39206D378295o32795j39614K63114O6744j87450J1732K59618O4552k86655l14123
39196C483418j17560j2344M5070J87425K66283J66929R7175K19897L45586K78067
39186D959946J60198K29329M84376P98243J151618J571693J941881J972664J376266
39177A4646214J77644j114664j867589j948606j739450j481620j041186m57635
39169E173108j48552k45196k96191n4847K6565l78638p50088n09639r926O2636
39159B869232j49310O105M88980O16691K17380j32619o4612J35217J37491P078
39149D131633r3973j52813j69822j42726j69491k67023k38996k8702P3841o0898
39139B881030o7770K74556N10066K12551k01591q6821L79864N59525M42124M97553
$$ y = [4378295, 3745500, 3605886, 3869000, 3935744, 3748294, 3760026, 4019644, 4084196, 3797541, 3483418, 3365858, 3353514, 3398584, 3586009, 3852292, 4019221, 4116396, 4336293, 4681879, 4959946, 5120144, 5349473, 5833849, 6632092, 7783710, 9355403, 11297284, 13269948, 14646214, 14823858, 13709194, 11841605, 9892999, 8153549, 6671929, 5630743, 5173108, 5024556, 4779360, 4483169, 4428322, 4454887, 4076249, 3326161, 2816522, 2806596, 2869232, 2719922, 2726027, 3215007, 3831698, 4049078, 3916459, 3851847, 3987064, 4124555, 4131633, 4037660, 3884847, 3715025, 3572299, 3402808, 3135785, 2896789, 2868087, 2941928, 2881030, 2813260, 3087816, 3597882, 3810433, 3608842, 3522021, 3901885, 4461410, 4903534, 5401087]
39129E401087O78240N21756J33225J04683M60465O23144N05557O97443J374400
39120A0500000J933614K056203K309662L163266L959656L455169J235172j682084
39112B6930658l602386l549590k085839o63689p5754J00177L63692L28167m91835
39103A7253601j590188k083449j976666j849535j669168j025562k71508j77851
39095F609674n37510l96971K60482L91187l13576q43732n27156j3622M387j08106
39085D525057J26628K74402j81896p77715p64545k99165p1599j86407k17109m4741
39075B382910R2840J60698L03050M25675L26145R9988j0392k6448j33040l12014
39065C309412l77599k57810m3609J08165M5430j93688k81052m727K99138J78523
$$ y = [5401087, 6079327, 6601083, 6734308, 6838991, 7299456, 7922600, 8428157, 9125600, 10500000, 12433614, 14489817, 16799479, 19962745, 23922401, 27377570, 28612742, 26930658, 23328272, 19778682, 17692843, 17029154, 16953400, 17053577, 17417269, 17745436, 17253601, 15663413, 13579964, 11603298, 9753763, 8084595, 7059033, 6787525, 6609674, 6072164, 5675193, 5935675, 6326862, 6013286, 5169554, 4642398, 4628776, 4633163, 4525057, 4651685, 4926087, 4744191, 3966476, 3201931, 2902766, 2831167, 2644760, 2427651, 2382910, 2475750, 2636448, 2939498, 3365173, 3691318, 3791306, 3780914, 3754466, 3621426, 3309412, 2931813, 2674003, 2630394, 2738559, 2783989, 2590301, 2309249, 2304522, 2603660, 2782183]
39055B782183j64287j58542J24519L9226m63145o28526j49089K91494J73906l5582
39045A812157J65822L57297k6167n89781n36881P9549N03949M20091J84087P7299
39035B447422K2652j1648Q9262K76517L53056K76113J36528m2969k05870j52792
39025C188271J56182L94120K71469n8885k81130l45511l17918r7165L41399O71379
39015C922211N91171K95516J99230L44246M37776L54314K47660K19310J71575
39006F783009L504k23510l37674k33726k9457K6679q1545m6019K49433L77972
38996F488666k2953n31609m53580Q9316L25299M7888j78112j10490j99107n90645
38986D864673o95772k10211K63227J69629j47396j40751N1018L4091r7489p4410
$$ y = [2782183, 2617896, 2459354, 2583873, 2623099, 2159954, 1531428, 1382339, 1673833, 1847739, 1812157, 1977979, 2335276, 2309109, 1719328, 1182447, 1261996, 1765945, 2186036, 2370123, 2447422, 2470074, 2458426, 2547688, 2824205, 3177261, 3453374, 3589902, 3546933, 3341063, 3188271, 3344453, 3738573, 4010042, 3951157, 3670027, 3324516, 3006598, 2909433, 3250832, 3922211, 4513382, 4808898, 5008128, 5352374, 5790150, 6144464, 6392124, 6611434, 6783009, 6786513, 6563003, 6225329, 5991603, 5962146, 5988825, 5907280, 5861261, 6110694, 6488666, 6465713, 5934104, 5480524, 5569840, 5895139, 5943027, 5764915, 5654425, 5455318, 4864673, 4168901, 3958690, 4221917, 4391546, 4244150, 4103399, 4154417, 4188508, 4091019, 4016609]
38976D016609k944k1307R8076M38253N44971J40045k72695j37074K92273M48450
38966E544657L48351L18192K61057o2029l49793j03484N36895R27270P53766K50275
38956H425157k16923l48732O4606R10886J742792K231032K300886J725349K53851
38947A7088904j566131k489484k011418j006063m30127j94367P4223R0248l70868
38938I184917o44817j53839M40090J99579n02662n79518k1900J95138j73649l10599
38928G632740K02819P51185Q06271P45772J116231J698155J744130Q91624l66253
38919A5222674j050657o27116L62880Q73313O24389L39972O18900J259499J974199
38910A9598053K951625M168011M841221M205935K354057p4464k394923l762160
$$ y = [4016609, 4013665, 3992358, 4090434, 4528687, 5073658, 5213703, 4941008, 4803934, 5096207, 5544657, 5893008, 6211200, 6472257, 6410228, 6060435, 5956951, 6493846, 7421116, 8174882, 8425157, 8208234, 7859502, 7924108, 8834994, 10577786, 12808818, 15109704, 16835053, 17088904, 15522773, 13033289, 11021871, 10015808, 9585681, 9391314, 9465537, 9555785, 9184917, 8540100, 8386261, 8826351, 9025930, 8523268, 7943750, 7921850, 8116988, 7943339, 7632740, 7835559, 8586744, 9393015, 10138787, 11255018, 12953173, 14697303, 15588927, 15222674, 14172017, 13544901, 13907781, 14781094, 15405483, 15745455, 16364355, 17623854, 19598053, 22549678, 26717689, 31558910, 35764845, 38118902, 38044438, 35649515, 31887355]
38902C1887355l461095j886461m65787o0469j12244K78062J209421K202717K860366
38893C2451865L371665N003227Q970068J3123593J1540301J217980j1502687j6190732
38885D7985280j0841860l960812k465380l530771j906564R45746Q80797o86421
38877B6420015L26384K805506K758638J115463J756133L605462K566659n4519
38869D1299741M67697K885062K014460k70220L011249J0427875J3583484J4754323
38861H8173671K7038738M8483564N2254987J8861069l1732739n8947668m8878969
38854I5252653k5086973j2921006j2027369r585782l569822q99567k580774l337398
38846B5243962j881804j667367l212364l377149j565063n12305j029265q65616
$$ y = [31887355, 28426260, 26539799, 26074012, 26013543, 25901299, 26179361, 27388782, 29591499, 32451865, 35823530, 40826757, 49796825, 62920418, 74460719, 75678699, 64176012, 47985280, 37143420, 33182608, 30717228, 27186457, 25279893, 26225639, 27106436, 26420015, 26746399, 29551905, 32310543, 33426006, 35182139, 38787601, 41354260, 41299741, 41767438, 44652500, 46666960, 46396740, 49407989, 59835864, 73419348, 88173671, 115212409, 163695973, 215950960, 234812029, 203079290, 144131622, 95252653, 70165680, 57244674, 45217305, 35631523, 32061701, 31162134, 28581360, 25243962, 23362158, 21694791, 18482427, 15105278, 13540215, 13027910, 11998645, 11133029]
38838A1133029R60296K560470K274092N18608j571176l125420l345330k211762
38830G192807j030214p90646p65975j19249L44412k73854r94039n20660L87944
38821C430526K27438n74147m88816L77616O04434j5373l87564k16985k07931l91654
38811B357544j25106L73710K43523l43041l70609J98804L87477k3673k39042l3220
38801B426367p3383m78204m89714J18021N84939M59318K08610K11782J98948L9418
38791C206102J11578N06973P26324N55333N04204J002002J748796K154894J925365
38782A2441571J063057j78512j227358j591902j423848j247741j183638r63285
38774E688344o13157m59927m69264k61906J45017K74404l679k15715j4823L67393
$$ y = [11133029, 12093325, 14653795, 16927887, 17446495, 15875319, 12749899, 9404569, 7192807, 6162593, 5371947, 4605972, 4486723, 4831135, 4557281, 3563242, 3042582, 3430526, 3657964, 3083817, 2595001, 2972617, 3577051, 3561678, 3174114, 2957129, 2749198, 2357544, 2232438, 2606148, 2849671, 2506630, 2136021, 2334825, 2722302, 2698629, 2459587, 2426367, 2352984, 1874780, 1385066, 1503087, 2088026, 2547344, 2755954, 2967736, 3166684, 3206102, 3317680, 3824653, 4550977, 5106310, 5610514, 6612516, 8361312, 10516206, 12441571, 13504628, 13326116, 12098758, 10506856, 9083008, 7835267, 6651629, 5688344, 5075187, 4615260, 4145996, 3884090, 4029107, 4303511, 4299832, 4084117, 4069294, 4436687]
38764D436687N71483N25377K56980k21616o59225o55720k36084O4696n6120j85400
38754C841058K39105J101015J670012J445266O92807O4560j83284l88414q51998
38745G630127j283795j193677o77131l32417l92281m71628l09041j89635l51300
38736B429222m99497l04114M7547J96515J46653P8132k1729j77183k19598j09527
38726A566421j06869l00539l71715j43200J04228K05476M39112Q38934P94244
38717C026092l7980r41648r78261k43988L82984M33573J46590j29305k09877q63
38707A447317L08491K56111k21779n23767k66642P7055r141k29807j29560K0827
38697G29105j71743l30188J9325M30350K60587q4420J83062P44154O55858K1637
$$ y = [4436687, 5008170, 5533547, 5790527, 5568911, 4909686, 4253966, 4017882, 4082578, 4026458, 3841058, 4080163, 5181178, 6851190, 8296456, 8989263, 9053823, 8870539, 8482125, 7630127, 6346332, 5152655, 4475524, 4143107, 3750826, 3279198, 2970157, 2780522, 2429222, 1929725, 1625611, 1673158, 1869673, 2016326, 2094458, 2072729, 1895546, 1675948, 1566421, 1459552, 1159013, 787298, 644098, 748326, 953802, 1392914, 2231848, 3026092, 2988112, 2046464, 1068203, 824215, 1207199, 1640772, 1787362, 1658057, 1448180, 1447317, 1755808, 2011919, 1790140, 1266373, 999731, 1076786, 1067645, 837838, 708278, 729105, 557362, 227174, 246499, 676849, 937436, 853016, 1036078, 1780232, 2436090, 2457727]
38687B457727k18286J837j40326o55931n90485J92569N99544J23210l60223j92023
38677A217613M0340j89628l01098K17416P21663N54145L07896P70748J354541
38668D693636Q70327n39529j482110j219165m40925o4745j39333j96138o9173
38659A412845l384j99095m83877m51291L9444N62843N63879Q3375k98239k66395
38649I60105q2621j1865L5608J10321J7468k22675k28360J01447K89596k616m13705
38638E52703m37311j33838J20352K25098K80178K34833K5036j76452j75309o167
38628E09123K40284N40294P22363N38487J52213Q5981M30542O13457K57872k57695
38618C832921m49518l93659l39980k22812k6141q0814m60508o13610j84932L12601
$$ y = [2457727, 2239441, 2241278, 2100952, 1445021, 854536, 1047105, 1646649, 1769859, 1409636, 1217613, 1257953, 1068325, 767227, 984643, 1706306, 2260451, 2568347, 3339095, 4693636, 5563963, 5024434, 3542324, 2323159, 1882234, 1817489, 1678156, 1482018, 1412845, 1409461, 1210366, 726489, 275198, 314642, 877485, 1441364, 1524739, 1226500, 960105, 877484, 865619, 901227, 1011548, 1029016, 806341, 577981, 679428, 969024, 966408, 552703, 115392, -18446, 101906, 327004, 607182, 842015, 867051, 690599, 515290, 509123, 749407, 1289701, 2012064, 2550551, 2702764, 2788745, 3219287, 3832744, 4090616, 3832921, 3383403, 2989744, 2649764, 2426952, 2400811, 2319997, 1859489, 1245879, 1060947, 1373548]
38608A373548K89689L9150J88647O74104J055350J398350J895485J953620P82062
38599I650005j155857k346401k066845j137748o03116n00887l23321K3990K60803
38590A800623K84894J95920P228l01394n74797n73591k32287K46375N00141K81334
38580A634446k33981n31230l48569j7619L1628j26124j58205p6496j04787j29425
38570f0362J23569M34636K65272l36847o40731k51853L28736M64835K27385R0037
38560F44677J41694O7095k34254m24713j76510L77456P39055N50525k7627m78505
38550A178893m77895j88767L6998Q4124O5194N5378M3606L6542K4593m4425j13603
38539G00638k4793J64566J50608r6518j30770K80172O17984K95835l89016o18563
$$ y = [1373548, 1663237, 1702387, 1891034, 2565138, 3620488, 5018838, 6914323, 8867943, 9650005, 8494148, 6147747, 4080902, 2943154, 2340038, 1839151, 1515830, 1539820, 1800623, 2085517, 2281437, 2288665, 1987271, 1412474, 838883, 606596, 852971, 1353112, 1634446, 1400465, 869235, 520666, 503047, 534675, 408551, 250346, 173850, 69063, -60362, 63207, 497843, 763115, 426268, -214463, -466316, -137580, 327255, 554640, 644677, 786371, 853466, 619212, 194499, 17989, 395445, 1134500, 1685025, 1657398, 1178893, 700998, 512231, 549229, 633353, 698547, 753925, 797531, 834073, 858666, 814241, 700638, 675845, 840411, 991019, 894501, 763731, 1043903, 1661887, 1957722, 1568706, 950143]
38529I50143k32395J29090M6318j87655k11440j13089q8032q9120n8322r4955
38519E0543j84925j26892J03012K57310K12686J08622J1925j53707k69119q1976
38509g2521K70131L04887n2045k75782n1709K38161J63814r7468j53493m0966
38499B33009m1357j62232k16498j77777j02123O5219K82945K80885k9308k81462
38489a48699j49982J45517K03909M8761l5687k4866n8483l8865J82080L71141
38479D94826J88777j91387k63366K9469K14316M2098j89437k00747j37665j78870
38469a91986j46082J59462N01728M62164M3902k92559k11733J09502K62153J23490
38459H20041n6837n3632L7497J0864r1391o9856L5714m5517l36343m65332j92127
$$ y = [950143, 717748, 846838, 893156, 705501, 494061, 380972, 292940, 203820, 145498, 50543, -134382, -261274, -158262, 99048, 311734, 420356, 432281, 278574, 9455, -72521, 197610, 502497, 450452, 174670, 122961, 361122, 524936, 427468, 273975, 233009, 191652, 29420, -187078, -364855, -466978, -401759, -118814, 162071, 132763, -148699, -298681, -153164, 50745, 99506, 63819, 38953, -19530, -58395, 123685, 494826, 683603, 492216, 228850, 258319, 472635, 514733, 325296, 124549, -13116, -191986, -338068, -178606, 323122, 785286, 829188, 536629, 324896, 434398, 696551, 820041, 763204, 709572, 747069, 757933, 666542, 596686, 632400, 586883, 250540, -214792, -406919]
38448d06919K02124L13715J72515Q2100R1238M227j77480k18910n8632R5127J17914
38437B17019J09574J24964O6442o0039o1602J31303L01049K41235L9526q2176
38427A027295o5323j6842k3799q0334j21348o2328J08284K45527J78833m1453
38417A148512j74699j12084q993l8129j80773l32262m23311l46778N319M71918
38407H720O22004K72488j63900j42816L04226O39924N44970K28522l829j26121
38397B184188k06673j76085o007J18306N4440l9078N1016K28522K32869M5102
38387B486600j21929j67550j66779j48170q9564q1203j84690j92039R2393L69718
38377A796787J40888m52277o55360j92985K65681J32875j79498J9539N01584M34490
$$ y = [-406919, -204795, 108920, 281435, 363535, 454773, 459000, 281520, 62610, 3978, 99105, 217019, 326593, 451557, 517999, 457960, 396358, 527661, 828710, 1069945, 1109471, 1027295, 961972, 945130, 921331, 840997, 719649, 657321, 765605, 1011132, 1189965, 1148512, 973813, 861729, 852736, 814607, 633834, 301572, -121739, -468517, -463198, 8720, 630724, 903212, 739312, 596496, 900722, 1540646, 2085616, 2314138, 2310309, 2184188, 1977515, 1801430, 1795423, 1913729, 1968169, 1929091, 1980107, 2208629, 2441498, 2486600, 2364671, 2197121, 2030342, 1882172, 1792608, 1711405, 1526715, 1334676, 1427069, 1796787, 1937675, 1485398, 830038, 637053, 902734, 1035609, 856111, 875650, 1377234, 1811724]
38367A811724k87933q46818o78276j34437K11621K95245L21051L04819J81675
38358A178671J4964j58949l88575n42052l50243J02957L34275J33503j16396m8559
38348A59596J69829K32342J83977J43194n2247m55852o35104k35864L52551M93580
38338C56002K62337K47661M90659L65721l40330r15514o55935J51179O12517L49614
38328I23911j66892l20786n5132J98133J13715j50708k00997N1222K57251J13219
38318G62936k01197k68502k7324J38462o0938m08072m35826r895M81769N63037
38308E34450K26403q3708q6751m1162k66590n01551k08799N04818Q49475M31502
38298A358087j72257k67956J6406J19877l6107j13062o0700j17051k31650j02850
$$ y = [1811724, 1523791, 676973, -1303, -135740, 75881, 371126, 692177, 996996, 1178671, 1193635, 1034686, 646111, 104059, -246184, -143227, 191048, 324551, 208155, 159596, 329425, 561767, 745744, 888938, 836691, 380839, -254265, -490129, -137578, 356002, 618339, 866000, 1356659, 1722380, 1382050, 466536, -189399, -38220, 574297, 923911, 757019, 436233, 381101, 579234, 692949, 542241, 341244, 392466, 649717, 762936, 561739, 293237, 265913, 404375, 343437, -64635, -500461, -510356, -28587, 534450, 760853, 677145, 590394, 549232, 282642, -218909, -427708, 77110, 926585, 1358087, 1185830, 917874, 934280, 1054157, 1018050, 904988, 844288, 727237, 495587, 392737]
38288C92737K23959L36272O9985l04656n19810n13333k39382K59167O19351M90161
38278H14451Q9757o2782M9010l6112m05811n69694k45205K29808M59678M45950
38268G69050L10715R3823o738K45535N79486L98444k62742o27729l34852J1273
38258A176265j22393l44531j35877J74188J1023l80448l46881L9570J51929q3415
38248A39430j44051P8282J05397j88815k88667O2025L72656J84821k06098k24603
38238a09623J58529M64031L48136r2394n13603o06086k96296J75750M51416L94149
38228C74009J59145n7492j89342k37391k15937j71034j20080j6618R8507M5592
38218c30641j88411k63678P8495N30652N61188J71210j30184j03639m2421j50070
$$ y = [392737, 616696, 952968, 1022953, 718297, 198487, -314846, -554228, -295061, 324290, 814451, 904208, 841426, 890436, 854324, 448513, -121181, -366386, -136578, 323100, 769050, 1079765, 1173588, 1166850, 1412385, 1991871, 2390315, 2127573, 1499844, 1164992, 1176265, 1053872, 709341, 573464, 747652, 758675, 378227, 31346, 70916, 222845, 139430, -4621, 73661, 179058, -9757, -298424, -236399, 136257, 321078, 114980, -109623, 48906, 512937, 861073, 768679, 255076, -351010, -647306, -471556, -20140, 374009, 533154, 475662, 286320, 48929, -167008, -338042, -458122, -474740, -376233, -330641, -519052, -782730, -704235, -173583, 387605, 558815, 428631, 324992, 282571, 132501]
38208A32501j61169J45746M66214L80043n971k14276q2049O5933o3949l33191
38198C29832m05423k13036j5721j6130q8105n941J70022J71321l0588j61751j27769
38187c93289k00061m79673n37543r951O97366Q21199K66182k88431l14094N740
38177d32555K06782J02538k03873m93793n02524j41931K66755L11072Q0788O1631
38167g45110L79177N90954L72926j4551j53397l656J88311K17496J5288k85981
38157E61457l22938R4585N36597M13065p8680j21035M45281P74955L17619l14449
38147B306457l58962p8444j49829m38933l09239J75990L23164k4025k82725j47103
38137A016351K759j26020k65774j46979M2904M9974l9991n5922n1393j22486j86807
$$ y = [132501, -28668, 117078, 583292, 963335, 957364, 743088, 661039, 726972, 663023, 329832, -75591, -288627, -304348, -320478, -408583, -414524, -244502, -73181, -103769, -265520, -393289, -593350, -1073023, -1610566, -1620517, -923151, -101952, 164230, -124201, -438295, -432555, -225773, -123235, -327108, -820901, -1323425, -1465356, -1198601, -887529, -806741, -745110, -365933, 225021, 597947, 583396, 429999, 426343, 614654, 832150, 847438, 561457, 238519, 333104, 869701, 1282766, 1204086, 1083051, 1528332, 2303287, 2620906, 2306457, 1947495, 1869051, 1719222, 1280289, 971050, 1147040, 1470204, 1446179, 1163454, 1016351, 1019110, 893090, 627316, 480337, 523241, 573215, 533224, 477302, 425909, 303423, 116616]
38126A16616j32485J3202J66344K61508K32811J11734Q0341K01749K40797N4317
38116A346934n0076K15994M96867K30901l90017n91692j94212J02889j83187o13530
38106C70871n61883r3432K98366M05101L53356K59735J76714J43520P4298j42202
38096A284444l26728j83243J15843M7369l78837m77894M3946N26108L33329k00567
38086G83770m02200k93619k86158k82810P8233N41818M67142j10753m37285j33643
38076g5505L37981M43455K33891N2770N2163J83001L18189K73023o568k53121
38066A559279j61192J87416M77712O07542O51270O37062Q13800J739743L311384
38057I824016M003232K239997j307564l921950l830728k078166q21790o90212
$$ y = [116616, -15869, -2667, 163677, 425185, 657996, 769730, 850071, 1051820, 1292617, 1346934, 1296858, 1512852, 2009719, 2240620, 1850603, 1258911, 1064699, 1167588, 984401, 370871, -191012, -284444, 13922, 419023, 772379, 1032114, 1208828, 1352348, 1426646, 1284444, 957716, 774473, 890316, 937685, 558848, 80954, 124900, 651008, 984337, 783770, 381570, 87951, -198207, -481017, -402784, 139034, 606176, 495423, 58138, -75505, 262476, 705931, 939822, 992592, 1044755, 1227756, 1545945, 1818968, 1812400, 1559279, 1398087, 1585503, 2063215, 2670757, 3322027, 3959089, 4772889, 6512632, 9824016, 13827248, 16067245, 14759681, 10837731, 7007003, 4928837, 4107047, 3416835]
38049C416835p48609l90421m5277j45678m35470n09483l48037r4741J96928M06356
38039A302403L26845k1478l32802l71565j78750P7075K21291R7679k40010m08765
38029D71923r8474M26265N84138K58394o0022M826K38686K70214J35862J24741
38019B356553K79999L77929L26099K96004M23706N97324O73072P75174J144974
38010G250834J632762J596366O16069p73025j483239j125928m47343k71568m56890
38001F538038l60942M2979K18731R6010K49927Q90750J369966J046368J20140
37992A0211967p86298j424370j837484j870984j351512n86383j43872j61147k84153
37983A765764k60527j87896j73710j47767p8571l9908J187J48295K81326J49496
$$ y = [3416835, 2668226, 2277805, 2232528, 2086850, 1651380, 1141897, 793860, 699119, 896047, 1302403, 1629248, 1607770, 1274968, 903403, 724653, 801728, 1023019, 1120698, 880688, 471923, 373449, 799714, 1383852, 1642246, 1582224, 1587050, 1825736, 2095950, 2231812, 2356553, 2636552, 3014481, 3340580, 3636584, 4060290, 4657614, 5330686, 6105860, 7250834, 8883596, 10479962, 11096031, 10323006, 8839767, 7713839, 7266496, 6994928, 6538038, 6177096, 6220075, 6438806, 6534816, 6784743, 7675493, 9045459, 10091827, 10211967, 9425669, 8001299, 6163815, 4292831, 2941319, 2354936, 2211064, 2049917, 1765764, 1505237, 1317341, 1143631, 995864, 917293, 877385, 878572, 1026867, 1308193, 1457689]
37973A457689j56194k07023J15007L46339R5377l39267l65489P0488M32849L32338
37963A782114j3647j15052K04956O32072O82982K11067l71425m89298r0302K68061
37953B701528J70420q9458j1797K77307J95912l57193p96317p05452l81838k62528
37943G40584k67686j04264J27717J11261j04323j73091k0056R7458O6250L4391
37933E08241L2702j00952l29761l48301o2061K13470K26977J45911K03027K83502
37923G72755J72358m382N6313L25501M28218J41252l41298o65904o58920l92567
37913a66674p6063Q4804L7545p4921q2522K0193J03447O7224q4282k55019k82601
37902g08869o6739K47297L62208K15050Q3142J46946J87767m394j58464J12900
$$ y = [1457689, 1301495, 1094472, 1209479, 1555818, 1651195, 1311928, 946439, 1016927, 1449776, 1782114, 1768467, 1653415, 1858371, 2490443, 3173425, 3384492, 3013067, 2523769, 2433467, 2701528, 2871948, 2782490, 2770693, 3048000, 3243912, 2886719, 2090402, 1384950, 1003112, 740584, 472898, 368634, 496351, 607612, 503289, 330198, 310142, 407600, 473850, 508241, 540943, 439991, 110230, -238071, -300132, -86662, 140315, 286226, 489253, 772755, 945113, 940731, 997044, 1322545, 1750763, 1892015, 1550717, 884813, 225893, -166674, -242737, -157933, -120388, -195309, -277831, -257638, -154191, -86967, -171249, -426268, -708869, -775608, -528311, -166103, 48947, 132089, 279035, 466802, 462408, 303944, 416844]
37892D16844O00068O72371K06817j98281j29051M8281j42382m71860m01383k1187
37882E80237N2448l18411n34825j93875K74467K72565o8416j52561J35435K98796
37872C45860L9051l10462l27667p5506J21697J68912J65319J08777k6839p5170
37862A33972J09885L24920K55118l2139k07528k23065k77935k66982J51276P96159
37852G63681R08638K09552n38674n23655J6031K71527P5089q4083l4122j03299
37842I60685l31070k88531J11163L08377o4857n84049o44564k49015J85362M37046
37832a59453N14343L92199J22432j9997J20789K77919J46210j22293j83273r1205
37822I97671j90914m95081o16164l62134j5029J05701N5751P3610J84105J93025
$$ y = [416844, 1016912, 1689283, 1896100, 1697819, 1568768, 1617049, 1474667, 1002807, 601424, 580237, 632685, 314274, -220551, -414426, -139959, 132606, 64190, -88371, 47064, 345860, 384911, 74449, -253218, -328724, -207027, -38115, 127204, 235981, 209142, 133972, 243857, 568777, 823895, 791756, 584228, 361163, 83228, -183754, -32478, 763681, 1672319, 1881871, 1343197, 819542, 835573, 1107100, 1182189, 1098106, 1063984, 960685, 629615, 341084, 452247, 760624, 695767, 111718, -532846, -781861, -596499, -159453, 354890, 747089, 869521, 849524, 970313, 1248232, 1394442, 1272149, 1088876, 997671, 806757, 311676, -304488, -666622, -681651, -575950, -520199, -446589, -262484, -69459]
37812f9459K960k19040k23051K1863K72891K99265J47148N434j01781k61976l66026
37801d91772j90440J60105K76136N9725q8552N8711J35112j80627n13048l25348
37791a099998J78365L28705L8483r9146K08611N15370L57979j05598m20881l99864
37781d97974j47057J39335K25785K4544j70311J1817L93763L88102j05479m76401
37771b13876l22081k0450o914n2912J83646L86298P8161m33691m17104J07106
37761g11817L51857k1616m37313l50639K3794K42181K90642L10145J70402j88548
37751c20912l78740p9949L28772K37848k24629l04209K63557Q26254P18121J26825
37741A192938k78521k67197j77524k62213l34121j46804J83874L40375K34326
$$ y = [-69459, -66499, -285539, -508590, -486727, -213836, 85429, 232577, 238011, 136230, -125746, -491772, -682212, -522107, -245971, -186246, -274798, -216087, -80975, -261602, -774650, -1099998, -921633, -592928, -554445, -653591, -444980, 70390, 428369, 322771, -98110, -497974, -645031, -505696, -279911, -255367, -425678, -413861, -20098, 368004, 262525, -213876, -535957, -556407, -563321, -616233, -432587, -46289, 31872, -401819, -818923, -711817, -359960, -381576, -818889, -1169528, -1145734, -903553, -612911, -302766, -132364, -320912, -699652, -779601, -450829, -212981, -437610, -741819, -478262, 347992, 1066113, 1192938, 914417, 647220, 469696, 207483, -126638, -273442, -89568, 250807, 485133]
37732D85133O3538j7129p1743j76337k23459r2112R4825R5899q6220j94560j18839
37721b41004o1531j63558k02211P8519M86789N55920J68275k96914m71985l72217
37711e19917j84566K5509K39022L42376K53120M9085j53987l05192l18974j00982
37701f74506K05216K69552N2091p3666Q5821J79065r4672l76070j66148K99000
37691b94317L50310m7722k53768j9474J41649j24701m21563k99352L8842J63472
37681g66624O5492n3269j85834k83704q0347L76800N17494J29404r6957L67849
37671i696Q19311K92432p63398r78787j54417M27918L4595m44462n3473O89441
37661a40536P08111M5577l92261l03122j82514k60640k04865Q7629K20352Q804
$$ y = [485133, 548671, 531542, 459799, 283462, 60003, -32109, 62716, 158615, 72395, -122165, -241004, -302535, -466093, -668304, -589785, -102996, 452924, 621199, 324285, -147700, -519917, -704483, -678974, -439952, -97576, 155544, 204629, 50642, -254550, -573524, -674506, -469290, -199738, -147647, -221313, -135492, 43573, -51099, -427169, -593317, -294317, 55993, 8271, -245497, -264971, -123322, -248023, -669586, -968938, -930096, -766624, -701132, -754401, -940235, -1223939, -1304286, -927486, -409992, -280588, -377545, -9696, 809615, 1102047, 338649, -640138, -794555, -366637, -332042, -776504, -829977, -140536, 567575, 613152, 220891, -82231, -264745, -525385, -730250, -642621, -422269, -413465]
37651d13465j76903k6836K42259K94465J69420J06818J49322J60982O3653j22912
37641D46803l39369m61889l55366o2567J76088J85212L7321r6209j63508k06268
37631h39752k01563n7287K25559M58450M02292L4335l57637m36195j78418J18122
37621h32094K11171J59078J30937J33380O8547m0057m7309J09066L07242L38798
37611E38759Q4163l39402n97832m44613m2019J89299R8229l1060N6181K06149
37601b82146J42169q4384j94696j00912L6819Q9321O2487j1892q2435m5588R8145
37590c73112J42973n7696l16405l34633j26256L2208L0023M4778K32250N08766
37580b17104O63823N35514J02293m39914p39020n98798k00341J16579K14145J73078
$$ y = [-413465, -590368, -617204, -374945, -80480, 88940, 195758, 345080, 506062, 569715, 446803, 107434, -354455, -709821, -772388, -596300, -411088, -373767, -469976, -633484, -839752, -1041315, -1098602, -873043, -414593, -12301, 22034, -335603, -771798, -950216, -832094, -620923, -461845, -330908, -197528, -128981, -169038, -216347, -107281, 199961, 538759, 622922, 283520, -314312, -758925, -800944, -611645, -513416, -544476, -488295, -282146, -139977, -224361, -419057, -519969, -483150, -393829, -331342, -343234, -425669, -471257, -373112, -230139, -287835, -604240, -938873, -1065129, -1032921, -1002898, -958120, -725870, -217104, 446719, 982233, 1084526, 644612, -94408, -693206, -893547, -776968, -562823, -389745]
37570c89745R2000N1983J37455K88711K81419N4595j35764j21908j24108l25310
37560a90672m34709j24144L43010M58038K59038J70405J90457l8285l74895k27222
37550C1021L67658N47188r5429p76989o36774J4574K43920j19113l94941j68074
37540i86959K20486L21928J57974N405j5765L0278O2370N4924L3953K3919k6849
37529a18336j72724k93200j78672J26688L02700J98651M2067M3157Q1751L955
37519C6037p3025l1980l9949k25645l39502j28175J70833J44728j35628k21301
37509h43607L0882L11637L68125K59227R9553p8432j76337p9911J01596J38979
37499A31712M4812M7885K01555L06663K34280M7352j90675m38146n25752l06135
$$ y = [-389745, -297745, -245762, -108307, 180404, 461823, 516418, 380654, 258746, 134638, -190672, -625381, -749525, -406515, 51523, 310561, 480966, 671423, 633138, 258243, 31021, 398679, 945867, 850438, 73449, -563325, -548751, -304831, -423944, -818885, -986959, -766473, -444545, -286571, -281166, -296931, -266653, -204283, -149359, -115406, -91487, -118336, -291060, -584260, -762932, -636244, -333544, -134893, -92826, -49669, 32082, 36037, -36988, -68968, -108917, -334562, -674064, -802239, -631406, -486678, -622306, -843607, -812725, -501088, -132963, 126264, 225817, 147385, -28952, -108863, -7267, 131712, 176524, 224409, 425964, 732627, 966907, 1014259, 823584, 385438, -140314, -446449]
37489d46449M5738K04619J63133J77556K53546J13331k50471m38816k40473M1649
37479c76637Q9624L4896J40328L20512L05929P6898j72665l46948m42349l72038
37469g42450r4720J71077J58924m5100p9923J93886N05834N37111K76422o2414
37459H18647l07642l95466l00651p0775J22854J42268Q9168J68192L09878J87286
37449G63759k35229m65500j45785K76994Q0520n97790q17137j86844N24302N15809
37439b86901N0964j50744n6756r2983j83224O7674M21305K04985n01342p97101
37429a324123k74048M31742O61539N12870K72116j25198o00448o37732o9050M55406
37419f96926L80958P6381J22955L26701J80809j48238j32814J35496J37691r2769
$$ y = [-446449, -400711, -196092, -32959, 144597, 398143, 511474, 261003, -177813, -418286, -376637, -287013, -252117, -111789, 208723, 514652, 591550, 418885, 71937, -370412, -742450, -837170, -666093, -507169, -552269, -632192, -438306, 67528, 604639, 881061, 818647, 511005, 115539, -185112, -255887, -133033, 9235, 98403, 266595, 576473, 763759, 528530, 63030, -82755, 194239, 274759, -323031, -1140168, -1327012, -802710, -286901, -235937, -386681, -443437, -536420, -719644, -651970, -230665, -25680, -527022, -1324123, -1598171, -1166429, -504890, 7980, 280096, 154898, -445550, -1083282, -1152332, -696926, -315968, -239587, -116632, 210069, 390878, 242640, 109826, 245322, 383013, 290244]
37409B90244m7679K66813K75163j60674m71080l00609n356K2815p1918j5240J13812
37398a03709J31500J14629K23162M06293M79216L05909j39035o47104p62831k56778
37388b48748M24771O11562K87702K6778O4930N0645j86335k93419p7637J01979
37378G62228j9360j37268M1164K56090J91065M6479J20136K26629O4958j88761
37368A363360j97965o2147n2299n2203J56105L32022J35790j94373k06840o7364
37358A154086k58575n93348m11888K17531M30504q3663n66587m10461m7150o6201
37348f35752k03246N1783M18057K65292k49635l80825o152K12505n6341l28708
37338i13022j70755J27174J22872m7505K2043L03480M20210K66443J03136Q8406
$$ y = [290244, 242565, 509378, 784541, 623867, 152787, -147822, -153178, -130363, -202281, -217521, -103709, 27791, 142420, 365582, 771875, 1251091, 1557000, 1417965, 770861, 8030, -248748, 176023, 787585, 1075287, 1102065, 1166995, 1217640, 1031305, 737886, 660249, 762228, 742868, 605600, 646764, 902854, 1093919, 1140398, 1260534, 1487163, 1552121, 1363360, 1165395, 1103248, 1050949, 998746, 1154851, 1486873, 1622663, 1428290, 1221450, 1154086, 895511, 302163, -109725, 107806, 538310, 454647, -111940, -522401, -569551, -635752, -838998, -787215, -369158, -103866, -353501, -734326, -740478, -527973, -584314, -913022, -1083777, -956603, -833731, -881236, -859193, -555713, -135503, 130940, 234076, 322482]
37328C22482R4739K8543M610R0057J30346J011j41031o3087J75329K82311J62013
37317A087323O0971J79385L14668J05892m25102q13835o96014k29076J38342J77171
37307a00275J4509j33839j77767j24976j5546P0935N4207m9919j32406j14337
37297g09414k4352M7804M3431P583Q8491L74286O76185O27056J50666l14679l14939
37286F52118p421M9045k76527m79804j92631K39436K64543q5686l19010k25915
37276c81852n5335Q517R2656K67647L34837J78408J8260O1747J35826m4590l86919
37265B29202n07765k67824N6934J72641J04151M2676L6871r158j06329j12305
37255c60906O3355K70522K39631q0943l91691l51605K981K86165K38404J8656
$$ y = [322482, 417221, 445764, 450374, 540431, 670777, 671788, 530757, 467670, 642999, 925310, 1087323, 1148294, 1327679, 1642347, 1748239, 1323137, 509302, -186712, -415788, -277446, -100275, -85766, -219605, -397372, -522348, -537894, -466959, -412752, -462671, -595077, -709414, -733766, -685962, -642531, -634948, -546457, -172171, 504014, 1131070, 1281736, 967057, 652118, 644697, 693742, 417215, -62589, -255220, -15784, 248759, 163073, -155937, -381852, -437187, -428670, -336014, -68367, 266470, 444878, 463138, 524885, 660711, 616121, 229202, -278563, -546387, -489453, -316812, -212661, -169985, -133114, -142272, -248601, -360906, -297551, -27029, 212602, 131659, -260032, -611637, -608656, -322491, -84087, -65431]
37245f5431p1603M129O8708Q2677J84462L66096L65040J8375m34550n84677l33699
37234d00473J1242J25258K3929k0466J50262L84184M17761K18313L9834J00400
37224A050244K88991L14525J24650J1641K21932N88700P02765M07981j2128j45509
37214C553792J64261P50010J294621J504047J231972N79493j41837o45259q89940
37205G401160j032737j184926j282068j190328q80674m84261j99341j20683j33186
37196H92956l5054J75749K36392k8140l84284m47109k22326r6986k31420k98251
37186d38473j8421L58479M21729K03362K5398p7682l04404n29242l60849J44626
37176e75477L81947O4571k95741j52445K44861K73465r7099l30376j84835K4631
$$ y = [-65431, -137034, -132905, -64197, 18480, 202942, 569038, 934078, 952453, 517903, -66774, -400473, -389231, -263973, -240044, -260510, -110248, 273936, 691697, 910010, 949844, 1050244, 1339235, 1653760, 1778410, 1790051, 2011983, 2600683, 3303448, 3711429, 3699301, 3553792, 3718053, 4468063, 5762684, 7266731, 8498703, 9078196, 8936359, 8291100, 7401160, 6368423, 5183497, 3901429, 2711101, 1830427, 1346166, 1146825, 1026142, 892956, 857902, 1033651, 1270043, 1241903, 857619, 410510, 188184, 91198, -140222, -438473, -456894, -98415, 323314, 526676, 552074, 474392, 169988, -359254, -720103, -575477, -193530, -128959, -424700, -577145, -332284, -58819, -155918, -486294, -671129, -646498]
37166f46498M5119L2095J37852K06308R6889l6208j8547P0481J09418J55805K35836
37155C88550J78614p6256k49642j11480J13120Q4982p9073j4903K04984J14688
37145E53584l50677o20742k89825K72720M54795K18140l2731j58141l44523n39018
37135h36418l85703J39655N12595L49350m9917j78230n4491o8265k67410k75529
37125a114363P3332M34313M16417O2912k63714k75737L3840L81977L67673r9450
37115A7200n31631l54555K79978N87403K09852k86707k74646M4951R0550j39876
37105c57481j81602L4330J14861l4686n5283J56754K17295m7616k44501o9529
37095d67458J84104J72712J08547L12745M97989J21395o54383r64584l40534O32075
$$ y = [-646498, -601379, -569284, -431432, -225124, -128235, -164443, -182990, -112509, -3091, 152714, 388550, 567164, 490908, 241266, 129786, 242906, 327888, 248815, 233912, 438896, 553584, 202907, -417835, -707660, -434940, 19855, 237995, 205264, 47123, -297400, -836418, -1222121, -1082466, -569871, -220521, -270438, -448668, -503159, -571424, -838834, -1114363, -1041031, -606718, -190301, -127389, -391103, -666840, -633000, -251023, 116650, 17200, -514431, -868986, -589008, -1605, 208247, -78460, -353106, -308155, -217605, -357481, -539083, -504753, -389892, -424578, -479861, -323107, -105812, -153428, -397929, -467458, -283354, -110642, -2095, 310650, 808639, 930034, 275651, -688933, -1029467, -397392]
37085c97392R92594N02969j74150l13856N6495K73843q4354o36361o92787j90724
37075f63723K31760J40839j44040j43270M8105L7665j40883j14002J42347K48572
37065c56630P7497m8827O6350J96668J53455R7154J32595K3575l28135n01392
37055d87690j35603L84453M01920N925q1324L23342N11818J708o31524n78140
37045b85115P815L24289J75361J04761K94211J97966m25430q97093n89681P1013
37035a021903K63033M842n4416J79137J63638k00933l27487K1893K96130J19960
37025e56106o9625J28683K79674j48113p54994p29949j05748L19490K05173K9665
37015a401850J77441L84697L09818Q0252k4526j8739m7543p7762j2576Q5762Q6537
$$ y = [-397392, 595202, 1098171, 924021, 610165, 666660, 940503, 856149, 219788, -472999, -663723, -431963, -291124, -435164, -578434, -530329, -492664, -633547, -747549, -605202, -356630, -279133, -327960, -261610, -64942, 88513, 185667, 318262, 341837, 13702, -487690, -623293, -238840, 163080, 169005, 87681, 411023, 922841, 924549, 293025, -285115, -277300, 46989, 222350, 327111, 621322, 819288, 393858, -503235, -1092916, -1021903, -758870, -754028, -808444, -629307, -465669, -666602, -994089, -972196, -676066, -556106, -625731, -497048, -217374, -365487, -1120481, -1850430, -1956178, -1636688, -1431515, -1401850, -1224409, -839712, -529894, -449642, -474168, -492907, -540450, -618212, -630788, -545026, -458489]
37004d58489k9214j81965k58892j45602J33762L23048K01643p6260j66085k7466
36994f85520P3626M5137Q0188K28278K44859K3847j56677k9014K73943M17796
36984E16463K73646j3960k10132j67433J5894J9361k91422n38986k69199L13476
36974c52292N10793J11960k99438k17074J17968K30927J32068J02529J28074K3901
36964D89416j14319m7312J54487J89430k5164k86457l94387k67574O9394L78830
36954A46344L09359j17841l66776o6059M16094M78072J46464m2935J13022K69552
36944A285296J36756j60553l75358m23830l25347j47754k9217k2353J5779J48012
36934A01431J44396j37543l75753k16094J17149J66730L0134J60216M57441L18381
$$ y = [-458489, -487703, -669668, -928560, -1074162, -940400, -617352, -415709, -491969, -658054, -685520, -611894, -566757, -486569, -258291, -13432, 10415, -146262, -175276, 98667, 516463, 790109, 776149, 566017, 398584, 414478, 433839, 142417, -396569, -665768, -352292, 158501, 270461, -28977, -246051, -128083, 102844, 234912, 337441, 465515, 489416, 375097, 327785, 482272, 671702, 646538, 360081, -34306, -301880, -232486, 146344, 455703, 337862, -28914, -94973, 321121, 799193, 945657, 902722, 1015744, 1285296, 1422052, 1261499, 886141, 462311, 136964, -10790, -40007, -62360, -46581, 101431, 245827, 108284, -267469, -483563, -366414, -199684, -169550, -9334, 448107, 766488]
36924G66488l02472o48693k73062K96796M14583K23223J80711J94083j11062n67125
36914A73470o08070j59334K12187J05323k19487k87613j1994L31365N12253N32342
36904E80442M69154K88493r6798n74653p69951m17514K24052N60290L30105j11872
36894D81748k67190n2796K22418K67528P1351j31345r4358J34421J90421j21423
36884G00775m23594k23042K75527L42618j73155n14711j18717N05710N18065m9014
36874H40462m54315l73214j88130k11443k54081r4107J24176J70576O8902l9540
36864d10714j29899k16108k02459K5791M06222O59315M87339p6450n18753k94944
36854b70660M51122R06274N55778j61147m74540k60640K6506J28835J43588P7146
$$ y = [766488, 464016, -184677, -457739, -160943, 253640, 476863, 657574, 851657, 740595, 173470, -434600, -593934, -381747, -276424, -495911, -783524, -795518, -464153, 48100, 580442, 1049596, 1338089, 1241291, 666638, -103313, -520827, -296775, 263515, 593620, 481748, 214558, 161762, 384180, 651708, 723059, 591714, 497356, 631777, 822198, 700775, 277181, 54139, 329666, 672284, 499129, -15582, -134299, 371411, 889476, 840462, 386147, 12933, -175197, -386640, -640721, -734828, -610652, -440076, -371174, -410714, -540613, -756721, -959180, -933389, -527167, 132148, 619487, 543037, 24284, -270660, 180462, 1086736, 1642514, 1481367, 1006827, 746187, 772693, 901528, 1045116, 1122262]
36844A122262j49336l01184o1542L09555J95183l78037o33914j95144L20632K53434
36834D81909j40033k16739L2278J37045K8005O5298K78365K33191k32725o60010
36824F584n67080n6442L86523M56037J94147k09821n53925o32443l35916J79271
36814a133065N24263M14900J198k49725q5269K31538L09712J92721K34926M50298
36804H91497L91341j62228p57995q09971l40206J38080L03890K55520J66239P4916
36794A51083J0441J7978K5974p3145j96401j57742J1974Q3717l411o0786k346
36783a92664l730j75465l23134k35229l3378M308j18983j01425K23231O23865
36773c32604P26081M23169n3925m16249n55858n03553k79642Q9000M42995N47152
$$ y = [1122262, 972926, 671742, 610200, 919755, 1114938, 736901, 102987, -92157, 228475, 481909, 341876, 125137, 157415, 294460, 322465, 387763, 666128, 899319, 666594, 6584, -560496, -616938, -230415, 225622, 419769, 209948, -343977, -976420, -1312336, -1133065, -608802, -193902, -192704, -442429, -527698, -296160, 13552, 206273, 441199, 891497, 1282838, 1120610, 362615, -447356, -787562, -649482, -345592, -90072, 76167, 151083, 161524, 179502, 205476, 132331, -64070, -221812, -209838, -126121, -129532, -190318, -192664, -196394, -371859, -694993, -930222, -963600, -959292, -1078275, -1179700, -956469, -332604, 393477, 816646, 762721, 346472, -209386, -712939, -992581, -903581, -460586, 86566]
36763H6566L49913Q7283K9972J78963K93458J77676j31588m15559m44092j59015
36753E3577K26424L66958J19310k99231n49678m96033k24175J27610L99736L88224
$$ y = [86566, 436479, 523762, 553734, 732697, 1026155, 1203831, 1072243, 656684, 212592, 53577, 280001, 646959, 766269, 467038, -82640, -578673, -802848, -675238, -275502, 112722]
$$ [...]
##END NTUPLES=NMR SPECTRUM
##END=
