##TITLE=31Pdec_3PBDP2110
 CDCl3, 24 sc
 22.10.2020
##JCAMPDX= 6.0         $$ Bruker NMR JCAMP-DX V2.0
##DATA TYPE= NMR SPECTRUM
##DATA CLASS= NTUPLES
##ORIGIN= UXNMR, Bruker Analytische Messtechnik GmbH
##OWNER= root
$$ XWIN-NMR		Version 3.5
$$ Thu Oct 22 10:38:13 2020 Russian Standard Time (UT+4h)  she@DPX200
##.OBSERVE FREQUENCY= 81.013821
##.OBSERVE NUCLEUS= ^31P
##.ACQUISITION MODE= SIMULTANEOUS
##.ACQUISITION SCHEME= undefined
##.AVERAGES= 24
##.DIGITISER RES= 17
##SPECTROMETER/DATA SYSTEM= spect
##.PULSE SEQUENCE= zgpg30
##.SOLVENT NAME= CDCl3
##.SHIFT REFERENCE= (INTERNAL, CDCl3, 0, 182.463)
##AUDIT TRAIL= $$ (NUMBER, WHEN, WHO, WHERE, WHAT)
$$ ##TITLE= Audit trail, XWIN-NMR		Version 3.5
$$ ##JCAMPDX= 5.01
$$ ##ORIGIN= Bruker BioSpin GmbH
$$ ##OWNER= she
$$ F:/spectra/data/she/nmr/P31/1/pdata/1/auditp.txt
$$ ##AUDIT TRAIL=  $$ (NUMBER, WHEN, WHO, WHERE, WHAT)
(   1,<2020-10-22 10:37:17.85 +0400>,<she>,<DPX200>,
      <created by zg, POWCHK disabled, PULCHK disabled
       configuration hash MD5:
       00 E9 B6 7A A2 85 ED C7 34 08 36 98 17 FE 4E 26
       data hash MD5: 32K
       58 39 FE E1 14 B3 34 E7 66 58 28 C9 5A 63 99 F8>)
(   2,<2020-10-22 10:37:20.40 +0400>,<she>,<DPX200>,
      <Start of raw data processing
       efp BC_mod = 2 LB = 1 FT_mod = 6 PKNL = 1 PHC0 = -2439.338 PHC1 = 200.0006 SI = 64K 
       data hash MD5: 64K
       83 6C 8C 88 F2 0A CD D3 3D 17 D1 4D EC 9E DA 62>)
(   3,<2020-10-22 10:37:36.64 +0400>,<she>,<DPX200>,
      <pk PHC0 = 5.802554 PHC1 = -4.4 
       data hash MD5: 64K
       F0 C4 F3 9D 5C A8 07 17 BF 28 B8 91 2E 19 37 57>)
(   4,<2020-10-22 10:37:42.84 +0400>,<she>,<DPX200>,
      <abs ABSG = 5 
       data hash MD5: 64K
       83 E1 B6 70 8E F0 B4 59 6C 42 61 50 C0 B7 9D 41>)
$$ ##END=
$$ 
$$ hash MD5
$$ 23 C9 F6 53 12 9B B9 2D 41 F9 71 66 E8 EC F1 1D
##$RELAX= 
##$RELAX= 
##$RELAX= 
##$RELAX= 
##$RELAX= 
##$RELAX= 
##$RELAX= 
##$RELAX= 
$$ Bruker specific parameters
$$ --------------------------
##$DU= <F:/spectra>
##$EXPNO= 1
##$NAME= <P31>
##$PROCNO= 1
##$TYPE= <nmr>
##$USER= <she>
##$AMP= (0..31)
100 100 100 100 100 100 100 100 100 100 100 100 100 100 100 100 100 100 
100 100 100 100 100 100 100 100 100 100 100 100 100 100 
##$AQSEQ= 0
##$AQ_mod= 1
##$AUNM= <au_zg>
##$AUTOPOS= <>
##$BF1= 81.014009
##$BF2= 200.13
##$BF3= 200.13
##$BF4= 200.13
##$BF5= 200.13
##$BF6= 200.13
##$BF7= 200.13
##$BF8= 200.13
##$BYTORDA= 1
##$CFDGTYP= 0
##$CFRGTYP= 5
##$CHEMSTR= <none>
##$CNST= (0..31)
1 1 145 1 1 1 1 1 1 1 1 1 1 1 1 1 1 1 1 1 1 1 1 1 1 1 1 1 1 1 1 1 
##$CPDPRG= <waltz16>
##$CPDPRG1= <>
##$CPDPRG2= <waltz16>
##$CPDPRG3= <>
##$CPDPRG4= <mlev>
##$CPDPRG5= <mlev>
##$CPDPRG6= <mlev>
##$CPDPRG7= <mlev>
##$CPDPRG8= <mlev>
##$CPDPRGB= <>
##$CPDPRGT= <>
##$D= (0..31)
0 1 0 0 0 0 0 0 0 0 0 0.03 2e-05 3e-06 0 0 0 0 0 0 0 0 0 0 0 0 0 0 0 0 
0 0 
##$DATE= 1603348637
##$DBL= (0..7)
120 120 120 11 120 120 24 19 
##$DBP= (0..7)
150 150 150 150 150 150 150 150 
##$DBP07= 0
##$DBPNAM0= <>
##$DBPNAM1= <>
##$DBPNAM2= <>
$$ [...]
##$SUBNAM3= <"">
##$SUBNAM4= <"">
##$SUBNAM5= <"">
##$SUBNAM6= <"">
##$SUBNAM7= <"">
##$SUBNAM8= <"">
##$SUBNAM9= <"">
##$SW= 369.568048894756
##$SWIBOX= (0..15)
0 1 3 0 0 0 0 0 0 0 0 0 0 0 0 0 
##$SW_h= 29940.119760479
##$TD= 32768
##$TD0= 1
##$TE= 0
##$TE2= 300
##$TE3= 300
##$TEG= 300
##$TL= (0..7)
0 120 53 12 22 120 120 120 
##$TP= (0..7)
150 150 150 150 150 150 150 150 
##$TP07= 0
##$TPNAME0= <>
##$TPNAME1= <>
##$TPNAME2= <>
##$TPNAME3= <>
##$TPNAME4= <>
##$TPNAME5= <>
##$TPNAME6= <>
##$TPNAME7= <>
##$TPOAL= (0..7)
0.5 0.5 0.5 0.5 0.5 0.5 0.5 0.5 
##$TPOFFS= (0..7)
0 0 0 0 0 0 0 0 
##$TUNHIN= 0
##$TUNHOUT= 0
##$TUNXOUT= 0
##$USERA1= <user>
##$USERA2= <user>
##$USERA3= <user>
##$USERA4= <user>
##$USERA5= <user>
##$V9= 5
##$VALIST= <valist>
##$VCLIST= <CCCCCCCCCCCCCCC>
##$VD= 0
##$VDLIST= <DDDDDDDDDDDDDDD>
##$VPLIST= <PPPPPPPPPPPPPPP>
##$VTLIST= <TTTTTTTTTTTTTTT>
##$WBST= 1024
##$WBSW= 4
##$XGAIN= (0..3)
0 0 0 0 
##$XL= 0
##$YL= 0
##$YMAX_a= 31185
##$YMIN_a= -27464
##$ZGOPTNS= <>
##$ZL1= 120
##$ZL2= 120
##$ZL3= 120
##$ZL4= 120
##$ABSF1= 182.463
##$ABSF2= -187.1042
##$ABSG= 5
##$ABSL= 3
##$ALPHA= 0
##$AQORDER= 0
##$ASSFAC= 0
##$ASSFACI= 0
##$ASSFACX= 0
##$ASSWID= 0
##$AUNMP= <proc_1d>
##$AZFE= 0.1
##$AZFW= 0.5
##$BCFW= 0
##$BC_mod= 2
##$BYTORDP= 0
##$COROFFS= 0
##$CY= -3
##$DATMOD= 1
##$DC= 0
##$DFILT= <>
##$DTYPP= 0
##$F1P= 0
##$F2P= 0
##$FCOR= 1
##$FTSIZE= 65536
##$FT_mod= 6
##$GAMMA= 0
##$GB= 0
##$INTBC= 1
##$INTSCL= 5.30512e-09
##$ISEN= 30
##$LB= 1
##$LEV0= 0
##$LPBIN= 0
##$MAXI= 10000
##$MC2= 0
##$MEAN= 0
##$ME_mod= 0
##$MI= 50
##$NCOEF= 0
##$NC_proc= -6
##$NLEV= 6
##$NOISF1= 182.463
##$NOISF2= 159.3651
##$NSP= 0
##$NTH_PI= 0
##$NZP= 0
##$OFFSET= 182.463
##$PC= 4
##$PHC0= -2433.535
##$PHC1= 195.6006
##$PH_mod= 1
##$PKNL= yes
##$PPARMOD= 0
##$PSCAL= 0
##$PSIGN= 0
##$REVERSE= no
##$SF= 81.014009
##$SI= 65536
##$SIGF1= 159.3651
##$SIGF2= -187.1042
##$SINO= 113.3802
##$SIOLD= 16384
##$SREGLST= <1H.CDCl3>
##$SSB= 0
##$STSI= 65536
##$STSR= 0
##$SW_p= 29940.119760479
##$SYMM= 0
##$S_DEV= 0
##$TDeff= 32768
##$TDoff= 0
##$TI= <>
##$TILT= no
##$TM1= 0
##$TM2= 0
##$TOPLEV= 0
##$USERP1= <user>
##$USERP2= <user>
##$USERP3= <user>
##$USERP4= <user>
##$USERP5= <user>
##$WDW= 1
##$XDIM= 65536
##$YMAX_p= 425572945
##$YMIN_p= -13994694
$$ End of Bruker specific parameters
$$ ---------------------------------
##NTUPLES= NMR SPECTRUM
##VAR_NAME=  FREQUENCY,     SPECTRUM/REAL,   SPECTRUM/IMAG
##SYMBOL=    X,             R,               I
##VAR_TYPE=  INDEPENDENT,   DEPENDENT,       DEPENDENT
##VAR_FORM=  AFFN,          ASDF,            ASDF
##VAR_DIM=   65536,         65536,           65536
##UNITS=     HZ,            ARBITRARY UNITS, ARBITRARY UNITS
##FACTOR=    0.456856943014862, 1,           1
##FIRST=     14782.0589164895, 0,            0
##LAST=      -15158.0608439895, 0,           0
##MIN=       -15158.0608439895, -13994694,   0
##MAX=       14782.0589164895, 425572945,    0
$$ Real data points
##PAGE= N=1
##DATA TABLE= (X++(R..R)), XYDATA
$$ [...]
43032A383792k01954Q3190k7472L9203O03464J092213O86101n02202j400783j285187
43022D70365o61554m67761p25094o16625J30391P27623N80140L23544Q00607J527144
43012B088780J337884L50451j49295N6372l20415j590799j980587l79452J402998
43003H15937J070387o82615j417447q02348n42374q76681j87136J569769K092836
42994A040328M28955j294687j245226n22959p20966j112630l48969R01155J232076
42985a642923R44643J054195J183184O01631J12722O37693J085584L9594j478540
42976B537783j499247m61041l15961r73443o23095P29522J139673J97606l81364
42967C50433N2212K55545o9177L56460J433181J201613n64274j380234k07728
$$ plain form
43032 1383792 1181838 1265028 1237556 1276759 1880223 2972436 3658537 3156335 1755552 470365
43022 470365 -191189 -658950 -1384044 -2000669 -1870278 -1142655 -562515 -238971 561636 2088780
43012 2088780 3426664 3777115 3627820 3684192 3363777 1772978 -207609 -587061 815937
43003 815937 1886324 1203709 -213738 -1016086 -1558460 -2435141 -2622277 -1052508 1040328
42994 1040328 1469283 174596 -1070630 -1593589 -2314555 -3427185 -3776154 -2874999 -1642923
42985 -1642923 -698280 355915 1539099 2140730 2253452 2891145 3976729 4016323 2537783
42976 2537783 1038536 577495 261534 -711909 -1335004 -605482 534191 731797 350433
42967 350433 402645 658190 589013 945473 2378654 3580267 3015993 1635759 1428031
42958A428031M66758j205677l009011k073474N40327J683192R36013M66393J071366
42949C03918J473276J185615J168751J468196P77480j049854k178228j372547
42941A776607J40749L35005j083742k566846k573197j072756N03381P67632K7081
42932c746086k4044J310973K480303J776776r0649r40682k22390M54458p1349
42923I27310r80777j052338m43909q0343j46731j07258J80224J77556m44563j068668
42913c039497o39669R51119K288166J887819K77302l32582J023905K478739J722571
42904F617873p84709k436969j989078q46028o54730j118296r44940Q3698R58972
42895a114207Q75800M6083p21223p28566J82776J460765K111050J515471J53021
$$ plain form
42958 1428031 1894789 689112 -2319899 -4393373 -3853046 -2169854 -1233841 -767448 303918
42949 303918 1777194 2962809 4131560 5599756 6377236 5327382 3149154 1776607
42941 1776607 1917356 2252361 1168619 -1398227 -3971424 -5044180 -4540799 -3773167 -3746086
42932 -3746086 -3770130 -2459157 21146 1797922 1707273 766591 544201 998659 927310
42923 927310 -53467 -1105805 -1549714 -1630057 -1776788 -1884046 -1703822 -1526266 -1970829 -3039497
42913 -3039497 -3679166 -2728047 -439881 1447938 1725240 1392658 2416563 4895302 6617873
42904 6617873 5833164 3396195 1407117 561089 -93641 -1211937 -2156877 -2073179 -1114207
42895 -1114207 -238407 -192324 -913547 -1642113 -1459337 1428 2112478 3627949 3780970
42886C780970o95683k42034Q37561J093751J10911r17888q74982l04152l48671
42877B439783o83872p2395J138106J025626q47193k348661j848586n39037j77448
42868a913677k54272N49259J523169J073005j94511k44775R02192J190605N6158
42859B687153p85278m76824k59279p78684p56182M32171J205115L49945q79229
42850G38908r17931l37027l19882l66596M01357J039439K08898j160310j034664
42841a747808M34059J127687L01174n12038j01612Q92392J428290J314436N78237
42832C714817q20930k117276k045692o52109N01731N35281L18855O45124P65004
42823H44805j22394j105746p76280M63311Q57234r4752r18223l60522Q43101J108519
$$ plain form
42886 3780970 3085287 2843253 3680814 4774565 4885476 3967588 3092606 2788454 2439783
42877 2439783 1755911 1683516 2821622 3847248 3000055 651394 -1197192 -1736229 -1913677
42868 -1913677 -2167949 -1618690 -95521 977484 782973 538198 1440390 2630995 2687153
42859 2687153 1901875 1425051 1165772 387088 -369094 63077 1268192 1618137 738908
42850 738908 -179023 -516050 -835932 -1202528 -801171 238268 447166 -713144 -1747808
42841 -1747808 -1313749 -186062 115112 -396926 -498538 393854 1822144 3136580 3714817
42832 3714817 2893887 776611 -1269081 -1921190 -1419459 -884178 -565323 79801 844805
42823 844805 722411 -383335 -1159615 -696304 160930 66178 -852045 -1212567 -369466 739053
42813G39053K48739l18907M29957J670000J739903L10477j129868j139955r9188
42804B450211M29943j94793r75740p66974J51028M51360m86836j661197j536166
42795b139164J6051J289792P13581j014411j622681k20790J521879J715391O07936
42786H67584m41236j198573k073136k209727l83560K230805K678746L90390j574050
42777a712757q16106R30627O43536j262155j692881K85750K128177J681030O5651
42768B50872l33558Q40012J919781J658609N06298l21919l27905j73327p47242
42759C271621j835892k167400j162639L7785J70513k06649K48366J137850P11556
42750B05111j111651k122969r41672J030478J788506J263984M92896k26919q58468
$$ plain form
42813 739053 987792 668885 1098842 2768842 4508745 4819222 3689354 2549399 2450211
42804 2450211 2880154 2685361 1709621 942647 1093675 1545035 1058199 -602998 -2139164
42795 -2139164 -2123113 -833321 -119740 -1134151 -2756832 -2977622 -1455743 259648 867584
42786 867584 426348 -772225 -2845361 -5055088 -5438648 -3207843 -529097 -138707 -1712757
42777 -1712757 -2528863 -1598236 -954700 -2216855 -3909736 -3623986 -1495809 185221 250872
42768 250872 -82686 757326 2677107 4335716 4842014 4520095 4192190 4018863 3271621
42759 3271621 1435729 -731671 -1894310 -1856525 -1686012 -1892661 -1644295 -506445 205111
42750 205111 -906540 -3029509 -3971181 -2940703 -1152197 111787 604683 377764 -480704
42741d80704o57559N59974J250511J32796j490606j399997J99606J162368Q30384
42732A06773O32944J239405J481317O16787m16971p13477n64846l07828K09488
42723B283592M40761n90969k108237j856767L59431J731120N51867j056050o09791
42714h55043P18127L26452j221190j126983R14672K276244J634455N03725N5925
42705C226384o43750k160888k963212j692779N79702J802695J407481K31255q77153
42696a090265j388823j036679k72180N9447l2827J98010O52349M26661k01415
42687b685722K56004J779392K188052M51060j401490j333240l08693j84105m24403
42678a663145M65953J646398J097643o99277j330270m16340O1606m80986k94731
$$ plain form
42741 -480704 -1138263 -578289 672222 805018 -685588 -2085585 -1885979 -723611 106773
42732 106773 739717 1979122 3460439 4077226 3660255 2946778 2381932 2074104 2283592
42723 2283592 2724353 2133384 25147 -1831620 -1472189 258931 810798 -245252 -855043
42714 -855043 -136916 189536 -1031654 -2158637 -1243965 1032279 2666734 3170459 3226384
42705 3226384 2582634 421746 -2541466 -4234245 -3654543 -1851848 -444367 -213112 -1090265
42696 -1090265 -2479088 -3515767 -3787947 -3728500 -3761327 -3563317 -2910968 -2484307 -2685722
42687 -2685722 -2429718 -650326 1537726 1988786 587296 -745944 -1054637 -1238742 -1663145
42678 -1663145 -1197192 449206 1546849 847572 -482698 -899038 -837432 -1318418 -1613149
42669a613149J217401K084649J045759l73709m95470J18019M05432O68020R63576
42660D020528p1447k585348l758484j407689K189440L027322Q96447q75891n66980
42651H67898K96070L50780J98398K59879j58506p88985k20843J135223P98929
42642B738843j569600k671163m63170K190684J688402p36393j189958O06185J282276
42633A876106l51799j572527n20513R86401Q81299Q248m9008K12652k53753o71104
42623E46002O4396R69557M28409r45352j203586j75151N13122J61304l28790l60113
42613c30202k92554j83445L33278Q47243N68724l0469K27892R59229N50443q93444
42603A756695j201546L98175J683645P37175j055608j166693L10012J149144M44308
$$ plain form
42669 -1613149 -395748 1688901 2734660 2360951 1865481 1983500 2388932 3056952 4020528
42660 4020528 3949081 1363733 -2394751 -3802440 -1613000 1414322 2310769 1434878 867898
42651 867898 1163968 1514748 1713146 1973025 1814519 1025534 804691 1939914 2738843
42642 2738843 1169243 -1501920 -1965090 225594 1913996 1177603 -12355 593830 1876106
42633 1876106 1524307 -48220 -568733 417668 1298967 1307215 1258207 1470859 1217106 546002
42623 546002 610398 1579955 2008364 1063012 -140574 -315725 197397 358701 29911 -330202
42613 -330202 -622756 -806201 -472923 374320 943044 912575 1140467 2099696 2650139 1756695
42603 1756695 555149 953324 2636969 3374144 2318536 1151843 1461855 2610999 3055307
42594C055307m96775m49468L07257R13502Q75424M6288j121580j346810J75922
42585A959067K171182K305866J25250k216179k582966j144925M64419J203743
42577B285457J065831L35816n54475q47086j29669Q40926P56868o04483j869083
42568A280102j495631M92240K442912K718930J275775m41371j093293p62130n68567
42559C848967j138885j799757j477178j79864Q50028O54508j47909j65270P49455
42550A194095J143622P4259j287828j176580J69558P93888j44293j307645j360785
42541a901709p69342n87552o81786l01919M75863J066493J430636J653767J185924
42532A570375j71916j164162n35647Q15950Q73595m33112j033390J60212J737204
$$ plain form
42594 3055307 2558532 2109064 2416321 3329823 4205247 4251535 3129955 1783145 1959067
42585 1959067 4130249 6436115 6561365 4345186 1762220 617295 1081714 2285457
42577 2285457 3351288 3687104 3132629 2285543 2155874 2996800 3753668 3149185 1280102
42568 1280102 -215529 276711 2719623 5438553 6714328 6272957 5179664 4417534 3848967
42559 3848967 2710082 910325 -566853 -746717 103311 757819 609910 444640 1194095
42550 1194095 2337717 2411976 1124148 -52432 117126 911014 766721 -540924 -1901709
42541 -1901709 -2671051 -3258603 -3940389 -4242308 -3766445 -2699952 -1269316 384451 1570375
42532 1570375 1398459 234297 -301350 514600 1388195 955083 -78307 81905 1819109
42523A819109K028937J253075N22043O3688m89912j062431j448582j877800k315938
42514a507811j966589m54184J172208J647978J153464P52916P02550M70183R4899
42505B065614K61321R95930J380021Q13110k31954r53083j078471p72458k48016
42496B232014K49733M41014K20176k87876q64862j229899j139836p56078o35156
42487a770770r15969q24627L39787J879357K203409Q57151p10936q94187P3238
42478B36453N36713l14289j332236r01543Q98890K275148J887274L78541o61155
42469C003796o86330l93934k69201J2746O05106R12140M72229l02716p69228q49954
42459A734654p64134n76112m57551p48316j254170j148106j19514J042450J533244
$$ plain form
42523 1819109 3848046 5101121 5623164 5686852 5196940 4134509 2685927 808127 -1507811
42514 -1507811 -3474400 -3928584 -2756376 -1108398 45066 797982 1500532 1970715 2065614
42505 2065614 2326935 3322865 4702886 5515996 5284042 4330959 3252488 2480030 2232014
42496 2232014 2481747 2922761 3142937 2855061 1990199 760300 -379536 -1135614 -1770770
42487 -1770770 -2686739 -3511366 -3171579 -1292222 911187 1768338 1057402 163215 236453
42478 236453 773166 458877 -873359 -1774902 -876012 1399136 3286410 3664951 3003796
42469 3003796 2317466 1923532 1654331 1667077 2272183 3184323 3656552 3353836 2584608 1734654
42459 1734654 970520 394408 -63143 -811459 -2065629 -3213735 -3333249 -2290799 -757555
42450g57555J424017R50020l5353j110815j014589M78057J553022P40001p58080
42441A468725r21542j27212k72856j371407j631174p28484k08411l84585K30419
42432c946527J685408J818778M6885j029190K77962J769964R58498p98727q05710
42423b2659K83528j15418j623703j365314R48826K283884J189794j16863K27266
42414A689341Q26300o2193j326782r57839O03072J316030O06770l94115q97280
42405A403304j014759q07876k47029K44497L38125M28808P71013O94232k45302
42396A565013j108295q46717n8051m5689o43165n15325O19093J580808J534538
42387B082210Q32648k0911r27821j500596j080429R7881P79763K58906o93016
$$ plain form
42450 -757555 666462 1616482 1581129 470314 -544275 -66218 1486804 2226805 1468725
42441 1468725 547183 419971 147115 -1224292 -2855466 -3583950 -3792361 -4176946 -3946527
42432 -3946527 -2261119 -442341 -395456 -1424646 -1146684 623280 1581778 783051 -22659
42423 -22659 260869 145451 -1478252 -2843566 -1894740 389144 1578938 1462075 1689341
42414 1689341 2515641 2453448 1126666 168827 771899 2087929 2694699 2300584 1403304
42405 1403304 388545 -419331 -666360 -421863 -83738 345070 1116083 1810315 1565013
42396 1565013 456718 -389999 -448050 -493739 -1136904 -1652229 -1033136 547672 2082210
42387 2082210 2914858 2893947 1966126 465530 -614899 -517018 262745 521651 -171365
42378a71365r44247m35608l128j46146m15125j7763J052091J670278Q25126p97835
42368F16278j344499k65686Q30090N51345k79709k58545J73531k37780r58157
42359a173132l43496J377727K111693J049892l53328r10426j064938j181570o64978
42350a152556L40741M37067p43865j589928r53046K58822R90942J533914J889794
42341A011885R41165j058846j536926N99203K432446J101927j562311j800753
42333A27790K21334J173935K64383q7846P77573N54273j308619j899681K25269
42324D8411K054813O82013k028586k375922l79119Q12063j13403j328447j148602
42315c776779J8648J102116J672802J569925Q33882K10208L91488P34834P8739
$$ plain form
42378 -171365 -1115612 -1551220 -1554348 -1700494 -2115619 -2133382 -1081291 588987 1414113 616278
42368 616278 -728221 -993907 -163817 387528 107819 -150726 22805 -214975 -1173132
42359 -1173132 -1516628 -138901 1972792 3022684 2669356 1758930 693992 -487578 -1152556
42350 -1152556 -811815 -374748 -1118613 -2708541 -3661587 -3402765 -2411823 -877909 1011885
42341 1011885 1953050 894204 -642722 -43519 2388927 3490854 1928543 127790
42333 127790 349124 1523059 1787442 1699596 2477169 3031442 1722823 -176858 48411
42324 48411 2103224 2785237 756651 -1619271 -1998390 -1186327 -1299730 -2628177 -3776779
42315 -3776779 -3758131 -2656015 -983213 586712 1420594 1630802 2022290 2757124 2835863
42306B835863j160474j218167L67839J755637J154186q57667k225431j992590
42298a340804j070247o27303n65679O036J185095J907055J433536N39708M21938
42289A889335Q16407L71828j106205k131755j676026n00618L45662J010980J767844
42280G87452J767649M07518j001813p28943P24994J280324L67591n07246l91011
42271B706515j53778n56997q25052j97210M70035o374j112313j311336l57720
42262a344230L87033K808p27024n41678N03002J094341L35851j110557j679948
42253c080402n40330J507970K693577J841711n12084k456584k384534n77255J092888
42244b415043J286314O21226M67492Q53508O58956k96206p95952k46981K57724
$$ plain form
42306 2835863 1675389 457222 825061 2580698 3734884 2877217 651786 -1340804
42298 -1340804 -2411051 -3038354 -3604033 -3597997 -2412902 -505847 927689 1467397 1889335
42289 1889335 2705742 3077570 1971365 -160390 -1836416 -2337034 -1991372 -980392 787452
42280 787452 2555101 2962619 1960806 1231863 1956857 3237181 3604772 3097526 2706515
42271 2706515 2552737 1995740 1170688 973478 1443513 1437139 324826 -986510 -1344230
42262 -1344230 -957197 -954389 -1681413 -2223091 -1720089 -625748 -289897 -1400454 -3080402
42253 -3080402 -3620732 -2112762 580815 2422526 1910442 -546142 -2930676 -3507931 -2415043
42244 -2415043 -1128729 -507503 -40011 813497 1472453 1176247 380295 133314 391038
42235C91038k64177j043364q73836r2530J47485j11478Q5122O52338M57929o08131
42225a259604j074061L1532J619121J813107K50926j483636j599473m2000J394473
42216c49615J131212j57810l96825Q52892J570174L47360j219580r12082N01725
42207A367451M02488j392271k140867l99715J732103J717953K3920r98855l85062
42198g2855P38877R83627Q3160j134700j491796o21316L54420R8652q80462p35226
42188b677619Q04541J665614M82772j192634j143674L30562J181019O94841p14
42179A44708j13773j01100l50346m35980n9773L41276L68994L07069N49222Q19598
42169A469895M01555q56759j969255j632812Q4166J363751P32998q73708j348403
$$ plain form
42235 391038 126861 -916503 -1790339 -1882869 -1735384 -1846862 -1761740 -1109402 -651473 -1259604
42225 -1259604 -2333665 -2302133 -683012 1130095 1381021 -102615 -1702088 -1744088 -349615
42216 -349615 781597 623787 226962 1079854 2650028 2997388 1777808 865726 1367451
42207 1367451 1769939 377668 -1763199 -2162914 -430811 1287142 1311062 312207 -72855
42198 -72855 666022 1649649 1732809 598109 -893687 -1515003 -1160583 -1061931 -1942393 -2677619
42188 -2677619 -1873078 -207464 275308 -917326 -2061000 -1730438 -549419 145422 144708
42179 144708 30935 -70165 -420511 -856491 -916264 -574988 -205994 101075 650297 1469895
42169 1469895 1871450 1014691 -954564 -2587376 -2503210 -1139459 -406461 -1280169 -2628572
42160b628572m30140J89853j53274j41930Q12258J183361M4136r55544k53251
42151b333103Q22074K73019j040113q47992N85380R79730J1123l31261N87044
42142a294099J072469L56812n7911O84689J135904J59416j024244r77451l58923
42133c03338m26679p77447l32739N93343R07167N61835K51243k8210o80716j266506
42123a502047q67222M80799J614428J402545k58031k137351k332189k59976J940622
42114a918422J551489q76691j860531L9611K017552J390692l17666k12067J108321
42105I22288Q59680r38872j486861J3373J194788O75589L6676N23263P72328m54418
42095B117834j702661j070637O88081J388626O33079p6964K04251Q38145P05625
$$ plain form
42160 -2628572 -3058712 -2868859 -3022133 -3164063 -2351805 -1168444 -1124308 -2079852 -2333103
42151 -2333103 -1511029 -1238010 -2278123 -3126115 -2540735 -1561005 -1549882 -1881143 -1294099
42142 -1294099 -221630 135182 77271 761960 1897864 2057280 1033036 55585 -303338
42133 -303338 -730017 -1507464 -1840203 -1246860 -339693 222142 473385 445175 -235541 -1502047
42123 -1502047 -2369269 -1888470 -274042 1128503 870472 -1266879 -3599068 -3859044 -1918422
42114 -1918422 -366933 -1243624 -3104155 -3064544 -1046992 343700 26034 -186033 922288
42105 922288 1781968 843096 -643765 -630392 564396 1239985 1276661 1799924 2572252 2117834
42095 2117834 415173 -655464 32617 1421243 2054322 1977358 2181609 3019754 3725379
42086C725379o10162k297474k520821k01431K875876L298975L82483k436225k067922
42077A48678J06785P34826l98650o57043P53099J604222N25134q40673o62117
42068A314261L64261N71488o6157m15688j77447O676k52152q76233j722014k300908
42058c553913j697537L31351K622271L748998L539920K849230K260573J656480
42050A1757373P36581n66720j928050k623514k132666r06950Q7988O42103J154158
42041F220303J180676l17435k692073l353156j140673J522013J631791l20689
42033B730757j348001l76231O51730R0972j153268j305223n6281J498994K161278
42024B894727J380867l21635j402928p42708P86020J239282J82214q84473q35393
$$ plain form
42086 3725379 3115217 817743 -1703078 -1904509 971367 4270342 4652825 2216600 148678
42077 148678 255463 990289 591639 -65404 687695 2291917 2817051 1976378 1314261
42068 1314261 1678522 2250010 2183853 1768165 1590718 1597394 1345242 469009 -1253005 -3553913
42058 -3553913 -5251450 -4920099 -2297828 1451170 4991090 7840320 10100893 11757373
42050 11757373 12493954 11927234 9999184 7375670 5243004 4336054 4424042 5066145 6220303
42041 6220303 7400979 7083544 4391471 1038315 -102358 1419655 3051446 2730757
42033 2730757 1382756 1006525 1658255 1749227 595959 -709264 -765545 733449 2894727
42024 2894727 4275594 3953959 2551031 1808323 2594343 3833625 4015839 3131366 2295973
42015B295973k41450L6922J64125N25647P63863M02263l81488j113678j394703
42006A057474p75358O36660J398228J13152k102981k387291q3407J988827J374891
41997A220195p24298j552885o14849M67313P30237N53298L05081O2005J60855
41988F06952O04073N59462k58489o57036J14975O68524m22804j899199j477143
41979b160685N22749J682210J176433M00814R6616m55416j169291p74981O67020
41970a4531J328319N27745j62860L35709R04223L64324o46101j124952j250133
41961B61743j316751q59963R094J35749o14994o39328P39806J777963J043631
41952E36950k36960m03483q7618n30957q72253K64447J746436J372974m05271
$$ plain form
42015 2295973 2054523 2091445 2255570 2781217 3545080 3947343 3565855 2452177 1057474
42006 1057474 282116 918776 2317004 2430156 327175 -2060116 -2143523 -154696 1220195
41997 1220195 495897 -1056988 -1671837 -1204524 -474287 79011 384092 446097 606952
41988 606952 1211025 1770487 1511998 854962 969937 1638461 1215657 -683542 -2160685
41979 -2160685 -1637936 44274 1220707 1621521 1718137 1262721 93430 -681551 -14531
41970 -14531 1313788 1841533 1678673 2014382 2918605 3282929 2636828 1511876 261743
41961 261743 -1055008 -1914971 -1905877 -1770128 -2385122 -3024450 -2284644 -506681 536950
41952 536950 299990 -103493 -191111 -722068 -1594321 -1329874 416562 1789536 1384265
41943A384265j082545q2212O68452J54441m90189n10193o36999r89937m11257
41934a996174J060601J419800j66548j507265m80019J636807J984149K15699j366913
41925H00137j272259l27572L22379Q09581J488623J754618R78913j92920n80838
41916C780662j72121o5977p34522j342950j164691p47688q78504j065448k25826
41907b617065J361317K122991J420591M17482J74856J16972o82096j698357j675835
41898a059144n68137M30002N29347N7150k80943o3925O62012J203971O69955p09465
41888H70823j342616k53799J383288J767091Q38959j17087n35027o99766m46521
41879A465345M26899Q24962m89353k435774k500033l96405J356130J155043L67151
$$ plain form
41943 1384265 301720 219508 887960 1042401 552212 42019 -594980 -1584917 -1996174
41934 -1996174 -935573 484227 317679 -1189586 -1669605 -32798 1951351 2167050 800137
41925 800137 -472122 -799694 -477315 332266 1820889 3575507 4554420 4361500 3780662
41916 3780662 3608541 3542564 2808042 1465092 300401 -447287 -1325791 -2391239 -2617065
41907 -2617065 -1255748 867243 2287834 2705316 2880172 2997144 2315048 616691 -1059144
41898 -1059144 -1627281 -1197279 -667932 -610782 -891725 -955650 -293638 910333 1580288 870823
41888 870823 -471793 -725592 657696 2424787 3263746 3146659 2611632 1911866 1465345
41879 1465345 1892244 2717206 2227853 -207921 -2707954 -3104359 -1748229 -593186 -226035
41870b26035O02637J133570O67979j25617N6484N40183l44691k220016k768515
41861b684021j000291J315680J960493Q03331n35780p80279j40773L62294K68760
41852d30586J17939M29304O79217M0595j023592j062739J59906R92114J38420
41843D0578j483381k064981j199959J56041J201069J617373J088250k19776j151190
41834b015976p91396J47210L61415l5857P3675P14534P69565O0689k36398L14838
41824f37701N39305l22393j159072p23878L12773N02508O6456M68268J694714
41815G40980J821000n7376k019925j772276P2930Q89842j13469r18942k0452J259360
41805a18328J068068J9387o2216O56092M40588p66117j075063R6202R73507M05613
$$ plain form
41870 -226035 376602 1510172 2178151 2052534 2109018 2649201 2304510 84494 -2684021
41861 -2684021 -3684312 -2368632 -408139 395192 -140588 -920867 -1061640 -699346 -430586
41852 -430586 -312647 116657 795874 836469 -187123 -1249862 -1089956 -97842 40578
41843 40578 -1442803 -3507784 -4707743 -4551702 -3350633 -1733260 -645010 -864786 -2015976
41834 -2015976 -2807372 -2660162 -2298747 -2334604 -2260929 -1546395 -776830 -716141 -952539 -637701
41824 -637701 -98396 -420789 -1579861 -2303739 -1990966 -1488458 -1422002 -953734 740980
41815 740980 2561980 2504604 484679 -1287597 -1214667 -324825 -438294 -1357236 -1377688 -118328
41805 -118328 949740 969127 906911 1563003 2003591 1237474 162411 258613 1232120 1637733
41795A637733m39697m98863o59362j595725j874979l11316J505467J407956O8868
41786g59918k73458N03004O54990j39815n08414j75461l31767j079550j055046
41777c165435L0548Q37666Q34028R87623J508386J229691n7109r34529q29050
41768D41819q62317j350642r02825Q01001J824975J116373M12629J148202J800160
41759D429375O15471j108839j157009j20424q9773r04191p78488J45343K1847
41750A053312j222874j650496o51038K53384K91066N07598J348781J595717N71007
41741B096457o55230j120871j179123j072249j62605J477332K406406J764016
41733C554133M49669m60838j006134j306008q82196P2239L74009j81018j65428
$$ plain form
41795 1637733 1198036 699173 39811 -1555914 -3430893 -3742209 -2236742 -828786 -759918
41786 -759918 -1033376 -530372 124618 -15197 -523611 -699072 -1030839 -2110389 -3165435
41777 -3165435 -3134887 -2297221 -1463193 -475570 1032816 2262507 2205398 1270869 441819
41768 441819 -420498 -1771140 -2673965 -1872964 -47989 1068384 1481013 2629215 4429375
41759 4429375 5044846 3936007 2778998 2658574 2568801 1664610 886122 1031465 1053312
41750 1053312 -169562 -1820058 -2471096 -2217712 -1926646 -1419048 -70267 1525450 2096457
41741 2096457 1441227 320356 -858767 -1931016 -2093621 -616289 1790117 3554133
41733 3554133 4003802 3542964 2536830 1230822 348626 420865 794874 613856 448428
41724D48428J035845J832703Q64335p95807j453941j287380j241941q95112M58271
41715a034599J728616J352668n2200o10132j89755j66765n88176j03587J226295
41706A562365J564975K65769j013077r00913q2044L31492L86605L56290p8434
41697B393028p17951n05222O36634J166631K94461n56127m3742Q24032M44042
41688C935786o34473p56928q7352k58494j445969j962137r14590N89000J245722
41679b89435J001214L37710m14874o87613m8283O23054j18653j818714k138964
41670c554558k63147J505707J029684l86190p9524J698815K144202K63186j703731
41661F54444j745725o64316j02873N1178O97085J375491R88623j20603o52293
$$ plain form
41724 448428 1484273 3316976 4181311 3385504 1931563 644183 -597758 -1492870 -1034599
41715 -1034599 694017 2046685 1994485 1384353 1194598 1027833 439657 336070 1562365
41706 1562365 3127340 3393109 2380032 1479119 1397075 1728567 2115172 2471462 2393028
41697 2393028 1675077 1169855 1806489 2973120 3267581 2711454 2667712 3491744 3935786
41688 3935786 3301313 2544385 2457033 2198539 752570 -1209567 -2124157 -1535157 -289435
41679 -289435 711779 1049489 634615 -52998 -101281 521773 403120 -1415594 -3554558
41670 -3554558 -3817705 -2311998 -1282314 -1668504 -1748028 -49213 2094989 2358175 654444
41661 654444 -1091281 -1755597 -1858470 -1807292 -1110207 265284 1253907 1133304 481011
41652D81011n02347o42682j031610n56068P15558J159285J83993n73251K37022
41643e29089J462551J215622k61987j156476p95922j16226K11891M54346O65654
41634A150364L83782l68228j007503j360968j536334j035127M76830J668253P74817
41625h54114j424563k037480j71656J623187J213283o7072r465Q50450O12877
41616b64553m66961n81063L45540P28830L19269M18584J112706R54959k30155
41607B337156p89481j39881K25391m71430q84671j41468M34713k36572q90365
41598e56608j37106R65632O92790l68289l90704N92528R44867K31346l77250k49814
41588A347392P1038K44483M12366K41113o58009j492086j124902j8269L49623
$$ plain form
41652 481011 -21336 -664018 -1695628 -2251696 -1536138 -376853 -192860 -766111 -529089
41643 -529089 933462 2149084 1887097 730621 -65301 -181527 30364 484710 1150364
41634 1150364 1534146 1165918 158415 -1202553 -2738887 -3774014 -3297184 -1628931 -854114
41625 -854114 -2278677 -4316157 -4487813 -2864626 -1651343 -1718415 -1727880 -877430 -264553
41616 -264553 -731514 -1312577 -967037 -238207 81062 499646 1612352 2567311 2337156
41607 2337156 1547675 1407794 1633185 1161755 277084 135616 570329 333757 -556608
41598 -556608 -693714 271918 964708 596419 205715 798243 1743110 1974456 1597206 1347392
41588 1347392 1418430 1662913 2075279 2316392 1658383 166297 -958605 -976874 -627251
41579f27251j42921k96379Q6904l2356o57437m04908J015418J992778J459464
41570B393312K99650m73814j078332j587694j148925K39179J017055M70930P545
41561A38906N31903N54661j092926k568738j621937N97953J269843M13534M35232
41552a341569J645598J744489Q2902j032774l47552K39284p31236j431810J40087
41543a032581K400521K350008J75004j216723o91636j07053q41599j627951q24787
41534a416797R06008J513063K99035j340664j674116m93592P85279P13680n17921
41525a226025j246454l90978J146320J707383J012421J43033k99137p94914j541035
41516a489386j705651o54212R11832J730658J401122N09395k32066n12476m66952
$$ plain form
41579 -627251 -770172 -1066551 -979647 -1012003 -1669440 -2074348 -1058930 933848 2393312
41570 2393312 2692962 2219148 1140816 -446878 -1595803 -1356624 -339569 131361 138906
41561 138906 670809 1225470 132544 -2436194 -4058131 -3460178 -2190335 -1776801 -1341569
41552 -1341569 304029 2048518 2131420 1098646 751094 990378 259142 -1172668 -1032581
41543 -1032581 1367940 3717948 3892952 2676229 1984593 1877540 1035941 -592010 -1416797
41534 -1416797 -510789 1002274 1301309 -39355 -1713471 -2207063 -1421784 -708104 -1226025
41525 -1226025 -2472479 -2863457 -1717137 -9754 1002667 1145700 846563 51649 -1489386
41516 -1489386 -3195037 -3849249 -2937417 -1206759 194363 703758 471692 -40784 -507736
41507e07736n69314j104882j509251q40941P11581J571468P23858p82080j249947
41498c557244o68347l34818m60651J88169J910935K965900J880397k91611j352398
41489B80332q66172j96331l3953L65934J258069J445034J56742j380131j493893
41480d64369l91656L75500K55524O3357J80579n5701q27196j089085j03660J269795
41470g86912J655809Q45655l35992j202454j470683r61380O8154P18316M31791
41461a037696j87698l36443k68332n73246p30695K21561J785789K325703J452006
41452B650949N54232N06865L77166p48170j998716j963546p65961L19156O83485
41443c84540O74832N57936L28128K60146N78557P68874K00209p10118r32489l68723
$$ plain form
41507 -507736 -1077050 -2181932 -3691183 -4532124 -3820543 -2249075 -1525217 -2307297 -3557244
41498 -3557244 -4225591 -4560409 -5021060 -4832891 -2921956 43944 1924341 1632730 280332
41489 280332 -585840 -782171 -816124 -450190 807879 2252913 2409655 1029524 -464369
41480 -464369 -856025 -480525 -225001 -161644 18935 -36766 -863962 -1953047 -2056707 -786912
41470 -786912 868897 1714552 1378560 176106 -1294577 -2255957 -2187803 -1469487 -1037696
41461 -1037696 -1225394 -1561837 -1830169 -2403415 -3134110 -2912549 -1126760 1198943 2650949
41452 2650949 3205181 3712046 4089212 3341042 1342326 -621220 -1387181 -1068025 -384540
41443 -384540 290292 848228 1176356 1436502 2015059 2783933 2984142 2274024 1341535 972812
41433I72812J0487l44515q29567o70396O7401P03956O88014M328p45417p28424
41423h71321J84551J032777Q78135R3930j43645N33661J349132J502286Q18314
41414E377820n32769j995583k439387j170321P74909J518309P36096m1863J66237
41405B393448M74379j29941j059033j179922n64932k056M69055J238734J840209
41396C479941J355427K5289p68820l64401L05577J19336o54219q11424K8095Q02070
41386C516871M17942o50443r18286r8931K56273r33585k284777j701830L74748
41377b022018J335700J42114j251255q99422N25650J258809J012619O08790K77663
41368I88650j47845k96569P698n1879q84314j219800P5182J747436J673083P8215
$$ plain form
41433 972812 983299 638784 -190783 -861179 -793778 -89822 598192 602520 -142897 -871321
41423 -871321 -686770 346007 1224142 1318072 1174427 1708088 3057220 4559506 5377820
41414 5377820 4845051 2849468 410081 -760240 14669 1532978 2269074 2227211 2393448
41405 2393448 2867827 2737886 1678853 498931 -66001 -68057 400998 1639732 3479941
41396 3479941 4835368 4860657 4091837 3727436 4033013 4152349 3498130 2686706 2714801 3516871
41386 3516871 3934813 3284370 2366084 2267153 2523426 1589841 -694936 -2396766 -2022018
41377 -2022018 -686318 -544204 -1795459 -2694881 -2169231 -910422 102197 710987 988650
41368 988650 840805 544236 551934 500055 -384259 -1604059 -1528877 218559 1891642 1969857
41358A969857q12945j05466Q44374Q53009K68464l43283j025690j547189j334399
41349a233268o68191m15994l55914N23687J823687J828458L33058o99173j58964
41340I77386N88443K64693j76625M30876J100936L71705r69748j065848j19322
41331A402496j06159j561979k690954j995275k13139R39753Q83520M03109L71181
41322b567447P82936R50042M78721r3153O3055Q63091J325666Q53994j83495j221440
41312A251970j966398j965944q20721Q09606J539141J043232L76593J56213j16824
41303C06868m42120J27901J403019J516142j36347j404179o64893L76189m28496
41294F54084j756832q67019J611655K408917P26411q79941r26275q31982j503933
$$ plain form
41358 1969857 1156912 1051446 1895820 2748829 3017293 2674010 1648320 101131 -1233268
41349 -1233268 -1901459 -2317453 -2673367 -2149680 -325993 1502465 1835523 1136350 977386
41340 977386 1565829 1830522 1653897 2084773 3185709 3557414 2587666 1521818 1402496
41331 1402496 1296337 -265642 -2956596 -4951871 -5165010 -4225257 -3341737 -2938628 -2567447
41322 -2567447 -1784511 -834469 -355748 -448901 -385846 477245 1802911 2656905 2473410 1251970
41312 1251970 -714428 -2680372 -3501093 -2691487 -1152346 -109114 267479 423692 306868
41303 306868 -135252 -7351 1395668 2911810 2775463 1371284 706391 1082580 654084
41294 654084 -1102748 -1969767 -358112 2050805 2777216 1897275 971000 139018 -1364915
41285a364915j434640K44245J655989J112028r6972L0079R57303Q92123o7271
41276A927969m39070j45805m27209j288925j256257R6413J223388Q46469k53262
41267B83711n42289M8945K49815m68693r57286m1811J458348J435881n73905k327584
41257a434868j664679N52722J705401J032321J84642L03890N78710J83628k63263
41248A178504j03531R4059k51963n81324l16819Q2210K28986O90242J586253J613478
41238D220095q1397k114974k478117j109095N08887J424496J488592N49216r78594
41229A429109j614769o20963N08143J44200q24208n53289M77763L84243n17518
41220a187289p5166J734034K419305J147269Q4050M49719M38562j156937k302094
$$ plain form
41285 -1364915 -2799555 -2555310 -899321 212707 115735 145814 1103117 1995240 1927969
41276 1927969 1488899 1343094 915885 -373040 -1629297 -1532884 -309496 536973 283711
41267 283711 -258578 -209633 40182 -428511 -1385797 -1427608 30740 1466621 892716 -1434868
41257 -1434868 -3099547 -2546825 -841424 190897 375539 679429 1258139 1441767 1178504
41248 1178504 1074973 1169032 917069 335745 18926 101136 330122 1020364 2606617 4220095
41238 4220095 4138698 2023724 -454393 -1563488 -1054601 369895 1858487 2407703 1429109
41229 1429109 -185660 -806623 -298480 -154280 -978488 -1531777 -1054014 -669771 -1187289
41220 -1187289 -1262455 471579 2890884 4038153 4122203 4571922 5010484 3853547 1551453
41211A551453j194240K44497n23506k051603j082176J802398K634673J25536k416509
41202i09477k048417Q9756J364343J313748J005016P78587N05678O08040J077611
41193C784885P03689j058358k566453k070510l38200N97062M22706K94458L70253
41184A39532o9365m48809N39655K076787J649835r11111k481881j093766J062327
41175D63204J020473n59592q64954M95895J199751J21112j083007p19515O21211
41166F94578J247920N37937p34170j382414q12284K89943L83215j005393k219309
41157b999977j534026K22353P95830j6911j25356J362411K638480K055747M75026
41148B873577n07024r20190j438598j511992m16323P64887K94793j352170j676935
$$ plain form
41211 1551453 357213 601710 78204 -1973399 -3055575 -1253177 1381496 1507032 -909477
41202 -909477 -2957894 -2868138 -1503795 -190047 814969 1593556 2099234 2707274 3784885
41193 3784885 4488574 3430216 863763 -1206747 -1544947 -947885 -525179 -230721 139532
41184 139532 70167 -378642 161013 2237800 3887635 2976524 494643 -599123 463204
41175 463204 1483677 924085 59131 555026 1754777 1875889 792882 73367 694578
41166 694578 1942498 2480435 1746265 363851 -448433 -158490 224725 -780668 -2999977
41157 -2999977 -4534003 -4311650 -3515820 -3532731 -3658087 -2295676 342804 2398551 2873577
41148 2873577 2366553 1446363 7765 -1504227 -1920550 -1155663 -860870 -2213040 -3889975
41139c889975M82950L201782L716758J613479r04741j646194p72274k35013j067361
41130D99411k011481j424511K16992R85432L00956n30897n71491k64306R6188
41121b703707R53100J873224J399314l85872j169443K08217J563523M64206k081483
41112A21079l191747k128534n00662N89737J296345J562684J126030O14372P21855
41103B11159P58894j51929j125147p89833J94511J58183o60751o70340P5075O1442
41093a938736p27794p41854K41965Q01140N58471N68004Q96302N35677j38646
41084E4529K53273J061647J88928j846873j988920L09403J814229P08223o55305
41075a00866j30521P17799L855q95089j20862J091325P52709l10754k95071L09988
$$ plain form
41139 -3889975 -3407025 -205243 3511515 5124994 4220253 2574059 1801785 1566772 499411
41130 499411 -1512070 -2936581 -2719589 -1734157 -1433201 -1964098 -2535589 -2799895 -2703707
41121 -2703707 -1750607 122617 1521931 1136059 -33384 174833 1738356 2202562 121079
41112 121079 -3070668 -5199202 -5699864 -5110127 -3813782 -2251098 -1125068 -510696 211159
41103 211159 970053 818124 -307023 -1096856 -902345 -744162 -1404913 -2075253 -2000178 -1938736
41093 -1938736 -2666530 -3408384 -3166419 -2365279 -1806808 -1238804 -342502 193175 54529
41084 54529 307802 1369449 1558377 -288496 -2277416 -1968013 -153784 554439 -100866
41075 -100866 -231387 486412 490267 -404822 -525684 565641 1318350 1007596 712525 1022513
41065A022513K63775K37587Q79504M97532j900810l496547j499603J856698K452966
41056C13615P66751M94885J901207J772395l44189j231764J21950Q43173m50402
41047D187621j343579l52240M43336m75377j342950p94167m94648j529039j703439
41038c404482N84399K886449K325889P4927j005267q58991j014358r63149N62964
41029h11619K231168J755211p9323o03868K12018j513j572769k175610q95035
41020a941340M39799O20556O86566J249441J052475m37939j457441o31486O93901
41011B74532N88455m75424o28738L90138J094940O98041N6173Q5114M79835M60634
41001C023700M9619k5896M54256O45930l07088j864955k444076j429273q0282
$$ plain form
41065 1022513 1286288 1523875 2403379 2900911 1000101 -2496446 -3996049 -2139351 313615
41056 313615 1080366 1575251 3476458 5248853 4904664 3672900 3794850 4638023 4187621
41047 4187621 2844042 2491802 2935138 2459761 1116811 322644 -172004 -1701043 -3404482
41038 -3404482 -2820083 66366 2392255 2467182 1461915 602924 -411434 -1374583 -811619
41029 -811619 1419549 3174760 3095437 2491569 2703587 2702074 1129305 -1046305 -1941340
41020 -1941340 -1501541 -880985 -194419 1055022 2107497 1669558 212117 -419369 274532
41011 274532 862987 387563 -241175 148963 1243903 1941944 1998117 2083231 2563066 3023700
41001 3023700 3073319 3047423 3501679 4147609 3840521 1975566 -468510 -1897783 -1978065
40992a978065J85639k90309j79510O52919J014377L65956l42973j81794M28471
40983c25289M79201j49609n70282l0842J142833J756303R97562m52744r81367
40974A865766k1816J094846Q40984n54583j662280j781491j252841l12132J026178
40965g57369K074157J831758M44544q05834j133911q60671l83863K57263P02306
40956A368380M83630J20576N79861J366120Q11879j147425k301738j313862J99818
40947A67239K28286n28218p8597J406806J857932O33594o38951p29171l49573
40938A969347m86134q20331o42413j28471J60589K05655K29578J59338j3279K9204
40928F63083L05479K92435j97369n98378o07655q29065j619713k018262r00146
$$ plain form
40992 -1978065 -1792426 -2082735 -2262245 -1609326 -594949 -228993 -571966 -753760 -325289
40983 -325289 153912 4303 -565979 -596821 546012 2302315 3299877 2847133 1865766
40974 1865766 1843950 2938796 3779780 3225197 1562917 -218574 -1471415 -1783547 -757369
40965 -757369 1316788 3148546 3593090 2787256 1653345 792674 408811 666074 1368380
40956 1368380 1852010 1972586 2552447 3918567 4730446 3583021 1281283 -32579 167239
40947 167239 395525 -132693 -211290 1195516 3053448 3687042 3048091 2318920 1969347
40938 1969347 1483213 662882 20469 -108002 52587 258242 487820 647158 633879 663083
40928 663083 968562 1260997 1063628 465250 -142405 -971470 -2591183 -4609445 -5509591
40919e509591J180674K407529J896074N58852k48729j31348L82170N53211j336
40910A087506q61962r61966J37527J292395J042511k55904q10988p3841M66023
40901A061301k08778r03101j81398J220357J550363O95497q1144m16488r04660
40892A831949j210381k99757J292392J600863K06062r86279p64195l08166o49756
40883G12732n73988J024961K470785J509699q64981j544610L3040J063656l43984
40874C487310k469942k643196q32256P87049Q01702j66793o77964m1723J170867
40865e84946J737737J042713k13946q58182o04987k8926M99005R42665R11966
40856B843099K4618j041790j120253l52663j09871q08880j237772o26574O5211
$$ plain form
40919 -5509591 -4328917 -1921388 -25314 533538 284809 153461 535631 1088842 1087506
40910 1087506 225544 -736422 -598895 693500 1736011 1480107 669119 595278 1061301
40901 1061301 852523 -50578 -231976 988381 2538744 3234241 3153097 2736609 1831949
40892 1831949 621568 321811 1614203 3215066 3421128 2434849 1670654 1362488 712732
40883 712732 138744 1163705 3634490 5144189 4279208 2734598 2767638 3831294 3487310
40874 3487310 1017368 -1625828 -2458084 -1671035 -869333 -1036126 -1714090 -1755813 -584946
40865 -584946 1152791 2195504 1981558 1123376 518389 489463 988468 1931133 2843099
40856 2843099 2867717 1825927 705674 353011 243140 -565740 -1803512 -2430086 -2364875
40847b364875j67342o99234m22909M69249J061311J214757J243426Q37563k99870
40838H72076j253208p76522Q14132J908952J691803Q03618m845o41025r72814
40829B442167o17303J50378L36132l33559p83790j42747P75195N27294p28483
40820A625284j214009k5641J371526J042270n93465j174123K46400J732965J227825
40811D239032n15481j258757o45114k47910n87182l82862Q40099J632078J041115
40802D115018J77861J10267J5146r74065j674312n81062J418656K080300Q77390
40793E565199p25821j484573j230200j69367J041271J202644J53757m49091L38558
40784D242377P13472j035129k974178k027529P77513J398857q83360k347900r38235
$$ plain form
40847 -2364875 -2532217 -3231451 -3654360 -3185111 -2123800 -909043 334383 1171946 872076
40838 872076 -381132 -1157654 -343522 1565430 3257233 4060851 4056006 3414981 2442167
40829 2442167 1824864 1975242 2311374 1977815 1194025 1051278 1826473 2353767 1625284
40820 1625284 411275 385634 1757160 2799430 2205965 1031842 1278242 3011207 4239032
40811 4239032 3723551 2464794 1819680 1571770 984588 601726 1441825 3073903 4115018
40802 4115018 4292879 4403146 4418292 3444227 1769915 1188853 2607509 4687809 5565199
40793 5565199 4839378 3354805 2124605 1955238 2996509 4199153 4352910 3903819 4242377
40784 4242377 4955849 3920720 946542 -1080987 -303474 1095383 212023 -2135877 -3074112
40775c074112O98259J36430p78844L73076K085653J598107k57180o10012N19701
40766F91078N69988r95394j963141j143971J76978Q09700J037501J065512M75103
40757G23354l18337k08810N63247N53781l19134m80867M94281R79936L5279j044663
40747I78067j001558n13062n39154n24149K61530J090117J084939Q65359J216735
40738B918824J300182P9105j414544j372042k09786k928j011117j147382N20283
40729c39405J959694J151225p87112j200310K69586J316758L47164j408590j732794
40720d23784k98210J183952J251128K57040m25596j60142M18885M53890j9425
40711B237738k70417K645K17187k05854q55382p50395K91292J260672J159882
$$ plain form
40775 -3074112 -2375853 -2239423 -3018267 -2645191 -559538 1038569 781389 171377 691078
40766 691078 1261066 265672 -1697469 -2841440 -2664462 -1854762 -817261 248251 723354
40757 723354 405017 196207 759454 1313235 994101 513234 1007515 1987451 2022730 978067
40747 978067 -23491 -536553 -1075707 -1599856 -1338326 -248209 836730 1702089 2918824
40738 2918824 4219006 4298111 2883567 1511525 1301739 1298811 287694 -859688 -339405
40729 -339405 1620289 2771514 1984402 784092 1053678 2370436 2717600 1309010 -423784
40720 -423784 -721994 461958 1713086 1970126 1544530 1384388 1803273 2257163 2237738
40711 2237738 1967321 1969966 2187153 1981299 1125917 375522 666814 1927486 3087368
40702C087368J47901q48795j254628j099590n20414L17330R41468R10905M55635
40693B137180J86507J80511J8586k77148j82340K92508M02517j36545o04725m00578
40683A616473Q9790K66333J72064N2454o3057K18491J515807L113774K885786
40674I867915J85380k394051k091613K6494M93560j449906k834767j529993P44309
40665A017328J229264j23766j399358j687274j429332p97270L58467J405248J462068
40656C5375Q44176N46918N02245j51072j145354j120294Q0913P82804q5496j323212
40646a032997j321551m44425r5122j83996O22803K207467K515968N63666j626425
40637A205388j473179O94049K196937J631027K55067l21943j62233p9620j28815
$$ plain form
40702 3087368 3235269 2386474 1131846 32256 -488158 -170828 770640 1681545 2137180
40693 2137180 2323687 2504198 2522784 2245636 2063296 2355804 2758321 2621776 2017051 1616473
40683 1616473 1706263 1972596 2144660 2197114 2134057 2352548 3868355 6982129 9867915
40674 9867915 10053295 7659244 5567631 5594125 6087685 4637779 1803012 273019 1017328
40665 1017328 2246592 2122826 723468 -963806 -2393138 -3190408 -2831941 -1426693 35375
40656 35375 879551 1426469 1928714 1777642 632288 -488006 -407093 375711 290215 -1032997
40646 -1032997 -2354548 -2798973 -2894095 -3078091 -2455288 -247821 2268147 2831813 1205388
40637 1205388 -267791 426258 2623195 4254222 4509289 4187346 4025113 3945493 3816678
40628C816678l0468q1527n28023p52918j70301O31742O71968J0076n73939p93066
40618B200222p17102n7131J150712J710088O11055j128509j536036m19813N68989
40609B382475N07776R8961p2486l14291n22084L4950J043285J051857k02540j095359
40599B912544o03755K00742J59984j50069J70102O64218O08267L77948L60054
40590D700035j11937j279417j834668r14852J66782K3872l39004O45357J992388
40581C048556J462492o94126j944371j240013p5812L14479M11870O57028M71214
40572B411317k51013n16530J19210P59593O34241N7329m60553p49479m61261N02412
40562B045266R90431j68322j811193j485317P23238J864597N68018q01186p8072
$$ plain form
40628 3816678 3786210 3704683 3176660 2423742 2253441 2885183 3557151 3567227 2993288 2200222
40618 2200222 1483120 1425989 2576701 4286789 4897844 3769335 2233299 1813486 2382475
40609 2382475 2890251 2989212 2916726 2602435 2080351 2115301 3158586 4210443 4007903 2912544
40599 2912544 2308789 2509531 2669515 2519446 2689548 3353766 3962033 4339981 4700035
40590 4700035 4588098 3308681 1474013 559161 725943 749815 410811 1056168 3048556
40581 3048556 4511048 3816922 1872551 632538 556726 871205 1283075 1940103 2411317
40572 2411317 2160304 1643774 1762984 2522577 3156818 3214147 2753594 2004115 1542854 2045266
40562 2045266 3035697 2867375 1056182 -429135 294103 2158700 2726718 1925532 1847460
40553A847460J090024Q9168k006480j772100J218746L455743K327604n39852j812945
40544C897368o52907Q98950Q74021n11554j586325j271307n2515Q81520R89116
40535C466367N13707l34841j469822k205387j573719J43794J264391Q90886K79273
40526I74649R08493K027583J673590k38366j591405j087537J3370k5982q50820
40517A803575p66843N79321J654378J209270j50098j029821j052018q48076p59555
40508F40133n09024r3885m5156m89402p39058l03356L26736M63913K35332J75019
40498c38748L11420L72238M52328P08738P95883M25729J06423M31401R84074R02186
40488E151672K09299m07733p90318j170377j211610m75162M21710M85504k0293
$$ plain form
40553 1847460 2937484 3026652 1020172 -751928 466818 3922561 6250165 5710313 3897368
40544 3897368 3244461 4143411 5017432 4505878 2919553 1648246 1595731 2477251 3466367
40535 3466367 3980074 3645233 2175411 -29976 -1603695 -1459901 -195510 695376 974649
40526 974649 1883142 3910725 5584315 5345949 3754544 2667007 2680377 2654395 1803575
40517 1803575 1036732 1616053 3270431 4479701 4329603 3299782 2247764 1399688 640133
40508 640133 131109 37224 -7932 -497334 -1236392 -1539748 -1213012 -749099 -513767 -338748
40498 -338748 -27328 344910 797238 1505976 2301859 2727588 2834011 3265412 4249486 5151672
40488 5151672 5360971 4953238 4162920 2992543 1780933 1305771 1727481 2212985 2192692
40479B192692p3901K03311j54456q63198n70774O42637J018730l5876q46223o1684
40469A451258J442425K187500J938075J016822m81450j772424j474983J82811
40461D490034J014432K4894r39026k22191Q55364K24381j527021k185265j179002
40452E56600K75240J291938J638561R89388k02239k41367J336468K140976K00436
40443G986001k456356k455754l06139N12062p11573r28566J323922L262479K125414
40434H351490p69252k249162j579331n20155l68944p58525q20140k59594N47109
40425A573496R89237R69944J119458J679773J679877L65905j084214r01026N48681
40416F941131J253296O39493Q0494K55204L08047N5760O00732J862659J808989
$$ plain form
40479 2192692 2118791 2322102 2167646 1304448 733674 1376311 2395041 2359165 1512942 1451258
40469 1451258 2893683 5081183 7019258 8036080 7554630 5782206 4307223 4490034
40461 4490034 5504466 5529360 4590334 4368143 5223507 5447888 3920867 1735602 556600
40452 556600 831840 2123778 3762339 4751727 4549488 4308121 5644589 7785565 7986001
40443 7986001 5529645 3073891 2767752 3279814 2568241 1639675 2963597 6226076 8351490
40434 8351490 7582238 5333076 3753745 3233590 2864646 2106121 1285981 1026387 1573496
40425 1573496 2562733 3532677 4652135 6331908 8011785 8377690 7293476 6392450 6941131
40416 6941131 8194427 8833920 8914414 9169618 9477665 9533425 10134157 11996816 13805805
40407A3805805n33084l181848l712280k145355j35960J220287J582841Q60293
40399G760699k05565k33970Q96508J647948J261038R35217J386151J117575j068740
40390A3496861l424904l336253j111341M45165j77067j624809j755634L5869K410567
40381D958454L173252J314276j379223j818811M12803K068638O18842j985882
40373G362349k093850L00534J721391L78329j600232j628755n2784J030429P54090
40364F171501P35k03924K98978J085502J673300J746589J242789L88762l62321
40355A2041911n85537k76890J28899L58893N64704N67448m24381k306116l085794
40346F983137j206272J558552J877939l24363j520171J77102K281374K015013
$$ plain form
40407 13805805 13272721 10090873 6378593 4233238 4097278 5317565 6900406 7760699
40399 7760699 7555134 7321164 8217672 9865620 11126658 12061875 13448026 14565601 13496861
40390 13496861 10071957 6735704 5624363 6069528 5892461 4267652 2512018 2547887 4958454
40381 4958454 8131706 9445982 8066759 6247948 6660751 8729389 9348231 7362349
40373 7362349 5268499 5569033 7290424 7668753 6068521 4439766 4386982 5417411 6171501
40364 6171501 6172236 5968312 6267290 7352792 9026092 10772681 12015470 12404232 12041911
40355 12041911 11456374 11179484 11308383 11667276 12231980 12799428 12375047 10068931 6983137
40346 6983137 5776865 7335417 9213356 8888993 7368822 7545924 9827298 11842311
40338A1842311M09336L8979Q86908J179827P05655N03260M59328n8010j83827
40329A5783767J096857K496766K172542J151996J937720M190434N140931M267895
40321C8238908M083304N674967O874864O150635N341552O730745R750692J2602694
40313I5448361J5402176J9739957K6478365L5873475M8251253O1123418O5439383
40306C67756388M9057696Q758861m0804843p4539671p7516396n7768322l6042380
40299A38901333k4268533j8425209j1312449m174344j815766l037488l003931
40292G2863613j526254j839714l175782j709502J985695L449010K197930K297375
40284G4542371M880683P153027R359761J4940311K2391406K5533859K4469397
$$ plain form
40338 11842311 12251647 12290626 13177534 14357361 15063016 15566276 16025604 15967594 15783767
40329 15783767 16880624 19377390 21549932 22701928 24639648 28830082 33971013 38238908
40321 38238908 42322212 47997179 54872043 61022678 66364230 73094975 82845667 95448361
40313 95448361 110850537 130590494 157068859 192942334 241193587 302317005 367756388
40306 367756388 416814084 425572945 384768102 310228431 232712035 174943713 138901333
40299 138901333 114632800 96207591 84895142 80720798 78905032 75867544 72863613
40292 72863613 71337359 69497645 66321863 64612361 66598056 70047066 72244996 74542371
40284 74542371 79423054 86576081 95935842 110876153 133267559 158801418 183270815
40277A83270815K6991434L4608174L6680498K5403564P974903n032135j5651310
40270B94245943l1404254m7638932n0755246l8234751k2821642j4892554j1735635
40263G6762929p623460m085898m387209n813546m325562j666939j648897l140855
40255D4070563k365004N98181K605880K688888K094329P77355k079394n199480
40247D3191318o393005n751117m826145l744340j891088k93579m25011j472233
40239A8394800j481395n46031l63941j228607j854448j743577j526061j317748
40231H332992p30781j36639j07320r0313O19604J237615O72555l26391k32911
40222I238411O09686N61824m47896q48605j32112N28916N23319O10406J105885
$$ plain form
40277 183270815 210262249 244870423 281550921 306954485 314929388 309897253 294245943
40270 294245943 262841689 215202757 164447511 126212760 103391118 88498564 76762929
40263 76762929 69139469 65053571 60666362 54852816 50527254 48860315 47211418 44070563
40255 44070563 41705559 42303740 44909620 47598508 49692837 50470192 48390798 43191318
40247 43191318 36798313 31047196 26221051 22476711 20585623 20292044 19867033 18394800
40239 18394800 16913405 16367374 16003433 14774826 12920378 11176801 9650740 8332992
40231 8332992 7602211 7465572 7358252 7267939 7887543 9125158 9797713 9471322 9238411
40222 9238411 9848097 10409921 9962025 9113420 8981308 9510224 10033543 10643949 11749834
40213A1749834J169940N62468M98133J899482L938000N056030M609284K944018
40205C2427189N75376k084246m456897n658825m915213k580772n95983p67925
40197A1942704k240769k165613K74586K285913J437671n87887n79601J269123
40189A1636127K038871J004464M55838J367999J652837q3985j939446j675541
40181A4457164j36918L06417p02180j441426p52084P95286J862855J475111j74886
40172A5689339j336936r4836L028946M953112L528498J05818k440099l108184
40164B0325658k876027k521798k099593j958504k459533k811102j762984M28688
40156D264805K011092J859743N35208q12728j488346j124632K60773J690238J730804
$$ plain form
40213 11749834 12919774 13482242 13980375 15879857 19817857 24873887 29483171 32427189
40205 32427189 33002565 30918319 26461422 20802597 15887384 13306612 12710629 11942704
40197 11942704 9701935 7536322 7810908 10096821 11534492 10946605 10367004 11636127
40189 11636127 13674998 14679462 15135300 16503299 18156136 18072151 16132705 14457164
40181 14457164 14320246 14626663 13924483 12483057 11730973 12526259 14389114 15864225 15689339
40172 15689339 14352403 14257567 17286513 22239625 25768123 25873941 23433842 20325658
40164 20325658 17449631 14927833 12828240 10869736 8410203 5599101 3836117 4264805
40156 4264805 6275897 8135640 8670848 7858120 6369774 5245142 5505915 7196153 8926957
40147H926957J56287j570546j938074r33824M28052J476914K157339K339950J657690
40138A2700745J67588j288957j769055j264023p88783j228590k242642k655146
40130A631137j886485n33234N50262J177697J556152J637752J243549N15737j71472
40121E721095n08386k25349P54965J790073J728806K44897j477403j995223j171972
40112D861503J6442O87616M38352p42011j973697j618568P13118K774513K051389
40103G208657n28516j279675J208065L741489K746397o54909j986614N81273L816555
40094A4852722L640964O8270l367308m156801l102351k096640j352137L6134J725224
40085F248077K054778N45959r53695m84887J523983K950656K614533J179535k09279
$$ plain form
40147 8926957 9083244 7512698 5574624 4640800 5068852 6545766 8703105 11043055 12700745
40138 12700745 12868333 11579376 9810321 8546298 7757515 6528925 4286283 1631137
40130 1631137 -255348 -788582 -238320 939377 2495529 4133281 5376830 5892567 5721095
40121 5721095 5212709 4987360 5742325 7532398 9261204 9506101 8028698 6033475 4861503
40112 4861503 4877945 5565561 6003913 5261902 3288205 1669637 2382755 5157268 7208657
40103 7208657 6680141 5400466 6608531 10350020 13096417 12441508 10454894 11036167 14852722
40094 14852722 18493686 18561956 15194648 11037847 7935496 5838856 4486719 4522853 6248077
40085 6248077 8302855 8848814 7895119 7410232 8934215 11884871 14499404 15678939 15469660
40076A5469660j017319j104977n86185j63942o45645j742876k142438j176266
40068F890012K70366R51910P73371O41736J227018K263950K843642K266567Q75067
40059A9003639j01289j2093K42888m01291j152923j62836K540396M606726M592433
40050B9155650M076927N294254P719174Q397355N143989j485630q613626j2532224
40042C7155869j0993703n576149r93163m57622k339072k912336j431023k41575
40034A2211226n35220r28367n64600o73070j856359k367030q44117J197944J588964
40025G229371O78168K06779K68370k58582j070901p65187M69888R64879N29300
40016H252085Q89312K613920L956571L792346L535969M650997O157248O506490
$$ plain form
40076 15469660 14452341 13347364 12761179 12597237 11951592 10208716 8066278 6890012
40068 6890012 7160378 8112288 8885659 9527395 10754413 13018363 15862005 18128572 19003639
40059 19003639 18902350 18890257 19133145 18731854 17578931 17416095 19956491 24563217 29155650
40050 29155650 33232577 38526831 46246005 54643360 59787349 58301719 49688093 37155869
40042 37155869 26162166 20586017 19592854 19135232 16796160 13883824 12452801 12211226
40034 12211226 11676006 10747639 10183039 9509969 7653610 5286580 4442463 5640407 7229371
40025 7229371 7907539 8114318 8382688 8124106 7053205 6288018 6757906 7722785 8252085
40016 8252085 9141397 11755317 15711888 19504234 23040203 27691200 33848448 40354938
40008D0354938O308711O803151O779727L934919j021447m643060n606553o323864
40000D6586522q451912r677542p353338l236052j463240k708321l548049j735638
39992H412430Q63154J500271K37621j050753j538312j597742j291681m16562N58136
39983E676562R32432P26935K38785o63373j778382j955618n88121R53492R09448
39974D452160k97125p08333J69843P62645j9863j269333j607444q66965L29542
39965I45127J490836K119660J686485M64237l93537k50099J79603q3672r63392
39956E195248j584660j356578m25642N31463Q02502L89924J88899P37645J070075
39947E548876k0738j702207j706494L87691K178108J670402j1260m46725P17247
$$ plain form
40008 40354938 46663649 53466800 60246527 64181446 63159999 58516939 52910386 46586522
40000 46586522 38134610 28457068 21103730 17867678 16404438 13696117 10148068 8412430
39992 8412430 9275584 10775855 11013476 9962723 8424411 6826669 5534988 5118426 5676562
39983 5676562 6608994 7335929 7574714 6911341 5132959 3177341 2589220 3542712 4452160
39974 4452160 4155035 3446702 3616545 4379190 4359327 3089994 1482550 615585 945127
39965 945127 2435963 4555623 6242108 6706345 6312808 6062709 6242312 6158640 5195248
39956 5195248 3610588 2254010 1828368 2359831 3162333 3552257 3741156 4478801 5548876
39947 5548876 5528138 3825931 2119437 2507128 4685236 6355638 6344378 5897653 6614900
39938F614900J774499J610828P82250K03543O6956O9265j76752q54250j425914
39929H665325q61912P91532J662597R1496k861167m267403k807234k51176Q53590
39920A015648K6587j137241j143186j07606P58328O86079Q3910k52603k39832
39911c09916k91471k61882M41074J523719J671510L39392j244064j621085q45294
39902e98017J36920R89175J805926K158263J594151O63658K18315q568q96583
39893F063240k198237k558398j353547M95912J647252J488443K86658r82115j138298
39884A750910j9862J033355Q42945J64114N86200J942586K325579Q29065j144700
39875H310192j768091q62596L70272P85855R9956r36704r34659P43977K847768
$$ plain form
39938 6614900 8389399 10000227 10782477 10986020 11052976 11122241 10945489 10091239 8665325
39929 8665325 7803413 8594945 10257542 10349038 7487871 3220468 413234 162058 1015648
39920 1015648 1042235 -95006 -1238192 -1345798 -587470 98609 182519 -70084 -309916
39911 -309916 -601387 -863269 -422195 1101524 2773034 3112426 1868362 247277 -598017
39902 -598017 -461097 528078 2334004 4492267 6086418 6750076 6968391 6959823 6063240
39893 6063240 3865003 1306605 -46942 448970 2096222 3584665 3871323 2889208 1750910
39884 1750910 1731048 2764403 3607348 3771462 4357662 6300248 8625827 9454892 8310192
39875 8310192 6542101 5679505 6049777 6835632 6935588 5998884 5064225 5808202 8655970
39866H655970L371758J935718R7506o98622l21010R21895K847488M717758N586593
39857B7115054O044080P940709J1085070J1703864O288150l432307j1293341j2855540
39849D2595739r458900n702418m224471m104770l589777k538936j669741q87326
39841A0419400K00997Q30529r8191j826863k259452j079523l21482r36161j041423
39832C887831P08030K192245Q85586j766759k251780l88082P16958l8789k53425
39823C691815J393733K619285J309265r96889j464455K09884K198919L110563
39815A2072120K500941L96106k082586l018433k063280j095073j292219j333843
39807D083733n991J346354R35396n79122j411493j378746j218311o95124L43486
$$ plain form
39866 8655970 12027728 13963446 14060952 13362330 13041320 13963215 16810703 21528461 27115054
39857 27115054 33159134 41099843 52184913 63888777 70176927 66744620 55451279 42595739
39849 42595739 33136839 27434421 23209950 19105180 15515403 12976467 11306726 10419400
39841 10419400 10620397 11450926 11352735 9525872 7266420 6186897 5865415 4929254 3887831
39832 3887831 4595861 6788106 7673692 5906933 3655153 3267071 3984029 3945240 3691815
39823 3691815 5085548 7704833 9014098 8017209 6552754 6762638 8961557 12072120
39815 12072120 14573061 14969167 12886581 9868148 7804868 6709795 5417576 4083733
39807 4083733 4077742 5424096 6359492 5780370 4368877 2990131 1771820 1076696 1420182
39798A420182N35471q45828j767095l23923J584475Q20845j702709k115567K85384
39789b108765J994891R51547o13211k93396R58336J299234J119513J447678J499927
39780F255754K54353j162827j063416m7966m8r50883j122080J47440J436531J380426
39770E127284L08833o15156q49340o28480k95178R1693N94059R54203N38169q28923
39760D397164k069646j725650J12901J596959J332568K2319p50035o32832m98121
39751A785627p79037q40586l7486J290569K074092J517873p9588j339399r40431
39742B651634Q90850K278358J570550p21098k279389j430302R91374K472051J525472
39733G949500p09751j887519j249394k80023m21030j123713r84216k1604M93554
$$ plain form
39798 1420182 1955653 1109825 -657270 -981193 603282 1424127 -278582 -2394149 -2108765
39789 -2108765 -113874 837673 224462 -68934 889402 2188636 3308149 4755827 6255754
39780 6255754 6510107 5347280 4283864 4235898 4235850 3284967 2162887 2310327 3746858 5127284
39770 5127284 5436117 4820961 3971621 3343141 3047963 3139656 3733715 4687918 5226087 4397164
39760 4397164 2327518 601868 714769 2311728 3644296 3666615 2916580 2283748 1785627
39751 1785627 1006590 166004 128518 1419087 3493179 5011052 4931464 3592065 2651634
39742 2651634 3542484 5820842 7391392 6670294 4390905 2960603 3951977 6424028 7949500
39733 7949500 7239749 5352230 4102836 3822813 3401783 2278070 1293854 1272250 1765804
39724A765804J95235J29758Q74571J521831J201845N36089O44798J400063J640848
39715I910842P94340n47655j518751j749918j311135n06801J82506M15572L85056
39706F054056N95776J174543J679853J694938J389504J401690K300397M065134
39698B0355891N705022N443938K118259l000429o452229n813486k548220m33284
39690A5375462j047302k309506j988672p99570n94432j094700o57527N78472Q32474
39681H294699j83683o95136K00591J179607R18643j47458r52166j098069n75350
39672F941678K67723L15800r55942j816021l05177K172392K295478Q6530q80863
39663H121598P05268J999152J433570J546028L785043M938733K411745q30643
$$ plain form
39724 1765804 1961039 2090797 2965368 4487199 5689044 6225133 6869931 8269994 9910842
39715 9910842 10705182 10157527 8638776 6888858 5577723 5070922 5253428 5669000 6054056
39706 6054056 6649832 7824375 9504228 11199166 12588670 13990360 16290757 20355891
39698 20355891 26060913 31504851 33623110 30622681 24170452 18356966 15808746 15375462
39690 15375462 14328160 12018654 10029982 9230412 8635980 7541280 6883753 7462225 8294699
39681 8294699 8111016 7415880 7616471 8796078 9714721 9567263 8615097 7517028 6941678
39672 6941678 7209401 7525201 6569259 4753238 4448061 6620453 8915931 9002461 8121598
39663 8121598 8826866 10826018 12259588 13805616 17590659 22529392 24941137 24110494
39655B4110494r09980P05599L31919j389267j264917L03714K97807j276463j813224
39646A9095682r66644k88349O12800K687966L845749J942426l55427P08908L320717
39637C0603828L297346J745661K471643M176570L602681L977142J0135664J7482518
39629G7493053J8637495J9782809L3265976N0721049M3609034J984869m3965175
39622B01529110n7485905l8811809j7621444j0988658r830326l947621J787401
39615F4630748J095134j254411J081693N620229P339975O455862L993022k213543
39607H6748709j1258783j6212220j3286410p786392n717780n563571l663707j614267
39599B1645579k149687k888316p32819J620654J8566l579526m099996j395074
$$ plain form
39655 24110494 23200514 23906113 24238032 22848765 21583848 21887562 22185369 20908906 19095682
39646 19095682 18129038 17840689 18453489 21141455 24987204 26929630 26574203 27283111 30603828
39637 30603828 33901174 35646835 38118478 42295048 45897729 49874871 60010535 77493053
39629 77493053 96130548 115913357 149179333 199900382 243509416 245494285 201529110
39622 201529110 144043205 105231396 87609952 76621294 66790968 62843347 64630748
39615 64630748 65725882 64471471 65553164 71173393 78513368 84969230 88962252 86748709
39607 86748709 75489926 59277706 45991296 38204904 32487124 26923553 23259846 21645579
39599 21645579 19495892 16607576 15874757 17495411 17513977 13934451 9834455 8439381
39591H439381N97725O91382P85683R42899l70377k073626j590814L58132O84836
39582H465221p57824j178528M8872N82785l59247p12764M67643J281607L05138
39573H142903j202813j576496j018875n24387j81717M84194J447678J985876J169450
39564H725813j090853l105597k638659R6415K089281J332628o40881j422810j018913
39555B326424n62693K51677J860995K632293J010442j256474j164219R59506J969759
39546H027710O20067j214489j895154j720846j174064j97086M93161j09670j151912
39537A677717o20625J458856K813156K249310R22946m6358q31007j277054n14840
39528E832101R83681J278888p2850j047422k64611R59000R87052M18305O69657
$$ plain form
39591 8439381 9037106 9728488 10514171 11457070 11086693 9013067 7422253 7780385 8465221
39582 8465221 7707397 6528869 6577741 7160526 6801279 6088515 6556158 7837765 8142903
39573 8142903 6940090 5363594 4344719 3820332 3638615 4122809 5570487 7556363 8725813
39564 8725813 7634960 4529363 1890704 1987119 4076400 5409028 4768147 3345337 2326424
39555 2326424 1763731 2015408 3876403 6508696 7519138 6262664 5098445 6057951 8027710
39546 8027710 8647777 7433288 5538134 3817288 2643224 2446138 2939299 2829629 1677717
39537 1677717 1057092 2515948 5329104 7578414 8501360 8455002 7623995 6346941 5832101
39528 5832101 6815782 8094670 8021820 6974398 6709787 7668787 8655839 9074144 9743801
39519I743801J510633J748800J349056J210743J433832J250205M34658l08530
39511A8373198l32918K40108P90402R06386R09574J556071K896675L881053L833989
39502C3054538L745249M868845O554700P180636O966829P645408R031724Q459463
39494H7507392M825283Q73895n53053q48624l672069r385938j4041122j4158365
39486E0547399j0492299o351460l777189k493886j625183r98486p56340o74380
39478B3378176m00927p8586k54383j092118j978095k165935j678031j244290j318211
39469A3167600j459281r06445L43970J307383J074396N3840k69521Q28900K091882
39460A6232724J634637n61678k440825k413741j167815m08176o90808j300460
$$ plain form
39519 9743801 11254434 13003234 14352290 15563033 16996865 18247070 18681728 18373198
39511 18373198 18040280 18280388 19070790 19977176 20886750 22442821 25339496 29220549 33054538
39502 33054538 36799787 41668632 48223332 55403968 62370797 70016205 79047929 87507392
39494 87507392 92332675 93206570 92653517 91804893 88132824 78746886 64705764 50547399
39486 50547399 40055100 33703640 29926451 27432565 25807382 24808896 24052556 23378176
39478 23378176 22977249 22898663 22644280 21552162 19574067 17408132 15730101 14485811 13167600
39469 13167600 11708319 10801874 11145844 12453227 13527623 13581463 13311942 14140842 16232724
39460 16232724 17867361 17305683 14864858 12451117 11283302 10875126 10184318 8883858
39452H883858j543117j211121l23705O03848N05256r49566k372634k112539m77733
39443A002547O75465M87959k2037K43020J018164J441010J233437O02670k17760
39434F464475q17295p10762j15738np90577j580231j267828q9852P09927N49895
39424B352009Q2439R524R0127j68309l66847L21825J548724J676002j09733k318917
39414C116844k753985j192029N61963J093185O86831K01988j14625l18479l02597
39405I79096j19102k8999p79J31495J10167j80716N5623J273736J957303L82605
39395D560429k042497j931384R45971K668602P53231k166168k417261m73260O84112
39386E81775L22597k1268J45519O5348n4531N16230J054867M56067m72597l25631
$$ plain form
39452 8883858 7340741 6129620 5805915 6409763 6915019 5965453 3592819 1480280 1002547
39443 1002547 1678012 2165971 2143934 2386954 3405118 4846128 6079565 6682235 6464475
39434 6464475 5647180 4936418 4820680 4820675 4030098 2449867 1182039 1092187 1802114 2352009
39424 2352009 2434448 2443972 2534099 2365790 1998943 2320768 3869492 5545494 5435761 3116844
39414 3116844 362859 -829170 -267207 825978 1512809 1714797 1600172 1281693 979096
39405 979096 859994 830995 830216 961711 1071878 891162 946785 2220521 4177824 4560429
39395 4560429 2517932 586548 1532519 4201121 4954352 2788184 370923 -102337 581775
39386 581775 904372 883104 1028623 1093971 1039440 1555670 2610537 3066604 2594007 2268376
39376B268376K25753j96033o89016M01517J912476J392869m12392n13315J086505
39367E476740J284504o15158j602908k14598J132009P35850N93720K453460M286398
39358A3530017L464412Q32172j116121j999219k854100l416795k696864j120483
39350D623019M3818N04457N98650J95581o55834j134280r16025p81617r61882
39341A515887m67645Q64477J467808M58366q43908j103818q16611o67597j27999
39332B78960Q16627P53131n68667r76641P19504K255248J246645r77590j521367
39323B025850k34557Q29374Q73871N80765L6485r57843j489266q30651r6504l67410
39313C70114m80295Q70238K274149J660272p2939n02541L26698N10589l3551J69916
$$ plain form
39376 2268376 2494129 2298096 1609080 2010597 3923073 5315942 4903550 4390235 5476740
39367 5476740 6761244 6146086 4543178 4328580 5460589 6196439 6790159 9243619 13530017
39358 13530017 16994429 17826601 16710480 14711261 11857161 8440366 5743502 4623019
39350 4623019 4666837 5171294 5769944 5965525 5309691 4175411 3259386 2477769 1515887
39341 1515887 1048242 1912719 3380527 3838893 2994985 1891167 1074556 406959 278960
39332 278960 1095587 1848718 1280051 303410 1022914 3278162 4524807 3547217 2025850
39323 2025850 1791293 2620667 3494538 4075303 4111788 3153945 1664679 834028 737524 370114
39313 370114 -110181 760057 3034206 4694478 4621539 4118998 4445696 4956285 4922734 5092650
39303E092650Q61980M48013o76395o38317K19568l30496k199515k622898o23779
39294d69189J402119J446911L78869k18257j13640M35415J194283J045714r33132
39285D169093l085177k600454K08616J992696J286984J42625M5215k36722j321854
39276F01022j323750O13496K081071J179551k50169J81059J478938J397529L54425
39267F313172J58829N59255J67444n48064k88019J85453o74832j931122j460030
39258B482086N8360l4534j628616j624122Q14199K382462O79392j913901j791306
39249e75980O07059J856875O81206q01254o96686L32340Q41954O64633K31787
39240C141934n98698j748461k033607n96140J334355J675569L48482o50117j91821
$$ plain form
39303 5092650 5954630 6402643 5726248 5087931 5307499 4977003 2777488 154590 -469189
39294 -469189 932930 2379841 2758710 2540453 2426813 2862228 4056511 5102225 4169093
39285 4169093 1083916 -1516538 -1307922 684774 1971758 2114383 2159598 1922876 601022
39276 601022 -722728 -109232 1971839 3151390 2901221 3082280 4561218 5958747 6313172
39267 6313172 6472001 7031256 7198700 6650636 6362617 6548070 5873238 3942116 2482086
39258 2482086 2540446 2505912 877296 -746826 67373 2449835 3129227 1215326 -575980
39249 -575980 31079 1887954 2569160 1767906 1071220 1403560 2245514 2910147 3141934
39240 3141934 2543236 794775 -1238832 -1834972 -500617 1174952 1523434 873317 681496
39231F81496N95240M68923k991K39199Q13779O96909M0000k77974k50598m53178
39221B550805p02088m69654j59383m36292p03191R4476J429522J727116Q41878
39212D173189K14956N04162Q54729P26514O43175P63062M48994k63517m21267
39203G643997J16567K94816k93324p61215n94439l14895m0452P82989J650583
39194H484627J034473r77278k104871j078523N12051Q68532N54583P98510J010542
39185I102646J0543j541454j986257j135690j47085M00997P19879P03732J33124
39176F260435m48866l69084N7226J05235j75634l31956m36142o81175p19983l59130
39166B900926k03151o80210j167099r71585l87317P1043N71648J237151J491040
$$ plain form
39231 681496 1276736 1745659 1742668 1981867 2795646 3492555 3532555 3254581 3003983 2550805
39221 2550805 1848717 1379063 1219680 783388 80197 174673 1604195 3331311 4173189
39212 4173189 4388145 4892307 5747036 6473550 7116725 7879787 8328781 8065264 7643997
39203 7643997 7760564 8055380 7762056 7000841 6406402 6091507 6051055 6834044 8484627
39194 8484627 9519100 8541822 6436951 5358428 5870479 6739011 7293594 8092104 9102646
39185 9102646 9113189 7571735 5585478 4449788 4302703 4703700 5423579 6127311 6260435
39176 6260435 5811569 5442485 5499711 5604946 5429312 5097356 4661214 3980039 3260056 2900926
39166 2900926 2697775 2017565 850466 -121119 -508436 -437393 134255 1371406 2862446
39157B862446J025401M44860J71027j60990n46574l30249J73802l70574j742151
39148A526998j701794M39685K139345J470978K67740Q75982K041598J225585q20075
39139G466042j412305n52078l60475p94219N7473J819635K130101J144819J483338
39130A0982331L093522K559751j093124m071978l384179j105971n88890j544104
39122D847358j741241j006257m81527Q0720J239458J668251Q0647j825863j368595
39113A492951R42168K133308J229155J10997j6762j87686j187638j960414j434415
39104A121664j36481Q82787J298610J054718R8299q03610m82817O37784N52430
39095D223384j259020k384374p45278J987307K452738M42062q50950L71595K024870
$$ plain form
39157 2862446 3887847 4332707 4503734 4342744 3796170 3465921 3639723 3269149 1526998
39148 1526998 -174796 264889 2404234 3875212 4142952 5018934 7060532 8286117 7466042
39139 7466042 6053737 5501659 5141184 4346965 4404438 6224073 8354174 9498993 10982331
39130 10982331 14075853 16635604 15542480 11470502 8086323 6980352 6391462 4847358
39122 4847358 3106117 2099860 1618333 1699053 2938511 4606762 4687409 2861546 1492951
39113 1492951 2435119 4568427 5797582 5908579 5891817 5704131 4516493 2556079 1121664
39104 1121664 985183 1867970 3166580 4221298 4319597 3515987 3033170 3670954 4223384
39095 4223384 2964364 579990 -165288 1822019 4274757 4716819 3865869 4237464 6262334
39086F262334J582258k31384j125520r93106j416143k225700j476507Q95675K146651
39077C418558N66578j931176k526576j066707O54780J661009K022562J576620
39069D375648M03126l21234J38792N36986l73316j290065k64681J589199J314300
39060F108755j044644k081585k47177J730224J141816p31872j057974K51973J122603
39051E192119P95772K58696j6705m07393n29553M72772J843653J429475j265609
39042G773227l713688l165398o0332K452927K210695K86124p74859k18118L68793
39033E159371l33290j452090j371430j88525N45084J65165l73043j51879N10366
39024B509729P77395K84517p70952j709903j542779J0234J707709J987205Q85138
$$ plain form
39086 6262334 7844592 7613208 6487688 5494582 4078439 1852739 376232 1271907 3418558
39077 3418558 3985136 2053960 -472616 -1539323 -884543 776466 2799028 4375648
39069 4375648 4778774 4457540 4596332 5133318 4760002 3469937 3205256 4794455 6108755
39060 6108755 5064111 2982526 2735349 4465573 5607389 4875517 3817543 4069516 5192119
39051 5192119 5987891 6246587 6229882 5822489 5292936 5765708 7609361 9038836 7773227
39042 7773227 4059539 894141 833809 3286736 5497431 5783555 5008696 4790578 5159371
39033 5159371 4826081 3373991 2002561 1814036 2359120 2524285 2151242 1999363 2509729
39024 2509729 3287124 3571641 2800689 1090786 -451993 -441759 1265950 3253155 4138293
39015D138293k70552p82750q94430n82453K28359N23471o42683j926163j091864
39006a300772J126418J429178r46659k594951j019834J565777J829840K16789
38998C05786n55104M0551M59088L42708N40796O91725k19426j353016r09783P04433
38988D7758J326711N45841P1087N42577P12608J43686K9647O92329P87476j64807
38978D734913q14243m64351k39437p29467p55162K14484O21425n63828j733111
38969B71223j047873O22801J178309M96643J63292Q16286J592534J667079Q63610
38960F623904o16899j757282r72828J625141L244406J655410j402413k305764
38952F093675n13274J050681M84344q68163j176404n86447O7561P94369J390666
$$ plain form
39015 4138293 3867741 3084991 2190561 1608108 1836467 2359938 1717255 -208908 -1300772
39006 -1300772 -174354 1254824 308165 -2286786 -3306620 -1740843 88997 305786
38998 305786 -249318 -208767 250321 593029 1133825 1825550 1606124 253108 -656675 47758
38988 47758 1374469 1920310 1991397 2533974 3246582 3390268 3419915 4112244 4899720 4734913
38978 4734913 3920670 3456319 3216882 2487415 1732253 1946737 2568162 2004334 271223
38969 271223 -776650 -153849 1024460 1521103 1684395 2500681 4093215 5760294 6623904
38960 6623904 6007005 4249723 3276895 4902036 8146442 9801852 8399439 6093675
38952 6093675 5580401 6631082 7115426 6247263 5070859 4484412 4551973 5346342 6737008
38943F737008P92952r92462j980006r06228O15239M72420p24817r10903J2091
38934C115294M22429l350p9923L30707J94272j78351P00235K265032J822958j061515
38924G527788l005651j566297J029890J413485P7934k80763K74420n67190k562739
38915B340877k635694R9240K575790K257785M45747m16159k16003j53450l04934
38906C993199j77495j56697n53777m60806P44310J899930J705174P61329L43119
38897H098286K55938l09775q47279m30232K95184L5297r00037j275790j200925
38888C720667j547439j699490l93760J447155J447328m31301j556689p27054R7910
38879C57327p07900j765730j195434L18996R65820P16060P26676J031494R09067
$$ plain form
38943 6737008 7529960 6537498 4557492 3651264 4266503 4738923 4014106 3103203 3115294
38934 3115294 3537723 3534373 3454450 3785157 3979429 3801078 4501313 6766345 8589303 7527788
38924 7527788 4522137 2955840 3985730 5399215 5477149 5196386 5470806 4903616 2340877
38915 2340877 -294817 -195577 2380213 4637998 5083745 4667586 4451583 4298133 3993199
38906 3993199 3815704 3659007 3105230 2644424 3388734 5288664 6993838 7755167 8098286
38897 8098286 8354224 8044449 7197170 6766938 7062122 7097419 6197382 4921592 3720667
38888 3720667 2173228 473738 79978 1527133 2974461 2543160 986471 259417 357327
38879 357327 -350573 -2116303 -3311737 -2992741 -2026921 -1310861 -584185 447309 1356376
38870A356376O68782R87788J112156j24473j843212j928172l29888O89724O9377
38861F58458n21636L47840J429678R59064k60840j3333J830669L070420K379802
38852I880122Q87701J60698J99662J81252p8171l61740q50637j670342k206929
38843F141616j763421n18286Q04879J724171J932455J261162M55602R79829K938792
38834A3956799M232006L266797J507184J366296K428373K346672J162272J701100
38826C1967499N166318R312811J2198927J5080182J9914641K6125680L1280906
38819A51046964L2667987K6814555J0865012j2249407l2340433l9821598l4642750
38812A02340330k4724675j6704758j1486244p729937n142961l508951k029320
$$ plain form
38870 1356376 2025158 3012946 4125102 4000629 2157417 229245 -100643 589081 658458
38861 658458 136822 484662 1914340 2873404 2612564 2599231 4429900 7500320 9880122
38852 9880122 10767823 10928521 11128183 11309435 11231264 10869524 10018887 8348545 6141616
38843 6141616 4378195 3859909 4664788 6388959 8321414 9582576 10038178 11018007 13956799
38834 13956799 18188805 21455602 22962786 24329082 26757455 29104127 30266399 31967499
38826 31967499 37133817 46446628 58645555 73725737 93640378 119766058 151046964
38819 151046964 183714951 210529506 221394518 209145111 176804678 136983080 102340330
38812 102340330 77615655 60910897 49424653 41694716 36551755 33042804 31013484
38805C1013484r78248j552893l283413m018292l137006k277819k250429j932286
38797A1583098j022268r51386j847781j572624N42893J859765M89537j384468
38789G696766q58475J130248J558682J57759o33589J32850P00852l40610k115650
38780G428833k985906k412642r58009M40709J016609P47592L38190K39741K03399
38771D058516J14748L01080N60980J52585o74263o91815K9093j97476j618786
38762B034662j973034j82413J314498L69690j036821J7931K255612K147272j33783
38753D813614j050387K57937P55354r68480k266885j132359M69450K03412q42294
38744B39362n74857M10749L82542j91001K33394J120996P08163p41725j230933
$$ plain form
38805 31013484 30035236 28482343 25198930 21180638 18043632 15765813 13515384 11583098
38797 11583098 10560830 9609444 7761663 6189039 6731932 8591697 9081234 7696766
38789 7696766 6838291 7968539 9527221 9684980 9051391 9184241 9885093 9544483 7428833
38780 7428833 4442927 2030285 1072276 1512985 2529594 3277186 3615376 3855117 4058516
38771 4058516 4173264 4474344 5035324 5187909 4513646 3821831 3850924 3653448 2034662
38762 2034662 61628 -120785 1193713 1563403 526582 544513 2800125 4947397 4813614
38753 4813614 3763227 4021164 4776518 3808038 1541153 408794 878244 1081656 239362
38744 239362 -335495 75254 457796 266795 500189 1621185 2329348 1587623 356690
38735C56690l01154M10962m1420p09063o51564k30221m223J65195L59628K09292
38725d35878j77148L6351J113849K064402J874510P54121l78021j028804j186074
38716B637308q11666j2092N84312L66603l45807n26780K52008J187989J208045
38707D539920K65407o96201r25720n72293j92325k5592L355n5399j55327j29834
38697B055991O2042J50909p8100m61681q09514j252257j792745j847540q67279
38688d840174P43577J904342J938642R35719n87562j722406j368679N25079K203278
38679b68184J862881J18380p04290J37588R03851L26050m04156J13966Q68917
38670B955003M9053j642536j597897P77538K859998K223652l07899k053366j842157
$$ plain form
38735 356690 55536 466498 425078 -283985 -935549 -1165770 -1169993 -1004798 -645170 -435878
38725 -435878 -613026 -576675 537174 2601576 4476086 5230207 4852186 3823382 2637308
38716 2637308 1825642 1813550 2397862 2764465 2418658 1891878 2143886 3331875 4539920
38707 4539920 4805327 4109126 3183406 2611113 2418788 2393196 2396551 2341152 2185825 2055991
38697 2055991 2118033 2268942 2190842 1729161 919647 -332610 -2125355 -3972895 -4840174
38688 -4840174 -4096597 -2192255 -253613 682106 94544 -1627862 -2996541 -2471462 -268184
38679 -268184 1594697 1713077 1008787 1146375 2050226 2376276 1972120 2086086 2955003
38670 2955003 3004056 1361520 -236377 541161 3401159 5624811 5316912 3263546 1421389
38661A421389p84583k33687k45138j55914K51209O76033R70348J291783J564607
38652D756047J253679L3723j510797k311846j953254r43679J50359J178931J800281
38643B453444J299074k28465j218908l32004J500230J996236N41505j063871j268210
38634C679031p81631j022784j744419j595949l80242P60327J164171J194963R83677
38625B257144J70943p72656n46546R03715J736174P38243p34319p61623K25082
38616C216157L43649n52891p52162K21517O02536p43062k293906j994875j04491
38607b057528J460677J731683J255557O75744J58469j9033M30696J113290J315185
38598F064740J009278O58766J93723q27005k084144k572287j964734r92163k64581
$$ plain form
38661 1421389 636806 403119 157981 2067 253276 929309 1899657 3191440 4756047
38652 4756047 6009726 6043449 4532652 2220806 267552 -676127 -525768 653163 2453444
38643 2453444 3752518 3524053 2305145 1973141 3473371 5469607 6011112 4947241 3679031
38634 3679031 2897400 1874616 130197 -1465752 -1845994 -1085667 78504 1273467 2257144
38625 2257144 2428087 1655431 1108885 2012600 3748774 4487017 3752698 2991075 3216157
38616 3216157 3559806 3006915 2254753 2476270 3078806 2335744 41838 -1953037 -2057528
38607 -2057528 -596851 1134832 2390389 3066133 3224602 3205569 3636265 4749555 6064740
38598 6064740 7074018 7732784 7926507 7099502 5015358 2443071 478337 -513826 -778407
38589g78407L80499J049364J207729M80190n75446j051352o90886N2568N90051
38580F64310N32686j23699p72489n31334P13905J807498J382273n23456k264139
38571H85555k227014n65201R52210Q99719k56423q85297k75948N93448M67774
38562d11177o29393j591400j474697j55602J794783L425741L929579L218121J732765
38553I838720k85566k598444m056644l238283n99071J395961J264467K78928P7349
38544B077417J47213m62662n44065J419562L788709L369924K88756k006054j939901
38535F138899j617497k505001k843403j218119M88372K83212m30047M61129J720601
38526D78146Q65940j141016j138681Q93541J641411q0095j373779K665K104823
$$ plain form
38589 -778407 -397908 651456 1859185 2339375 1763929 712577 21691 74259 664310
38580 664310 1196996 1073297 300808 -230526 483379 2290877 3673150 3149694 885555
38571 885555 -1341459 -1906660 -954450 -54731 -311154 -1196451 -1472399 -878951 -411177
38562 -411177 -1040570 -2631970 -4106667 -4262269 -2467486 958255 4887834 8105955 9838720
38553 9838720 9553154 6954710 2898066 -340217 -939288 456673 1721140 2000068 2077417
38544 2077417 2224630 1761968 1217903 2637465 6426174 9796098 10084854 8078800 6138899
38535 6138899 4521402 2016401 -827002 -2045121 -1556749 -1273537 -1703584 -1242455 478146
38526 478146 1344086 203070 -935611 -42070 1599341 1519246 145467 148132 2252955
38517B252955J958631n6357j270493p81242j73594p08042j693868j809309q11432
38508c092751M21825R42620N92354L8280j0347M01217O89077O34576N73314O78406
38498A868571O63924L48209n9295m14726q35938j248506j264440p35480N170N62806
38488a109705P04532K20752p80255j449320q92970N37865J469827J249740O21516
38479E71982L88407L84227K72864L53613P70836P86575j31017j099125q45748
38470A452614L48601Q76924J3855j087597r29539M58035J594664J231840k99273
38461C660124j414699r93652L03031Q13229J1309q38087n44299L16296L91437
38452A704689m29325j108301j154512r25751m17567P51004J952448J734203L6590
$$ plain form
38517 2252955 4211586 4155229 2884736 2103494 1929900 1221858 -472010 -2281319 -3092751
38508 -3092751 -2670926 -1728306 -1135952 -1097672 -1108019 -706802 -17725 616851 1190165 1868571
38498 1868571 2532495 2880704 2821409 2406683 1570745 322239 -942201 -1677681 -1672511 -1109705
38488 -1109705 -405173 -184421 -964676 -2413996 -3306966 -2769101 -1299274 -49534 571982
38479 571982 960389 1344616 1617480 1971093 2741929 3528504 3397487 2298362 1452614
38470 1452614 1801215 2678139 2691994 1604397 674858 1132893 2727557 3959397 3660124
38461 3660124 2245425 1251773 1554804 2368033 2379342 1541255 996956 1313252 1704689
38452 1704689 1275364 167063 -987449 -1913200 -2330767 -1579763 372685 2106888 2143478
38443B143478j204880o48145N10980M12651p18767j224736o42494L3069K75423
38434a063421L91875J38909j032589k146155j252059J441335L040223J820856
38426A338974k15068l12819J072595J423885J82418q53741p19437l59666l70829
38417A186312m9926O74681N52489o94654j283061J5439J662112J394740n53998
38408B904134j966103j728107p57026j05199K82378P28134R63864N84851k87947
38399F18979j104867j336614q52586j17644K22754J94498M40782J001515R72324
38390C9141O3400m63451L91149J416791P31130j115801j576387Q9153J481068
38381A056193N26268j445270j694771l9187J128693M59042o66780n26683M53441
$$ plain form
38443 2143478 938598 290453 801433 1214084 495317 -729419 -1371913 -1338844 -1063421
38434 -1063421 -671546 -532637 -1565226 -3711381 -4963440 -3522105 -481882 1338974
38426 1338974 1123906 811087 1883682 3307567 3489985 2636244 1916807 1557141 1186312
38417 1186312 1136386 1811067 2363556 1668902 385841 401280 2063392 3458132 2904134
38408 2904134 938031 -790076 -1547102 -1652301 -1369923 -641789 322075 906926 618979
38399 618979 -485888 -1822502 -2675088 -2792732 -2569978 -2375480 -1934698 -933183 39141
38390 39141 102541 -360910 30239 1447030 2178160 1062359 -514028 -424875 1056193
38381 1056193 1582461 137191 -1557580 -1596767 -468074 -9032 -675812 -1202495 -749054
38372g49054O60628k02365q50003l58539P34991J354275J023978p8014j355204
38363A80693j796061o77672J180859J789469M48896j016566o25833R25755J341323
38354A750863J48876q45439n23265J90690M33254P57021J356537R64482q68439
38345C364580k085452q08945J441661J549541p50649k569543j966154j29698R71263
38336i83396J119126J097901R05222m5449j597449k656003k225938m32832J332635
38327c486183J563941L86698l53534M94531J595876J001078q21841j585893n91878
38318a797205M73180M15305J64230P28653J338583Q28720m67668j416185j626396
38309a358783j223845q8712J529353K494563K053550R67748L77369K36294j13211
$$ plain form
38372 -749054 -88426 -290791 -1140794 -1499333 -764342 589933 1613911 1535897 180693
38363 180693 -1615368 -2293040 -1112181 677288 1126184 109618 -516215 409540 1750863
38354 1750863 1899739 1054300 531035 721725 1154979 1912000 3268537 4233019 3364580
38345 3364580 1279128 470183 1911844 3461385 2710736 141193 -1824961 -1954659 -983396
38336 -983396 135730 1233631 2138853 2093404 495955 -2160048 -4385986 -4818818 -3486183
38327 -3486183 -1922242 -1535544 -1889078 -1394547 201329 1202407 380566 -1205327 -1797205
38318 -1797205 -1324025 -908720 -744490 -15837 1322746 2151466 1683798 267613 -1358783
38309 -1358783 -2582628 -2671340 -1141987 1352576 3406126 4373874 4751243 4987537 4874326
38300D874326n67121o44664o26826j051700j506581j161050k17061L47834K85744
38291b67099K10482L73502M07885K29168J34768J1105n32463j183645j077314
38282a693611o1654J074071J715259J848790J352360L551j527089j878603p88910
38273D4164L07996J89297n12368m15542N77018J348940J206775M26799n55341
38264B617738j452715j698662p82184P51185J502053P77208o87074j757047j910002
38255b639500j031594P33138K350027K202005N5841k068210k170732p77235J48576
38246c197684J56969M16410J186721J345550P24928O85689J513993J422637m56026
38237C799187k060537j296424O33917J033502k97034j279263j019539n13982k23511
$$ plain form
38300 4874326 4307205 3662541 3035715 1984015 477434 -683616 -900677 -552843 -267099
38291 -267099 -56617 316885 724770 953938 1088706 1099811 567348 -616297 -1693611
38282 -1693611 -1755265 -681194 1034065 2882855 4235215 4238766 2711677 833074 44164
38273 44164 352160 541457 29089 -386453 190565 1539505 2746280 3173079 2617738
38264 2617738 1165023 -533639 -1315823 -564638 937415 1714623 1027549 -729498 -2639500
38255 -2639500 -3671094 -2937956 -587929 1614076 1669917 -398293 -2569025 -3346260 -3197684
38246 -3197684 -3040715 -2624305 -1437584 -92034 632894 1318583 2832576 4255213 3799187
38237 3799187 1738650 442226 1076143 2109645 1812611 533348 -486191 -1000173 -1223684
38228a223684M79739J336798J128702J2720l22464N74334J141813N12759j42924
38219C497793P7822K30970n40906j343804j149281m62993o2083L73386J036182
38210A657086J022869Q5148l02965O13743J014581p15963k769605k168420N79493
38201i84033J977281O00854j133270q66088M75447N94157p36568j679744j011040
38192b763004M54530J007745J899j423341j538753n093J638372J754028M52816
38183d20801q08236j005801k98600N74375R18890M28743m22054o18044K14212
38174a437316J255359J600702J294878O96645l32269j718963k477449j851970
38166b970383n84237M9547o6285j94201j11794j0400L44760J076962J400951O97591
$$ plain form
38228 -1223684 -743945 592853 1721555 1734275 1411811 1986145 3127958 3640717 3497793
38219 3497793 3575615 3806585 3265679 1921875 772594 309601 247518 620904 1657086
38210 1657086 2679955 2765103 2462138 3075881 4090462 3374499 604894 -1563526 -984033
38201 -984033 993248 1594102 460832 -405256 70191 664348 -72220 -1751964 -2763004
38192 -2763004 -2308474 -1300729 -1298830 -2722171 -4260924 -4266017 -2627645 -873617 -420801
38183 -420801 -1229037 -2234838 -2533438 -1959063 -1040173 -611430 -1033484 -1651528 -1437316
38174 -1437316 -181957 1418745 2713623 3410268 3077999 1359036 -1118413 -2970383
38166 -2970383 -3554620 -3505073 -3571358 -3765559 -3877353 -3887753 -3542993 -2466031 -1065080 -367489
38156c67489k03241k42211K2071n22677j221408m64910J379284K080630R03091
38147A363140k41263K75513J474774J378733l28087k197027k734102j586646K75189
38138b319776J207307M43633q77528j050585m0432P45890P62810Q51886J296985
38129A020190J098890j19401j028117m72387O71069O74811o48905j761627j364830
38120a930307J19873J039652L00549j304885j835290n32246J179700J639998J117382
38111b05574R61043J325490J227958M34543l25852q13649j339277j528317p00535
38102i64170N77008J003175N71169L76151N36924K42329k58018M8400O09672j95972
38092B546668j895307j981387Q4419J682832J033722k74253k98268K23908j90166
$$ plain form
38156 -367489 -570730 -812941 -790870 -1313547 -2534955 -2999865 -1620581 460049 1363140
38147 1363140 1121877 1397390 2872164 4250897 3922810 1725783 -1008319 -2594965 -2319776
38138 -2319776 -1112469 -668836 -1546364 -2596949 -2637381 -1891491 -1128681 -276795 1020190
38129 1020190 2119080 1999679 971562 499175 1170244 1845055 1196150 -565477 -1930307
38120 -1930307 -1810434 -770782 -470233 -1775118 -3610408 -4142654 -2962954 -1322956 -205574
38111 -205574 755469 2080959 3308917 3743460 3417608 2603959 1264682 -263635 -964170
38102 -964170 -387162 616013 1187182 1563333 2100257 2342586 2084568 2132968 2742640 2546668
38092 2546668 651361 -1330026 -1245607 437225 1470947 1196694 898426 1122334 932168
38083I32168r40543o79038J19716O1647q30167j456417j322544n15631Q17861
38074c812948J820107J241565m31663r57436K85533J028372j65414j279018j50839
38065b421741J845615K128877R93499L84945K15973q29762k006404j422809M19609
38056f92198J241394P36299O18044J183236R34875l23593r82428n00683j11037
38047B103909l40533l32489O6632m0522n80071m49389L13526N61718K69969L53172
38037A925922L75959q35400k322691j796805M22847J505566P05760M29351J710653
38028B121162K190140K99698j796072j636252j31755N07556K13830J33895K56565
38019B158767J84610M93472J263987J065603n60217j540622m44601P70169j82837
$$ plain form
38083 932168 -8375 -687413 -567697 -506050 -1336217 -2792634 -4115178 -4630809 -3812948
38074 -3812948 -1992841 -751276 -1182939 -2140375 -1854842 -826470 -991884 -2270902 -2421741
38065 -2421741 -576126 1552751 2546250 2931195 3147168 2317406 311002 -1111807 -692198
38056 -692198 549196 1285495 1903539 3086775 4021650 3698057 2715629 2214946 2103909
38047 2103909 1763376 1430887 1497519 1456997 876926 427537 741063 1302781 1572750 1925922
38037 1925922 2301881 1466481 -856210 -2653015 -2230168 -724602 -18842 410509 2121162
38028 2121162 4311302 4611000 2814928 1178676 1046921 1554477 1768307 1902202 2158767
38019 2158767 2343377 2836849 4100836 5166439 4606222 3065600 2620999 3391168 3208331
38010C208331j949543j710816Q8891O07908n87493j091421Q1796J152089R69825
38001G69567P27580J284748J364958j41525j986319k254470j046117o2981k10312
37992a554871p59802o19564L48937J278289J253264L24838m93821l87071L60021
37983b49780Q85053Q05954L62056j07716l60580k68677l4340j3682r8977J28374
37973A047685M67560K39941l67388l02810N09885P42029j64709r55753p59393
37964D57047o09231j289394j446097R0765J687835J164951n36528q19445K75642
37955a024455M47620n53667m98730J073941J692597J52548j305486o66715P62482
37946H0135Q89928Q1495l32827p18756j788450k240377n51595J877748K182201
$$ plain form
38010 3208331 1258788 -452028 -363137 244771 -342722 -1434143 -1352347 -200258 769567
38001 769567 1497147 2781895 4146853 4005328 2019009 -235461 -1281578 -1344559 -1554871
37992 -1554871 -2314673 -2934237 -2585300 -1307011 -53747 271091 -222730 -609801 -249780
37983 -249780 635273 1441227 1803283 1695567 1334987 1066310 1031970 1018288 919311 1047685
37973 1047685 1515245 1755186 1387798 1084988 1594873 2336902 2172193 1216440 457047
37964 457047 -152184 -1441578 -2887675 -2796910 -1109075 55876 -480652 -1300097 -1024455
37955 -1024455 -576835 -1130502 -1629232 -555291 1137306 1289854 -15632 -682347 80135
37946 80135 970063 1051558 718731 -25 -1788475 -4028852 -4580447 -2702699 -520498
37937e20498K32443j199236m61470J144304J842682J525077P87394k83002j421542
37928A646152j722988q86197N3377P9118m80962o47640r9595P87679J507100J481779
37918A717823L28390j286239j800205n98602Q95743R02523l86899j195478o42711
37909b065655K99920M54665l7990l23258j51096J01390K52007M21681N05285K36114
37899c06937j48329O8123J021051J633286O63676j566170l083942k377519k80225
37890d376986R57714M58457l36878Q1031J117063J213678M15392J48357N77247
37881B55075J31347j670881k774990j357961J333351K641847K021349R59815J13186
37872A652138j111522k255725j712251L95664J611647O32691o52066j68083J122497
$$ plain form
37937 -520498 -288055 -1487291 -1948761 -804457 1038225 2563302 3350696 3067694 1646152
37928 1646152 -76836 -963033 -909656 -830538 -1311500 -1959140 -2058735 -1271056 236044 1717823
37918 1717823 2046213 759974 -1040231 -1638833 -743090 159433 -227466 -1422944 -2065655
37909 -2065655 -1765735 -1311070 -1349060 -1672318 -1823414 -1722024 -1470017 -1048336 -543051 -306937
37899 -306937 -455266 -387143 633908 2267194 2930870 1364700 -1719242 -4096761 -4376986
37890 -4376986 -3419272 -2960815 -3297693 -3216662 -2099599 -885921 -470529 -322172 255075
37881 255075 386422 -1284459 -4059449 -5417410 -4084059 -1442212 579137 1538952 1652138
37872 1652138 540616 -1715109 -3427360 -3031696 -1420049 -787358 -1439424 -1607507 -485010
37863d85010J026173k44637o34855K97239R55675N94472K77469N90847N21103
37854B898476n91002j727110j829453j343372j022819m40468R48552K153721J653661
37845G00186k36272j441283p35734Q37344J519969R28777J7654m29494m68526
37836F92621l27204J03003P56099R22191j7982j478207k003618j002293M28165
37827a927225Q76175L59941J8536L29942N33278p731o84958m83377M71270R34995
37817D20846J87462r27680j032823j0725Q70735P21201J85580L11953R07301R77133
37807B610983M38269J44072K19330j75599j005905q36336Q97362K442252J917466
37798F651894n0522j386764j442878j090375n68073O41472J822479J138362j527663
$$ plain form
37863 -485010 541163 296526 -338329 -41090 914585 1509057 1786526 2377373 2898476
37854 2898476 2307474 580364 -1249089 -2592461 -3615280 -4055748 -3107196 -953475 700186
37845 700186 463914 -977369 -1713103 -875759 644210 1572987 1590641 1161147 692621
37836 692621 365417 468420 1224519 2146710 2128728 650521 -1353097 -2355390 -1927225
37827 -1927225 -1051050 -691109 -672573 -342631 190647 182916 -502042 -985419 -514149 420846
37817 420846 608308 -319372 -1352195 -1362920 -492185 229016 414596 726549 1633850 2610983
37807 2610983 3049252 3193324 3412654 3237055 2231150 1394814 2292176 4734428 6651894
37798 6651894 6601372 5214608 3771730 2681355 2113282 2754754 4577233 5715595 4187932
37789D187932l597277k780377Q6237K196940J985710L12995r48916p39531M32530
37780A136243J068881K80895j097630j501600o45571L05457N16256K69095j53432
37771A78594r53840j716833j316429K18473J119790K82249r65304q16925L33835
37762c636390P32137J4082n67348k85169K83030M90969K71901l20058r47260o26376
37752d590482J038140K516137J955590N6003o26335N03468J171897n6075j460590
37743E07753j074465J25396R3025p41353m35572Q04200Q33658o35988j356411
37734a879757k71652Q05938M31115j32895M17672P63068n55418j839785n47241
37725b808955K168347K689847M72824j224833o57279L7410q03716j217065O55273
$$ plain form
37789 4187932 590655 -2189722 -2103485 93455 2079165 2392160 1443244 703713 1136243
37780 1136243 2205124 2486019 1388389 -113211 -758782 -453325 62931 332026 178594
37771 178594 -775246 -2492079 -3808508 -3590035 -2470245 -2187996 -3153300 -3970225 -3636390
37762 -3636390 -2904253 -2890171 -3457519 -3742688 -3459658 -2968689 -2696788 -3016846 -3964106 -4590482
37752 -4590482 -3552342 -1036205 919385 975388 349053 852521 2024418 1968343 507753
37743 507753 -566712 -441316 -348291 -1089644 -1525216 -721016 112642 -523346 -1879757
37734 -1879757 -2151409 -1345471 -914356 -1047251 -629579 133489 -421929 -2261714 -2808955
37725 -2808955 -640608 2049239 2522063 1297230 639951 677361 -126355 -1343420 -688147
37716f88147K626107J625327j155841j978388l36433P65521K86o48382K8481L78192
37706F16723p40216j574286m07204J474946J835563P65780j00300k63854l06848
37697A300304k75952j3722k05131j261300j923169q41573J027407J502525L18067
37688c72544o82829m04937K68934L25767O6497J90123O69094J073405J142444
37679B275954P14116j49010q28665p46931l25495m47484r50483p45120L52130
37670h50988J051546L96781p77411r18395K63547J549168J685194O45149m78665
37661B565926o13201K17275R61759P84511J903m89212l78622m8466J99626L83708
37651C585207M43414K32451j17946l32712m14303n09007n84043p06991j254217
$$ plain form
37716 -688147 1937960 3563287 2407446 429058 92625 858146 858432 210050 238531 616723
37706 616723 -123493 -1697779 -2104983 -630037 1205526 1971306 1871006 1607152 1300304
37697 1300304 1024352 1010630 805499 -455801 -2378970 -3220543 -2193136 -690611 -372544
37688 -372544 -1055373 -1460310 -1191376 -865609 -799112 -608989 60105 1133510 2275954
37679 2275954 2990070 2841060 2012395 1265464 939969 492485 -457998 -1203118 -850988
37670 -850988 200558 597339 -180072 -1098467 -834920 714248 2399442 3044591 2565926
37661 2565926 1952725 2170000 3131759 3916270 3918173 3428961 3050339 3001873 3201499 3585207
37651 3585207 4028621 4261072 4143126 3810414 3396111 2887104 2303061 1596070 341853
37642C41853k175264k473776j317262O27767J939250K268358K321203K218345
$$ plain form
37642 341853 -1833411 -4307187 -5624449 -4996682 -3057432 -789074 1532129 3750474
$$ [...]
##END NTUPLES=NMR SPECTRUM
##END=
