##TITLE=31Pdec_3PBDP1910
 CDCl3, 24 sc
 20.10.2020
##JCAMPDX= 6.0         $$ Bruker NMR JCAMP-DX V2.0
##DATA TYPE= NMR SPECTRUM
##DATA CLASS= NTUPLES
##ORIGIN= UXNMR, Bruker Analytische Messtechnik GmbH
##OWNER= root
$$ XWIN-NMR		Version 3.5
$$ Tue Oct 20 11:18:59 2020 Russian Standard Time (UT+4h)  she@DPX200
##.OBSERVE FREQUENCY= 81.013821
##.OBSERVE NUCLEUS= ^31P
##.ACQUISITION MODE= SIMULTANEOUS
##.ACQUISITION SCHEME= undefined
##.AVERAGES= 24
##.DIGITISER RES= 17
##SPECTROMETER/DATA SYSTEM= spect
##.PULSE SEQUENCE= zgpg30
##.SOLVENT NAME= D2O
##.SHIFT REFERENCE= (INTERNAL, D2O, 0, 182.463)
##AUDIT TRAIL= $$ (NUMBER, WHEN, WHO, WHERE, WHAT)
$$ ##TITLE= Audit trail, XWIN-NMR		Version 3.5
$$ ##JCAMPDX= 5.01
$$ ##ORIGIN= Bruker BioSpin GmbH
$$ ##OWNER= she
$$ F:/spectra/data/she/nmr/P31/1/pdata/1/auditp.txt
$$ ##AUDIT TRAIL=  $$ (NUMBER, WHEN, WHO, WHERE, WHAT)
(   1,<2020-10-20 11:17:52.34 +0400>,<she>,<DPX200>,
      <created by zg, POWCHK disabled, PULCHK disabled
       configuration hash MD5:
       00 E9 B6 7A A2 85 ED C7 34 08 36 98 17 FE 4E 26
       data hash MD5: 32K
       22 27 B8 6A 5B C1 E9 A2 B0 48 A2 87 71 8A 76 F4>)
(   2,<2020-10-20 11:17:54.90 +0400>,<she>,<DPX200>,
      <Start of raw data processing
       efp BC_mod = 2 LB = 1 FT_mod = 6 PKNL = 1 PHC0 = -2764.807 PHC1 = 71.60141 SI = 64K 
       data hash MD5: 64K
       32 38 18 1E CA 08 FB 9A 60 F3 14 C6 3D 2F 27 99>)
(   3,<2020-10-20 11:18:08.73 +0400>,<she>,<DPX200>,
      <pk PHC0 = 14.11259 PHC1 = 0 
       data hash MD5: 64K
       09 A5 B7 73 18 BF 20 0C 61 9F 48 6F E2 15 28 6B>)
$$ ##END=
$$ 
$$ hash MD5
$$ AB D4 2A 41 0F E1 AD 2C 12 8A 90 9E D7 28 6A 35
##$RELAX= 
##$RELAX= 
##$RELAX= 
##$RELAX= 
##$RELAX= 
##$RELAX= 
##$RELAX= 
##$RELAX= 
$$ Bruker specific parameters
$$ --------------------------
##$DU= <F:/spectra>
##$EXPNO= 1
##$NAME= <P31>
##$PROCNO= 1
##$TYPE= <nmr>
##$USER= <she>
##$AMP= (0..31)
100 100 100 100 100 100 100 100 100 100 100 100 100 100 100 100 100 100 
100 100 100 100 100 100 100 100 100 100 100 100 100 100 
##$AQSEQ= 0
##$AQ_mod= 1
##$AUNM= <au_zg>
##$AUTOPOS= <>
##$BF1= 81.014009
##$BF2= 200.13
##$BF3= 200.13
##$BF4= 200.13
##$BF5= 200.13
##$BF6= 200.13
##$BF7= 200.13
##$BF8= 200.13
##$BYTORDA= 1
##$CFDGTYP= 0
##$CFRGTYP= 5
##$CHEMSTR= <none>
##$CNST= (0..31)
1 1 145 1 1 1 1 1 1 1 1 1 1 1 1 1 1 1 1 1 1 1 1 1 1 1 1 1 1 1 1 1 
##$CPDPRG= <waltz16>
##$CPDPRG1= <>
##$CPDPRG2= <waltz16>
##$CPDPRG3= <>
##$CPDPRG4= <mlev>
##$CPDPRG5= <mlev>
##$CPDPRG6= <mlev>
##$CPDPRG7= <mlev>
##$CPDPRG8= <mlev>
##$CPDPRGB= <>
##$CPDPRGT= <>
##$D= (0..31)
0 1 0 0 0 0 0 0 0 0 0 0.03 2e-05 3e-06 0 0 0 0 0 0 0 0 0 0 0 0 0 0 0 0 
0 0 
##$DATE= 1603178271
##$DBL= (0..7)
120 120 120 11 120 120 24 19 
##$DBP= (0..7)
150 150 150 150 150 150 150 150 
##$DBP07= 0
##$DBPNAM0= <>
##$DBPNAM1= <>
##$DBPNAM2= <>
##$DBPNAM3= <>
##$DBPNAM4= <>
##$DBPNAM5= <>
##$DBPNAM6= <>
##$DBPNAM7= <>
##$DBPOAL= (0..7)
0.5 0.5 0.5 0.5 0.5 0.5 0.5 0.5 
##$DBPOFFS= (0..7)
0 0 0 0 0 0 0 0 
$$ [...]
##$SUBNAM2= <"">
##$SUBNAM3= <"">
##$SUBNAM4= <"">
##$SUBNAM5= <"">
##$SUBNAM6= <"">
##$SUBNAM7= <"">
##$SUBNAM8= <"">
##$SUBNAM9= <"">
##$SW= 369.568048894756
##$SWIBOX= (0..15)
0 1 3 0 0 0 0 0 0 0 0 0 0 0 0 0 
##$SW_h= 29940.119760479
##$TD= 32768
##$TD0= 1
##$TE= 0
##$TE2= 300
##$TE3= 300
##$TEG= 300
##$TL= (0..7)
0 120 53 12 22 120 120 120 
##$TP= (0..7)
150 150 150 150 150 150 150 150 
##$TP07= 0
##$TPNAME0= <>
##$TPNAME1= <>
##$TPNAME2= <>
##$TPNAME3= <>
##$TPNAME4= <>
##$TPNAME5= <>
##$TPNAME6= <>
##$TPNAME7= <>
##$TPOAL= (0..7)
0.5 0.5 0.5 0.5 0.5 0.5 0.5 0.5 
##$TPOFFS= (0..7)
0 0 0 0 0 0 0 0 
##$TUNHIN= 0
##$TUNHOUT= 0
##$TUNXOUT= 0
##$USERA1= <user>
##$USERA2= <user>
##$USERA3= <user>
##$USERA4= <user>
##$USERA5= <user>
##$V9= 5
##$VALIST= <valist>
##$VCLIST= <CCCCCCCCCCCCCCC>
##$VD= 0
##$VDLIST= <DDDDDDDDDDDDDDD>
##$VPLIST= <PPPPPPPPPPPPPPP>
##$VTLIST= <TTTTTTTTTTTTTTT>
##$WBST= 1024
##$WBSW= 4
##$XGAIN= (0..3)
0 0 0 0 
##$XL= 0
##$YL= 0
##$YMAX_a= 36798
##$YMIN_a= -34480
##$ZGOPTNS= <>
##$ZL1= 120
##$ZL2= 120
##$ZL3= 120
##$ZL4= 120
##$ABSF1= 0
##$ABSF2= 0
##$ABSG= 0
##$ABSL= 0
##$ALPHA= 0
##$AQORDER= 0
##$ASSFAC= 0
##$ASSFACI= 0
##$ASSFACX= 0
##$ASSWID= 0
##$AUNMP= <proc_1d>
##$AZFE= 0.1
##$AZFW= 0.5
##$BCFW= 0
##$BC_mod= 2
##$BYTORDP= 0
##$COROFFS= 0
##$CY= -3
##$DATMOD= 1
##$DC= 0
##$DFILT= <>
##$DTYPP= 0
##$F1P= 0
##$F2P= 0
##$FCOR= 1
##$FTSIZE= 65536
##$FT_mod= 6
##$GAMMA= 0
##$GB= 0
##$INTBC= 1
##$INTSCL= 5.30512e-09
##$ISEN= 30
##$LB= 1
##$LEV0= 0
##$LPBIN= 0
##$MAXI= 10000
##$MC2= 0
##$MEAN= 0
##$ME_mod= 0
##$MI= 50
##$NCOEF= 0
##$NC_proc= -4
##$NLEV= 6
##$NOISF1= 182.463
##$NOISF2= 159.3651
##$NSP= 0
##$NTH_PI= 0
##$NZP= 0
##$OFFSET= 182.463
##$PC= 4
##$PHC0= -2750.694
##$PHC1= 71.60141
##$PH_mod= 1
##$PKNL= yes
##$PPARMOD= 0
##$PSCAL= 0
##$PSIGN= 0
##$REVERSE= no
##$SF= 81.0140089999434
##$SI= 65536
##$SIGF1= 159.3651
##$SIGF2= -187.1042
##$SINO= 113.3802
##$SIOLD= 16384
##$SREGLST= <1H.CDCl3>
##$SSB= 0
##$STSI= 65536
##$STSR= 0
##$SW_p= 29940.119760479
##$SYMM= 0
##$S_DEV= 0
##$TDeff= 32768
##$TDoff= 0
##$TI= <>
##$TILT= no
##$TM1= 0
##$TM2= 0
##$TOPLEV= 0
##$USERP1= <user>
##$USERP2= <user>
##$USERP3= <user>
##$USERP4= <user>
##$USERP5= <user>
##$WDW= 1
##$XDIM= 65536
##$YMAX_p= 285067224
##$YMIN_p= -3475688
$$ End of Bruker specific parameters
$$ ---------------------------------
##NTUPLES= NMR SPECTRUM
##VAR_NAME=  FREQUENCY,     SPECTRUM/REAL,   SPECTRUM/IMAG
##SYMBOL=    X,             R,               I
##VAR_TYPE=  INDEPENDENT,   DEPENDENT,       DEPENDENT
##VAR_FORM=  AFFN,          ASDF,            ASDF
##VAR_DIM=   65536,         65536,           65536
##UNITS=     HZ,            ARBITRARY UNITS, ARBITRARY UNITS
##FACTOR=    0.456856943014862, 1,           1
##FIRST=     14782.0589164792, 0,            0
##LAST=      -15158.0608439998, 0,           0
##MIN=       -15158.0608439998, -3475688,    0
##MAX=       14782.0589164792, 285067224,    0
$$ Real data points
##PAGE= N=1
##DATA TABLE= (X++(R..R)), XYDATA
$$ [...]
45360 -754388 -738354 -425921 -207653 -226776 -152704 191644 485869 474017 421394 644525
45350 644525 954610 992877 837589 821841 940277 896509 633811 390730 281588 207863
45340 207863 150761 180443 188481 -28920 -407919 -665308 -712539 -689495 -586766 -215531 367491
45329 367491 755119 649936 186719 -277130 -459224 -234182 276353 662934 598462 284838
45319 284838 187372 316938 234227 -147101 -312995 38858 459158 418713 103814 71353
45309 71353 420564 798803 998691 1044311 854089 353588 -150711 -231970 21867 120924
45299 120924 -46611 -60098 282860 575363 435192 119175 130355 462606 627127 341700
45289 341700 -132362 -358960 -203211 134570 426320 645260 891833 1169527 1342143 1340057
45279 1340057 1276673 1254457 1186377 979346 773095 759627 849245 797389 617263 545296 601694
45268 601694 554542 383811 375644 592996 654450 308714 -117819 -184718 36230 180669
45258 180669 200944 304754 431439 293240 -65582 -226929 -25954 180512 46465 -283596
45248 -283596 -431690 -275410 25551 293458 413209 298070 -14489 -312486 -409347 -325043
45238 -325043 -163888 67297 374043 616683 620236 396061 108911 -131849 -309485 -378221
45228 -378221 -272307 -40412 165963 261876 292564 331048 410105 544434 709844 808669
45218 808669 778020 723924 791135 880304 694745 175625 -286275 -254435 242571 793354
45208 793354 1111698 1219134 1153061 820152 279429 -99816 -24112 319294 506720 446965
45198 446965 424331 599052 781508 777002 657740 544890 386465 161412 76317 281498
45188 281498 539172 472690 79760 -266676 -281229 23727 531752 1114907 1519351 1472850
45178 1472850 1004002 422529 -75276 -523610 -853875 -784169 -238770 386512 633918 500847
45168 500847 332040 332846 410265 407064 290020 142174 96099 219869 395459 424591 318376
45157 318376 298942 419810 430882 194459 -24777 56277 297819 401464 421261 623296
45147 623296 957766 1097407 971313 839907 799837 629343 253236 -7896 138527 545487
45137 545487 846076 901727 852850 859889 951507 1050543 1050965 917382 725834 540668 309139
45126 309139 5481 -219141 -239605 -214257 -359464 -536734 -409268 7567 335639 405648
45116 405648 421424 463520 292612 -142735 -433014 -249467 170013 379399 286773 79878
45106 79878 -114269 -192725 616 370891 476562 120498 -239354 -108677 273957 318881
45096 318881 51312 68197 547987 930614 746786 250214 -31397 18136 162527 275586
45086 275586 411992 530323 431332 29180 -431564 -540399 -171177 290877 364033 120497
45076 120497 113141 527985 817309 500814 -64765 -224583 -24606 -23829 -292458 -358249 -146520
45065 -146520 -162407 -533537 -642030 -96386 584916 750550 538637 471155 567878 490317
45055 490317 272035 256161 443395 497471 363072 345017 537781 651637 507280 304786
45045 304786 260279 295580 247925 140422 76540 37960 -48822 -131367 -51093 247681 578113
45034 578113 647402 403712 185678 347320 746600 870897 537700 150558 88985 183501
45024 183501 90234 -105619 -52884 281359 585581 655693 524024 251863 -41730 -53535
45014 -53535 393970 969309 1149132 878153 536854 337752 216303 263909 696106 1302640
45004 1302640 1489362 1062048 479597 126435 -153240 -525117 -706381 -456606 -86876
44995 -86876 16050 36608 365141 829249 876485 435450 45790 99023 415019 657010
44985 657010 750611 734272 531230 95967 -392814 -657341 -562016 -191462 188593 242709
44975 242709 -176988 -811861 -1169648 -995123 -495992 -82002 31689 -47556 -63982 107844
44965 107844 314696 281679 -55621 -475806 -784412 -1031915 -1281437 -1360901 -1110193 -740199
44955 -740199 -620071 -758224 -826229 -688367 -540438 -459452 -210538 305793 742611 714439
44945 714439 298044 -132854 -392009 -525740 -525972 -333146 -85889 -49923 -240523 -365667
44935 -365667 -240151 -46004 -35533 -130895 -25295 355725 689859 627916 211988 -191575
44925 -191575 -324424 -257357 -168763 -77388 77177 206723 129917 -150476 -401095 -442241
44915 -442241 -358548 -365938 -546771 -756297 -740994 -366202 189412 504388 313224 -179529
44905 -179529 -518639 -494474 -245077 76323 447352 760712 792058 530369 263357 152958
44895 152958 -12562 -424406 -867528 -1014357 -902273 -805927 -790881 -723057 -602779 -545581
44885 -545581 -508278 -375080 -257052 -347831 -511135 -391813 39845 423401 533253 498305
44875 498305 436937 281633 93576 130274 383582 433675 45404 -411964 -452866 -112861
44865 -112861 230762 441884 661683 917088 1054145 986118 718038 214431 -473913 -1044877
44855 -1044877 -1209215 -1063745 -928186 -886383 -789825 -645717 -640966 -766476 -762388 -517293
44845 -517293 -231525 -84542 5068 172160 373063 485202 477626 388045 269542 224074
44835 224074 343475 553917 649098 526602 275299 13242 -224476 -422724 -550314 -601857
44825 -601857 -563424 -369705 -23865 311728 501842 604110 651028 447408 -80740 -492819
44815 -492819 -262113 436310 874417 758853 530162 547553 581046 407119 314029 537066
44805 537066 669697 230768 -499667 -828841 -641012 -422916 -395954 -253743 182430 611217
44795 611217 714062 526099 179896 -318967 -856189 -1097336 -869509 -424207 -108101 39317
44785 39317 179773 352921 465823 492808 506828 559886 632087 651154 528387 270365 73123
44774 73123 163093 496915 763881 748330 549019 374398 277032 197495 143595 190231 357354
44763 357354 580042 767434 847622 795606 637170 390034 36764 -365126 -611073 -538232
44753 -538232 -254265 -573 195139 502333 886109 989377 582854 -46535 -368694 -202079
44743 -202079 139163 266614 134218 -10786 1431 55131 -44820 -237951 -244826 15022
44733 15022 227272 63827 -380626 -746950 -900631 -992988 -1080031 -989963 -631516 -187473
44723 -187473 81075 38405 -334123 -908175 -1333593 -1275879 -832836 -465238 -404761 -389591
44713 -389591 -121602 287661 526079 510120 384027 260587 170460 138524 138478 90991 28530
44702 28530 99495 293774 375632 235385 72474 51987 45252 -50125 -10763 359370 800040
44691 800040 912464 761270 735112 863080 712865 56737 -715310 -1023497 -744048 -285533
44681 -285533 -112196 -270901 -384373 -137587 276990 393359 161096 57475 340818 587899
44671 587899 336074 -155144 -289000 -50703 41341 -193656 -381748 -269640 -35792 172955
44661 172955 452738 722756 643774 210640 -73342 76273 280441 140113 -98221 32328
44651 32328 450006 666298 502767 223839 78055 93141 225525 364794 299774 29206
44641 29206 -18697 513735 1260160 1424447 775942 -51141 -367536 -182994 25899 1568
44631 1568 -111277 -123535 -74370 -113465 -244265 -288778 -135018 59892 64845 -33939 117297
44620 117297 583843 921651 777328 460871 516752 864617 865092 268847 -397711 -576828
44610 -576828 -382907 -270541 -328949 -289756 -65143 112964 78851 -44391 -80326 -61249
44600 -61249 -153140 -407204 -664582 -705835 -487994 -213541 -119237 -221752 -355499 -419648
44590 -419648 -434272 -380580 -226122 -151239 -443785 -997940 -1222691 -761649 -83411 49190
44580 49190 -410968 -771861 -599922 -243952 -171503 -241330 -30549 398261 548691 248075
44570 248075 -97011 -99031 120707 233476 211674 247089 314970 163110 -241835 -551035
44560 -551035 -473098 -196879 -157947 -444467 -664619 -462689 19217 341814 323723 196730
44550 196730 209602 282054 173631 -121181 -317539 -177535 215159 550544 590536 348862
44540 348862 45193 -74998 71267 328375 422601 210034 -177072 -451967 -459528 -332905
44530 -332905 -338120 -553151 -744417 -620277 -186754 240596 391889 290760 89916 -186441
44520 -186441 -568343 -906709 -953977 -689317 -349599 -87613 183193 513003 722503 667157
44510 667157 503607 456115 458551 310510 101804 138683 422254 545417 256739 -151839
44500 -151839 -240512 -4537 200349 192629 124368 116513 28512 -286111 -685292 -869406 -726594
44489 -726594 -411400 -123800 57461 126964 72368 -96457 -310068 -491905 -611544 -656296
44479 -656296 -611749 -517173 -466027 -474456 -424037 -245532 -88188 -148543 -373380 -521490 -499808
44468 -499808 -407170 -242841 110311 512939 554848 173491 -55976 339018 938876 905291
44458 905291 154023 -511556 -499640 -98968 150157 210175 304695 362025 196178 -16185
44448 -16185 56407 347849 515487 530232 657649 850454 680515 33012 -581254 -669845
44438 -669845 -375710 -152553 -95197 41351 304009 411276 175386 -233969 -525966 -597997
44428 -597997 -532985 -429403 -319722 -185234 -8813 139513 89592 -253734 -725679 -1022102
44418 -1022102 -1041688 -979562 -1013445 -1031169 -806759 -371101 -37091 -40180 -279772 -468685
44408 -468685 -451952 -306868 -178573 -110179 -58586 -22970 -84541 -290204 -543961 -687325
44398 -687325 -680628 -619324 -563599 -477265 -388243 -446779 -678944 -822888 -635766 -285447 -171512
44387 -171512 -377058 -590385 -601573 -544222 -529148 -388548 -14373 348070 443787 408103
44377 408103 492308 593283 443779 131311 1420 103084 156016 67292 50970 172934
44367 172934 194133 -7008 -221309 -253758 -146676 55147 390479 688380 594268 111211
44357 111211 -259389 -166978 167703 447095 782288 1283357 1552836 1135885 271979 -320591
44347 -320591 -306208 63698 484025 851081 1042969 931345 645158 425924 221471 -174313
44337 -174313 -598771 -615402 -201149 126453 12041 -319429 -506280 -512840 -446104 -277337
44327 -277337 -341 216717 268808 262319 248223 85960 -226155 -377199 -153222 227517
44317 227517 440758 479805 492368 441567 249026 77672 125923 276854 283815 192092 242287
44306 242287 448832 625349 757095 956509 1065837 749251 94967 -292019 -42282 446700
44296 446700 536898 186181 -107791 -99901 -111711 -443571 -823110 -743574 -211186 189404
44286 189404 32494 -421422 -607177 -369800 -45069 82125 96383 180939 293567 269341
44276 269341 91679 -104615 -227883 -301282 -379100 -475771 -548410 -508838 -308519 -42407
44266 -42407 107911 73348 -30243 -47229 85389 347511 643672 778098 578320 110578
44256 110578 -350608 -610405 -677581 -591828 -341757 -25549 140148 105413 73462 153948
44246 153948 151250 -100215 -395764 -417227 -189729 -18704 -68089 -243812 -399059 -401611 -102573
44235 -102573 446408 794372 467769 -385522 -1025884 -917919 -282341 243092 276985 -92249
44225 -92249 -545566 -773268 -594016 -71868 459454 630274 368516 -35210 -233063 -171151
44215 -171151 -86745 -153366 -232395 -89151 217960 372524 249081 98489 172307 370330
44205 370330 436495 336716 233678 209657 221371 229866 188561 24966 -173839 -131464 204786
44194 204786 421445 180001 -162264 34493 702745 1056167 690405 133367 3101 110511
44184 110511 -133743 -737892 -1099572 -862585 -324403 60276 207050 300745 425824 473404
44174 473404 316102 -18977 -315521 -323251 -33298 244687 207627 -80822 -315877 -391350
44164 -391350 -468253 -572370 -435811 48655 451593 233396 -513092 -1098283 -1082455 -763961
44154 -763961 -658198 -795625 -838585 -682933 -545507 -525338 -488017 -417617 -477813 -608229
44144 -608229 -464707 27555 434888 417102 233463 289403 476390 413238 129750 -7123
44134 -7123 52428 -5470 -243739 -328506 -103086 147332 161037 40958 -22136 405 142188
44123 142188 457279 693421 396148 -381498 -902339 -666469 -155069 -187555 -790437 -1227176
44113 -1227176 -1035445 -518041 -185681 -163800 -272787 -357679 -375844 -361733 -407951 -538684
44103 -538684 -590989 -408344 -146772 -144514 -436691 -648450 -487971 -135130 29800 -58877
44093 -58877 -110167 87294 352644 297663 -221951 -887629 -1182730 -894374 -322369 44080
44083 44080 13496 -201552 -305561 -221531 -64418 53140 98735 68805 -28321 -128685 -140516
44072 -140516 -67268 -36582 -121150 -184132 -44885 214026 301763 137954 -14691 22674 42213
44061 42213 -165059 -354712 -157490 265125 362721 -9188 -404289 -462636 -286895 -13228
44051 -13228 445721 954230 992167 378910 -287857 -442136 -412875 -828539 -1439153 -1347669
44041 -1347669 -413448 384285 257774 -358644 -516204 -40604 392631 242599 -323362
44032 -323362 -805827 -937929 -780817 -502925 -222127 12966 192414 304990 314193 196704
44022 196704 25758 -22729 165153 447825 518191 290877 78419 192736 476751 517696
44012 517696 268765 80526 96131 88542 42002 343700 1047821 1467576 1043297 234058
44002 234058 -92759 100808 101006 -375977 -840121 -908302 -798583 -752825 -615046 -280980
43992 -280980 -26847 -47657 -104313 33645 172367 52492 -213083 -393791 -534302 -749708
43982 -749708 -882446 -722688 -399295 -228840 -279777 -331089 -180899 159857 469728 434261
43972 434261 -43019 -583036 -655503 -245558 123471 127486 2808 21005 72932 37356 89274
43961 89274 283510 281787 -73460 -339532 -135810 167491 24121 -347551 -293123 198173
43951 198173 465928 187299 -262948 -507328 -595190 -621700 -487742 -224256 -83847 -121974
43941 -121974 -83331 146478 352562 378103 327650 276514 168371 116886 386902 901284
43931 901284 1164235 895787 414537 193495 335592 645842 899697 882039 500012 30871
43921 30871 -78195 179069 317445 83492 -188448 -164399 -8769 10394 -12841 79619
43911 79619 139919 58238 108925 481802 801599 654165 319123 375595 761650 875857
43901 875857 550937 267998 331170 439033 262454 -62509 -253860 -275394 -169755 122380
43891 122380 503432 604921 253569 -173756 -175699 238575 630806 757355 809811 1010366
43881 1010366 1220210 1111426 647405 210707 157068 344334 317396 -25007 -231308 73067
43871 73067 632503 926923 864332 726458 596476 325405 2803 -78408 21444 -87603
43861 -87603 -412987 -469119 -130910 -4514 -521797 -1187455 -1298847 -1012857 -1012867 -1360125 -1441464
43850 -1441464 -1031187 -655377 -713137 -867404 -641467 -155919 117211 34417 -149659 -202731
43840 -202731 -86020 174008 497819 681499 538633 128715 -272866 -425568 -299956 -76828
43830 -76828 -16753 -236407 -572526 -764739 -766796 -708628 -561655 -123568 559427 1039561
43820 1039561 946103 424413 -90162 -343224 -314909 -35962 367085 614864 568883 465072
43810 465072 577145 790780 830641 754801 815097 930190 785952 458315 411755 757586
43800 757586 1021037 868738 599469 601946 743419 692160 506165 443757 440415 270961 71821
43789 71821 172869 455677 405421 -122279 -656032 -784696 -671920 -679742 -820972 -861930
43779 -861930 -726861 -517544 -294963 -105134 -99590 -358818 -651466 -625544 -255533 101410
43769 101410 138404 -73369 -254025 -275567 -233525 -210569 -103973 237159 739485 1078243
43759 1078243 994648 589573 200808 5424 -131719 -384427 -668493 -715751 -393870 120399
43749 120399 473359 428020 83109 -182174 -57952 358453 631711 429729 -156129 -740162
43739 -740162 -1005382 -914996 -666789 -498320 -472966 -431565 -226095 22730 54107 -142148
43729 -142148 -279521 -189383 -33632 39457 172321 461222 582454 157019 -616168 -1128285
43719 -1128285 -1168475 -1113130 -1194660 -1064427 -407671 368507 533306 -11060 -608827 -703077
43709 -703077 -434985 -271056 -331451 -323903 -23949 395559 547662 270192 -160776 -287264
43699 -287264 48662 551485 854598 928425 949004 888829 550076 18351 -271663 -101305
43689 -101305 188908 187185 19341 122407 535622 822727 712686 429428 268959 200806
43679 200806 93371 33849 131130 201650 -21030 -459474 -773889 -818359 -727675 -581264
43669 -581264 -314233 -20715 -7487 -364214 -728794 -709265 -377790 -114257 -73763 -72466
43659 -72466 24626 67053 -134779 -492845 -716850 -667619 -528883 -578216 -805613 -839769 -353185
43648 -353185 468992 1012061 869770 282774 -186071 -305843 -311221 -439715 -606278 -627213
43638 -627213 -542590 -524167 -578984 -553450 -400899 -248586 -165349 -38052 225382 502856
43628 502856 611913 587294 639133 830471 947180 751135 259457 -296776 -705513 -892277
43618 -892277 -894988 -821773 -770296 -694603 -432279 18140 352700 291012 -15950 -153469 -3846
43607 -3846 148688 118928 84110 185373 216150 14977 -113438 202178 737633 907408
43597 907408 648219 549429 952043 1403802 1326303 850413 563931 653512 766788 655150
43587 655150 490922 469582 491017 416510 343928 389398 397653 137900 -307414 -597827 -562364
43576 -562364 -367669 -231657 -140933 68105 449148 846848 1016813 818865 350441 -86922
43566 -86922 -225495 -84967 62136 16144 -130654 -169363 -88838 -71589 -185039 -248801 -103861
43555 -103861 115267 147565 -499 -28877 235631 574945 667263 502347 323325 241829
43545 241829 153642 30810 25717 184023 290330 163998 -83156 -273148 -452819 -701708
43535 -701708 -819100 -559806 -114040 40914 -197461 -427003 -371720 -246190 -296458 -363233
43525 -363233 -216749 -22433 -84739 -319287 -371511 -149470 119600 270441 278251 44895
43515 44895 -483813 -1005911 -1077350 -679489 -209837 103929 363133 541919 387608 -51812
43505 -51812 -298221 -119485 101276 -1686 -189926 -73983 206894 245209 45406 -68998
43495 -68998 -55932 -147470 -344925 -433340 -456798 -662540 -945302 -866775 -352913 100761 119378
43484 119378 -54172 9412 322761 570832 563080 357292 111754 10234 174892 484282
43474 484282 623223 455440 200489 118827 184670 204929 110921 -846 9411 254466
43464 254466 719304 1148002 1207538 857068 382722 9265 -290203 -528960 -557258 -335590
43454 -335590 -70216 113626 350871 683554 846209 675327 413486 273206 33038 -489251
43444 -489251 -871567 -593345 54725 228070 -292215 -813164 -759924 -385730 -182371 -122744
43434 -122744 88751 384368 425930 152223 -159754 -299131 -292799 -246584 -264857 -457381
43424 -457381 -797262 -1035441 -963377 -685453 -421537 -139340 337099 892807 1117677 827749
43414 827749 354530 182895 448989 896252 1186620 1138906 785031 350418 125552 209197
43404 209197 376200 302574 -72795 -499930 -727015 -734882 -628622 -455520 -268690 -245223
43394 -245223 -497528 -780245 -661233 -90799 448929 546817 382698 366822 455314 237138
43384 237138 -344599 -810662 -796392 -489990 -231514 -37905 193014 313952 135047 -189775
43374 -189775 -356062 -371515 -462444 -600593 -519723 -203622 34086 38474 31252 208445 426531
43363 426531 461010 328275 171792 36942 -70829 -95653 -67639 -148234 -371465 -520978
43353 -520978 -442719 -297688 -308317 -435772 -527260 -600492 -729441 -821285 -790314 -780850 -881467
43342 -881467 -782140 -145115 764276 1288537 1223646 970215 781104 418705 -207206 -600667
43332 -600667 -309757 362190 744240 674596 533468 541078 502119 252992 -48218 -187441
43322 -187441 -174996 -150033 -173183 -178473 -45797 240321 440452 251943 -185808 -243075 408180
43311 408180 1182320 1237285 619594 183247 361368 660149 565990 306555 286368 291805
43301 291805 -130652 -783178 -947226 -375507 365373 627658 364564 -33188 -252733 -238565
43291 -238565 -79289 98668 217814 329378 537923 806879 932516 763832 383741 31032
43281 31032 -121928 -100798 -64745 -113188 -169383 -102913 60556 166791 169424 180454 246070
43270 246070 254555 144500 13197 -81053 -208304 -328150 -213565 184425 540331 579219
43260 579219 470144 502104 607935 584007 556920 748733 928244 666269 109341 -107364
43250 -107364 181545 408587 195482 -51478 150542 563665 662036 508316 589643 930456
43240 930456 977178 428824 -306730 -667288 -603020 -467621 -475858 -530646 -505636 -460579 -510948
43229 -510948 -609831 -587473 -400524 -218716 -190556 -224944 -134404 87066 309831 532718
43219 532718 855613 1181543 1226518 925272 577956 448354 434673 311226 97213 -29785
43209 -29785 -40286 -43795 -57688 6125 151703 249925 180892 -39385 -240359 -204223 94677
43198 94677 366473 305105 14352 -111384 48437 229338 315215 553503 1008393 1236206
43188 1236206 897499 351019 169720 317079 318534 81139 -24151 137058 214320 -95029
43178 -95029 -679088 -1242908 -1546324 -1399646 -824092 -246962 -116288 -270319 -135347 376907
43168 376907 678978 387010 -121811 -322852 -269765 -331559 -542445 -616514 -395443 53629
43158 53629 596814 1000673 962927 502585 122030 229238 563538 568839 202927 -49845
43148 -49845 72874 290149 284370 147553 133811 225894 187191 -55250 -274729 -214631 91321
43137 91321 338322 311669 158687 185405 425185 614418 625886 660815 868332 1030355
43127 1030355 869486 489351 233990 230782 346232 494274 681481 792604 657426 374573
43117 374573 291801 567786 951038 1080233 851716 425598 5890 -311353 -549584 -744850
43107 -744850 -805877 -575420 -128141 139737 -66668 -512259 -664273 -307512 303612 844176
43097 844176 1180649 1264881 1110549 927776 947426 1016494 712041 11821 -502245 -366871
43087 -366871 128408 348538 132707 -163279 -312854 -493389 -889844 -1363145 -1628859 -1544429
43077 -1544429 -1125900 -485138 121348 353216 89643 -374955 -581036 -358107 47646
43068 47646 291345 285925 208306 226052 316055 363380 347601 348560 400379 439367 418772 395041
43056 395041 445324 542477 571902 467485 292320 168156 134570 110001 29841 -3492 186239
43045 186239 562479 804577 652111 249944 -6778 59423 263947 376053 375982 332265 213137
43034 213137 -33768 -307895 -391052 -135592 410919 990951 1238633 956961 385327 52123
43024 52123 232498 655566 872290 793601 685966 717804 741462 548876 161161 -217410
43014 -217410 -435647 -516223 -580619 -679986 -690982 -427390 90263 549899 653249 470546
43004 470546 346680 454828 608926 577128 414558 334374 336150 164154 -312508 -817635
42994 -817635 -912564 -526552 -125585 -249175 -896297 -1475938 -1418224 -767810 -96690 127790
42984 127790 -18847 -118414 68855 380367 510459 375198 163233 92960 220848 482362
42974 482362 801987 1092662 1229523 1137277 887396 627945 433772 298033 234037 278636
42964 278636 409628 568701 755488 983176 1162609 1189118 1150705 1259774 1519263 1647987
42954 1647987 1449426 1090640 868451 819563 719085 396880 -64519 -394872 -344674 52386
42944 52386 370565 145307 -527342 -954507 -626668 142477 618283 530016 224389 44172
42934 44172 -30080 -86513 -38343 154417 312916 288624 176754 105169 3231 -216120 -396475
42923 -396475 -299820 27063 252397 145527 -156691 -301347 -90166 309206 522209 359886
42913 359886 13089 -209820 -256491 -284086 -305973 -145566 214909 508007 538280 450025
42903 450025 473715 587864 619351 528932 397030 243670 63893 -45384 18603 208553
42893 208553 413560 596755 697321 556124 165312 -156622 -127195 74671 75056 -90821
42883 -90821 -51747 223523 299724 -20868 -320887 -196017 104781 83819 -188962 -151268
42873 -151268 395333 949314 953733 466135 14636 -14299 313380 639773 642487 297268
42863 297268 -71586 -84083 262218 554464 465861 166615 54428 166860 119495 -346227
42853 -346227 -998791 -1412677 -1429934 -1162113 -707428 -132105 328007 355064 -56337 -494289
42843 -494289 -562789 -294738 -3291 152051 253651 329611 205223 -243754 -807911 -1062726
42833 -1062726 -796948 -265695 41411 -95637 -388182 -351950 162081 822603 1186604 1093215
42823 1093215 674398 152928 -242388 -303359 -4357 375751 463210 155188 -310042 -617466
42813 -617466 -602994 -290114 110324 262464 -2040 -408114 -470836 -86532 319475 343177
42803 343177 74662 -140938 -181597 -132054 22308 336736 618785 575875 289276 182116
42793 182116 387892 491242 135001 -390385 -505764 -147595 165733 76560 -150534 -50322
42783 -50322 397041 741123 581056 -43588 -738015 -1120626 -1120088 -957954 -830228 -649805
42773 -649805 -226711 318553 557464 287740 -146822 -276593 -79385 132698 267465 524130
42763 524130 913683 1106305 909994 576682 403272 287578 -29418 -462594 -662808 -531512
42753 -531512 -341935 -331866 -434780 -464964 -353895 -140819 87111 186997 71829 -103973
42743 -103973 -55931 233727 403849 143141 -393704 -756437 -709513 -424680 -213793 -223539
42733 -223539 -395462 -587652 -672207 -588117 -379470 -175940 -83184 -70791 -3625 179485
42723 179485 362036 407910 388794 500274 726220 788808 551198 268076 230816 337123
42713 337123 291309 99712 15785 54485 -32335 -261367 -318141 -78653 168101 203942 191747
42702 191747 254917 163813 -180035 -314557 210290 1044648 1373855 970173 402424 202084
42692 202084 320222 486680 622604 719965 716477 700885 898520 1236188 1250023 696361
42682 696361 -10849 -265551 13204 388917 473026 238080 -90076 -208519 76875 612531
42672 612531 949003 836120 531783 393175 334999 23567 -499176 -783998 -590887 -180883
42662 -180883 103035 231801 316850 317105 149474 -71532 -135328 -10081 157014 273620
42652 273620 383487 520546 616448 597993 495529 388126 272263 75250 -152747 -145615
42642 -145615 317212 1035616 1469144 1323826 899147 661338 628648 480166 185788 111653
42632 111653 405903 682517 576942 323736 433834 955210 1413555 1439641 1124644 731722
42622 731722 369883 62942 -110007 -109479 -17608 112085 360794 768246 1161888 1313308
42612 1313308 1199122 972825 736126 487734 270022 193952 263063 285729 53336 -416060
42602 -416060 -850548 -942865 -617158 -118257 176082 87127 -201512 -335536 -148504 184387
42592 184387 334020 138089 -240422 -448770 -267726 176601 563029 739822 832144 940038
42582 940038 907308 580771 177016 97696 375106 604347 529606 402844 548988 821291
42572 821291 811771 487020 260707 405875 694042 743069 523320 358979 515174 900197
42562 900197 1155118 1003983 543373 166453 145977 351786 479769 466409 485743 596581
42552 596581 660407 637437 686426 867655 1002589 976887 945907 1054042 1176361 1173938 1200118
42541 1200118 1451742 1756631 1745802 1382797 1008311 870442 903912 978952 1062783 1085298
42531 1085298 938704 691392 529424 410786 92961 -366230 -485438 5930 680801
42522 680801 879414 495693 4443 -160241 56369 507229 998382 1260912 1097290 654429
42512 654429 330656 334039 509411 633653 667368 650022 560021 388650 194705 3087
42502 3087 -196900 -299377 -134303 235743 496248 500897 483481 646275 753801 437548
42492 437548 -214515 -698883 -708048 -417835 -147435 -9706 23875 -42185 -181249 -276140
42482 -276140 -211736 42089 453140 890017 1071869 797577 304613 141874 514034 962231
42472 962231 905365 324066 -324742 -705718 -820332 -743220 -507530 -252701 -144233 -76506
42462 -76506 231826 738681 994199 744626 332662 221552 339919 244106 -183251 -574647
42452 -574647 -633600 -510681 -503919 -638048 -712763 -605615 -354685 -39142 266320 465711
42442 465711 483645 298504 -123153 -814073 -1604319 -2048349 -1783795 -974778 -209053 100127
42432 100127 56170 -19906 -24037 -58217 -150568 -218267 -255863 -335647 -402561 -268740 116584
42421 116584 546846 793520 836765 778894 659943 479276 296779 168787 37721 -190882
42411 -190882 -495659 -756333 -874721 -801347 -530311 -178879 26077 -10731 -109213 -65756
42401 -65756 61877 128795 233973 552843 883384 760729 137575 -407872 -357315 128363
42391 128363 520105 625675 689000 920682 1231185 1405956 1328682 1037452 706785 535215
42381 535215 530174 481969 270051 70721 99789 285133 404235 429516 494149 598586 602842
42370 602842 453449 181326 -245060 -785681 -1127421 -968788 -503400 -256660 -385661 -510364
42360 -510364 -351798 -147591 -203438 -361344 -245119 150451 441991 367146 63367 -155309
42350 -155309 -129899 43729 144310 44766 -172525 -343627 -414031 -388181 -171006 300837
42340 300837 792076 947007 800612 776732 1040393 1210186 946859 479236 207409 77250
42330 77250 -217051 -597393 -658936 -326483 -8312 -18906 -189929 -161229 187869 666207
42320 666207 926927 693453 66074 -408988 -264387 265736 451523 -26379 -671387 -797564
42310 -797564 -304791 314052 517435 133917 -541401 -930215 -676801 -121180 -19220 -599078
42300 -599078 -1173495 -989730 -225623 278937 161742 -93374 465 225355 117154 -198500
42290 -198500 -113396 557832 1219577 1224680 670768 191699 121537 210961 150643 3466 -29120
42279 -29120 33955 78994 171556 404597 597218 466449 55866 -312210 -501773 -663126
42269 -663126 -839325 -825558 -550664 -278761 -224119 -218700 -3895 340729 519366 439926
42259 439926 263107 118147 3266 -84510 -137860 -226714 -394661 -484207 -272607 185044
42249 185044 518704 416660 -55979 -534861 -678444 -431254 -61042 86225 -39599 -107372
42239 -107372 190314 706628 992709 863635 601744 542271 662583 714560 612042 503321
42229 503321 519708 617873 669333 583668 338108 1182 -248721 -239795 7190 299474 524374
42218 524374 762246 1062831 1256421 1173363 952044 870564 900105 742515 385358 263636
42208 263636 640404 1120643 1114405 591274 17395 -306868 -428927 -352482 36184 577232
42198 577232 828650 625405 288391 111264 2434 -165288 -234905 -92724 7790 -196416
42188 -196416 -531561 -648524 -548026 -499235 -569385 -564193 -349149 43876 530791 952539
42178 952539 1075626 866784 607358 479273 257247 -257944 -733804 -662070 -59298 620304
42168 620304 1113556 1418051 1406428 964756 446500 357386 571292 500154 96104 -45131
42158 -45131 241976 304754 -255712 -849145 -794326 -368374 -293331 -601938 -734088 -506621
42148 -506621 -273534 -215149 -108755 175796 483627 727779 983604 1179532 1104615 790686
42138 790686 520362 388496 195812 -149272 -438746 -460017 -220271 172459 595069 849877
42128 849877 790651 543324 350485 202264 -85548 -440736 -552251 -382694 -288090 -483563
42118 -483563 -719851 -674095 -385231 -111074 9356 -30356 -200735 -348187 -200872 327885
42108 327885 960141 1318426 1258232 873709 373310 46860 120069 484191 767411 807581
42098 807581 821170 959368 1005384 775938 536290 633304 894284 823355 346434 -58362
42088 -58362 -38789 181153 179616 -99917 -363248 -390723 -251842 -139518 -130710 -141539 -70422
42077 -70422 56494 110160 17115 -166454 -346186 -469082 -487173 -356794 -133032 55562
42067 55562 201176 439911 764438 876729 532364 -59663 -405718 -284433 40594 171109
42057 171109 -3259 -244815 -229749 125482 540147 632205 362025 84348 57999 92070
42047 92070 -119513 -489948 -660848 -521655 -277788 -57684 184537 374812 330039 155858
42037 155858 233533 624402 857302 580121 103363 -55804 77429 72800 -151551 -202512
42027 -202512 106895 391214 228515 -235866 -513839 -446427 -336977 -427594 -537990 -366586
42017 -366586 35079 313343 292739 185555 262649 496067 657193 642935 543444 467756
42007 467756 474856 619109 864992 977957 719514 187199 -237995 -342402 -292156 -325727
41997 -325727 -432598 -456784 -351996 -190972 -47791 696 -116875 -315770 -332291 -21289
41987 -21289 398972 566162 407275 218744 320173 717754 1110439 1193776 981767 811317
41977 811317 945806 1225957 1293991 1132697 1096865 1346429 1577829 1489729 1197693 939718
41967 939718 682537 359578 215717 463106 782165 684162 301454 274682 794436 1269136
41957 1269136 1116747 451432 -228240 -633582 -697696 -358872 283108 797086 783041 352957
41947 352957 -2334 12851 246214 368050 222248 -74880 -269624 -212388 1238 187626
41937 187626 346618 609501 910756 955595 611345 106106 -286808 -543580 -736007 -826442
41927 -826442 -795402 -739513 -642216 -299276 273523 617382 364398 -185501 -398025 -106100
41917 -106100 287607 428899 343808 171225 -44064 -222275 -237305 -135028 -122287 -279728
41907 -279728 -496369 -686955 -832085 -838293 -663122 -549983 -765487 -1089564 -1001321 -464508
41897 -464508 -55674 -112584 -229726 76693 623517 904097 842524 707462 502427 623
41887 623 -686601 -1114945 -1136944 -1068040 -1114284 -1055718 -683118 -189262 122066 251029 374673
41876 374673 514029 585713 624650 686129 636060 317791 -124062 -361673 -327161 -273392 -348203
41865 -348203 -384009 -239616 -96165 -178699 -344247 -232456 220323 687250 894036 900820
41855 900820 858799 738711 492151 319438 542221 1247079 2197798 3034723 3428459 3165924
41845 3165924 2344484 1466245 1085504 1283308 1646411 1790412 1714227 1598628 1490704 1328375
41835 1328375 1114407 908599 737781 618772 576592 557356 439638 222770 76305 98474
41825 98474 163212 139074 127008 310551 657531 931860 944184 674299 241505 -114943
41815 -114943 -148699 119524 337404 220653 -73849 -180207 -32892 109550 87599 -1824
41805 -1824 -65867 -139171 -195232 -104232 138117 376017 558135 785671 1023625 1068736 946477
41794 946477 1014997 1433399 1816445 1739033 1350378 1097345 1006630 723651 236042 33940
41784 33940 376145 829275 842761 489530 279306 409493 588567 565887 460596 449900
41774 449900 410423 84414 -514584 -1053378 -1230080 -1068405 -846223 -782307 -819452 -730613
41764 -730613 -445196 -202592 -280637 -599533 -751285 -471161 66245 508624 736157 866010
41754 866010 969686 992679 914089 792028 652534 497781 402100 402582 316512 -58551 -510406
41743 -510406 -499047 138751 853218 1036031 806558 782424 1167712 1495706 1348661 944742
41733 944742 781997 952813 1105011 980086 707588 535522 477197 348027 75294 -150489
41723 -150489 -73505 310803 703037 808636 654059 497597 438625 287040 -62836 -275741
41713 -275741 133586 1096921 1826288 1586291 564242 -268084 -203968 485369 980375 855715
41703 855715 392977 73629 35918 76538 -4577 -169558 -189132 98820 535631 721681
41693 721681 462824 32347 -194151 -231678 -314567 -345518 19400 683728 1025362 729935
41683 729935 245379 77689 85468 -60950 -126820 327180 1048168 1275824 831530 371498
41673 371498 425141 763718 932929 879738 750938 516089 155281 -100749 -67834 89429
41663 89429 140274 141785 233961 313834 220804 61253 51077 187283 336083 465368 508805
41652 508805 208092 -536836 -1292961 -1469650 -1032822 -494313 -210188 -50107 199982 466540
41642 466540 559327 459202 285656 142304 102513 218083 459231 736215 1003527 1241233
41632 1241233 1353594 1242846 995641 844593 918353 1153209 1436178 1662227 1643965 1188084
41622 1188084 377092 -365974 -630968 -394355 26241 338243 523378 736365 1024278
41613 1024278 1224082 1178536 971273 807572 708097 550012 433080 685057 1331086 1863518
41603 1863518 1835009 1446243 1191483 1115389 864459 378100 30269 40604 202101 316826
41593 316826 485392 773916 952945 808851 455511 141986 -4434 111492 589893 1256345
41583 1256345 1638903 1510751 1219801 1189557 1326004 1259346 970627 770529 769061 786183
41573 786183 754773 797089 864318 715110 391904 348660 854664 1515105 1666676 1142534
41563 1142534 419630 56413 167211 442540 535912 383698 211668 261950 514572 719329
41553 719329 725400 696230 893978 1279486 1465359 1139766 460281 -82971 -183332 11367
41543 11367 162791 136694 24033 -114202 -308552 -488705 -456641 -166514 128400 169327
41533 169327 39483 46547 298070 565211 585248 356909 87317 -42141 9476 176377
41523 176377 348711 443584 490992 631126 951280 1318440 1449954 1201904 745477 392688
41513 392688 268802 236746 139158 -2593 -83545 -94640 -99312 -110632 -120784 -187457 -321721
41502 -321721 -319360 80881 805020 1388817 1440783 1060981 694180 644776 832801 958112
41492 958112 795664 365749 -90741 -316555 -280811 -199494 -264174 -387780 -298615 116107
41482 116107 636855 928540 903846 800324 856945 988203 912997 588376 301685 238104
41472 238104 191772 -73345 -373852 -351356 -64085 54763 -163777 -411066 -395086 -161688
41462 -161688 189918 681272 1127399 1078632 459435 -84018 71683 671771 944048 642529
41452 642529 212101 -4108 -142647 -321865 -310915 50442 495505 694947 711295 801474
41442 801474 962192 977182 825582 761992 967012 1294511 1422388 1178818 694427 268243
41432 268243 101127 172397 369714 641219 923831 1022580 776430 361881 222196 579486
41422 579486 1136717 1376793 1090386 523358 62481 -120076 -111970 -48015 42123 139459
41412 139459 105353 -164295 -463625 -418634 -29420 195967 -101006 -560371 -546889 -27817
41402 -27817 412267 405670 202461 149598 205281 183599 127544 158090 202527 151618 103044
41391 103044 191225 328719 365501 370747 497727 666685 641293 371648 38537 -203705
41381 -203705 -325529 -310050 -160184 -4383 5489 -93373 -140215 -120680 -176930 -332037 -410635
41370 -410635 -303783 -136473 -70307 -80964 -56607 -11781 -45065 -117710 -33948 303150 714786
41359 714786 919629 851621 711773 703256 824595 971531 1120544 1290481 1405649 1358620
41349 1358620 1181480 1001104 837104 604060 309399 64086 -130288 -412848 -820238
41340 -820238 -1184548 -1340688 -1274420 -1018723 -603407 -176455 49294 77295 136197 299812
41330 299812 357322 213663 121306 266596 396922 184239 -243779 -479653 -378399 -71715
41320 -71715 389865 976369 1369757 1222920 747071 547085 761658 845663 411588 -161539
41310 -161539 -278573 58792 365154 365133 192552 41850 -86 162269 548640 877837
41300 877837 756790 197109 -316458 -408304 -248880 -242645 -467470 -677873 -776824 -968392
41290 -968392 -1355629 -1646432 -1480380 -925571 -408431 -182536 -109290 6876 125704 132982
41280 132982 73101 44816 35374 40577 179089 461260 601575 346569 -116654 -387367 -407845
41269 -407845 -442400 -538306 -431971 -80242 132204 -71319 -443669 -582738 -447886 -235733
41259 -235733 28591 447234 925378 1200622 1148680 836422 357309 -145351 -385320 -166649
41249 -166649 298768 577763 534808 404041 325476 133079 -259527 -558129 -434495 -15217
41239 -15217 250544 159267 -60805 -147477 -146823 -238687 -394326 -406595 -207151 43758 216405
41228 216405 381169 606410 725890 508180 31552 -315484 -284941 -75614 -67164 -335165
41218 -335165 -581409 -533684 -263940 -35528 60000 159881 326361 370163 120438 -241560
41208 -241560 -348819 -139822 70038 72165 31648 109338 130232 -61037 -173026 161570
41198 161570 725344 931687 678381 439217 408582 156528 -558567 -1168573 -983857 -171874
41188 -171874 474401 558519 369811 255103 222467 218528 350808 659463 943056 964383
41178 964383 679974 225352 -173331 -293134 -115972 83033 46284 -112163 -85426 163080
41168 163080 398261 520440 628816 681004 483068 111056 -43057 174218 402753 259843
41158 259843 -167397 -533896 -680824 -632301 -396883 -59513 119637 3101 -158129 -44104
41148 -44104 260554 412079 342925 315861 443707 485098 223923 -192832 -442770 -403136
41138 -403136 -208898 -34283 63549 126988 224593 407567 685959 997575 1189549 1090234
41128 1090234 679118 161014 -226153 -451238 -601341 -594156 -234322 365643 700601 427027
41118 427027 -180969 -570228 -569053 -451271 -440765 -459216 -375258 -236862 -163721 -158290 -90239
41107 -90239 188362 663218 1020108 846231 164456 -395506 -271004 278930 466595 16187
41097 16187 -507121 -520348 -160805 51210 -32364 -111902 45666 343459 566636 620505
41087 620505 540802 400621 222506 -39426 -354670 -476550 -165023 385398 612327 260522
41077 260522 -245915 -342148 -30270 229400 164274 -94359 -322699 -387609 -184440 252898
41067 252898 591912 499942 127634 -46885 101307 191840 -34973 -341058 -440561 -450966
41057 -450966 -582696 -665981 -375827 216999 690108 821016 785216 804477 872926 883563
41047 883563 808497 672561 491121 298840 152367 81289 94044 193542 311788 310924 166256
41036 166256 52549 93888 138202 -65 -166663 -35672 361197 599550 439264 137810
41026 137810 44465 150480 239140 251189 247776 173216 -65210 -362017 -514727 -520246 -531363
41015 -531363 -537343 -347451 54694 375943 358933 108869 -59936 -9877 115892 129502
41005 129502 24365 -40857 83711 401014 763207 968629 873699 487193 42937 -60534
40995 -60534 422216 1224893 1681258 1393290 724778 411309 682877 1017713 850738 283404
40985 283404 -121659 -111730 -28348 -292330 -828613 -1159007 -986716 -520814 -177409 -79179
40975 -79179 11461 285005 591734 669048 540933 491536 646566 776199 602752 173411
40965 173411 -198075 -303014 -236547 -224755 -329124 -370646 -155616 257011 598115 726404
40955 726404 794487 959044 1065096 859148 452116 258262 427979 649445 620113 395134
40945 395134 99377 -350664 -942119 -1305810 -1177604 -891223 -931252 -1149642 -988730 -439539
40935 -439539 -136497 -356766 -557230 -233989 301758 467417 300005 241438 318455 167490
40925 167490 -227897 -450393 -359838 -333103 -613327 -887635 -782122 -420332 -178761 -136975
40915 -136975 -86960 70562 243570 385064 545423 698731 722881 580384 383401 250418
40905 250418 176672 60298 -164398 -386057 -331470 140990 738982 927266 537862 7222
40895 7222 -151609 73420 350965 534959 700270 769529 529818 68603 -197547 -82825
40885 -82825 104044 60075 -38886 151821 578648 871849 880644 780330 681185 493126 253924
40874 253924 252558 625227 1058060 1135494 855147 556652 414296 271162 1463 -226921
40864 -226921 -200282 2519 126422 126115 211123 468431 646672 470409 60900 -155257
40854 -155257 43242 429637 654969 648117 553868 406686 110012 -252816 -335980 74731
40844 74731 694737 947385 542551 -244913 -860818 -949043 -573814 -95816 143379 110899
40834 110899 94740 354412 759979 908198 632714 231686 77095 153652 171066 28022
40824 28022 -75553 34298 303084 602766 862117 979757 852362 623396 671078 1135694
40814 1135694 1635783 1709305 1406972 1151870 1096839 992508 721666 560261 709749 894179
40804 894179 732948 319418 84399 170797 294017 230223 95823 39379 -13482 -99879
40794 -99879 5322 422230 757850 494172 -236046 -709758 -580290 -339653 -512853 -789668
40784 -789668 -487674 319075 788513 503344 54644 137629 583572 758719 554384 391213
40774 391213 420007 354220 121874 92626 463156 888753 987421 831218 651915 403893
40764 403893 -18960 -392926 -408448 -170743 -61278 -149449 -113784 220002 591968 670455
40754 670455 467111 253945 208145 264975 270635 199809 185143 297282 357737 151905 -162568
40743 -162568 -147695 278544 627157 534429 344792 565415 999929 1007307 510857 96983
40733 96983 70933 97715 -26155 58853 545736 911781 650364 104399 -32663 278435
40723 278435 539286 583407 644690 683898 369306 -225854 -569568 -467390 -330656 -449135
40713 -449135 -542518 -308696 68689 286336 381192 487581 511825 412094 456642 798545
40703 798545 1092340 973855 674074 680637 968173 1060002 755908 321314 3554 -173505
40693 -173505 -147581 170405 562777 622224 308044 12046 -4291 146925 354585 666844
40683 666844 950001 885398 540006 470855 942814 1460306 1450413 1039599 734214 675628
40673 675628 710459 915128 1451302 2025599 2084362 1561317 942881 566945 330059 133240
40663 133240 108291 249684 279732 105101 39003 334581 802138 1107781 1175533 1092497
40653 1092497 900711 708592 734099 979372 1102500 878728 570024 558955 817375 1033462
40643 1033462 1082342 1049643 943320 734598 584799 675726 865466 853138 657705 583846
40633 583846 700905 718882 469995 186904 158260 368383 625447 812328 849942 640118
40623 640118 267798 97428 404147 957295 1196045 848237 220545 -171863 -134913 134583
40613 134583 410645 680674 967520 1089318 838427 387231 240640 639925 1216495 1440767
40603 1440767 1257765 1028561 963113 934670 837705 790697 879011 957974 863896 647533 467981
40592 467981 392936 410453 502158 593129 552512 363963 202744 242905 470539 759971 1015378
40581 1015378 1134435 965062 479449 -56712 -269323 -70076 245548 354079 285528 351344
40571 351344 690532 1007778 891926 358954 -106579 -115638 196076 426805 419640 310527
40561 310527 200940 49726 -155775 -365215 -578593 -769139 -742575 -354871 138060 260033
40551 260033 -92624 -506639 -563767 -241176 238190 648960 780447 536041 142184 -38798
40541 -38798 -10106 -113181 -383772 -376792 114560 603358 562954 194334 91831 396514
40531 396514 761018 985444 1184117 1377629 1388391 1183316 954302 810302 685086 566477
40521 566477 539122 590301 618760 614849 607084 514944 316864 240790 459149 717219 656389
40510 656389 403178 379408 590841 634278 427111 344927 498310 463029 -999 -488725
40500 -488725 -563072 -386320 -340318 -393211 -288529 -68476 61813 182939 504490 886433
40490 886433 965670 717032 505892 591925 891086 1191945 1310616 1096466 615597 283378
40480 283378 463008 943444 1167544 979687 763652 799873 917804 925677 956196 1123732
40470 1123732 1187842 895822 425535 148561 113558 94321 33972 92892 295829 465240
40460 465240 534601 639957 841986 1014871 1085271 1136601 1185597 1105649 898409 786501
40450 786501 853911 840789 554734 283272 458585 1011965 1416237 1364863 1080889 900806
40440 900806 865907 850040 834178 887303 1040817 1296883 1606882 1774998 1592461 1160404
40430 1160404 853163 848263 938936 944110 1005847 1265085 1538327 1612302 1603897 1683377 1669303
40419 1669303 1310684 807550 598995 724612 858315 930339 1206749 1689941 1939280 1668510
40409 1668510 1130113 723282 560302 581128 741228 889079 794919 519020 430662 639788
40399 639788 758721 510148 215014 287473 535443 443412 -2069 -258260 18049 576283
40389 576283 987060 1106620 1037392 914580 863614 969847 1168984 1290592 1265674 1164409
40379 1164409 1005198 701582 280096 -5694 69769 389228 572948 408637 114254 76067
40369 76067 346041 555391 424255 196097 324082 794054 1086214 879907 471604 310018
40359 310018 398545 427746 286441 115545 -15108 -134809 -131161 160012 591166 774225
40349 774225 633331 571698 874528 1203609 1013276 350023 -144909 -87600 153932 42709
40339 42709 -328538 -406936 -31697 355371 429378 431719 641419 839694 740985 622193 939319
40328 939319 1486482 1586319 1124818 753071 904463 1207799 1149862 801894 535818 440363
40318 440363 394306 377515 350403 134826 -231574 -319190 149459 845059 1268929 1366651
40308 1366651 1346949 1204987 879735 634333 784516 1198082 1494301 1588417 1633730 1612306
40298 1612306 1428021 1233557 1210175 1196406 1002242 882258 1146903 1493185 1364036 866838
40288 866838 645161 850086 952680 679452 437863 588061 890902 957638 770137 521346
40278 521346 366159 489584 953708 1333739 1042580 215005 -295512 -63208 344055 287458
40268 287458 -30438 -48256 241712 420853 355020 239431 151100 35714 -11447 141273
40258 141273 398306 617749 879490 1241535 1435360 1190812 707238 410218 357019 270155
40248 270155 76046 8314 180310 416803 575756 753700 1063106 1381666 1434081 1088221
40238 1088221 561492 301982 539560 959321 1023390 644366 271647 243765 402188 509682
40228 509682 668658 1024694 1372351 1432089 1302914 1268956 1321619 1246210 1069913 1056824
40218 1056824 1298264 1605042 1774599 1729270 1464967 1102000 901365 987499 1134525 1052861
40208 1052861 786308 593153 556067 577106 651251 848045 1081796 1182689 1173947 1241431
40198 1241431 1448574 1672444 1768039 1622771 1151678 446656 -163359 -401582 -299387 -14059
40188 -14059 413141 898166 1155588 1034789 831846 891455 1048326 893879 505020 413795
40178 413795 807255 1212603 1133081 648631 203519 64707 184512 418245 687313 987773
40168 987773 1327627 1638408 1780699 1710606 1575617 1539500 1587209 1611458 1586378 1534660 1462597
40157 1462597 1463947 1693018 2039918 2067711 1574296 1016926 991642 1410461 1626704 1359766
40147 1359766 1058607 1232276 1767355 2106233 1906842 1357094 918308 855573 1025666 1143826
40137 1143826 1204731 1444966 1863916 2098449 1959245 1787378 1991556 2488574 2931397 3246165
40127 3246165 3541658 3677546 3380726 2715794 2049936 1613432 1431756 1563300 1998079
40118 1998079 2411817 2440001 2147188 1849637 1578158 1163022 774893 865540 1517391 2281801
40108 2281801 2734898 2842152 2759268 2638078 2647957 2855506 3097178 3266679 3595535 4263995
40098 4263995 4920719 5117747 5093307 5503347 6412530 7219063 7659266 8229808 9432062
40089 9432062 11189199 13229382 15480956 17802051 19808405 21290484 22415682 23230517
40081 23230517 23297213 22110698 19674778 16534601 13453957 11063091 9488531 8288936
40073 8288936 7049078 5957793 5419490 5272350 4986020 4549931 4461535 4790949 4994834
40064 4994834 4817230 4653601 4774057 4865976 4654447 4352036 4162808 3918786 3538995 3295206
40054 3295206 3291579 3214061 2912373 2691044 2709260 2658040 2385366 2278742 2626854 3116693
40044 3116693 3366740 3474111 3634125 3682973 3432397 3063651 2834101 2758225 2841301 3204369
40034 3204369 3723757 3981915 3811225 3481656 3228018 3069290 3137338 3579381 4092717 4230390
40024 4230390 4166831 4383070 4664228 4403512 3874052 3990492 4689965 4893120 4347652 4079058
40014 4079058 4585824 5084384 5116128 5350163 6066527 6428732 6133621 6188734 7072143 7756527
40004 7756527 7653155 7818124 8986423 10184361 10707658 11627013 13702424 15700636 16642350
39995 16642350 17811951 20491620 23685240 26358355 29791360 35043958 40270682 43608761
39987 43608761 46547560 51146587 56511671 62028643 71104147 86629921 106260413 129252602
39979 129252602 163867942 215654172 267442568 285067224 251567202 187654390 129959234
39972 129959234 95434310 75795964 59927362 47657201 41656790 38754424 34710359
39965 34710359 30260236 27514897 25225844 21603273 17973695 16055762 14653440 12175879
39957 12175879 9771828 9016440 8801634 7387989 5599969 5204328 5708503 5457011 4646146
39948 4646146 4651833 5272567 5094844 4044615 3383325 3485280 3529665 3207551 3049991 3161445
39938 3161445 3099027 2951545 3243096 3805005 3900553 3458809 3179116 3427769 3894100 4269684
39928 4269684 4494054 4460041 4216499 4310906 5232700 6674445 7946695 8845740 9474474
39919 9474474 9577189 8857911 7711424 6820698 6169244 5215886 3950464 3019346 2783381
39910 2783381 2883522 2795184 2331595 1622740 1020700 929855 1329783 1635420 1436578 1118416
39900 1118416 1256517 1682573 1775189 1485616 1383495 1719866 2089398 2119623 1986954 2098064
39890 2098064 2582159 3171069 3387587 2948577 2181896 1814709 2075625 2318434 1913643
39881 1913643 1163884 822101 1010322 1246027 1341923 1594374 2128178 2679020 3046707 3224382
39871 3224382 3090435 2540007 1948309 1916857 2442530 2859011 2743094 2400524 2295967 2449640
39861 2449640 2589449 2518556 2152879 1533273 956208 774521 929446 975282 669397 230467
39851 230467 -59181 -145834 -11864 384383 798319 751500 177213 -329613 -227456 289903
39841 289903 671557 818697 1077278 1541892 1855150 1794267 1664299 1868667 2328698 2631372
39831 2631372 2653195 2695821 2940614 3101031 2852690 2367909 2073401 2010291 1860030 1578713
39821 1578713 1505994 1713678 1751935 1332987 834244 738137 923523 946913 740093 559620
39811 559620 476135 411396 498453 878050 1267817 1278753 1071970 1131237 1433350 1470070 1128475
39800 1128475 887092 986718 1066159 897876 863889 1281016 1749008 1666474 1066268 481156
39790 481156 228488 251691 459300 780575 1007917 994639 967316 1305174 2015110 2675432
39780 2675432 2870072 2483332 1671674 796387 295517 336111 614363 726071 671635 734185
39770 734185 930092 940769 647542 388586 496188 812287 901335 636038 349281 404537
39760 404537 770994 1087847 1081003 836253 644300 634894 661086 568736 465630 598439 1000859
39749 1000859 1409179 1565293 1493734 1407212 1418715 1456230 1440311 1425337 1503908 1634002 1653213
39738 1653213 1476831 1227486 1137460 1337564 1743992 2128601 2311878 2335144 2437423 2795246
39728 2795246 3279152 3551932 3431875 3064155 2700014 2435497 2246682 2133236 2063876 1880864
39718 1880864 1471443 1012077 835038 1012536 1247866 1253333 1095934 1072041 1339597 1775455
39708 1775455 2132191 2242296 2108742 1887981 1780777 1870881 2052367 2150343 2121740 2098217
39698 2098217 2201939 2356031 2358156 2162538 1991899 2074455 2337428 2509868 2508654 2534330
39688 2534330 2734336 2965974 3022490 2939770 2897946 2911107 2819562 2582797 2408843 2531918
39678 2531918 2937871 3353396 3497750 3363781 3253109 3477073 4020153 4584624 4958721
39669 4958721 5193530 5399878 5584736 5796213 6226461 6990388 7939488 8868138 9791855
39660 9791855 10866608 12156616 13641347 15312057 17078332 18734453 20270268 22134944
39652 22134944 24963141 29074051 34375556 40611468 47447156 54337617 60436306 64539042
39644 64539042 65143259 61112599 52845848 42625149 33245981 26180171 21250557 17767614
39636 17767614 15340283 13646467 12213634 10816635 9668891 8906008 8212649 7250575
39628 7250575 6174008 5414166 5129529 5106190 5058236 4847778 4552573 4459423 4832073 5547892
39618 5547892 6111024 6141591 5719995 5188960 4801332 4636818 4670128 4829574 5134897 5771037
39608 5771037 6789930 7748365 7968666 7241526 5990800 4708027 3577720 2712377 2288563
39599 2288563 2230121 2148621 1857931 1616710 1631170 1691932 1596375 1561203 1843692 2253330
39589 2253330 2429540 2360242 2252574 2134798 1989977 2047956 2463921 2852057 2643614 1884840
39579 1884840 1236334 1148037 1423876 1669684 1810326 2018296 2394017 2894801 3442676 3961936
39569 3961936 4362029 4586551 4726257 5059620 5849951 7006975 8125015 9071676 10313902
39560 10313902 12284373 14715866 17295874 20747200 26023397 31994980 35169441 32888221
39552 32888221 26311025 19241065 14362847 11612451 9822272 8485569 7585968 6884962
39544 6884962 6135584 5464184 5043356 4751966 4448456 4192633 3963372 3548470 2923162
39535 2923162 2361141 2007386 1738746 1575814 1759163 2225821 2480707 2227840 1715972
39526 1715972 1268084 928300 767766 991301 1430236 1464494 860356 230669 224515 663808
39516 663808 932827 837633 589135 290910 -4682 -17101 397383 794056 634310 116254
39506 116254 -48131 371292 891601 1080459 1019275 920805 779444 592280 548449 757251
39496 757251 1009093 992581 635102 155751 -118095 2061 368320 591117 480096 303812
39486 303812 420974 765179 956820 854105 700381 737566 941877 1151124 1215719 1031549
39476 1031549 668265 454055 666746 1123630 1335773 1099451 689447 445954 438710 582954
39466 582954 799456 959880 931937 809918 885351 1250512 1606385 1599821 1229593 834290
39456 834290 787496 1218090 1859290 2166150 1816897 1147480 832506 1057483 1305858 1111639
39446 1111639 691550 549363 715150 769103 520131 273463 375978 781862 1171668 1313339
39436 1313339 1210315 1028051 959888 1073205 1227464 1217946 1034032 887746 944410 1115766
39426 1115766 1189719 1102153 1002615 1084002 1416948 1928983 2456867 2791837 2752541 2314103
39416 2314103 1685898 1195667 1031320 1105893 1217185 1308798 1483072 1755072 1935014 1858774
39406 1858774 1634736 1496236 1453169 1304048 1025907 896856 1068335 1235140 1009393 497115
39396 497115 164778 169136 209046 114988 153564 507998 843547 776820 510872 545364 900318
39385 900318 1110600 957465 736941 754690 989425 1337778 1750086 1988654 1705515 983942
39375 983942 398425 285188 343646 238290 165696 426955 817266 938101 846671 874875
39365 874875 993876 896180 602707 463787 593974 785039 953351 1198998 1436457 1454985
39355 1454985 1348782 1382136 1425767 1110882 604627 558720 1075939 1410470 1066986 577264
39345 577264 689775 1315009 1853232 2125528 2312704 2306685 1885747 1383944 1422257 1947812
39335 1947812 2218010 1844422 1227366 805296 523308 330409 574262 1419381 2332327
39326 2332327 2714507 2774029 3202479 4124844 4930469 5146180 4961355 4765156 4604861 4325405
39316 4325405 3914497 3439689 2864730 2197335 1677484 1563950 1805699 2126786 2362750
39307 2362750 2513978 2550817 2424140 2256620 2268654 2466378 2616507 2581745 2466519 2367267
39297 2367267 2218292 2000148 1865983 1898543 1953854 1931419 1984826 2235173 2493019 2565025
39287 2565025 2640175 2983883 3391513 3441373 3284865 3634645 4775022 6063063 6736339
39278 6736339 6833616 6895820 7046660 6936091 6543500 6457083 7114010 8127010 8705249 8589694
39268 8589694 8250949 8189998 8364611 8434210 8302853 8123952 7877244 7317633 6431999 5609157
39258 5609157 5135808 4792206 4247062 3632723 3336607 3360307 3345022 3187551 3117827 3104478
39248 3104478 2752928 2027516 1535536 1695503 2055367 1937035 1444882 1260007 1598581
39239 1598581 1973265 1984378 1793244 1685024 1634337 1529714 1481863 1648106 1961075 2239240
39229 2239240 2418625 2523715 2544290 2473661 2363903 2255744 2158231 2132521 2230858 2305122
39219 2305122 2095011 1623255 1285997 1364693 1631182 1687470 1578016 1747929 2377987 3066478
39209 3066478 3328718 3205903 3149058 3406617 3808065 4158883 4522921 4935093 5119413 4839938
39199 4839938 4385603 4282507 4536732 4621171 4320456 4091946 4313087 4635434 4529835 4128893
39189 4128893 3996010 4271336 4600279 4787336 4955116 5104479 5102719 5146561 5661253 6627411
39179 6627411 7540199 8152281 8703539 9284907 9611477 9668704 9944639 10697400 11615115 12540967
39169 12540967 13828990 15576905 17383094 19475035 22973855 27861588 31657678 31925722
39161 31925722 29745859 28664063 29886335 30527847 27601741 22026920 17170084 14631752
39153 14631752 13308697 11975170 10757352 9928273 9003485 7700499 6586935 6049446
39145 6049446 5526793 4495428 3472489 3239605 3604970 3744095 3418413 3084062 3016822
39136 3016822 3082288 3270789 3724864 4197206 4147397 3522728 2880207 2569720 2346289 2021321
39126 2021321 1933780 2367617 2924679 2970129 2462545 1894654 1581133 1459045 1498456 1820907
39116 1820907 2344992 2717683 2750785 2643600 2633705 2670685 2587720 2389601 2204813 2114206
39106 2114206 2176834 2460940 2874486 3119835 3039063 2896665 3069660 3511376 3792324 3682181
39096 3682181 3411330 3269402 3220894 3109168 3025879 3203860 3648744 4157389 4655303 5200074
39086 5200074 5614785 5484128 4726542 3886839 3538370 3555373 3336137 2673057 1993516 1687747
39076 1687747 1616968 1486533 1345643 1391494 1515363 1421661 1096366 815430 730464 760850
39066 760850 873683 1131641 1423448 1483729 1288703 1135557 1202654 1330954 1408485 1645897
39056 1645897 2183466 2677258 2644980 2105782 1537160 1259779 1198197 1228623 1391070 1652160
39046 1652160 1772477 1609815 1363785 1323584 1483562 1577200 1430569 1144206 951720 995266
39036 995266 1217617 1398481 1316068 941903 482541 206642 245429 555166 994153 1378507
39026 1378507 1522063 1327227 869739 361208 5833 -105495 20162 338932 755370
39017 755370 1063060 1031469 682161 415218 640185 1212920 1457733 934490 29524 -467151
39007 -467151 -287780 106672 234536 149903 142620 204833 123031 -34827 106543 688135
38997 688135 1296534 1370705 851359 265494 145132 481470 846945 979040 1050244 1300412
38987 1300412 1602904 1614838 1285758 968038 979517 1249144 1467326 1429586 1159558 843104
38977 843104 721558 905704 1209703 1307779 1129233 934094 917585 954242 877963 791873
38967 791873 874474 1049700 1105939 1015066 865280 586399 59655 -532366 -786798 -572181
38957 -572181 -199983 -37168 -128533 -242716 -130607 277926 787112 1068802 1033022 982023
38947 982023 1200197 1531838 1664289 1674582 1848506 2036301 1763567 1065477 595085 653050
38937 653050 710126 303631 -137495 54898 704610 1038014 816725 560234 692244 1074649
38927 1074649 1433681 1708551 1878356 1903367 1920435 2059474 2029258 1406274 424884 -115028
38917 -115028 58476 293749 53316 -249820 26757 684999 1004180 839699 701835 839244
38907 839244 921995 715892 503288 643569 1121071 1689507 2120691 2188141 1774041 1171531
38897 1171531 946485 1279960 1724380 1825285 1708732 1787097 2118872 2386261 2376545 2177312
38887 2177312 1950729 1777003 1704770 1744326 1818822 1887217 2067032 2447075 2831707 2907708
38877 2907708 2674037 2481577 2595514 2910954 3158054 3190750 2984947 2556662 2050200 1772070
38867 1772070 1933951 2387844 2749180 2769205 2498397 2137505 1866785 1817104 2060210 2545782
38857 2545782 3103452 3561716 3840059 3904383 3690694 3157495 2434095 1849286 1708893 1996568
38847 1996568 2350783 2416436 2196973 1978414 1939980 1985936 1982336 1971553 2030093 2067672 1958168
38836 1958168 1777646 1692999 1659659 1482704 1194145 1081482 1218840 1242630 837378 262415
38826 262415 75950 388449 724077 703572 562804 770093 1311491 1670106 1521251 1167267
38816 1167267 1125385 1460840 1766538 1739532 1492896 1235318 947622 606915 496101 913818
38806 913818 1640836 2087309 2031916 1849818 1879370 1947427 1774265 1501460 1438089 1513174
38796 1513174 1406726 1105157 904562 907863 927293 888062 915938 964727 772617 329912
38786 329912 21926 124300 472713 811399 1142906 1505801 1714613 1609201 1329272 1069981
38776 1069981 788462 437767 262534 497896 914572 1035552 755815 426920 341498 418816
38766 418816 424064 273724 86401 68074 322007 669649 763767 501154 170251 51152
38756 51152 88787 147151 286803 486366 416319 -50072 -369170 39576 838337 1106360
38746 1106360 615867 87739 60700 208867 69025 -200910 -238426 -156175 -286740 -566414
38736 -566414 -653726 -451754 -108629 307784 750026 984514 843556 564487 508787 636997
38726 636997 617309 382477 211278 260629 350277 276506 91065 -17916 29391 142751
38716 142751 186083 165958 276679 629918 967131 903779 504189 276302 477657 821300
38706 821300 1057362 1363482 1821826 2022397 1717405 1435147 1768584 2362922 2371884 1747302
38696 1747302 1272072 1353691 1593453 1614771 1502800 1260489 661535 -64886 -221076 269317
38686 269317 539177 90006 -320325 170450 1113972 1390490 870294 471220 705557 1107762
38676 1107762 1181147 1066027 1004442 827139 359763 -122149 -215805 113756 606694 1015834
38666 1015834 1152378 903250 414399 29058 -128437 -273405 -519761 -618506 -365878 16219
38656 16219 224909 376152 774159 1304709 1483456 1129397 611273 311025 171361 -29026
38646 -29026 -225517 -188996 51948 238457 304318 453432 741729 883748 666647 328165
38636 328165 254750 441317 555989 486060 485900 735802 1073478 1299790 1472803 1689826
38626 1689826 1796503 1589868 1208602 1048352 1268369 1557454 1456108 864896 221937
38617 221937 139831 763211 1514927 1673954 1225429 879962 1161083 1776334 2082197 1875240
38607 1875240 1440399 1067886 873180 915741 1120332 1186352 916261 535696 370328 358549
38597 358549 267683 222479 521985 1035138 1344131 1463870 1802270 2350072 2594848 2432417
38587 2432417 2449441 2932389 3271049 2899852 2292114 2346771 3137014 3940860 4287011 4304707
38577 4304707 4169060 3887888 3669397 3890435 4544871 5171176 5461840 5581868 5804345
38568 5804345 6198660 6775065 7596368 8624400 9709826 10798933 11963413 13312447 15128103
38559 15128103 17874570 21645037 25821504 29860058 34169646 39371763 44816363 48968901
38551 48968901 51442238 53256830 54372835 52407196 45369621 34979410 25544513 19595274
38543 19595274 16101353 13104670 10411375 8874812 8380571 7898978 6985934 6079383 5490959
38534 5490959 5017374 4514418 4096482 3705408 3096128 2338168 1809488 1600158 1391579
38525 1391579 1018088 689882 545460 448652 405249 722063 1468647 2144013 2207477 1700859
38515 1700859 1074889 629536 395740 345644 403309 395256 268747 220121 354212 406730
38505 406730 127858 -239473 -273849 -51109 -28277 -266486 -293753 118276 532375 476780
38495 476780 106979 -110037 -75011 -24445 -21695 87083 285132 363672 308498 346446 526933
38484 526933 588528 395116 224124 387096 738730 825998 468832 -38706 -327097 -346899
38474 -346899 -252163 -40284 440219 1076241 1343123 848145 -61249 -582229 -428931 -164887
38464 -164887 -357456 -772989 -818532 -499276 -346160 -470777 -359543 226905 759398 690347
38454 690347 217619 -123956 -242206 -367549 -464817 -338000 -139642 -175603 -271301 51626
38444 51626 716040 1017156 598474 -38039 -267624 -109807 83282 271393 582415 799128
38434 799128 523805 -188170 -766494 -754652 -261006 227753 304134 -54324 -470987 -509737
38424 -509737 -158126 129386 -1842 -371214 -590274 -625910 -739740 -1005249 -1224917 -1259803
38414 -1259803 -1117201 -769287 -238090 169999 117858 -221479 -276115 149309 589272 598003
38404 598003 361588 355592 666374 985393 1121153 1185760 1307006 1408760 1318145 971148
38394 971148 510801 224622 299323 585220 734169 637377 545650 643035 728572 550109
38384 550109 279309 337900 797420 1254201 1352575 1183871 1052371 1036342 964425 751930
38374 751930 562218 560139 611883 389361 -188871 -754548 -853629 -441834 125025 528859
38364 528859 722419 765627 696828 628149 715861 906580 916165 604329 198438 6989 71081
38353 71081 225369 327698 293023 91867 -125998 -99514 179179 365793 211814 -108082
38343 -108082 -325158 -477595 -695400 -825859 -645043 -282540 -53580 23924 171749 400492
38333 400492 503797 454049 426441 455009 426448 382158 447144 490031 265859 -113366 -295061
38322 -295061 -291446 -482284 -928154 -1184596 -973332 -571614 -313088 -135563 113851 317701
38312 317701 327365 244515 205861 179460 174757 317659 532206 554531 471259 744604 1395124
38301 1395124 1720731 1305291 784264 977276 1670760 1989417 1697276 1344557 1251953 1148256
38291 1148256 856015 610330 542428 450553 248077 107542 33983 -155119 -299692 32829
38281 32829 728648 1025188 588179 95151 256533 761248 806649 324905 -4634 174708
38271 174708 466730 408323 56088 -261745 -378343 -277787 52705 521624 843277 777154
38261 777154 437890 225568 397274 761631 883777 622113 354619 534731 1090193 1482835
38251 1482835 1373193 966928 615361 355965 54279 -223637 -272818 -94444 66541 5079
38241 5079 -284269 -672997 -969216 -995285 -760275 -493897 -365147 -263447 -26330 239602
38231 239602 297868 148566 -12510 -141616 -351499 -579480 -583745 -337299 -104811 -7229
38221 -7229 169274 539094 804911 678091 371336 289151 359950 122455 -495616 -917776
38211 -917776 -627408 180911 907292 1265487 1397349 1435197 1324828 1081603 896155 886374
38201 886374 964167 1020311 1023784 871847 417112 -201858 -522300 -293113 145520 283877
38191 283877 81373 -114447 -145374 -165800 -244176 -247694 -178366 -241334 -441013 -444243 -43313
38180 -43313 510180 841833 896917 826987 642479 252719 -260221 -657800 -796337 -699178
38170 -699178 -440800 -103792 212112 454651 617746 609207 288664 -232922 -525621 -283669
38160 -283669 298092 789726 1023083 1099733 1063939 876460 633809 501234 451780 356784
38150 356784 310097 542125 984139 1250066 1155551 961674 958112 1072454 1098263 1099330 1320190
38139 1320190 1776089 2157809 2151387 1724020 1098490 549765 235182 141767 156008 193379
38129 193379 263762 412075 608134 709965 571671 235628 -15525 83514 447369 698111
38119 698111 613432 363234 211797 179310 168377 234409 467376 726482 787897 701472 711922
38108 711922 849060 891263 747738 580556 498871 424132 347015 442784 797944 1236740
38098 1236740 1536855 1634065 1536885 1250635 875980 576412 365854 135369 -62601 -30931
38088 -30931 189851 270630 72516 -129331 -84702 73956 138336 185662 347260 482448
38078 482448 412105 265962 263696 335305 305489 288049 511776 860895 973033 745662 408023
38067 408023 147276 -3535 20859 242313 419189 286753 -335 -56086 127135 200124
38057 200124 96869 130306 340668 322391 -33151 -171791 314481 946298 966956 418787
38047 418787 28323 137376 331543 176940 -193339 -406981 -371433 -237067 -131362 -166114
38037 -166114 -480393 -1007713 -1345260 -1129172 -482805 138148 500274 735470 929010 881938
38027 881938 450026 -116970 -435931 -472199 -485420 -543529 -407586 31181 496227 676255
38017 676255 608047 511880 436245 307625 185883 188649 241925 180591 46703 10584 30243
38006 30243 -105907 -393703 -590113 -611950 -614884 -594548 -296194 289317 703697 583951
37996 583951 167704 -75897 -78957 -82783 -112647 24674 298494 439248 394393 424918 661717
37985 661717 887649 878880 689146 470167 264083 115117 141777 318812 400202 260191
37975 260191 123344 228684 431405 414523 186634 58731 156163 264627 204532 64372
37965 64372 -44876 -194193 -419856 -534888 -399200 -215511 -275979 -505127 -553928 -320271
37955 -320271 -57527 73037 209651 400538 342621 -195726 -900964 -1202467 -948156 -495344
37945 -495344 -184688 -35558 39560 46554 22358 62580 119874 4433 -298586 -533939 -526219
37934 -526219 -405186 -336864 -261426 -91364 52707 56260 77675 301051 540475 415147
37924 415147 -115935 -692274 -1032572 -1197202 -1321530 -1352760 -1170632 -785794 -304019 174815
37914 174815 535966 649838 487271 171061 -120336 -235286 -72974 319150 669270 692307
37904 692307 441100 282142 444573 757676 931546 913632 803371 575884 148810 -318697
37894 -318697 -463470 -156211 264003 346732 65017 -152522 46137 479927 609316 140891
37884 140891 -644442 -1194916 -1232629 -933779 -638216 -492696 -391978 -199779 23451 31741
37874 31741 -347442 -979002 -1498015 -1622957 -1343519 -848487 -408012 -306670 -667352 -1251203
37864 -1251203 -1628612 -1661622 -1608805 -1628179 -1479120 -991268 -536382 -583788 -932443 -904723
37854 -904723 -326743 183768 70172 -438604 -704587 -480346 -62330 162307 81725 -129136
37844 -129136 -218113 -146783 -181974 -527721 -906781 -829259 -316207 42739 -99886 -402846
37834 -402846 -455973 -425643 -675601 -1063514 -1121536 -790374 -490473 -483257 -563773 -428786 -38245
37823 -38245 435387 774975 817675 596611 383637 417455 627249 771275 737600 539429
37813 539429 193431 -156967 -206595 98734 314791 64461 -327531 -254813 234021 492044
37803 492044 257851 -28346 -5514 118156 88833 57486 171267 198262 -44230 -291233
37793 -291233 -279153 -230790 -425580 -604654 -358441 96555 129271 -366842 -809864 -767565
37783 -767565 -446617 -187225 63961 485827 917923 1021266 751063 357529 -17812 -445460
37773 -445460 -874963 -993078 -620962 -99501 14367 -337946 -582870 -260243 319861 448512
37763 448512 -69190 -704000 -892284 -605222 -176246 108441 127085 -63788 -173191 94604
37753 94604 598962 832479 583781 198923 397 -131070 -292424 -154471 460268 973622
37743 973622 697209 -110790 -530864 -256851 126829 179131 150826 278926 261867 -150010
37733 -150010 -625714 -801749 -885977 -1186836 -1442029 -1224058 -731321 -519631 -598887 -472758
37723 -472758 -56445 130835 -163673 -485023 -386074 -74574 24160 -54569 -12543 119189
37713 119189 63604 -169544 -286737 -202294 -119209 -114685 -44138 81228 30227 -184050 -171250
37702 -171250 239182 597549 397793 -169006 -437112 -159892 219402 212995 -153623 -529910
37692 -529910 -689593 -640179 -499535 -420441 -499545 -654223 -700959 -591225 -413754 -161571
37682 -161571 259133 738629 967521 844955 605681 413597 156297 -163832 -211711 170432
37672 170432 550620 434494 -12713 -231172 -101496 -16591 -185249 -383475 -441625 -485594
37662 -485594 -560576 -452783 -89550 225276 186461 -154695 -553382 -841916 -921879 -755430
37652 -755430 -487429 -324920 -221240 16188 254160 96590 -429254 -720552 -416722 61794
37642 61794 156183 -46946 -126598 -80806 -212165 -465882 -467769 -165574 88129 95870 -11859
37631 -11859 -177191 -503997 -871008 -934997 -674102 -491040 -576266 -591310 -262721 95050
37621 95050 29162 -359529 -605322 -592661 -616770 -756817 -659136 -108526 541251 789184
37611 789184 644863 562872 793367 1105542 1200536 1103089 973121 769360 385466 -13123
37601 -13123 -134206 -22418 -22861 -217851 -279482 -57245 68397 -264361 -792423 -971953
37591 -971953 -733408 -453746 -288082 -15714 433179 770691 807039 725269 723902 716968 593593
37580 593593 485858 540536 651409 652867 590428 572808 532693 384126 277526 427368 750384
37569 750384 899989 629543 -24254 -813864 -1356637 -1284540 -607951 120064 292688 -82944
37559 -82944 -459758 -494262 -395295 -432794 -445179 -113161 478378 880862 831202 483808 97536
37548 97536 -229835 -445296 -443399 -276389 -249208 -529463 -775696 -482845 289575 862523
37538 862523 743360 211358 -114944 -69967 2940 -137845 -335054 -394589 -439208 -724860
37528 -724860 -1244161 -1661508 -1615180 -1054733 -334374 46955 -95712 -440387 -530524 -307363
37518 -307363 -121299 -245088 -582183 -876364 -986796 -886003 -601511 -273881 -93731 -61766
37508 -61766 35363 317434 657618 930402 1183002 1404912 1371007 960590 448945 202939
37498 202939 216278 224240 156534 149198 183092 85011 -98421 -102545 86760 125203 -147693
37487 -147693 -370773 -132619 438683 863003 960782 1001290 1231445 1569623 1841747 2049278
37477 2049278 2223120 2191679 1754561 1066115 611271 689660 1053929 1201159 959759 629878
37467 629878 550714 709059 858168 878869 870937 949276 1103853 1266539 1410856 1582034
37457 1582034 1923905 2669279 3961847 5599927 7015152 7597354 7089058 5718491 4020697
37448 4020697 2524914 1512984 979290 776091 763748 818319 789838 585186 301803 169217
37438 169217 300626 560407 718917 685549 546063 417563 321214 181508 -71586 -372316
37428 -372316 -492408 -230866 314333 748940 767816 496055 312129 342411 319634 38003
37418 38003 -232385 -22457 680304 1303582 1310426 764658 143097 -251212 -471171 -615699
37408 -615699 -626288 -456629 -230384 -102557 -85084 -108005 -142484 -162640 -93529 79205 231621
37397 231621 262779 262230 369651 518657 495163 252741 -1586 -90974 -95500 -200671 -417127
37386 -417127 -571407 -539756 -379650 -215505 -78774 90519 330109 599635 813324 863830
37376 863830 632207 89071 -558764 -930596 -813879 -416036 -157836 -221548 -409653 -437602
37366 -437602 -232343 69861 272846 226379 -65251 -365795 -372382 -46596 334594 529668
37356 529668 587974 659049 724886 694891 624951 620229 603169 415669 127371 9703 168804
37345 168804 401439 482200 430828 402059 432549 416243 287080 135876 122986 281181 426975
37334 426975 337373 48652 -115263 93655 532086 834872 833214 648159 419653 165059
37324 165059 -53295 -50569 225374 488825 377601 -78791 -423603 -288415 170419 489020
37314 489020 486174 420901 514460 578911 343247 -50391 -228867 -183459 -257790 -496092 -477609
37303 -477609 -16511 415221 332900 -35382 -132319 48823 8037 -399859 -681869 -404998
37293 -404998 217552 615426 484152 -11634 -466425 -567563 -330995 -38573 133153 307938
37283 307938 588379 753093 575964 261026 160503 202227 72137 -132561 -3149 427587
37273 427587 654768 539739 544551 910387 1241592 1240904 1228777 1462323 1516257 957197 185036
37262 185036 -92819 85590 135167 -31564 50836 434832 527996 29837 -539749 -564137
37252 -564137 -110624 341526 584563 734207 841440 810050 610612 326478 36023 -177453
37242 -177453 -158598 196689 742759 1138262 1161303 934703 788265 888277 1056747 1016750
37232 1016750 756042 512061 427587 422925 431947 511915 614503 505803 91551 -393903
37222 -393903 -697231 -807057 -720663 -274230 464506 925726 626960 -106961 -471750 -175522
37212 -175522 321453 529399 450295 322870 239651 135926 -103278 -553944 -1027913 -1033170
37202 -1033170 -336553 507475 671237 115963 -370384 -285149 -6353 -63059 -348894 -422504
37192 -422504 -180653 165189 478800 684531 610145 222772 -154588 -197262 1109 156323
37182 156323 260680 482764 740212 748775 462850 151200 27462 57950 140314 237939
37172 237939 299823 234981 35441 -166071 -188307 70787 536515 954160 1082951 931219
37162 931219 682391 396273 5000 -364236 -377096 45764 545173 801120 904453 1007633
37152 1007633 926572 470502 -67408 -209349 8497 66022 -309612 -805508 -962475 -667811
37142 -667811 -173566 140972 31582 -345841 -461570 33059 805160 1180389 960619 575028
37132 575028 402329 324637 90892 -214571 -312095 -149728 30095 -29098 -361057 -744543
37122 -744543 -862223 -602362 -229164 -115689 -284261 -379767 -150111 219417 343544 81005
37112 81005 -354684 -653747 -711175 -689266 -772526 -870128 -713126 -332282 -197741 -618010
37102 -618010 -1191818 -1248663 -746839 -280664 -181254 -118693 229109 596795 559063 192753
37092 192753 -84735 -130389 -138578 -193918 -131908 138410 446120 561585 437752 218799
37082 218799 99281 157841 264836 212627 -6976 -157599 -63261 164583 292872 225237
37072 225237 4984 -269259 -407201 -200021 287358 666003 668689 488185 454799 558506
37062 558506 579122 529968 594517 688291 495796 -1417 -400707 -409053 -195162 -60183 -30729
37051 -30729 17448 44968 -95068 -386651 -630827 -653018 -422746 -48301 245914 238499 -64024
37040 -64024 -393424 -517909 -492002 -504364 -589746 -653955 -698981 -812351 -944075 -901273 -623808
37029 -623808 -302185 -124833 -24781 201726 587011 931438 1055949 1015771 1004106 1078355
37019 1078355 1052596 704618 79431 -467318 -578801 -248367 173813 330709 181414 -29325
37009 -29325 -62169 110454 346324 480552 405670 100919 -323036 -638514 -660957 -421042
36999 -421042 -122843 71074 138820 90555 -93401 -329871 -374829 -81712 327481 450356
36989 450356 192312 -121612 -196912 -133301 -181886 -313157 -290336 -106239 -38439 -204060
36979 -204060 -341656 -206033 41747 83138 -64760 -101158 68075 214664 206684 219524
36969 219524 375572 455076 214463 -203597 -464641 -514194 -538295 -534079 -299695 112346
36959 112346 317455 132792 -135434 -156920 -38466 -29521 -26619 211323 484478 285637
36949 285637 -410661 -926558 -678862 87064 613505 482160 -98947 -689118 -979333 -827454
36939 -827454 -267490 419882 859723 924593 805496 686423 506794 155032 -242550 -401596
36929 -401596 -207252 177778 520857 709049 722488 559177 275036 25785 -40475 64574
36919 64574 187695 208899 138809 33347 -98891 -232907 -241986 -15041 329917 491218
36909 491218 324801 36654 -78614 -11204 1817 -152455 -309600 -273233 -54562 194082
36899 194082 347051 330932 115564 -214855 -484544 -618642 -709111 -797724 -749514 -508311
36889 -508311 -321669 -438190 -648741 -463015 180934 686886 492169 -184653 -546946 -147333
36879 -147333 602481 936371 621904 176711 183115 570862 777818 543874 223071 199536
36869 199536 329948 267582 97443 210178 615979 843419 603377 168930 -43155 56237
36859 56237 314044 569898 641618 388708 -26394 -247111 -265766 -482698 -980114 -1175687
36849 -1175687 -616173 246312 593580 308906 -53523 -196711 -351758 -641060 -791052
36840 -791052 -629426 -382793 -292621 -308812 -305086 -246904 -35482 438126 953513 1060218
36830 1060218 676435 216854 -32012 -238418 -505367 -496663 18871 602207 607492 38767
36820 38767 -483130 -522081 -223310 49299 124847 30646 -153089 -345554 -488499 -558165
36810 -558165 -526646 -378136 -197575 -117278 -122780 -68675 59303 106628 50690 79415 239483
36799 239483 293687 125185 -7348 116176 276119 152298 -157462 -326844 -343062 -456774
36789 -456774 -675464 -709313 -432889 -67799 139340 160769 82615 -14009 -40752 47716 194109
36778 194109 360571 610995 892104 884938 362497 -387725 -799068 -659740 -264391 15124
36768 15124 50577 -91233 -225565 -94319 396924 978682 1258632 1115996 680259 85527
36758 85527 -470734 -623049 -218483 298237 332534 -66942 -320310 -198523 -70735 -203271
36748 -203271 -363653 -330742 -316044 -568463 -899972 -908584 -466950 201815 747603 898094
36738 898094 670368 423711 438636 480166 164515 -299925 -307255 150996 360747 -12265
36728 -12265 -387820 -231201 124862 176843 164776 553325 1034976 896380 173462 -380327
36718 -380327 -434683 -419048 -634054 -755116 -482527 -109191 -78238 -343911 -507948 -374219
36708 -374219 -110579 19296 -71996 -218667 -160970 119543 276913 -4740 -549423 -853182
36698 -853182 -675878 -228675 185839 433856 462181 269322 29825 -19631 111870 207617
36688 207617 220597 336907 591533 705574 451855 -20662 -360721 -369782 -113865 164038
36678 164038 195072 -89099 -443598 -572768 -484972 -395644 -350671 -254555 -238496 -576803 -1130315
36667 -1130315 -1309826 -843919 -219403 -32550 -204124 -239147 -41311 25716 -175454 -315274
36657 -315274 -152330 104137 215211 341264 701059 1034088 858862 234571 -195347 -59971
36647 -59971 259267 291554 240770 605000 1258459 1532120 1212998 838497 817469 852912
36637 852912 563043 131456 -112902 -287717 -574825 -656028 -207781 331088 251064 -306939
36627 -306939 -509435 -93341 332509 353235 295469 448748 521091 286500 101226 276225
36617 276225 508053 467674 429791 712558 966391 740881 406399 687127 1424061 1644280
36607 1644280 952807 123918 44681 624060 1085179 952299 396956 -154605 -416616 -329693
36597 -329693 -17683 284134 359134 151637 -169718 -305790 -92772 285116 465523 329472
36587 329472 91622 -73045 -251695 -541118 -860707 -1182835 -1616442 -2007408 -1832037 -902313
36577 -902313 133279 513237 371006 438126 878291 1096486 741007 199613 -115868 -345329
36567 -345329 -676174 -791441 -333897 391196 703933 424966 20098 -120621 -159428 -435118
36557 -435118 -864666 -958203 -423580 398445 844309 667598 296808 256520 522716 671811
36547 671811 515139 259700 88237 -67234 -275138 -426080 -402087 -199605 166688 651543
36537 651543 1044402 1109961 902775 683226 514420 251712 -68896 -223979 -238394 -398112
36527 -398112 -718640 -859099 -733422 -716765 -991632 -1185978 -1009036 -775513 -862889 -1068422
36517 -1068422 -1011023 -817443 -850754 -1031399 -1007393 -795671 -677852 -623623 -407925 -170438
36507 -170438 -233498 -433788 -281730 211246 503745 369830 130473 -41434 -349465 -718580
36497 -718580 -628373 48135 655529 627851 234163 29371 55140 73739 153659 457629
36487 457629 771710 802746 697918 744563 789532 510535 65917 -123343 -109636 -307946
36477 -307946 -690494 -741823 -307653 115897 137397 -4262 74290 321117 451289 400635
36467 400635 289750 179947 113828 206693 501418 896913 1328089 1779331 2024440 1702404
36457 1702404 874584 183920 153454 575187 904421 998799 1059146 1042464 672510 40953
36447 40953 -304168 -52802 438320 636778 497560 376247 441740 470846 222992 -202547
36437 -202547 -474373 -395406 -80662 194391 256763 144273 2677 -83653 -159943 -314784
36427 -314784 -523568 -598659 -367012 73321 367102 265028 -90453 -348103 -348346 -202212
36417 -202212 -43747 90087 153030 94266 3980 38678 156504 151330 1948 -67323 51438
36406 51438 213018 341475 543303 730870 534444 -105560 -633594 -583867 -276987 -310261
36396 -310261 -611472 -626355 -323584 -295268 -759921 -1139794 -915241 -368300 -112581 -275997
36386 -275997 -524243 -603312 -491042 -214739 139972 357371 288098 21705 -301061 -676582
36376 -676582 -1062015 -1224956 -1014457 -622915 -346971 -228497 -137537 -46174 4496 50833
36366 50833 93400 -2715 -270306 -481254 -461579 -361462 -347251 -270277 11821 236358 117280
36355 117280 -67549 173562 691678 806500 330878 -126141 -82280 156180 81428 -247535
36345 -247535 -454339 -503534 -607667 -682777 -419615 129350 486492 375429 84970 57422
36335 57422 331401 552213 406799 -88756 -658747 -1004722 -1009582 -813415 -692948 -787261
36325 -787261 -928379 -829505 -474528 -188443 -194342 -239334 65486 576890 685416 197034
36315 197034 -253559 -13305 682166 1095081 1078059 1161979 1548014 1686959 1154061 409723
36305 409723 222266 634004 972951 757751 173810 -315858 -472321 -350537 -160655 -162865
36295 -162865 -496579 -983374 -1209061 -925370 -350978 3512 -153399 -581807 -775590 -544716
36285 -544716 -196277 -49614 23822 319212 714914 784091 485555 280233 414232 539742
36275 539742 320027 -6960 -58899 44085 -44529 -213885 -62722 329272 385324 -117516
36265 -117516 -686521 -803182 -571332 -422576 -492065 -588321 -577797 -494381 -363543 -177518
36255 -177518 -19051 -5924 -94833 -85828 137972 464553 691364 769595 870244 1191304
36245 1191304 1696258 2073427 2001724 1467079 800747 412714 486253 876566 1253799 1363407
36235 1363407 1187678 867976 517914 186357 -43844 -79792 33995 145141 202784 257533
36225 257533 219541 -116384 -677997 -1041106 -983153 -851954 -1069537 -1485499 -1613180 -1365093
36215 -1365093 -1111041 -1055113 -1018168 -889911 -841265 -922414 -835255 -351415 302044 698522
36205 698522 677330 403734 147208 125901 376867 654454 644994 380257 212046 276037
36195 276037 269741 -60397 -501306 -693011 -620401 -498251 -376129 -193836 -84447 -254045
36185 -254045 -602825 -788450 -671513 -428970 -223061 -30034 161317 234595 120815 -90495
36175 -90495 -284282 -415410 -435695 -294129 -66735 66196 37340 -37449 -42620 24040 151211
36164 151211 347219 504743 425443 104572 -182154 -238733 -235304 -417216 -666753 -665655 -447126
36153 -447126 -403378 -637466 -697171 -242914 322624 328942 -209634 -634115 -643213 -670552 -1021663
36142 -1021663 -1200662 -618455 380077 850388 516957 79285 166499 562747 711698 514105
36132 514105 271990 168805 173798 247457 306517 153252 -237579 -506901 -334144 23168
36122 23168 -8402 -518921 -952844 -857478 -479951 -399710 -746329 -1038195 -784780 -67069
36112 -67069 563922 689756 414704 147119 116648 218966 261498 187055 52082 -45322
36102 -45322 25742 332796 727358 920742 771624 395483 -5130 -264877 -254192 -11273
36092 -11273 115327 -239667 -955456 -1518589 -1668981 -1571623 -1284984 -618185 222432 458174
36082 458174 -262683 -1153505 -1217552 -560493 -85449 -125025 -178586 61469 268888 211387
36072 211387 157179 279012 305476 104468 34925 321160 585243 453075 195192 260536
36062 260536 499826 384594 -195597 -834207 -1180357 -1191169 -922337 -486190 -170473 -214807
36052 -214807 -464960 -562857 -463740 -448280 -617926 -707949 -485941 -77848 210409 217639 911
36041 911 -257566 -348410 -169091 169329 440259 523637 466317 349271 197480 20542 -139109
36030 -139109 -207064 -101978 186790 519033 699245 701895 678071 676139 529716 151092 -238141
36019 -238141 -359325 -232914 -90951 -52122 -93635 -232571 -476853 -651585 -534878 -169885
36009 -169885 169876 325056 364044 364633 298306 161665 45424 38696 181898 462254 693781
35998 693781 508141 -247657 -1128911 -1433174 -995515 -363676 -92707 -163310 -244588 -217372
35988 -217372 -164140 -60422 186054 472441 584909 546802 614759 861182 990385 716244
35978 716244 179611 -192870 -197153 -35566 39251 77078 270707 559186 648933 463482
35968 463482 310087 438917 650139 591849 303680 133169 152554 39273 -352429 -645131
35958 -645131 -410062 233175 769871 921940 839335 706880 472211 60750 -369145 -566381
35948 -566381 -491162 -339149 -303110 -415167 -588758 -701899 -651100 -445987 -266313 -294268
35938 -294268 -448104 -436296 -168620 63934 246 -163564 -45919 313549 495782 373545
35928 373545 311498 520507 635682 283463 -259463 -438670 -264705 -263527 -622669 -911073
35918 -911073 -767438 -403720 -186490 -86346 130096 395894 396218 59932 -292870 -334875
35908 -334875 -86677 171255 237235 153170 41129 -130142 -474220 -863523 -900733 -418893
35898 -418893 148868 211440 -224988 -586690 -528973 -320599 -323464 -478942 -541477 -496431 -446123
35887 -446123 -330854 -98742 21254 -235651 -742272 -1102292 -1136441 -966679 -690985 -298988
35877 -298988 99110 283966 233988 166342 211622 284968 329811 414721 483582 297783 -171557
35866 -171557 -529590 -418116 -56662 -7588 -420987 -829572 -796950 -489539 -368027 -487233
35856 -487233 -447448 -48222 359551 361963 70306 -64424 117197 368668 508938 644497
35846 644497 843054 915637 694296 283151 -130597 -485062 -701887 -611322 -263213 -54761
35836 -54761 -224237 -425287 -192177 318308 505251 205248 -88235 14529 271184 267242
35826 267242 44075 -54502 56517 141217 71411 24678 209003 566302 824951 777310
35816 777310 469487 149559 49512 216618 538180 866120 1078392 1102373 977685 839522
35806 839522 739689 565361 271376 86274 262139 669644 897675 755678 419899 72861
35796 72861 -289360 -619886 -740153 -669205 -712975 -977532 -1078510 -664526 -22061 222256
35786 222256 -98196 -551464 -723941 -611389 -374262 -73379 216448 314938 142546 -152445
35776 -152445 -397324 -564118 -640770 -538076 -279022 -98917 -156723 -276504 -187169 76194
35766 76194 236847 184844 79867 52795 47261 3788 -29013 -52577 -163022 -306962 -217493
35755 -217493 194716 565619 472175 5607 -347084 -351086 -221019 -145616 654 302208
35745 302208 510396 413572 259988 437570 846378 978415 625667 151778 -32273 45358
35735 45358 113202 89723 94151 157534 151191 -1369 -170157 -113015 282937 829540 1145402
35724 1145402 1026286 670169 412544 313543 220348 163429 329169 587518 485644 -52631
35714 -52631 -433130 -191063 249731 158072 -363281 -480919 106978 699146 629994 169053
35704 169053 -46054 18508 -29369 -180473 -62976 282884 345722 -40266 -413100 -423495
35694 -423495 -318600 -385805 -413898 -138545 178256 136640 -113701 -131339 64930 98994
35684 98994 -19802 87641 407086 473780 213879 144871 467004 646930 327637 1877
35674 1877 198707 558247 438473 24783 14859 445181 682803 492245 264399 156180
35664 156180 -145314 -627758 -740819 -300439 101402 -20204 -364133 -452713 -339948 -259927
35654 -259927 -119827 129917 109581 -410482 -932667 -840347 -273163 188351 406422 617156
35644 617156 742820 499709 73921 -23696 221984 293838 -29552 -396724 -494008 -368972
35634 -368972 -73734 434752 910497 897983 385620 -114704 -308182 -431387 -651432 -710900
35624 -710900 -452225 -172669 -105143 -14082 292768 472824 136392 -487583 -836966 -742106
35614 -742106 -453654 -160632 90536 158265 -79667 -445511 -641917 -634887 -560277 -385799
35604 -385799 -22196 331382 343688 37255 -219786 -219621 -123742 -155266 -338678 -551727 -617394
35593 -617394 -382790 63694 327432 136634 -233947 -295060 -55944 -20485 -433053 -928427
35583 -928427 -1069373 -869929 -580036 -275086 51842 228900 86650 -203709 -302868 -210485
35573 -210485 -305579 -789156 -1320182 -1391674 -954250 -456084 -272020 -300303 -223222 2854
35563 2854 116843 -59335 -420462 -759713 -933001 -822114 -397245 83495 203541 -98583
35553 -98583 -364905 -183348 280781 568567 552177 455378 385112 226370 -10213 -89476
35543 -89476 126524 510473 863054 1040878 895576 389620 -161191 -262636 198987 793062
35533 793062 1051598 919744 591855 163303 -336623 -738222 -810636 -521658 -90276 193575
35523 193575 160277 -124853 -370453 -285650 126932 576063 799150 768563 591436 380557
35513 380557 255700 273937 283382 32082 -488140 -981436 -1212433 -1236014 -1172773 -993014
35503 -993014 -689705 -453446 -446800 -530771 -424159 -68205 306345 404568 91983 -459920
35493 -459920 -796185 -585063 -114132 -77101 -665240 -1219750 -1126714 -716222 -748004 -1217039
35483 -1217039 -1340335 -767707 -146635 -201238 -747096 -1024110 -698854 -114973 293286 427584
35473 427584 372762 151836 -229335 -636893 -843354 -732410 -462772 -364388 -564166 -745561
35463 -745561 -463305 262644 877490 934187 610566 398037 432747 403557 82365 -324480
35453 -324480 -447752 -228614 846 -107484 -505399 -748265 -472785 133069 479073 257096
35443 257096 -191346 -336425 -122070 73111 24813 -109183 -156210 -194541 -326711 -448101
35433 -448101 -423512 -312869 -241553 -188835 -77776 52914 143502 258017 443509 559320
35423 559320 464335 277794 210143 209610 51715 -260512 -482015 -498889 -391479 -113058 488405
35412 488405 1199410 1425189 944650 349924 344607 812181 1000898 545550 -102922 -297557
35402 -297557 78280 590251 743073 426165 9048 -13659 406586 745308 520108 -100670
35392 -100670 -549254 -576907 -394761 -216379 -78445 -76693 -307184 -509859 -246063 420093
35382 420093 867580 745688 419192 338682 409444 327014 137239 42074 -24217 -172384
35372 -172384 -186594 139488 514038 510473 265959 283092 624569 856580 779263 659514
35362 659514 671204 640531 491723 446462 568992 558243 252439 -45340 -41080 69366 -88494
35351 -88494 -507778 -848276 -880801 -643788 -302856 -53452 -18039 -78118 24066 282739
35341 282739 357966 77030 -261082 -319595 -199810 -181689 -227787 -125903 35033 -44715
35331 -44715 -363920 -600666 -625764 -671539 -906333 -1151778 -1148489 -870253 -467642 -101819
35321 -101819 73225 -39927 -342078 -601976 -730752 -820730 -862116 -665833 -198268 253591
35311 253591 464392 608992 932687 1239786 1105714 596914 351153 737974 1271400 1202578
35301 1202578 519774 -45464 14219 421027 641711 592472 532098 529708 426526 207293
35291 207293 22082 -146148 -472474 -896124 -1075186 -847463 -443350 -120050 114170 260117
35281 260117 148626 -240344 -556744 -494066 -224179 -108928 -167668 -189047 -209131 -429476
35271 -429476 -704191 -585068 13514 594028 707263 489336 341926 333657 219431 -67800
35261 -67800 -249464 -63639 388045 747185 790019 638664 568189 651399 685835 498874
35251 498874 207639 63657 115247 170674 73278 -120608 -245429 -214761 -105933 -103240 -299107
35240 -299107 -515230 -466700 -196275 -130440 -494988 -894970 -817778 -405471 -282141 -632011
35230 -632011 -933686 -747751 -326565 -174623 -338012 -465123 -368182 -186362 -70387 16267
35220 16267 168207 371815 495477 407227 149283 -17592 118341 409559 500812 305171
35210 305171 80161 -10330 -90191 -218105 -212971 -58011 -115651 -592927 -1081876 -1053474 -615868
35199 -615868 -331105 -388094 -432682 -217594 39785 67189 -62080 -112686 -18737 122382
35189 122382 206247 162709 -4622 -149231 -104439 72943 134598 -42217 -319642 -509497
35179 -509497 -564324 -535812 -495219 -507474 -539453 -423763 -98133 171826 71641 -265518
35169 -265518 -345763 30352 488341 576341 283572 -81846 -293641 -304859 -139836 106920
35159 106920 274557 282197 185738 32826 -180912 -356598 -310599 -51197 179055 247851
35149 247851 280483 336269 227740 -128542 -456566 -487388 -348415 -295755 -281525 -126249
35139 -126249 74295 107199 66018 192812 381977 293685 -50972 -251400 -166208 -111462
35129 -111462 -276337 -380955 -165355 138838 133357 -194807 -529013 -636124 -466391 -32739
35119 -32739 514369 828065 686234 304451 69009 31826 -49045 -225921 -266389 -91902
35109 -91902 29763 -93972 -224372 -13575 455283 733881 603514 346532 327793 508728
35099 508728 571851 421383 301031 386514 515542 470478 324695 270515 239943 12886
35089 12886 -326804 -394921 -67953 269501 228607 -73506 -237528 -130190 48218 112428
35079 112428 34157 -195279 -581657 -1016554 -1343532 -1498444 -1419780 -954674 -140620 525747
35069 525747 503939 -74150 -492306 -357622 -32053 16764 -110801 -37295 251345 466256
35059 466256 522322 560719 562594 363902 55082 -23670 239857 579876 759895 816270 791211
35048 791211 555284 92347 -309523 -394256 -273553 -199892 -178545 -60681 110826 132514
35038 132514 -42889 -279155 -517447 -816121 -1128339 -1285095 -1244132 -1134929 -995938 -698268
35028 -698268 -249555 40231 -99718 -509086 -758674 -673248 -500074 -520712 -664582 -635955
35018 -635955 -344667 -34338 63728 55369 215522 573409 873737 956791 935114 901692 730933
35007 730933 378964 138996 270552 530109 458768 62087 -227029 -253458 -304762 -462268
34997 -462268 -348635 167473 522053 197925 -446267 -660273 -384957 -219586 -394757 -455388
34987 -455388 -83201 377859 483593 287813 57929 -195749 -521627 -679768 -438338 -36542
34977 -36542 65660 -187507 -429290 -405498 -175803 173493 632240 1037230 1102177 809073
34967 809073 490444 380444 331131 131447 -135804 -278515 -347246 -523790 -746078 -723615
34957 -723615 -338455 189997 584238 761673 742793 505946 93000 -259031 -292425 -27955
34947 -27955 255449 352511 308392 234141 104118 -151757 -460990 -659230 -685430 -604968 -478401
34936 -478401 -342084 -286575 -381144 -502290 -411110 -63072 309062 491365 517360 517249 506314
34925 506314 454475 414750 417410 366798 231191 213071 497747 919777 1143768 1123318 1073094
34914 1073094 989047 577877 -186707 -781162 -693693 -67452 515347 762844 860294 972844
34904 972844 932643 562519 57546 -182617 -14774 317568 473520 309518 -76380 -447417
34894 -447417 -555980 -300088 168067 551862 693031 703415 766685 873677 849190 612382
34884 612382 301045 118846 133914 236622 223979 -59746 -546420 -892627 -755698 -199919
34874 -199919 296370 338845 20158 -269286 -306963 -172651 -30761 27825 -19636 -100135
34864 -100135 -33150 270282 599577 619210 272033 -169558 -490659 -777006 -1171597 -1546255
34854 -1546255 -1584945 -1175628 -625123 -436415 -834008 -1497716 -1844528 -1622385 -1117132 -712843
34844 -712843 -453514 -215346 -69028 -124435 -174730 59000 379484 307255 -122486 -290978
34834 -290978 95154 559314 626557 531048 702235 974911 901752 584443 544078 849651
34824 849651 992075 677339 202120 -95049 -278341 -497814 -617561 -440683 -69210 202067
34814 202067 222706 74507 -68235 -88936 -39472 -98415 -282480 -277595 192285 878219 1210975
34803 1210975 1006024 620776 358475 109100 -265059 -563302 -518267 -167720 269492 649406
34793 649406 831619 620274 46316 -489008 -608475 -345817 43664 434053 760331 843137
34783 843137 596242 247314 60720 -17624 -172586 -347907 -356606 -197397 41142 394749
34773 394749 789894 834823 337279 -138604 154301 1031647 1476040 977490 154053 -212955
34763 -212955 -152869 -105627 -86563 147961 417793 257837 -335335 -848144 -970928 -906402
34753 -906402 -884390 -819543 -628368 -503804 -607993 -755029 -678035 -430311 -243897 -124311
34743 -124311 100779 377860 402562 72552 -303151 -392843 -245242 -134883 -158344 -192240
34733 -192240 -158043 -97437 -12206 144390 292530 252923 15144 -198908 -214264 -84762
34723 -84762 62746 172229 169096 -33815 -298471 -283573 77260 364219 235447 -24666
34713 -24666 70727 392398 323922 -275197 -783492 -700539 -346597 -336761 -697078 -924796 -740186
34702 -740186 -351458 -27003 205899 381911 436065 355036 281688 326599 402201 365131 237639
34691 237639 169927 215174 239090 74522 -273654 -607452 -722095 -594250 -362652 -147780
34681 -147780 40928 214416 322372 337797 358335 508967 739392 819264 602632 254328
34671 254328 117228 321289 609711 652814 471334 363755 409936 321596 -50046 -322022
34661 -322022 -24753 697533 1218418 1232066 1018972 862515 656439 291993 15450 62556
34651 62556 230491 175070 -80337 -286113 -419115 -598268 -703519 -532913 -271670 -329007
34641 -329007 -680943 -840609 -590862 -300564 -317514 -449208 -327060 29049 329352 468026
34631 468026 532365 514147 337840 104917 23198 102899 138924 -7301 -268179 -476758
34621 -476758 -465949 -126981 453856 958404 1100748 893460 527396 101433 -332938 -592944
$$ [...]
##END NTUPLES=NMR SPECTRUM
##END=
