##TITLE=31Pdec_3MTBDP2212
 CDCl3, 24 sc
 23.12.2022
##JCAMPDX= 6.0         $$ Bruker NMR JCAMP-DX V2.0
##DATA TYPE= NMR SPECTRUM
##DATA CLASS= NTUPLES
##ORIGIN= UXNMR, Bruker Analytische Messtechnik GmbH
##OWNER= root
$$ XWIN-NMR		Version 3.5
$$ Fri Dec 23 14:01:28 2022 Russian Standard Time (UT+4h)  she@DPX200
##.OBSERVE FREQUENCY= 81.013821
##.OBSERVE NUCLEUS= ^31P
##.ACQUISITION MODE= SIMULTANEOUS
##.ACQUISITION SCHEME= undefined
##.AVERAGES= 24
##.DIGITISER RES= 16
##SPECTROMETER/DATA SYSTEM= spect
##.PULSE SEQUENCE= zgpg30
##.SOLVENT NAME= DMSO
##.SHIFT REFERENCE= (INTERNAL, DMSO, 0, 248.564)
##AUDIT TRAIL= $$ (NUMBER, WHEN, WHO, WHERE, WHAT)
$$ ##TITLE= Audit trail, XWIN-NMR		Version 3.5
$$ ##JCAMPDX= 5.01
$$ ##ORIGIN= Bruker BioSpin GmbH
$$ ##OWNER= she
$$ F:/spectra/data/she/nmr/P31/1/pdata/1/auditp.txt
$$ ##AUDIT TRAIL=  $$ (NUMBER, WHEN, WHO, WHERE, WHAT)
(   1,<2022-12-23 14:00:38.18 +0400>,<she>,<DPX200>,
      <created by zg, POWCHK disabled, PULCHK disabled
       configuration hash MD5:
       00 E9 B6 7A A2 85 ED C7 34 08 36 98 17 FE 4E 26
       data hash MD5: 32K
       D0 FB F3 B9 39 86 5A 87 D0 E8 BE 80 2A 27 9A A2>)
(   2,<2022-12-23 14:00:41.51 +0400>,<she>,<DPX200>,
      <Start of raw data processing
       efp BC_mod = 2 LB = 1 FT_mod = 6 PKNL = 1 PHC0 = -10874.95 PHC1 = 793.0566 SI = 64K 
       data hash MD5: 64K
       C1 BE A8 9B 68 A8 3D 0E 0E BC 41 AE 82 C4 4C 3B>)
(   3,<2022-12-23 14:01:02.12 +0400>,<she>,<DPX200>,
      <pk PHC0 = -65.83657 PHC1 = 62.00001 
       data hash MD5: 64K
       4A E7 78 DD 5F 8B D3 8A B4 0A 91 A1 E2 E2 A1 83>)
(   4,<2022-12-23 14:01:05.51 +0400>,<she>,<DPX200>,
      <abs ABSG = 5 
       data hash MD5: 64K
       83 F7 F0 24 7E 34 A5 D5 B9 A9 67 77 8A 4C B5 F8>)
$$ ##END=
$$ 
$$ hash MD5
$$ 15 AD A6 1D 6C 8D BE 21 3F CB 6D BD 82 26 38 D6
##$RELAX= 
##$RELAX= 
##$RELAX= 
##$RELAX= 
##$RELAX= 
##$RELAX= 
##$RELAX= 
##$RELAX= 
##$RELAX= 
$$ Bruker specific parameters
$$ --------------------------
##$DU= <F:/spectra>
##$EXPNO= 1
##$NAME= <P31>
##$PROCNO= 1
##$TYPE= <nmr>
##$USER= <she>
##$AMP= (0..31)
100 100 100 100 100 100 100 100 100 100 100 100 100 100 100 100 100 100 
100 100 100 100 100 100 100 100 100 100 100 100 100 100 
##$AQSEQ= 0
##$AQ_mod= 1
##$AUNM= <au_zg>
##$AUTOPOS= <>
##$BF1= 81.014009
##$BF2= 200.13
##$BF3= 200.13
##$BF4= 200.13
##$BF5= 200.13
##$BF6= 200.13
##$BF7= 200.13
##$BF8= 200.13
##$BYTORDA= 1
##$CFDGTYP= 0
##$CFRGTYP= 5
##$CHEMSTR= <none>
##$CNST= (0..31)
1 1 145 1 1 1 1 1 1 1 1 1 1 1 1 1 1 1 1 1 1 1 1 1 1 1 1 1 1 1 1 1 
##$CPDPRG= <waltz16>
##$CPDPRG1= <>
##$CPDPRG2= <waltz16>
##$CPDPRG3= <>
##$CPDPRG4= <mlev>
##$CPDPRG5= <mlev>
##$CPDPRG6= <mlev>
##$CPDPRG7= <mlev>
##$CPDPRG8= <mlev>
##$CPDPRGB= <>
##$CPDPRGT= <>
##$D= (0..31)
0 1 0 0 0 0 0 0 0 0 0 0.03 2e-05 3e-06 0 0 0 0 0 0 0 0 0 0 0 0 0 0 0 0 
0 0 
##$DATE= 1671789637
##$DBL= (0..7)
120 120 120 11 120 120 24 19 
##$DBP= (0..7)
150 150 150 150 150 150 150 150 
##$DBP07= 0
##$DBPNAM0= <>
##$DBPNAM1= <>
$$ [...]
##$SUBNAM3= <"">
##$SUBNAM4= <"">
##$SUBNAM5= <"">
##$SUBNAM6= <"">
##$SUBNAM7= <"">
##$SUBNAM8= <"">
##$SUBNAM9= <"">
##$SW= 501.771253377433
##$SWIBOX= (0..15)
0 1 3 0 0 0 0 0 0 0 0 0 0 0 0 0 
##$SW_h= 40650.406504065
##$TD= 32768
##$TD0= 1
##$TE= 0
##$TE2= 300
##$TE3= 300
##$TEG= 300
##$TL= (0..7)
0 120 53 12 22 120 120 120 
##$TP= (0..7)
150 150 150 150 150 150 150 150 
##$TP07= 0
##$TPNAME0= <>
##$TPNAME1= <>
##$TPNAME2= <>
##$TPNAME3= <>
##$TPNAME4= <>
##$TPNAME5= <>
##$TPNAME6= <>
##$TPNAME7= <>
##$TPOAL= (0..7)
0.5 0.5 0.5 0.5 0.5 0.5 0.5 0.5 
##$TPOFFS= (0..7)
0 0 0 0 0 0 0 0 
##$TUNHIN= 0
##$TUNHOUT= 0
##$TUNXOUT= 0
##$USERA1= <user>
##$USERA2= <user>
##$USERA3= <user>
##$USERA4= <user>
##$USERA5= <user>
##$V9= 5
##$VALIST= <valist>
##$VCLIST= <CCCCCCCCCCCCCCC>
##$VD= 0
##$VDLIST= <DDDDDDDDDDDDDDD>
##$VPLIST= <PPPPPPPPPPPPPPP>
##$VTLIST= <TTTTTTTTTTTTTTT>
##$WBST= 1024
##$WBSW= 4
##$XGAIN= (0..3)
0 0 0 0 
##$XL= 0
##$YL= 0
##$YMAX_a= 1233
##$YMIN_a= -1221
##$ZGOPTNS= <>
##$ZL1= 120
##$ZL2= 120
##$ZL3= 120
##$ZL4= 120
##$ABSF1= 248.5645
##$ABSF2= -253.2056
##$ABSG= 5
##$ABSL= 3
##$ALPHA= 0
##$AQORDER= 0
##$ASSFAC= 0
##$ASSFACI= 0
##$ASSFACX= 0
##$ASSWID= 0
##$AUNMP= <proc_1d>
##$AZFE= 0.1
##$AZFW= 0.5
##$BCFW= 0
##$BC_mod= 2
##$BYTORDP= 0
##$COROFFS= 0
##$CY= -3
##$DATMOD= 1
##$DC= 0
##$DFILT= <>
##$DTYPP= 0
##$F1P= 0
##$F2P= 0
##$FCOR= 1
##$FTSIZE= 65536
##$FT_mod= 6
##$GAMMA= 0
##$GB= 0
##$INTBC= 1
##$INTSCL= 6.047779e-11
##$ISEN= 30
##$LB= 1
##$LEV0= 0
##$LPBIN= 0
##$MAXI= 10000
##$MC2= 0
##$MEAN= 0
##$ME_mod= 0
##$MI= 50
##$NCOEF= 0
##$NC_proc= -10
##$NLEV= 6
##$NOISF1= 182.463
##$NOISF2= 159.3651
##$NSP= 0
##$NTH_PI= 0
##$NZP= 0
##$OFFSET= 248.5645
##$PC= 4
##$PHC0= -10940.79
##$PHC1= 855.0566
##$PH_mod= 1
##$PKNL= yes
##$PPARMOD= 0
##$PSCAL= 0
##$PSIGN= 0
##$REVERSE= no
##$SF= 81.0140089999694
##$SI= 65536
##$SIGF1= 159.3651
##$SIGF2= -187.1042
##$SINO= 113.3802
##$SIOLD= 16384
##$SREGLST= <1H.CDCl3>
##$SSB= 0
##$STSI= 65536
##$STSR= 0
##$SW_p= 40650.406504065
##$SYMM= 0
##$S_DEV= 0
##$TDeff= 32768
##$TDoff= 0
##$TI= <>
##$TILT= no
##$TM1= 0
##$TM2= 0
##$TOPLEV= 0
##$USERP1= <user>
##$USERP2= <user>
##$USERP3= <user>
##$USERP4= <user>
##$USERP5= <user>
##$WDW= 1
##$XDIM= 65536
##$YMAX_p= 474781272
##$YMIN_p= -79354571
$$ End of Bruker specific parameters
$$ ---------------------------------
##NTUPLES= NMR SPECTRUM
##VAR_NAME=  FREQUENCY,     SPECTRUM/REAL,   SPECTRUM/IMAG
##SYMBOL=    X,             R,               I
##VAR_TYPE=  INDEPENDENT,   DEPENDENT,       DEPENDENT
##VAR_FORM=  AFFN,          ASDF,            ASDF
##VAR_DIM=   65536,         65536,           65536
##UNITS=     HZ,            ARBITRARY UNITS, ARBITRARY UNITS
##FACTOR=    0.620285442955139, 1,           1
##FIRST=     20137.2065510682, 0,            0
##LAST=      -20513.1999529968, 0,           0
##MIN=       -20513.1999529968, -79354571,   0
##MAX=       20137.2065510682, 474781272,    0
$$ Real data points
##PAGE= N=1
##DATA TABLE= (X++(R..R)), XYDATA
$$ [...]
12832h738476J733791l402581o000526l62158O568211N555182k488082q635431
12824a5770070n901814M681727J3616595R588812o837104j8344104r610391J0294695
12816a8281654J7107459L920318j0599615j0571241k617428J093607K343185O024914
12808a1580455N142823n401373j1573767K039550K3500931K4645595L03264k3729550
12800C347018k4918868q811659N203949P701667K076128m322259m789919K515508
12792b1998435J0161995Q607855J5614l721881J771416Q201139Q517563M733688
12784A6288954p66150r303280j6950054j4172487o55982J1152895J3608151J2635575
12776A1837622J2118031M473833j1939055k0839677r943309O514632O812211m391518
$$ plain form
12832 -8738476 -7004685 -10407266 -16407792 -16769950 -10201739 -4646557 -7134639 -15770070
12824 -15770070 -21671884 -16990157 -3373562 6215250 -621854 -18965958 -28576349 -18281654
12816 -18281654 -1174195 2746123 -7853492 -18424733 -21042161 -19948554 -17605369 -11580455
12808 -11580455 -6437632 -11839005 -23412772 -21373222 2127709 26773304 27076568 3347018
12800 3347018 -21571850 -30383509 -25179560 -17477893 -15401765 -19724024 -24513943 -21998435
12792 -21998435 -11836440 -3228585 -3212971 -6934852 -5163436 3037703 11555266 16288954
12784 16288954 15522804 6219524 -10730530 -24903017 -25558999 -14406104 -797953 11837622
12776 11837622 23955653 28429486 16490431 -4349246 -14292555 -7777923 -965712 -5357230
12768e357230l916212J0598750J4315907n631176k7173008k3287234R49462J8241869
12760b1258872J6507933Q340329O345376O873318K148257n192823q020078p166880
12752a423440q691630j2001714r572668P12908J0154503J0218667M535102L716471
12744b351801R182888R777030j446548j3473882r623573P946372J7571436O544070
12736B4125992j0198342r671166P955307K0849058J5298824m89205j3097955j8892952
12728A5879561j7568622o488547R013543J3464772J926097q765813l407488Q325527
12720A2379030R098420L209756O099818J2455511K789651j9182457k5970184r471779
12712h592234M860564m00116p276027L825823J7697896Q343406j7187309k7802959
$$ plain form
12768 -5357230 -9273442 1325308 15641215 10010039 -17162969 -40450203 -39500741 -21258872
12760 -21258872 -4750939 3589390 9934766 16808084 18956341 13763518 5743440 -1423440
12752 -1423440 -10115070 -22116784 -31689452 -30976544 -20822041 -10603374 -6068272 -2351801
12744 -2351801 6831087 16608117 15161569 1687687 -7935886 10486 17581922 24125992
12736 24125992 13927650 4256484 12211791 33060849 48359673 47870468 34772513 15879561
12728 15879561 -1689061 -8177608 835935 14300707 16226804 7460991 4053503 12379030
12720 12379030 21477450 24687206 30787024 43242535 46032186 26849729 879545 -8592234
12712 -8592234 -3731670 -4131786 -11407813 -7581990 10115906 18459312 1272003 -26530956
12704b6530956j3098954P096699J4534973J0783958M115868j748634m029371j596953
12696a0473370j02173m247625p712080l019972M152909M718382L184294Q240814
12688e258821J3674439P996792l462263p218189n912061j0284788j3336174o42729
12680b4443794J7413487J5859943k072077o999067P114748J2884315m86769o633026
12672A2637760R372147K0169583K216988k0385326j3779435R229982J0662246
12665C0123945j0886743k1388098p731851O351591K758638o539546n567856J690203
12657a1189717L975452N94571k937400m555281m776319m377413m283456j933383
12649b9482946P205314J7421024J2980727p452273k0130978p567682J2825346
$$ plain form
12704 -26530956 -39629910 -32533211 -17998238 -7214280 -3098412 -4847046 -8876417 -10473370
12696 -10473370 -10575543 -14823168 -22535248 -25555220 -21402311 -16683929 -13499635 -5258821
12688 -5258821 8415618 16412410 12950147 5731958 -180103 -10464891 -23801065 -24443794
12680 -24443794 -7030307 8829636 6757559 -241508 6873240 19757555 19270786 12637760
12672 12637760 22009907 42179490 44396478 24011152 10231717 19461699 30123945
12665 30123945 19237202 -2150896 -9882747 -3531156 -772518 -7312064 -12879920 -11189717
12657 -11189717 -7214265 -6619694 -9557094 -14112375 -18888694 -23266107 -27549563 -29482946
12649 -29482946 -22277632 -4856608 8124119 671846 -19459132 -27026814 -14201468
12642a4201468J3876321Q0899l774181M006357K898827q851524r419046O040516
12634i343299J3552602o29382j8214164j8826391o897216L778048R529637R257902
12626a7792263j65983r611551j640644J9815303K7813370J2650861k548428r79009
12618B7541656K341119o069214r801222M954267J6094512r62072k7734774k8139395
12610b1775123m676084R398033M307932O11359O147806N990538k636224l221674
12602e853437N473210K770704j5602903k4909284j0935103O726827P136993j375637
12594c6568630o44496Q573218J5001420J6274564J3750233M008030r653145j2962759
12586b221565j889923P938015O199248L943836R926710J1678395j73622r045496
$$ plain form
12642 -14201468 -325147 -244248 -4018429 -12072 2886755 -5964769 -15383815 -9343299
12634 -9343299 4209303 3579921 -14634243 -33460634 -40357850 -36579802 -27050165 -17792263
12626 -17792263 -17958246 -27569797 -29210441 -9395138 18418232 31069093 28520665 27541656
12618 27541656 29882775 23813561 14012339 18966606 35061118 34099046 6364272 -21775123
12610 -21775123 -26451207 -17053174 -12745242 -12133883 -5986077 4461 -2631763 -5853437
12602 -5853437 -380227 2390477 -13212426 -38121710 -49056813 -42329986 -35192993 -36568630
12594 -36568630 -37213126 -28639908 -13638488 2636076 16386309 20394339 10741194 -2221565
12586 -2221565 -4111488 3826527 10025775 13969611 23896321 35574716 35401094 26355598
12578B6355598J278789J4809372O952947j2713392j3428532P259581J9537936
12571E0052299P191408j2444353j9174159j4530632q610611m530100l511987o846538
12563a2404673p564821J907865J1728658N786213p178650o72034K4487268L2721872
12555D8811698O490505k2629602j8696326O725243J5582235j129324j9356949
12548A5797480k2699141j6263542n037266J1107508K0602213P702724j7478500
12541f268524k2955096J028683K4863163J9991632l165677j4897060q725692k982809
12533a3111380p027627q314692L783450J8782924J9808407P886802r86502k71444
12525B0549938p44030r602646j4990372m095541J2325217J2717926o73403l415694
$$ plain form
12578 26355598 27634387 42443759 49396706 36683314 23254782 30514363 50052299
12571 50052299 57243707 44799354 25625195 11094563 2483952 -2046148 -5558135 -12404673
12563 -12404673 -19969494 -18061629 -6332971 -546758 -7725408 -8397442 16089826 48811698
12555 48811698 55302203 32672601 13976275 20701518 36283753 35154429 15797480
12548 15797480 -6901661 -23165203 -28202469 -17094961 3507252 11209976 -6268524
12541 -6268524 -29223620 -28194937 -3331774 16659858 13494181 -1402879 -10128571 -13111380
12533 -13111380 -20139007 -28453699 -24670249 -5887325 13921082 21807884 20821382 20549938
12525 20549938 19805908 10203262 -4787110 -8882651 3442566 16160492 15487089 12071395
12517A2071395J0461969J5842095k051301k0075889j3730323K277389R75916q478913
12509b707662J350100K1634960J6913769j1645894k2145804j421842J1616418
12502A3594045o016070j9171958L981165L1133294J5443220k3957713k8083997
12495a3078014R119913L2285497J0476548k2090667k5022206n895706O719837
12488g484798Q481184J0539297J0760317J040350j1564543j3533115n354246K638150
12480d477404N674170L630913m235924j2237376q137949Q110553J8184349J0318271
12472A6829603k740443m219583K057400L547966K095378N778650Q494083m11244
12464C1431810j2818570j0503815N610172J5767077J0364135j021078r862423
$$ plain form
12517 12071395 22533364 38375459 36324158 16248269 2517946 4795335 5771251 -2707662
12509 -2707662 -1357562 20277398 37191167 25545273 3399469 1977627 13594045
12502 13594045 7577975 -11593983 -7612818 23520476 38963696 15005983 -13078014
12495 -13078014 -3958101 28327396 38803944 16713277 -8308929 -14204635 -7484798
12488 -7484798 996386 11535683 22296000 23336350 11771807 -1761308 -7115554 -4477404
12480 -4477404 1196766 4827679 591755 -11645621 -19783570 -11673017 6511332 16829603
12472 16829603 14089160 9869577 11926977 15474943 17570321 23348971 31843054 31431810
12464 31431810 18613240 8109425 13719597 29486674 39850809 38829731 28967308
12457B8967308j7595882k1508812j2626422M876868J0691952m074640k0573225
12450c1842853j5959940O368104K2570740J8441791K828706o463609k134054P104969
12442I13854P054300n136998j5559348r924435O212796J2909729K672250r305014
12434a0162866o555785P396312J6705397J3842639L937282n340332r403657o416021
12426D002969O63250M521808K312928P22623O303005J4615922J5554010O349438
12418E5045953o543513j5108637j4290811m145364O444788M789889q833147j6806511
12410E52647p285268O182832L406972j0081309r949673P811971J7915882L946215
12402A2500269j5823117j5764217K88767Q737276K285517m804961l141792J050276
$$ plain form
12457 28967308 11371426 -10137386 -22763808 -17886940 -7194988 -11269628 -31842853
12450 -31842853 -47802793 -41434689 -18863949 -422158 2406548 -4057061 -6191115 913854
12442 913854 7968154 2831156 -12728192 -22652627 -16439831 -3530102 -857852 -10162866
12434 -10162866 -16718651 -9322339 7383058 21225697 25162979 19822647 10418990 4002969
12426 4002969 4666219 9188027 11500955 12223578 18526583 33142505 48696515 55045953
12418 55045953 48502440 33393803 19102992 14957628 21402416 26192305 17359158 552647
12410 552647 -6732621 -549789 2857183 -7224126 -17173799 -9361828 8554054 12500269
12402 12500269 -3322848 -19087065 -18798298 -10061022 -7775505 -12580466 -15722258 -14671982
12394a4671982K583341N481448R415648N038613q520314j5819070o148524Q718073
12386a3922767J1140188L777171L455573J2785971J5446134K557436j2024343
12379B3215363j1351505Q39441P451897K688020l380701k985477k30526M18025
12371A6664537K876025Q652835P067327j0513134l0650034k8109768m8036K4454785
12363i605463J9306162m319249j3113123L808839K2663781J9324065r71745j6934706
12355B0158561k0422989j8104983j2637104m27566J2711328J1761077n196018
12348a2157694j8798191j2629211M410773J1965376P049655M081168R318244J2599433
12340E839553P584496L194267N848674N104432q582904k2644838j7639905J697030
$$ plain form
12394 -14671982 -12088641 -6607193 2808455 7847068 -673246 -16492316 -22640840 -13922767
12386 -13922767 -2782579 994592 4450165 17236136 32682270 35239706 23215363
12379 23215363 11863858 12703299 20155196 22843216 19462515 16477038 16246512 16664537
12371 16664537 19540562 28193397 35260724 24747590 -5902444 -34012212 -34060248 -9605463
12363 -9605463 9700699 5381450 -7731673 -3922834 18740947 38065012 37093267 20158561
12355 20158561 -264428 -18369411 -31006515 -31434081 -18722753 -6961676 -12157694
12348 -12157694 -30955885 -43585096 -39174323 -27208947 -20159292 -16078124 -6759880 5839553
12340 5839553 13424049 16618316 22466990 27571422 18988518 -3656320 -21296225 -19599195
12332a9599195J1504386M704936n95755N846283Q781737l517817j4460176m973551
12324a2309152J2215636J1243549l878141o015939P810479R927203r951911k3524149
12316a4482425q295083J4736358J2740969r581865k0765870j0598916J820505
12309c4426327L179402J468652N176013J0440008J2932669J3292727P722119q012567
12301A1772696k2425686j6638040N905565J8866057J0059464j900945Q17588Q076630
12293A4533329K612373r883308j2186997m392295L51654K88889L093194N010732
12285e72429m417437j7675725j3519755Q923613K2588252R764841j1519346j3587632
12277b0015618K101255J1229737M533046k094636K690743O285380n614839k1113253
$$ plain form
12332 -19599195 -8094809 -3389873 -3985628 1860655 10642392 7124575 -7335601 -12309152
12324 -12309152 -93516 11150033 7271892 1255953 9066432 18993635 9041724 -14482425
12316 -14482425 -22777508 -8041150 4699819 -4882046 -25647916 -36246832 -34426327
12309 -34426327 -31246925 -29778273 -24602260 -14162252 -1229583 12063144 19785263 11772696
12301 11772696 -10652990 -27291030 -21385465 -2519408 7540056 5639111 6456699 14533329
12293 14533329 17145702 7262394 -4924603 -9316898 -8965244 -8676355 -5583161 -572429
12285 -572429 -4989866 -22665591 -36185346 -27261733 -4673481 5091360 -6427986 -20015618
12277 -20015618 -17914363 -6684626 -2151580 -4246216 -1555473 4729907 -884932 -21998185
12269b1998185j5375542J1409172K9190077J7551831o743470j4700693m439110
12262e105920L318563R99675R26552O170122J507409j6528249k4955806p558032
12254d1225686J6195389J7735607J179979o656909Q71633N484251m64796l013597
12246i894129M071171O896901n39078j169687J5180967K7526038J2214854j7785817
12238C6501220k7514134q646049J1215511R591865l430659p667678l765152n473968
12230H10956j1818962p207007J0667499K1591070J0651138p938835r872658L619304
12222A0502505Q704280k545469r433585J981443J3412488M278904j0910418m155101
12214A1835047J6820210J6133751j2297941l1305972j7231997M874449M984902
$$ plain form
12269 -21998185 -37373727 -25964555 3225522 20777353 14033883 -666810 -5105920
12262 -5105920 -1787357 -787682 138870 6308992 7816401 -8711848 -33667654 -41225686
12254 -41225686 -25030297 -7294690 -6114711 -12771620 -11899987 -6415736 -6880532 -9894129
12246 -9894129 -5822958 1073943 534865 -634822 14546145 42072183 54287037 36501220
12238 36501220 8987086 341037 11556548 21148413 17717754 10050076 6284924 810956
12230 810956 -11008006 -18215013 -7547514 14043556 24694694 16755859 6883201 10502505
12222 10502505 19206785 16661316 7227731 9209174 22621662 26900566 15990148 11835047
12214 11835047 28655257 44789008 32491067 1185095 -16046902 -11172453 -6187551
12207f187551m060280N372962K2995459J6387857j1173528k1276955o90279J8190982
12199A9558667Q601881j2609108j6294695l305372O576564Q032826Q968956R291885
12191B8821604L775315k133987P8163M254297j708563j3753296j6732511q736469
12183f135447j897405r3559M915529J3251121J2116357k586902j6375479j6494179
12175a3299964q739138m733969l914722R84310Q809123J1502490O310998k136667
12167e217539q811377j0945479o947269K004396J1880357K0004057K4975906K1642261
12159D8585313N116967j6561823k4615411j2089275M916485P835297o28514m069863
12151H489176K912308R707243O085458o585288j8384268j8403963m380090R525827
$$ plain form
12207 -6187551 -10247831 -4874869 18120590 34508447 23334919 2057964 1367685 19558667
12199 19558667 28160548 15551440 -743255 -4048627 2527937 10560763 19529719 28821604
12191 28821604 32596919 30462932 30541095 34795392 33086829 19333533 2601022 -6135447
12183 -6135447 -8032852 -8126411 -3210882 10040239 22156596 19569694 3194215 -13299964
12175 -13299964 -22039102 -26773071 -30687793 -29703483 -20894360 -9391870 -3080872 -5217539
12167 -5217539 -14028916 -24974395 -31921664 -29917268 -18036911 1967146 26943052 48585313
12159 48585313 53702280 37140457 12525046 435771 5352256 13187553 12559039 8489176
12151 8489176 11401484 21108727 27194185 20608897 2224629 -16179334 -20559424 -11033597
12143a1033597M506569j4894359j8912800O355912L1827055K3162101o916581
12136A4094300j5950699L814580J5795990q35184k0092158j4900241Q51593J846904
12128a5374915m821533K523197J7404406J5288831k971458j1581315j915406O193919
12120D745726j116457j2212067j2308502m387670J185348K180070J559945R33681
12112a9419926K666520Q666291J4106223J1855030L670419l187944q498471j5465010
12104e606868j7661503o233904J1071484J6835811J0775555R427485J6359203
12097C4967263J5273416l75032j3929387j2782089p423969r241660j0012305j180712
12089d704475N341036k828150j3152088o864889Q548851J1490032L103352L889953
$$ plain form
12143 -11033597 -6527028 -21421387 -40334187 -33978275 -2151220 21010881 14094300
12136 14094300 -1856399 1958181 17754171 16918987 -3173171 -18073412 -17221819 -15374915
12128 -15374915 -20196448 -17673251 -268845 15019986 12048528 467213 -1448193 4745726
12120 4745726 3629269 -8582798 -20891300 -25278970 -24093622 -21913552 -20353607 -19419926
12112 -19419926 -16753406 -8087115 6019108 17874138 21544557 18356613 9858142 -5606868
12104 -5606868 -23268371 -29502275 -18430791 -1594980 9180575 18608060 34967263
12097 34967263 50240679 49865647 35936260 23154171 15730202 6488542 -3523763 -4704475
12089 -4704475 636561 -2191589 -15343677 -22208566 -13659715 -2169683 933669 4823622
12081D823622J5648512J5866656m477846k3574017k0613895m518022L238610q33329
12073a4439709m317245j220007L327305N593462O999861O905613K300758m822565
12065C27473p690805l802230J491810J857287k831002p049821n649075O98200
12057b2648163N554290L757160j446378j844558L868474O716463m9761r640766
12049a5733239r673499O10264Q878060O479133n00866n70492P954768J5854870
12041A3298999J4384979L716844q337234j3156912q613062j388203P23438n12793
12033A16056L018913R803175O321018j1365152k4468813j4478673Q056486J6396154
12025f600836N886653k527194J566955L299193p303084j4661640l386863J4643216
$$ plain form
12081 4823622 20472134 36338790 31860944 8286927 -12326968 -16844990 -13606380 -14439709
12073 -14439709 -18756954 -19976961 -16649656 -11056194 -4056333 2849280 5150038 327473
12065 327473 -7363332 -11165562 -9673752 -7816465 -10647467 -17697288 -23346363 -22648163
12057 -22648163 -17093873 -13336713 -14783091 -16627649 -12759175 -6042712 -6092473 -15733239
12049 -15733239 -25406738 -24796474 -15918414 -9439281 -9940147 -10510639 -2555871 13298999
12041 13298999 27683978 31400822 23063588 9906676 1293614 -94589 628849 116056
12033 116056 3134969 12938144 19259162 7894010 -16574803 -31053476 -22996990 -6600836
12025 -6600836 -714183 -3241377 -1674422 1624771 -5678313 -20339953 -23726816 -9083600
12017i083600J8227421P345164l245893q050483r331107m089746P025916R871862
12009H669534k540180j2257069l263248P997345j479702j8114996j1232216J2671024
12001a9549508J7487546j619995j0288957M735652J3544725k300207j6938008
11994a4928752o524597J0359488Q541926p06141L783828J1081311k88674j9090961
11986g772572j7256591L721567J6721194J1285641J663689j420882p0026M684316
11978A1556336J2339754J3767057L403091o502584l047413N647926N251312m23988
11970D1991491o82135r4205o834162j2700778q049526j678146k283147J201289
11962A0870681J4208688J4589341j0332814k9315406j2225773J3435995K948294
$$ plain form
12017 -9083600 9143821 16488985 13243092 5192609 -4138498 -8228244 -1202328 8669534
12009 8669534 6129354 -6127715 -9390963 -1393618 -2873320 -20988316 -32220532 -19549508
12001 -19549508 -2061962 -3681957 -13970914 -9235262 4309463 2009256 -14928752
11994 -14928752 -21453349 -11093861 -2551935 -3258076 525752 11607063 11318389 -7772572
11986 -7772572 -25029163 -21307596 -4586402 6699239 8362928 6942046 6872020 11556336
11978 11556336 23896090 37663147 41066238 34563654 31516241 37164167 42415479 41991491
11970 41991491 41309356 41215151 34380989 21680211 13630685 11952539 9669392 10870681
11962 10870681 25079369 39668710 29335896 20490 -12205283 1230712 4179006
11955D179006k6897163k1516871J7110966K9189028l207382k5609345k343197
11948b9094958K6783308J5819886j5849011k3602663o732517O386648J0034510
11941a6254797J5556720J8033671P435985m826641l656952J623799m337705j3359711
11933B14369r625551J754886P407570R193531J1198174L675036j4796069k1397687
11925a2375741l464904J3770210N006685j2005905o718434J1403903J1012061
11918F627875n387681p489553Q868215J6629722N000540p039289o924846l448004
11910F836979k218775K134753N879328j897549j3974378j0339723P578284J5793989
11902I792908M721665r500547j4112244j3394136r710683J614360J3504396J0273197
$$ plain form
11955 4179006 -22718157 -44235028 -27124062 2064966 -1142416 -26751761 -29094958
11948 -29094958 -2311650 13508236 -2340775 -25943438 -32675955 -26289307 -16254797
11941 -16254797 -698077 17335594 24771579 19944938 16287986 17911785 13574080 214369
11933 214369 -9411182 -7656296 -248726 8944805 20142979 23818015 9021946 -12375741
11925 -12375741 -15840645 -2070435 2936250 -9069655 -15788089 -4384186 6627875
11918 6627875 1240194 -6249359 2618856 19248578 24249118 17209829 10284983 6836979
11910 6836979 4618204 6752957 12632285 10734736 -3239642 -13579365 -6001081 9792908
11902 9792908 14514573 5014026 -9098218 -22492354 -32203037 -30588677 -17084281 -6811084
11894f811084m448191r006828J575051R191007O515634P500966J5248809J0943871
11886C0709235j0487473k3262092q989420J2840664J4646919Q16053n146513J949222
11878A3076595P718131M583627j285465l921925k522539K809845Q014844L712109
11870C2185222j1817885k4426435j9978542l630448O630037K260442p882243r648755
11862c6308607J151485J4049766J4419662K237497m390237O481301J9460509J1240029
11854B8341405j2817492k3230568q964411Q181666Q435209k21555k602744o67977
11846c546467j717029p98361P027270J1340663J864293j1424082j1197705K031808
11838f419610J2751271J1750181K083122q799167j2068211k072264J1693462R346257
$$ plain form
11894 -6811084 -11259275 -20266103 -18691052 -9500045 -2984411 4516555 19765364 30709235
11886 30709235 20221762 -3040330 -12029750 810914 15457833 16273886 11127373 13076595
11878 13076595 20794726 25378353 24092888 20170963 17648424 20458269 28473113 32185222
11870 32185222 20367337 -4059098 -24037640 -27668088 -21038051 -18777609 -26659852 -36308607
11862 -36308607 -35157122 -21107356 -6687694 -4450197 -8840434 -2359133 17101376 28341405
11854 28341405 15523913 -7706655 -16671066 -8489400 -54191 -275746 -2878490 -3546467
11846 -3546467 -5263496 -6061857 965413 12306076 14170369 2746287 -8451418 -6419610
11838 -6419610 6331661 18081842 20164964 11365797 -702414 -2774678 8918784 18265041
11830A8265041j0528120k1642585o231583J4847152J1132416j0174167j4481054
11823a8812900O796418K3418929J2398258r765484j4319295q76601O550234m868735
11815E20824k1195986k1477728l154287J6210802J9527802Q187551k766734m211592
11807h359348p93299M79622j95123o79285j737746j162733O350742J6308893J3546028
11798B3757751n099924j9425456j1722085O478861J1037266K99277o772007k629141
11790d075458J113379k136937m005351O05624M977651N759297Q119976R563142
11782A9921323j563909k1877781k7492680p436898J5253451J4918495J384316
11775f893683K977295K0069409K3486412O50471k3516953k2892068o281084M82002
$$ plain form
11830 18265041 7736921 -13905664 -20137247 -5290095 5842321 -4331846 -18812900
11823 -18812900 -12016482 11402447 23800705 14035221 -284074 -1160675 5389559 520824
11815 520824 -20675162 -42152890 -45307177 -29096375 -9568573 -1381022 -4147756 -8359348
11807 -8359348 -9152647 -8673025 -8868148 -9547433 -11285179 -12447912 -6097170 10211723 23757751
11798 23757751 18657827 -767629 -12489714 -6010853 5026413 5325690 -1446317 -4075458
11790 -4075458 -2962079 -5099016 -9104367 -8498743 -3521092 2238205 10358181 19921323
11782 19921323 18357414 -3520367 -31013047 -38449945 -23196494 -8277999 -6893683
11775 -6893683 -3916388 16153021 39639433 40289904 16772951 -6119117 -12400201 -11918199
11767a1918199n006477j798988J6864000K9056983J6003945p919438j3046709
11760B2235117M539663J7682167N866772j7889957k7298451j8107871q118983
11753b1091543p098126m750079P695915J9953458J7474381L730214n375277m333047
11745F205896j791813k899656j972470L919993O749181L31849p844468o625451
11737c926939K849168R914377R089792M038338K19786R41677O771577J1457188
11729D1354964M307831j3496943k2232299p933800J2436279R701497j5348414
11722H789115l1143950j9969740P63173R991376J0415540J0557818M712810q530028
11714a4413886j0357062R594540K7375841J7272455n431330p983771N964719N242556
$$ plain form
11767 -11918199 -16924676 -18723664 -1859664 27197319 43201264 35281826 22235117
11760 22235117 26774780 44456947 50323719 32433762 5135311 -12972560 -21091543
11753 -21091543 -28189669 -32939748 -25243833 -5290375 12184006 15914220 10538943 6205896
11745 6205896 4414083 1514427 -458043 3461950 10211131 10542980 2698512 -3926939
11737 -3926939 -1077771 8836606 17926398 21964736 22184522 23126199 29897776 41354964
11729 41354964 45662795 32165852 9933553 1999753 14436032 24137529 8789115
11722 8789115 -22354835 -42324575 -41561402 -31570026 -21154486 -10596668 -5883858 -14413886
11714 -14413886 -24770948 -15176408 12199433 29471888 24040558 16056787 22021506 27264062
11706B7264062j2581291j7712643l095827K733170j0805497j4680220P161094
11699b1717152K4663148J0056187j5340443j6810984n42376N166005O07334N914431
11691h003850J6938127J2242286l397636l995649J0493496J1997312o685432j9233166
11683A0355488j1739413m674602j2853325j6565111L837159K9938648K9829831
11676B8128675N522194j1370944m599165R943930J1963255J865893o697933o706554
11668B8049351l134393l455887p697839q447270q37101R000556R393357k717586
11660B0153188j7547552k3143464j5998544j240493J1943099J4773690N685984
11653e374092n471786o197457L526577J0458618M730577p878625j2988284l409030
$$ plain form
11706 27264062 14682771 -3029872 -6125699 -3392529 -14198026 -28878246 -21717152
11699 -21717152 2945996 13002183 -2338260 -19149244 -19691620 -14525615 -13918281 -8003850
11691 -8003850 8934277 21176563 17778927 13783278 24276774 36274086 29588654 10355488
11683 10355488 -1383925 -6058527 -18911852 -35476963 -31639804 -1701156 28128675
11676 28128675 33650869 22279925 17680760 27624690 39587945 41453838 34755905 28049351
11668 28049351 24914958 21459071 13761232 5313962 4476861 13477417 22870774 20153188
11660 20153188 2605636 -20537828 -36536372 -37776865 -25833766 -11060076 -5374092
11653 -5374092 -10845878 -17043335 -13516758 -3058140 1672437 -6206188 -19194472 -22603502
11645b2603502J3833217K4083990J8943511N185806l007564k244342l361777j2419921
11637A8409418j8844840j2530180k003144k92470k121393M566464J1567131J347684
11629I8670j6424897j0525461K1580393M0424427J9256941j4780319j9174253
11622B0455501M519084J9422073R227852o372050q810957l392029p30121j09246
11614C4210107N88363k479927p983026o771949J307824K465888r739269k1042092
11606i444081j5690765P11897R559882M276174m270835m483786L164079R708884
11598f468551Q066961m54130p457278o413241n49714K023241N54987J889946P423528
11589a384251R226922L296221k818802k068108J286508R45883q4555K124750P59066
$$ plain form
11645 -22603502 -8770285 15313705 34257216 39443022 36435458 34191116 30829339 18409418
11637 18409418 -435422 -12965602 -14968746 -15261216 -17382609 -12816145 -1249014 98670
11629 98670 -16326227 -26851688 -5271295 35153132 54410073 39629754 20455501
11622 20455501 24974585 44396658 53624510 47252460 38441503 35049474 34319353 34210107
11614 34210107 34798470 32318543 24335517 17563568 18871392 21337280 11598011 -9444081
11606 -9444081 -25134846 -24422949 -14863067 -10586893 -14857728 -19341514 -16177435 -6468551
11598 -6468551 1598410 1144280 -6312998 -12726239 -13275953 -11252712 -10697725 -8807779 -1384251
11589 -1384251 7842671 11138892 8320090 6251982 7538490 8484373 8399818 10524568 11283634
11580A1283634j1032920k2656611j5826401P682080K3678185J5978109l416861
11573E689215j1962123m867142L535413J720754m882302k434118J2688400K6414964
11565B5903061K0957113k247343j9393737j1466135R908417J5352208m216397
11558C4797187k5739958k4130499k411453J5119201J1456885p929587k2353175
11551b1191399j4146267J3681025L5421214K7089925m416063k7209896k2660162
11544a3431623m566964N044163L534901J235899K150071M241075P546814R599079
11536A5353415L790336o545701o302042O518470J1316812k631857j3461275k89347
11528G748811J8814854J3567650q022214j3092180M3471J129423j6127704k1025606
$$ plain form
11580 11283634 250714 -22405897 -38232298 -30550218 -6872033 9106076 5689215
11573 5689215 -6272908 -11140050 -7604637 -5883883 -10766185 -13200303 -511903 25903061
11565 25903061 46860174 44612831 25219094 13752959 23661376 39013584 34797187
11558 34797187 9057229 -15073270 -17484723 -2365522 9091363 1161776 -21191399
11551 -21191399 -35337666 -21656641 13764573 40854498 36438435 9228539 -13431623
11544 -13431623 -17998587 -12954424 -9419523 -8183624 -6033553 -1792478 5754336 15353415
11536 15353415 19143751 12598050 6296008 12814478 24131290 21499433 8038158 7748811
11528 7748811 26563665 40131315 32109101 19016921 19060392 20189815 4062111 -16963495
11520a6963495O02498K0574581J4573801j228144k891411K389123k906721j1390606
11512B759626n700238Q453780J2058788L792042l324126o536064j1926728j6128136
11504a6551056j0481197J767372R707431J0985680R929770O870484J995642O34048
11496A4858174K867499n33626j0288274j2054215j327138L672570q006414j7056838
11488b7868262m342595J4464176J3239064j347061l656142N353270K641633j2017689
11480a3533606j3079066O511326K2546483J8389645O579718K206469J324366k945169
11472B8000166n680054l187643j909754m555535m411598j086694m170246j3454694
11464a0456052j3700909J259767J5574405J3042239j655361j2742894j2739927
$$ plain form
11520 -16963495 -16360997 4213584 18787385 17559241 14667830 17056953 14150232 2759626
11512 2759626 -2940612 5513168 17571956 21363998 18039872 11503808 -422920 -16551056
11504 -16551056 -27032253 -25264881 -15557450 -4571770 5358000 12228484 14224126 14858174
11496 14858174 17725673 17192047 6903773 -5150442 -6477580 -2805010 -10811424 -27868262
11488 -27868262 -32210857 -17746681 -4507617 -5854678 -9510820 -4157550 -1515917 -13533606
11480 -13533606 -26612672 -20101346 2445137 20834782 27414500 29620969 30945335 28000166
11472 28000166 22320112 19132469 17222715 12667180 8255582 7168888 2998642 -10456052
11464 -10456052 -24156961 -22897194 -7322789 5719450 4064089 -8678805 -21418732
11457b1418732m187497P345178J4934052J3584100O336915O9168m301507q218285
11449D143392o565690L367947Q990152k224874j7325111j0922600J5167234K9771666
11441B4402116J5410719r654482k0377241j4185365j939215R523258J4588757
11434A7768547P216556o431982j0091814j589928K343280n669926j0423480r71424
11426g850171R176289M170844q626046j1789418l203564P044388J3445851J4668524
11418A7036697P380686n930991j2571280n235292O527259J0028315N271395q16105
11410B1690684n195202o540733l675503j767955p192407j3041516o770166N362412
11402a7130386M319893o881912l372041J6606256K0599223n092763k5289491p654225
$$ plain form
11457 -21418732 -25606229 -18261051 -3326999 10257101 16594016 16663184 12361677 4143392
11449 4143392 -2422298 945649 9935801 7710927 -9614184 -20536784 -5369550 24402116
11441 24402116 39812835 30158353 9781112 -4404253 -6343468 3179790 17768547
11434 17768547 24985103 18553121 8461307 6871379 9214659 3544733 -6878747 -7850171
11426 -7850171 1326118 5496962 -3129084 -14918502 -18122066 -11077678 2368173 17036697
11418 17036697 24417383 18486392 5915112 679820 7207079 17235394 22506789 21690684
11410 21690684 16495482 9954749 6279246 4511291 -2681116 -15722632 -22492798 -17130386
11402 -17130386 -12810493 -19692405 -23064446 -6458190 14141033 9048270 -16241221 -23895446
11394b3895446K4787415K8796966N955529p782574k337387l43482j0053824j3373359
11386A753838l145142M368352O56815k867604j075276m595286j4629360j5235292
11378c4768955j100341J1133332J0157403O063463P617081N769174n532084j2358026
11370a3018953l002164Q501334J668872j7301200k2483458n123784J4951899J7365947
11362a8441507O241408K00745N914384J1450144N158005p327035j0717063j088702
11354h609621R066021P968072j285025p816433p401038l919672j373577n39787
11346a3911060n70480K50601K557228L304417J82756j595245M246027J1518310
11338E982554P071055p423544j4096386n163819N266986M241969j636250k169031
$$ plain form
11394 -23895446 891969 29688935 35644464 27861890 25524503 25181021 15127197 1753838
11386 1753838 -1391304 2977048 3633863 766259 -309017 -4904303 -19533663 -34768955
11378 -34768955 -35869296 -24735964 -14578561 -8515098 -898017 4871157 -660927 -13018953
11370 -13018953 -16021117 -7519783 -5850911 -23152111 -45635569 -50759353 -35807454 -18441507
11362 -18441507 -12200099 -11999354 -6084970 5365174 10523179 3196144 -7520919 -8609621
11354 -8609621 456400 8424472 7139447 -676986 -8078024 -11997696 -13371273 -13911060
11346 -13911060 -14481540 -14230939 -11673711 -8369294 -8186538 -9781783 -5535756 5982554
11338 5982554 13053609 5630065 -8466321 -13630140 -8363154 -4121185 -5757435 -7926466
11330g926466j244312m104024k828510Q152813J6192235R100162k829139l542487
11322A0970272J741377j780525r878693o419210P556746J5497991J1802875M823306
11314C4314139k091691j0825580j4362062m933990P446161O891219k108657l274292
11306A1055247K015083j43298o251628l12667J2682569R971156r169650j8477952
11298A368860o355692P868785Q334538L794441L307402j92603q359173p310116
11290B456442N050010Q147635o841306j7287924m773152J3187982J1286139l795641
11282G430185q226407j07836L799917O9023N81483P658587J0736399O153489J161273
11273B9256113p78766l011231n550805n389192m844517q070372j2132267j1253939
$$ plain form
11330 -7926466 -9170778 -13274802 -16103312 -7950499 8241736 17341898 14512759 10970272
11322 10970272 12711649 10931124 1052431 -5366779 2189967 17687958 29490833 34314139
11314 34314139 32222448 21396868 7034806 2100816 9546977 16438196 14329539 11055247
11306 11055247 13070330 12927032 6675404 6362737 19045306 29016462 19846812 1368860
11298 1368860 -4986832 2881953 11216491 15010932 18318334 18125731 9766558 2456442
11290 2456442 7506452 15654087 8812781 -8475143 -13248295 -60313 11225826 7430185
11282 7430185 -796222 -904058 2895859 2964882 3546365 11204952 21941351 28094840 29256113
11273 29256113 28477347 25466116 19915311 14526119 9681602 1611230 -10521037 -21774976
11265b1774976n542804K519699J2691529J9719410J2632915o930268j7704801
11258d389296n603481J3137416J3611264j983868j0694641m660042J906087l57243
11250I66196m596439n770007r219664j5108168j2171951M065630K0263340K1674036
11242A02973J0261378q99964l759039Q369L864207J341099q231252j6299884j3799804
11233b7411917m530298j041443n183182m201518Q130749J8413752J2406275j765240
11225e182822l525788J0219257K0233257J2578671k552613p368013j662068K50595
11217B2990476p045856j3051071r035840j173356k48779n886565q063396m63312
11209b1977699J2928265K1657120J6280829k859851k0981521k0215714j299231
$$ plain form
11265 -21774976 -27317780 -24798081 -12106552 7612858 20245773 13315505 -4389296
11258 -4389296 -9992777 3144639 16755903 14772035 4077394 -582648 1323439 966196
11250 966196 -3630243 -9400250 -18619914 -33728082 -45900033 -41834403 -21571063 102973
11242 102973 10364351 9464387 5705348 5713717 9577924 10919023 2687771 -13612113 -27411917
11233 -27411917 -31942215 -32983658 -38166840 -42368358 -34237609 -15823857 -3417582 -5182822
11225 -5182822 -8708610 1510647 21743904 34322575 31769962 24401949 22739881 22990476
11217 22990476 15944620 2893549 -6142291 -7315647 -7564426 -13450991 -21514387 -21977699
11209 -21977699 -9049434 12607686 28888515 26028664 5047143 -15168571 -16467802
11202a6467802J3870732R028160n625208j0117348l734093j775064q123652r535728
11194c2480003J489309J4938190J9202531J5263988R570350M307832K54481p18734
11186C1827944r55079n798236j3369907j4815508p706227O62959N549336Q988700
11178D383982R751477K935110o616059n991039M257856O562109o005256j4828491
11170e550311k754581J7500684J9819406J329229j5863318j6484133q469717n619874
11162a6092615p491465l018885J1817257K5659492K2493794J385061j7578517
11155A7174122j3870387P617098K0984876J1536702p614195j5902379j0656847
11148I268990l895594l253959o122564p117048l044270N846753J4202123J5140051
$$ plain form
11202 -16467802 -2597070 6431090 805882 -9311466 -13045559 -14820623 -22944275 -32480003
11194 -32480003 -30990694 -16052504 3150027 18414015 27984365 32292197 32546678 31827944
11186 31827944 30872865 25074629 11704722 -3110786 -10817013 -10154054 -4604718 4383982
11178 4383982 14135459 17070569 10454510 4463471 8721327 15283436 9278180 -5550311
11170 -5550311 -8304892 9195792 29015198 30344427 14481109 -2003024 -10472741 -16092615
11162 -16092615 -23584080 -26602965 -14785708 10873784 33367578 34752639 17174122
11155 17174122 3303735 10920833 31905709 43442411 35828216 19925837 9268990
11148 9268990 5373396 2119437 -4003127 -11120175 -14164445 -8317692 5884431 21024482
11140B1024482Q308671o90845q635165j3947921j0019030O217424J9487383R518825
11132C1263824j6672096k7624836j1053168Q540081Q747787J042716M089736Q955588
11124G289632j600357j6980610j3802262L454840R201593r66633o647677m69424
11116b0520898K419104k974741l88154J5586823K3774982Q699069j2618112j4455707
11108d77634J464634J1851367N548059n202810n169788M306863R106885J299988
11100B2727564r381053p021928P126434J2651052j071646j5747436r721014P108082
11092F670055P075811j0528991j6858395n86384J1733394k327660k3505261j8812771
11084d7140202Q764713K5432472J5356638j729574m225092K581050J989099n352454
$$ plain form
11140 21024482 29333153 28642308 20007143 6059222 -3959808 2257616 21744999 31263824
11132 31263824 14591728 -13033108 -24086276 -15546195 -6798408 -5755692 -1665956 7289632
11124 7289632 5689275 -11291335 -25093597 -21638757 -12437164 -13403797 -20051474 -20520898
11116 -20520898 -18101794 -21076535 -21464689 -5877866 17897116 26596185 13978073 -477634
11108 -477634 987000 12838367 18386426 13183616 8013828 12320691 21427576 22727564
11100 22727564 13346511 6324583 13451017 26102069 25030423 9282987 -438027 6670055
11092 6670055 13745866 3216875 -13641520 -14227904 -2494510 -4822170 -28327431 -47140202
11084 -47140202 -38375489 -12943017 2413621 684047 -3541045 -959995 1029104 -4323350
11076d323350m196166Q770607J6892369O870248j0368691j2942009J278930J0442133
11068A2424071q48958j8988079j9497902J5480J8068401J7594840L386189r125016
11060C029026j1378814n503486R70574J651139k154004k079289M899062R221077
11052a344715K591606o665343n201313K754711J252851r985675j3320947j972809
11044c1891634Q353955M948855k192778J835192J3073886J6639178R260070O73561
11036B0700285j982092l86443R69684l30968k866509j687179L866895L341217
11028B1624890j1564785k6593277j7062487J3184600K7932675Q614471j4514247
11021A621840n314708K2295015K3873392q394345l4049511k3445646M253565J4535785
$$ plain form
11076 -4323350 -8519516 251091 17143460 24013708 13645017 703008 1981938 12424071
11068 12424071 11575113 -7412966 -26910868 -26895388 -8826987 8767853 12154042 3029026
11060 3029026 -8349788 -13853274 -12882700 -11231561 -13385565 -15464854 -10565792 -1344715
11052 -1344715 1246891 -5418452 -10619765 -7865054 -6612203 -16597878 -29918825 -31891634
11044 -31891634 -23537679 -18588824 -20781602 -18946410 -5872524 10766654 20026724 20700285
11036 20700285 18718193 18331750 19301434 18970466 16103957 14416778 18283673 21624890
11028 21624890 10060105 -16533172 -33595659 -20411059 7521616 16136087 1621840
11021 1621840 -3692868 18602147 42475539 34081194 31683 -23413963 -19160398 -4624613
11013d624613K720120j1474472j5169316r237534L001133J5868316J8421972P217485
11005F723091m321088l119289L628089P30293q717769p434526O979021J5856067
10997A0323889O951921p712148j0090338q94874M223993k865075j3491647j3615191
10989b7169470O12246J7404258J8351200k148088k5322457k4560164J910363K4732594
10981a6189518J8747252m503197j3562514p51555R683995o80972j7680249j6738506
10973d1675264J666975J4999354J1393052K419997J777328O083946M308711l650378
10965b676279q366327o620865m967764o915094o055772L014204J3339519J2927236
10957f321142J442978p986995m907681O384919J3214365Q386817m424402j4443564
$$ plain form
11013 -4624613 -1904493 -13378965 -28548281 -37785815 -34784682 -18916366 -494394 6723091
11005 6723091 2402003 -717286 2910803 3641096 -5076673 -12511199 -5532178 10323889
10997 10323889 17275810 9563662 -526676 -1421550 2802443 -62632 -13554279 -27169470
10989 -27169470 -26557224 -9152966 9198234 7050146 -18272311 -42832475 -40922112 -16189518
10981 -16189518 2557734 -1945463 -15507977 -16259532 -6575537 -7256509 -24936758 -41675264
10973 -41675264 -40008289 -25008935 -13615883 -11195886 -9418558 -3334612 974099 -2676279
10965 -2676279 -11042606 -17663471 -22631235 -29546329 -35602101 -32587897 -19248378 -6321142
10957 -6321142 -4878164 -12865159 -17772840 -11387921 1826444 10213261 5788859 -8654705
10949h654705j1031526O512401K3052675J9437009l284959j9424447q625370J6004745
10941A3985823K3254319M271133j8170744k2460074j3810891r835033j3971022
10934c6736489j4929657n333194R786487J9945953J7844414M756914p401211m760816
10926a6827599J1408997K1833167J1371058j0218846j8606695m271937J6619497
10919A1307642K1220213M152433j8255520k4644064r738818R673600J2235553
10912E951039l372330j6321053r049173J1489919K3741995J7432077J784821r175792
10904B2481503j1063615q391843n937659l830240O33057P544125J1644965P469821
10896B0550114k719794r997107q994737l391638k9132j255447l999389l180180
$$ plain form
10949 -8654705 -19686231 -13173830 9878845 29315854 26030895 6606448 -2018922 13985823
10941 13985823 37240142 41511275 23340531 880457 -12930434 -22765467 -36736489
10934 -36736489 -51666146 -56999340 -47212853 -27266900 -9422486 -4665572 -12066783 -16827599
10926 -16827599 -5418602 16414565 27785623 17566777 -1039918 -5311855 11307642
10919 11307642 32527855 36680288 18424768 -6219296 -15958114 -6284514 5951039
10912 5951039 2578709 -13742344 -22791517 -11301598 12440397 29872474 31657295 22481503
10904 22481503 11417888 3026045 -2911614 -6741854 -6108797 1435328 13080293 20550114
10896 20550114 17830320 7833213 -1161524 -4553162 -4582294 -5837741 -9837130 -13017310
10888a3017310L251252R160723L986230j1678977k0026466p368259J3231396J7082493
10880e378918L559258l582763O441415J6845416J3555343O450190P032391O649164
10872E1571496n151595j8633098j9909182j4103636j3121380j4097461r269973
10865d2714829l149172l7432R479026K6949845K9090352J245362k8513762k3313024
10857c0963634O634421K0089972Q043367j518315J738037j517835j3064999p471360
10849a8030346J5972429J9865969r412847l1193411j3123777J5844863J3939915
10842f137205n797102k835911J9847109K3685684K383400r571244K438548J1011526
10834C5024805l355994k0163148j5705449j238387j153633j3672885j7083297
$$ plain form
10888 -13017310 -9766058 -605335 3380895 -8298082 -28324548 -35692807 -22461411 -5378918
10880 -5378918 -1819660 -5402423 1038992 17884408 31439751 37889941 44922332 51571496
10872 51571496 46419901 27786803 7877621 -6226015 -19347395 -33444856 -42714829
10865 -42714829 -45864001 -45901433 -36422407 -9472562 19617790 20863152 -7650610 -30963634
10857 -30963634 -24329213 -4239241 3804126 2285811 4023848 2506013 -10558986 -18030346
10849 -18030346 -2057917 17808052 8395205 -22798206 -35921983 -20077120 -6137205
10842 -6137205 -11934307 -14770218 5076891 28762575 31145975 21574731 24013279 35024805
10834 35024805 31668811 11505663 -4199786 -5438173 -6591806 -20264691 -37347988
10827c7347988m147953J0465873J3501489Q347052N812714Q827894R780934J347922
10819A6587937j1731590j5688780n654474N557195M588700k571966o12314Q966473
10811e58819Q829536n482964j6030575r069735N083990J0322102R115933J3074439
10803A5283907J8743886J1709081p862173k1730675j8178452n273164M819464
10796b488126J0794822J4286220J0160223l634399j5868236j5221504p666552
10789i637552o375116q753571j160592J3722159J4808361m542701k0359881r326263
10781c1625156J6903986K6594690J0284115j0073875j2942041j222743R000576
10774F919552J0093270O092040K215096j270463o157365j0791688r649013j230908
$$ plain form
10827 -37347988 -41495941 -31030068 -17528579 -9181527 -3368813 5459081 15240015 16587937
10819 16587937 4856347 -10832433 -16486907 -10929712 -6341012 -8912978 -9525292 -558819
10811 -558819 8270717 2787753 -13242822 -22312557 -17228567 -6906465 2209468 15283907
10803 15283907 34027793 45736874 37874701 16144026 -2034426 -7307590 -2488126
10796 -2488126 8306696 22592916 32753139 29118740 13250504 -1971000 -9637552
10789 -9637552 -16012668 -24766239 -25926831 -12204672 2603689 -1939012 -22298893 -31625156
10781 -31625156 -14721170 11873520 22157635 12083760 -858281 -2081024 6919552
10774 6919552 17012822 23104862 25319958 24049495 17892130 7100442 -2548571 -3779479
10766c779479N379787J86144j0481054r050328N521375J1021415m863047k1038737
10758b7103924j2165992J1856607K0613754R015579l41472K243277K048648o962740
10750g96263r016406K282493Q050802m275380j7366876j0964958P093777J6384010
10742h608801J3969833R237622L118472o881267j2581256o590835J407299r11576
10734g840509o767189k536025O906751O603734j107835k56824J0873043J7692183
10726B3567329J4544165J0647807R424206K885756r072945j3430741n299151K285548
10718C5551974j537054r458702r455947k922845N94702j332418l548100l192953
10710D698657k061149j278352P87932N279913R394456O920577m995805j8182171
$$ plain form
10766 -3779479 1600308 1786452 -8694602 -17744930 -12223555 -1202140 -6065187 -27103924
10758 -27103924 -39269916 -27413309 -6799555 2216024 1874552 4117829 6166477 -796263
10750 -796263 -9812669 -7530176 520626 -3754754 -21121630 -32086588 -24992811 -8608801
10742 -8608801 5361032 14598654 17717126 10835859 -1745397 -8336232 -6928933 -7840509
10734 -7840509 -14607698 -17143723 -10236972 -3633238 -4741073 -4997897 5875146 23567329
10726 23567329 38111494 48759301 58183507 61069263 51996318 38565577 33266426 35551974
10718 35551974 34014920 24556218 15100271 12177426 12772128 11439710 7891610 4698657
10710 4698657 2637508 1359156 2147088 7427001 16821457 23742034 18746229 564058
10702E64058j8463051l605373J0296966Q716886j500354l704770K831842M103319
10694g60477l911000r121220m452308J502682R51646p29845K543784N348482J156518
10685g471738m716649l168062M444554R445275P971567K436095l527130m898805
10677E15107K936563J4609226J4879172j796828j9119500j8329283l855284M141630
10669f019197j140743p048211l458137N414362J3387835K0260350K2145839R944687
10661E3486785j3173072k6694276j7828470j224165M93891j1436578j4879348
10654c1255233J470857K3520268K9509204J2222705j6287888l4109973k6099668
10647d1029728K72584J9260160J5627970K614902J03202M813358N66737r973232
$$ plain form
10702 564058 -17898993 -21504366 -11207400 -2490514 -3990868 -7695638 -4863796 -760477
10694 -760477 -4671477 -13792697 -18245005 -16742323 -15790677 -16520522 -13976738 -8628256 -7471738
10685 -7471738 -12188387 -15356449 -10911895 -1466620 6504947 8941042 5413912 515107
10677 515107 3451670 18060896 32940068 31143240 12023740 -6305543 -10160827 -6019197
10669 -6019197 -7159940 -14208151 -17666288 -12251926 1135909 21396259 43542098 53486785
10661 53486785 40313713 13619437 -4209033 -5433198 -4939307 -16375885 -31255233
10654 -31255233 -29784376 -6264108 23245096 35467801 19179913 -14930060 -41029728
10647 -41029728 -40757144 -21496984 -5869014 -3254112 -3150910 1662448 2229185 -7744047
10639g744047q827251M494656J1338210P481599Q813161J6379092Q179101j9250450
10631B0864071l3258975j2529306J5618549J4445786p997958j6463713l313517
10624b2635063R305512J1079199J1704156J2658829M758076p044268p261993J390649
10616A3955097J634518o359249o136565J842587j627j0749180q708431Q322991
10608f199859J4092143l016451j9143070j2701964M480327J0816854N676877r14304
10600f909447p607973j2974718o699397J2272384K4859004J6292830j896468r479218
10592G856997n200396k932924r344152j6566920j1702816R715924L2830206L1100514
10584C5756433n36013k8795643k1664347M137034P874132r621757q439024J9776847
$$ plain form
10639 -7744047 -16571298 -12076642 -738432 6743167 15556328 31935420 40114521 20864071
10631 20864071 -12394904 -24924210 -9305661 5140125 -2857833 -19321546 -22635063
10624 -22635063 -13329551 -2250352 9453804 22112633 26870709 19826441 12564448 13955097
10616 13955097 15589615 9230366 3093801 4936388 4934761 -5814419 -14522850 -6199859
10608 -6199859 7892284 4875833 -14267237 -26969201 -22488874 -11672020 -5995143 -6909447
10600 -6909447 -14517420 -27492138 -34191535 -21919151 2939853 19232683 17336215 7856997
10592 7856997 2656601 -276323 -9620475 -26187395 -37890211 -28174287 4655919 35756433
10584 35756433 35220420 6424777 -15239570 -11102536 -3228404 -12850161 -21289185 -1512338
10576a512338L3447386R190447j9536164j7461396J425108Q494581P786501J3572842
10568C5406967J3948928m769390k3757897j9156544j771981M775729L266291O441501
10560A4383604M766324j2469315k4946402r210471J8159830K3147506N615026
10553A9446102p693051p274993l330338J624818Q680471N762621j2196784k2979378
10545a7960532r755671O120205L44495r853157K340351K0844419J4146238n583153
10537F43195l802362J2362173P893365j3400180j4442424P920312J9034698Q888798
10529B5097575K282208N352138j913902j6051624r679852J2123344J1287202j6361202
10521A2135887k8358251m463476K3051006K4444583J0385200j110307j0700913
$$ plain form
10576 -1512338 31935048 41125495 21589331 4127935 5553043 14047624 21834125 35406967
10568 35406967 49355895 44586505 20828608 1672064 -99917 4675812 7942103 14383604
10560 14383604 19149928 6680613 -18265789 -27476260 -9316430 13831076 19446102
10553 19446102 11753051 4478058 1147720 2772538 11453009 17215630 5018846 -17960532
10545 -17960532 -27716203 -21595998 -21251503 -31104660 -28764309 -7919890 6226348 643195
10537 643195 -3159167 9203006 17096371 3696191 -10746233 -2825921 16208777 25097575
10529 25097575 27379783 32731921 30818019 14766395 5086543 17209887 28497089 12135887
10521 12135887 -16222364 -20685840 2365166 26809749 37194949 36084642 25383729
10514B5383729j6072566o908157O910798L567974q531549k122247J4535918Q193554
10506B4957454j3659997r940478J6510662J8062012j0539026j9067006O863814
10499A3187435K0158000J498349q157507O407418M034749k1552937j6289643K2374319
10491B1660183J7554119l6122585j5413101J30587188K35185118J21330350j19645481
10484C55135791k28319732j25891092J0631116K7795820k1550188k5118296R719104
10477B402523J3737834j1105682j5365128J942231N718385l985568j020478J2205310
10469D529427J3487377M370555J333973J347905p328446j6635797j2252133m79283
10461a1626422M081248K400144J616851r39249n840637k988768P514413P114815
$$ plain form
10514 25383729 9311163 2403006 9313804 12881778 4350229 2227982 16763900 24957454
10506 24957454 11297457 1356979 17867641 35929653 25390627 6323621 13187435
10499 13187435 33345435 34843784 26686277 33093695 37128444 15575507 -714136 21660183
10491 21660183 39214302 3091717 -12321384 118265804 353450922 474781272 355135791
10484 355135791 126816059 924967 11556083 39351903 17801715 -7316581 2402523
10477 2402523 16140357 5034675 -10330453 -8388222 -2669837 -6655405 -7675883 4529427
10469 4529427 18016804 22387359 23721332 25069237 17740791 1104994 -11147139 -11626422
10461 -11626422 -7545174 -5145030 -3528179 -4467428 -10308065 -13296833 -5782420 1332395
10453A332395j0400235k2058191r690675J0673600J5017989P122467N150740R780190
10445F928280R790677N997685O134869N613102m845096j8733866k0062686o910899
10437a6087934O240190P998323J222514m141793k962031j89710m179710j1705532
10429b3805683o591792J6122205L3878029K3346566l479551j4512729n010945
10422A9946100k27735r935499j4194939k841146M974265l850379j2415327m884899
10414b3429559N852760L561283k748447O01872M476025m446531j5760499j2045992
10406d3939088J316951P802979P823554J1142580J4199724R401687M763970R478742
10398B1991099J2197607K9258j3192200p124632P684258N966519p020168m460543
$$ plain form
10453 1332395 -9067840 -31126031 -40816706 -30143106 -15125117 -8002650 -2851910 6928280
10445 6928280 16718957 22716642 28851511 34464613 29619517 10885651 -9177035 -16087934
10437 -16087934 -9847744 -1849421 -626907 -4768700 -7730731 -7920441 -12100151 -23805683
10429 -23805683 -30397475 -14275270 19602759 42949325 39469774 24957045 19946100
10422 19946100 19718365 9782866 -4412073 -7253219 -2278954 -6129333 -18544660 -23429559
10414 -23429559 -17576799 -14015516 -16763963 -16162091 -11686066 -16132597 -31893096 -43939088
10406 -43939088 -42622137 -34819158 -26995604 -15853024 -1653300 7748387 12512357 21991099
10398 21991099 34188706 34217964 21025764 13901132 21585390 27551909 20531741 16071198
10390A6071198J0654014N574975k3993185l8237208j3247613K0484068K4220684
10383A526933N214868m331317J255760L406225k507373m363873p29127j120408
10375a648312l274023K116126P428983k405015j7779762j2709887J1691616K4093142
10367G512868J1116547m076870m009291l476396j3891015j5134897P230725K6093843
10359A1365514J1874159j4751737j2182289J4617508K2624661O17273j7715765
10352A6449324j2731110l175786k285080L822290J7730067J5199755r521771k3794206
10344A693483q638593P662154j170318j3352112K78985K1731225J5739716r838065
10336A4106475j9266436q138451k117250p135635n182857N094527N408030m885838
$$ plain form
10390 16071198 26725212 32300187 8307002 -29930206 -43177819 -22693751 1526933
10383 1526933 6741801 2410484 3666244 7072469 4565096 201223 -527904 -1648312
10375 -1648312 -4922335 -2806209 4622774 2217759 -15562003 -28271890 -16580274 7512868
10367 7512868 18629415 14552545 10543254 7066858 -6824157 -21959054 -14728329 11365514
10359 11365514 23239673 8487936 -3694353 10923155 33547816 34165089 16449324
10352 16449324 3718214 542428 -1742652 2079638 19809705 35009460 25487689 1693483
10344 1693483 -6945110 717044 -453274 -13805386 -13526401 8204824 23944540 14106475
10336 14106475 -5159961 -13298412 -15415662 -22551297 -27734154 -22639627 -17231597 -22117435
10328b2117435o123979N346032J1808302O746559J858576J039611l008481p020015
10320a1470830j267277P090220M494962k30679R422802K0393012O033358k3919012
10312A0546556l1668737j0831014O125207M309826M257358J4164392J2205990
10305I109578o920335j3840479M523239J7883192K934355j7118126j2576246O456069
10297i548753J4139979J0303055P607741L021801q174960j2518039p28654J0624275
10289A4726445N593124l970505k284176J894485l659875q276648m47328O672658
10281A0248180K68650n218425L207825O373104j3363036l1310086j5312546J7154625
10273b7951709K2825113J456548p631268P107714J5340172K375038o897217M625641
$$ plain form
10328 -22117435 -28241414 -22895382 -11087080 -4340521 -2481945 -1442334 -4450815 -11470830
10320 -11470830 -12738107 -5647887 -1152925 -1383604 8039198 28432210 34465568 10546556
10312 10546556 -21122181 -31953195 -25827988 -21518162 -17260804 -3096412 9109578
10305 9109578 2189243 -11651236 -7127997 10755195 13689550 -3428576 -16004822 -9548753
10297 -9548753 4591226 14894281 22502022 25523823 17348863 4830824 4102170 14726445
10289 14726445 20319569 16349064 14064888 15959373 12299498 4022850 3575522 10248180
10281 10248180 10516830 5298405 8506230 14879334 1516298 -29793788 -45106334 -27951709
10273 -27951709 -5126596 -3670048 -11301316 -4193602 11146570 13521608 6624391 11250032
10265A1250032J6206980O994794q929858q731310K193219L611463n393569q889961
10257H311790k269015K334147k336879o647322J288145J5925915J7469683k214484
10249C1861980k3138230j8227267R470673K6731969J3981160q233204j0224389
10242B2222692M977083J0687700k348102j6316477j5191177l615157N090655N288638
10234A0795855M6113m975629o263574n099385m233160j691803N139424J0036113
10226C753954N159551k318906J283336R737354L201289j3978806j2559959J1719890
10218E997703K2176769j902915k6379701j3474447J7172141J9796415n977005
10211A7408960k0145607p362673P857031P423916K40015m483574q459163p046504
$$ plain form
10265 11250032 27457012 34451806 25521948 16790638 18983857 22595320 17201751 8311790
10257 8311790 6042775 8376922 6040043 -607279 680866 16606781 34076464 31861980
10249 31861980 8723750 -9503517 -32844 26699125 40680285 32447081 22222692
10242 22222692 27199775 37887475 35539373 19222896 4031719 416562 5507217 10795855
10234 10795855 10841968 5866339 -397235 -5496620 -9729780 -11421583 -6282159 3753954
10226 3753954 8913505 6594599 7877935 17615289 20816578 6837772 -5722187 5997703
10218 5997703 28174472 26271557 -108144 -13582591 3589550 23385965 17408960
10211 17408960 -2736647 -10099320 -2242289 5181627 5421642 938068 -7521095 -14567599
10203a4567599O722849K0168707J4237312k221347l470791R784103J2593572K82462
10195D3529268o226706j203778j901442j1027949j0248046J435394J787064j1918248
10187D225557j3232712O578826J9818461P842285r816701j0989871l184682o06107
10179F35056O65292M443130K30316j2988241j6629614m787133K401200m018053
10171c0048047l461947J3864270K2727019O044449j1248589l946726Q862761j399166
10163A394024k0079974j3629613J2594214K4023849J2221379n11111m104998r022016
10155B885754j5121612r124577O096548J1829645M956546R99105M997119N964141
10147A3482669J026928l86283K728375J868640j552596R96775M563317k500480
$$ plain form
10203 -14567599 -7844750 12323957 26561269 24339922 20869131 30653234 43246806 43529268
10195 43529268 37302562 36098784 34197342 23169393 12921347 14356741 16143805 4225557
10187 4225557 -9007155 -2428329 17390132 25232417 15415716 4425845 1241163 635056
10179 635056 1300348 5743478 5973794 -7014447 -23644061 -28431194 -26029994 -30048047
10171 -30048047 -33509994 -19645724 3081295 9125744 -2122845 -6069571 2793190 1394024
10163 1394024 -18685950 -32315563 -19721349 4302500 16523879 16012768 11907770 2885754
10155 2885754 -12235858 -21360435 -15263887 -3434242 1522304 2521409 7518528 13482669
10147 13482669 14509597 14123314 16851689 18720329 17167733 18164508 22727825 20227345
10139B0227345j2849905p958524Q213381J1328238m385011j7004507j2618602
10132a5047585l287336p42446K187158J1774332J7347525R491789k855121o949013
10124A1919303m196820k140163n84340L725737Q278037R140558O437826P11573
10116C3291711p801455j3945538j1687091m666247j831113k823251n80863K788483
10108g255364j164626q709687o695371M080311P645738q12183p025636k034845
10100b1971663N095080O459809P545810J0892625P031421o278961j3541771l976125
10092h743775J0373451J2164299J483375j0155540j5438004j1310997J777400
10085a9849791J1933102M759497j0809825p885579J5169651K4201638J257040
$$ plain form
10139 20227345 7377440 -581084 7632297 18960535 14575524 -2428983 -15047585
10132 -15047585 -18334921 -19077367 -16890209 -5115877 12231648 21723437 18868316 11919303
10124 11919303 7722483 5582320 4997980 8723717 17001754 26142312 32580138 33291711
10116 33291711 25490256 11544718 -142373 -4808620 -6639733 -9462984 -10043847 -7255364
10108 -7255364 -8419990 -17129677 -23825048 -19744737 -12098999 -12911182 -19936818 -21971663
10100 -21971663 -16876583 -10416774 -2870964 8021661 15053082 8774121 -4767650 -8743775
10092 -8743775 1629676 13793975 15277350 5121810 -10316194 -21627191 -19849791
10085 -19849791 -7916689 -3157192 -13967017 -21852596 -6682945 17518693 18775733
10078A8775733k2247029j3197155R894120R783399n718904j156874J8204382J1502424
10070B5840096k2474181l3234732K52037K9663046J0563047k8145225l0122947
10063d7658859M153169K6545163J6898547J016876j681327k109128p027022j576325
10055a1438906J8234047K7957974J0237359j5397129j9861636n272370K977472
10048G436811n708130j7148648j5493036k17999J7076512K1046907K962282k5206197
10040a5251498l3668019p047565L0888494M1712654J9115031p352526j4841766
10033A3554805j0995770r201144m289602J0677711K1727779J1012846j2424713
10026B0061912k1937957j0826229J121158N04345j845088O009410J4940201R704508
$$ plain form
10078 18775733 -3471296 -16668451 -6774331 3009068 -2709836 -3866710 14337672 25840096
10070 25840096 3365915 -29868817 -29616780 46266 10609313 -17535912 -47658859
10063 -47658859 -43505690 -16960527 -61980 954896 -726431 -2835559 -9862581 -11438906
10055 -11438906 6795141 34753115 44990474 29593345 9731709 4459339 7436811
10048 7436811 1728681 -15419967 -30913003 -31131002 -14054490 6992417 9954699 -15251498
10040 -15251498 -48919517 -55967082 -25078588 16634066 35749097 28396571 13554805
10033 13554805 2559035 -6642109 -10931711 -254000 21473779 32486625 20061912
10026 20061912 -1876045 -12702274 -11581116 -11076771 -12921859 -6912449 8027752 17732260
10018A7732260o283457j6484078j4394492o601598K814025J5491980K6672105
10011A8946745K4677078P303274j1648135j7976916j2289273n173773l581110
10004B57890o692160r907774q131370O11665J0716727J2380908L261063p541020
9996e044071j0570948o057797M49142N725686P522487L672980q29540M667359
9988d64702J8181948J9165706l605490k7549890k1834578O511365J8797161O57422
9980I858942j7264957p777909J1741094J0266891o629252q963521O991169J4605746
9972A2828203K060683j1000008q307579M94760L435329O486388J4459615J4020617
9964C4478008l780717k0919500j5252932N034971J2910748J936419q675993o224558
$$ plain form
10018 17732260 11448803 -5035275 -19429767 -26031365 -23217340 -7725360 18946745
10011 18946745 43623823 50927097 39278962 21302046 9012773 3839000 257890
10004 257890 -6434270 -16342044 -24473414 -23861749 -13145022 -764114 2496949 -5044071
9996 -5044071 -15615019 -21672816 -21223674 -15497988 -7975501 -4302521 -5132061 -464702
9988 -464702 17717246 36882952 33277462 5727572 -16107006 -9595641 9201520 9858942
9980 9858942 -7406015 -15183924 -3442830 6824061 194809 -8768712 -1777543 12828203
9972 12828203 14888886 3888878 -4418701 -3923941 -488612 5997776 20457391 34478008
9964 34478008 30697291 9777791 -5475141 -440170 12470578 14406997 5731004 -493554
9956d93554P13791K224014J484666K730960J467150m704326q555221n449677k322208
9947a2904405n455819q755495m036291M943736R526181J0842962J5049444J7552975
9939B6763288O302805j7199710l2556257k2863200M565628K6531760K8827540
9932B0371854J6582785K713786o155307j0894769j3105186j1994136o968015k48204
9924i697192M130604L689155j0655k536631j024070L095061O902551R831922J1687436
9915B6068181Q928649p49302j0300046q904795Q29569J889206j2613680k4632519
9907a9484737j5213646M887841R045147l444564m893695J4787284K6375489M048720
9899A6107839l1056265l6739536q211316J8421975J8832289P513047N996363J0675036
$$ plain form
9956 -493554 220237 2444251 3928917 6659877 8127027 3422701 -5132520 -10582197 -12904405
9947 -12904405 -18360224 -27115719 -31152010 -26208274 -16682093 -5839131 9210313 26763288
9939 26763288 33066093 15866383 -16689874 -39553074 -34987446 -8455686 20371854
9932 20371854 36954639 39668425 33513118 22618349 9513163 -2480973 -9448988 -9697192
9924 -9697192 -5566588 -1877433 -1888088 -4424719 -5448789 -2353728 4548823 14380745 26068181
9915 26068181 34996830 34247528 23947482 15042687 15872256 17761462 5147782 -19484737
9907 -19484737 -34698383 -29810542 -20765395 -24209959 -29103654 -14316370 12059119 16107839
9899 16107839 -14948426 -51687962 -59899278 -41477303 -22645014 -15131967 -9135604 1539432
9891A539432P066064l015696o859322k390241K197920L317968K217579l394345
9883F79359j3164673j4664967K615485K4967945K4661241k700554k7544614k2868653
9875b8019431J471989J4470238N383243p399581o974719M47076R53325m131994
9867b3799854l409416L530982M719567m520462j2977584r122156L552232J2612613
9859b9414078J1916137M863335k605024n979186k773263M731265R822600R284478
9851a53736P686724R137960R794715M984392j881137n999341j0765698j9179671
9843f375792k1229925n951685J5704322J9242147J970994r368514L588547K2628564
9835B0208658J8335185q310689k8395009k3636190m518986R386879J1113529N207738
$$ plain form
9891 1539432 8605496 5589800 -1269522 -3659763 -1461843 1856125 4073704 679359
9883 679359 -12485314 -27150281 -24534796 433149 25094390 22393836 -5150778 -28019431
9875 -28019431 -26547442 -12077204 -6693961 -14093542 -21068261 -20621185 -19667860 -23799854
9867 -23799854 -27209270 -23678288 -18958721 -23479183 -36456767 -45578923 -42026691 -29414078
9859 -29414078 -17497941 -12634606 -15239630 -21218816 -23992079 -19260814 -9438214 -153736
9851 -153736 7532988 16670948 26465663 31450055 29568918 23569577 12803879 -6375792
9843 -6375792 -27605717 -33557402 -17853080 1389067 3360061 -6008453 -2419906 20208658
9835 20208658 38543843 30233154 1838145 -21798045 -26317031 -16930152 -5816623 -608885
9827f08885j947782m979523j338291M366262L489657n500928j3727835j2572436
9819c2819761l433345N547343Q633382N935084Q62690l027606l674118m94367
9811b2470698O432481J5221612K0078566J4869491J812185p898710p004143j866898
9803A9173886l291105j0925266j4126811o967244M591171J0355760N374341p266270
9795c081538j8016030j7081531m534542Q033140J1088350Q131223O636759M827179
9787c996990j428732m641350N298999J9926442J8149102l136597k1480844j8990048
9779a0300018m767148K243614n31814k204502K481327R502071J4384271J3917872
9771B4725673M886021q936151j4167561k561347J5795725K3272958J4949620K24232
$$ plain form
9827 -608885 -2556667 -7536190 -8874481 -4508219 -1018562 -6519490 -20247325 -32819761
9819 -32819761 -36253106 -30705763 -22072381 -16137297 -15274607 -18302213 -21976331 -22470698
9811 -22470698 -16038217 -816605 19261961 34131452 35943637 28044927 21040784 19173886
9803 19173886 15882781 4957515 -9169296 -16136540 -11545369 -1189609 4184732 -3081538
9795 -3081538 -21097568 -38179099 -42713641 -34680501 -23592151 -15460928 -8824169 -3996990
9787 -3996990 -5425722 -10067072 -4768073 15158369 33307471 30170874 8690030 -10300018
9779 -10300018 -15067166 -12823552 -13355366 -15559868 -13078541 -3576470 10807801 24725673
9771 24725673 29611694 20675543 6507982 3946635 19742360 43015318 57964938 58189170
9763E8189170j0730240j3510454p789535J244320L874782k835387r236707o992769
9755A2213180k309139m764727r942615o933118J910257M350981r39084l116733
9747i530998J083003K384510l300812p100853k503553M047448M233456l62061
9739a1049860l439209k806859P72160O213966R711554O564320j623417p938444
9731c595789r481607q395110m087455N418264J4026539J1721410Q66660m054227
9723B418685K628200R183858M604253o050925j1311295q266909r44409P093922
9715f44620J1824808R029832J567194j927724k16834j528834q296540j1947022
9707b139740q342348m791001m803129j115593P055804O787489n807000j2936477
$$ plain form
9763 58189170 47458930 33948476 26158941 27403261 31278043 28442656 19205949 12213180
9755 12213180 9904041 5139314 -4803301 -11736419 -9826162 -5475181 -6414265 -9530998
9747 -9530998 -8447995 -6063485 -9364297 -16465150 -18968703 -14921255 -10687799 -11049860
9739 -11049860 -14489069 -17295928 -16523768 -10309802 -598248 5966072 4342655 -3595789
9731 -3595789 -13077396 -21472506 -25559961 -20141697 -6115158 5606252 6472912 2418685
9723 2418685 5046885 14230743 18834996 12784071 1472776 -6794133 -7738542 -644620
9715 -644620 11180188 20210020 21777214 19849490 19632656 18103822 9807282 -2139740
9707 -2139740 -10482088 -15273089 -20076218 -21191811 -14136007 -7348518 -13155518 -26091995
9699b6091995k215385R971382L671586j0017328n794709J3220443J8917450K404721
9691D066165j3710756j1280320P92476P564358Q783713Q067369J291844j0927029
9683e352180j4885203k332007J3663956J4561414L56093j3017665j3925640l871310
9675b4802542P927968J1427122L182813p177329n050483R077512J6823648O531532
9667A7940241r241717j1500253j804261K012782p035366j6231193j2214864K071369
9659c6003262J2938932J1712799J763069o532393o064627K20912L438747N06418
9651a8019405k019591J159541M448446p38482j1316537j4290124m291527P916945
9643c7150734Q746636m90603m874504M883858J9290247K0697064O249585o303336
$$ plain form
9699 -26091995 -28307380 -18335998 -14664412 -24681740 -30476449 -17256006 1661444 4066165
9691 4066165 -9644591 -20924911 -20132435 -12568077 -3784364 4283005 5574849 -5352180
9683 -5352180 -20237383 -22569390 -8905434 5655980 6012073 -7005592 -20931232 -24802542
9675 -24802542 -16874574 -5447452 -2264639 -9441968 -14492451 -5414939 11408709 17940241
9667 17940241 8698524 -2801729 -4605990 -2593208 -9628574 -25859767 -38074631 -36003262
9659 -36003262 -23064330 -11351531 -9588462 -16120855 -22185482 -21964570 -18525823 -18019405
9651 -18019405 -20038996 -18879455 -14431009 -15169491 -26486028 -40776152 -45067679 -37150734
9643 -37150734 -28404098 -28894701 -33769205 -28885347 -9595100 11101964 17351549 11048213
9635A1048213m84306J5902573J8853608m28098k2490414k4001281p503244L318693
9627e784256m278324j6021134j0815056J0892359K7465924K2974639N047510p387209
9619B2094453p277899l019962k543069m175318m715556o164390q782397o294562
9611b0878700L563252J0889320O734038j054785J566617J1143096R802681n696128
9603A6069391j5198537m458146J1394447Q839475q217122j2571259O359835K5249456
9595B7467540J8490826n959815j7444080m406325J1826441Q891999o504026j1996449
9587B0366111k681254N806032L700771j524959k739284m836671j1540449j5411881
9579h861584j0943737m903273k913769J588983J2392108J7539606P470066n472306
$$ plain form
9635 11048213 10563907 26466480 45320088 44891990 22401576 -1599705 -9102949 -5784256
9627 -5784256 -10062580 -26083714 -36898770 -26006411 1459513 24434152 29481662 22094453
9619 22094453 14816554 11796592 9253523 5078205 362649 -5801741 -14584138 -20878700
9611 -20878700 -17315448 -6426128 307910 -746875 819742 11962838 21765519 16069391
9603 16069391 870854 -3587292 7807155 16646630 8429508 -4141751 2218084 27467540
9595 27467540 45958366 39998551 22554471 18148146 29974587 38866586 32362560 20366111
9587 20366111 17684857 23490889 27191660 25666701 22927417 18090746 6550297 -8861584
9579 -8861584 -19805321 -24708594 -27622363 -26033380 -13641272 3898334 11368400 5896094
9571E896094m698268L301923J215478p299791l771869J0473904J3714902J02900
9563A8935273j0910653q056489m539082r989042j1443342J725037J5292719J1856918
9555B871339j156045n006518Q03536K241704l831124o734604j389740M302547
9547g898905J430014r419767j8370462j3357909O980484K5385522K1953661J665513
9539H368151q555077L429161J8143976J4471565j276170j0477675j0041923p948929
9531F113079m914793J037802L377794j600195l579403M081794Q502274j374114
9523A1644238j2080864p526830J239056l513662r735189M997753K6161888J6180328
9515B7366718k2698327m2127867j6401328K1165390K9669169J4411787M277878
$$ plain form
9571 5896094 1197826 4499749 5715227 -1584564 -5356433 5117471 18832373 18935273
9563 18935273 8024620 -31869 -4570951 -14559993 -26003335 -24278298 -8985579 2871339
9555 2871339 1715294 -3291224 -2487688 -245984 -4077108 -10811712 -12201452 -7898905
9547 -7898905 -6468891 -15888658 -34259120 -47617029 -40636545 -15251023 6702638 8368151
9539 8368151 -186926 3242235 21386211 35857776 34581606 24103931 14062008 6113079
9531 6113079 1198286 2236088 5613882 4013687 434284 4516078 13018352 11644238
9523 11644238 -436626 -7963456 -6724400 -10238062 -19973251 -14975498 11186390 27366718
9515 27366718 4668391 -37459476 -53860804 -32695414 -3026245 11385542 15663420
9508A5663420L904941n30199p009435j914230J0658889J2724973K006691o554515
9500B8950535p175858q732726j3316073j0762601Q01625P495974N45066r616113
9492a1810171q801340K148758J2605295J7037873J5097080M530272j3412071k5050140
9484g654444j5438651Q594853K0066217N179927j5647534j3927693O420628J3897751
9476A491054m447450k3335096j6307778O139748J3834711L94205j2400014q701734
9468d3332354M756075J6229963K2386478K0201576N219871j3987533j6983895
9461e509819J378262J8554562J2199420r704428k0821365j1984959M80006O89178
9453a4719143o566021o433522L779119J1420775O828408k295517j081794J0119652
$$ plain form
9508 15663420 19568361 19038162 12028727 10114497 20773386 33498359 35505050 28950535
9500 28950535 21774677 13041951 -274122 -11036723 -10235098 -2739124 -2194058 -11810171
9492 -11810171 -20611511 -18462753 -5857458 11180415 26277495 30807767 17395696 -7654444
9484 -7654444 -23093095 -14498242 5567975 10747902 -4899632 -18827325 -12406697 1491054
9476 1491054 -2956396 -26291492 -42599270 -36459522 -22624811 -22230606 -34630620 -43332354
9468 -43332354 -38576279 -22346316 40162 20241738 25461609 11474076 -5509819
9461 -5509819 -4131557 14423005 26622425 16917997 -3903368 -15888327 -15408321 -14719143
9453 -14719143 -21285164 -27718686 -23939567 -12518792 -5690384 -7985901 -9067695 1051957
9445A051957J3964315J584018j0935177l699019J6072452K0847467L80994k3633456
9437A5633551k5374043m534920J8190526K5083454J4347184k730707j1463137
9430B9151908o508027J743124l16183j0348691j3460754n618926j1268n313430
9422a0682247j1950014q838550j203052R9153k571624J129351J1048686J6210987
9414f757310J1023957J300767n684566q855357j0160280r890305p184026k423430
9406c8630550K167825M117704L180424J289778m96865j858767Q08771J0909093
9398a8512587K0356975J3299565q920672j9629617j399721K2319908J5337440
9391B2851291j7078715l2415942j1440470J7384032K3472073J2777520M509198
$$ plain form
9445 1051957 15016272 16600290 5665113 1966094 18038546 38886013 39267007 15633551
9437 15633551 -9740492 -14275412 3915114 28998568 43345752 40615045 29151908
9430 29151908 22643881 24387005 24070822 13722131 261377 -5357549 -5368817 -10682247
9422 -10682247 -22632261 -31470811 -32673863 -32574710 -35146334 -34016983 -22968297 -6757310
9414 -6757310 4266647 5567414 -117152 -8972509 -19132789 -29023094 -36207120 -38630550
9406 -38630550 -36462725 -32345021 -29164597 -27874819 -28371684 -30230451 -29421680 -18512587
9398 -18512587 1844388 15143953 6223281 -13406336 -14806057 7513851 22851291
9391 22851291 5772576 -26643366 -38083836 -20699804 2772269 15549789 20058987
9384B0058987j783388j2600708j7149601m344297J2894432J5425507O999766K454268
9376B1954966K97040p950347j3349363k260958J4960215J5984597J992919n885471
9368B5743598j807884M35354l570426l387943J666411l16966q425176o748139
9360C588829O563657J2655422K053455j1026358j2721785p152703k008960L202577
9352d845866O288826m1466j0960516j0147056L123483Q759210j432271q462018
9344a7717674J765964J3496594P798367n187828m289798O611927O128739q921923
9336c15632j9887116j5660059m148607N760937J4376996K0301013J6033247R85494
9328A7446273j2260579j1424327J516171J3535457J4164049M780665l035421O80161
$$ plain form
9384 20058987 18275599 5674891 -11474710 -15819007 -2924575 12500932 19500698 21954966
9376 21954966 22252006 14301659 952296 -1308662 13651553 29636150 31629069 25743598
9368 25743598 23935714 24371068 20800642 17412699 19079110 18762144 10336968 3588829
9360 3588829 10152486 22807908 24861363 13835005 1113220 -6039483 -8048443 -4845866
9352 -4845866 1442960 1401494 -9559022 -19706078 -16582595 -7823385 -9255656 -17717674
9344 -17717674 -15951710 -2455116 5343251 155423 -4134375 2477552 8606291 -315632
9336 -315632 -20202748 -35862807 -40011414 -34250477 -19873481 427532 16460779 17446273
9328 17446273 5185694 -6238633 -4722462 8812995 22977044 27757709 24722288 25402449
9320B5402449J2031762J5998024M354324j3422369k1422005j5588576o026841
9313A326768l778784r220393j2358973m031130J0997487J5503742J340293j4938952
9305a5159942j0752819J0300335K2011871J3097131R19508P28518L102515m015382
9297B0231735j0909183l765643Q381805P252918m161504p965378j846756L67698
9289G585692m213042l481780N240318Q433399r86304j2347340j4563137r668091
9281b4000285l235664N087526J4940775K0124941J6294697O303067m689398j2335482
9273A8490177j2289573n435788j390032n765465q370402J307245J2170735N405953
9265D122850j2151830j3677469N166104J6447662L011761j4573849j0838647O788553
$$ plain form
9320 25402449 37434211 53432235 57786559 44364190 22942185 7353609 1326768
9313 1326768 -2452016 -11672409 -24031382 -28062512 -17065025 -1561283 -220990 -15159942
9305 -15159942 -25912761 -15612426 6399445 19496576 20416084 21144602 24247117 20231735
9297 20231735 9322552 5556909 13938714 21191632 17030128 9064750 7217994 7585692
9289 7585692 3372650 -109130 5131188 13564587 12578283 230943 -14332194 -24000285
9281 -24000285 -27235949 -22148423 -7207648 12917293 29211990 35515057 30825659 18490177
9273 18490177 6200604 764816 -625216 -6390681 -14761083 -13453838 -1283103 4122850
9265 4122850 -8028980 -21706449 -16540345 -92683 2919078 -11654771 -22493418 -15704865
9257a5704865J4055001P044312L25359m62301j198315j667375L036841P702174
9249A3130831L292208m903367m285823J962263j662695j5791653k1619740p942477
9241c7820453J3170346K3414284J8276938N183914o834286j0681219m418186M374022
9233D665360N406288r41113n493753n593484o909336q805252k305075J2171417
9225g804948J9008765Q228890q710101j3875995n448212M373005P321596M765220
9217G858220o1104n654893r799382j0855162j0267237q762733k987498Q402930
9209c2126859J8226884J7066365N339170o119182p718416l11704O867822N888800
9201G112880j092376l080529N984239J5690352R294589j2319034k6358840j4987753
$$ plain form
9257 -15704865 -1649864 5394448 5719807 5257506 4059191 2391816 5428657 13130831
9249 13130831 16423039 11519672 7233849 9196112 7533417 -8258236 -29877976 -37820453
9241 -37820453 -24650107 -1235823 17041115 22225029 15390743 4709524 291338 4665360
9233 4665360 10071648 9130535 3636782 -1956702 -8866038 -17671290 -19976365 -7804948
9225 -7804948 11203817 19432707 10722606 -3153389 -8601601 -4228596 3093000 7858220
9217 7858220 7797116 2142223 -7657159 -18512321 -28779558 -37542291 -40529789 -32126859
9209 -32126859 -13899975 3166390 8505560 2386378 -5332038 -5643742 1224080 7112880
9201 7112880 6020504 2939975 8924214 24614566 33909155 21590121 -4768719 -19756472
9193a9756472J0542998K2348114R480152j0487836j4090200J139161J5885692
9186A5061609J2476573m437223j3567473m134367Q926158N048039j1279744j4911354
9178f817782L080101K0536123J5474036l829276j4752497j3067939j0342159p848095
9170a7567488L029141J6437737J3178017p776299k0507734o502007J8416911K5340739
9162B4049017R251990r594881j4249362o879642J304500L549805j73126n852358
9154A405943p914078l630441L605474P820864O755183K572052j882712m608042
9146D124243l772455R75645O418743P297664J151936q111603j1865317m181178
9138g962322J0586868J9848765J5518634L084184n226473m277977O09597J542438
$$ plain form
9193 -19756472 -9213474 13134640 22614792 12126956 -1963244 -824083 15061609
9186 15061609 27538182 23100959 9533486 5399119 14325277 19373316 8093572 -6817782
9178 -6817782 -3737681 16798442 32272478 28443202 13690705 622766 -9719393 -17567488
9170 -17567488 -14538347 1899390 15077407 7301108 -13206626 -19708633 -1291722 24049017
9162 24049017 33301007 23706126 9456764 2577122 3881622 7431427 7258301 1405943
9154 1405943 -6508135 -10138576 -6533102 1287762 8042945 10614997 8732285 4124243
9146 4124243 351788 1327433 7746176 15043840 16195776 8084173 -3781144 -7962322
9138 -7962322 2624546 22473311 37991945 41076129 35849656 31571679 32181276 33723714
9130C3723714n000774j6031020k2111168j4031348M153262J4377849O063209p424925
9122f281201o326357O430084J0277004m69712q552930j877219R315727J1086822
9114A3602218M744340k328401r202859j4050425r200624M364791J1832816O559039
9106F320895J971490O924274O893774r535326k2483475p821229J8573009J7849517
9098A8692929j2098794k9319129q482956K3370361K8163933P290843j1392947
9091A6224240j7322866k1012055k3993365j2883124J4400032L7211905L5162456
9084B7787223J1517817j2646625k0616277j1715489L207131J1915909Q610742
9077A8060431k947611j2588556j2412553m506817J040082j686791n692681Q4195
$$ plain form
9130 33723714 28722940 12691920 -9419248 -23450596 -19297334 -4919485 1143724 -6281201
9122 -6281201 -12607558 -6177474 4099530 3629818 -4923112 -6800331 2515396 13602218
9114 13602218 18346558 16018157 6815298 -7235127 -16435751 -12070960 -238144 6320895
9106 6320895 8292385 15216659 22110433 12575107 -9908368 -17729597 843412 18692929
9098 18692929 6594135 -22724994 -31207950 -7837589 20326344 27617187 16224240
9091 16224240 -1098626 -22110681 -46104046 -58987170 -44587138 -7375233 27787223
9084 27787223 39305040 26658415 6042138 -5673351 -2466220 9449689 18060431
9077 18060431 15112820 2524264 -9888289 -14395106 -13355024 -15041815 -20734496 -20650301
9069b0650301J2939221J6117688J560033j5837033j6774121m035372L081969j981485
9061b5579401n478195K191351J0285722M908041q871682j3874541m457206P646214
9053c3229697J0365163N784550M718953J0624166J3525409K805757j5524590k1677696
9045b2607985o718266J2887353J4636110j028434j3180970r636231K92119L776607
9037b1579697J344024M43133K922547N094909L209526m167196j2379507j0122285
9029c5234546O635357K1787005J5631735n008248j2125496L570886J9118003J4695940
9021B9070636P45398m629283m563298r952496j4417043o554612M894056L101072
9013b305570p227217o942198M927261R594436r57163j3221575j3203471n86406
$$ plain form
9069 -20650301 -7711080 8406608 9966641 -5870392 -22644513 -26679885 -23597916 -25579401
9061 -25579401 -31057596 -28866245 -18580523 -13672482 -22544164 -36418705 -40875911 -33229697
9053 -33229697 -22864534 -17079984 -12361031 -1736865 11788544 14594301 -930289 -22607985
9045 -22607985 -29326251 -16438898 -1802788 -2831222 -16012192 -25648423 -25356304 -21579697
9037 -21579697 -20235673 -19792540 -16869993 -11775084 -8565558 -12732754 -25112261 -35234546
9029 -35234546 -28599189 -6812184 8819551 3811303 -8314193 -4743307 14374696 29070636
9021 29070636 29816034 25186751 20623453 10670957 -3746086 -10300698 -5406642 -2305570
9013 -2305570 -9532787 -16474985 -11547724 -1953288 -2910451 -16132026 -29335497 -29921903
9005b9921903J7255651K8654460J9372247q995802k7564300j1876805J8423522
8998E347070K1128541p028799k4648807q958801J1927105P665042p797787n895322
8990h261758P360323N917957r228528j3044548K2930Q372052L91517q526086k994115
8981a9990256R353960J1526084Q07677r821487q070954L613041R206427j872467
8973e247975j6232647r371005J7300024L0558283J0843015j5693663j4008442
8966a852410P326330J1887413o338835j7674201q618168L00470l431089k931862
8958b1332352J0858379J6232901o09539j4563325j63063K2887342J8564637p126198
8950B4748782j5613689L099192J7984447Q663918o710018o710567P65501j098912
$$ plain form
9005 -29921903 -12666252 15988208 35360455 26364653 -1199647 -13076452 5347070
8998 5347070 26475611 19446812 -5201995 -14160796 -2233691 5431351 -2366436 -8261758
8990 -8261758 -901435 5016522 -4212006 -17256554 -17233624 -8861572 -8470055 -16996141 -19990256
8981 -19990256 -10636296 889788 1697465 -8124022 -16194976 -12581935 -3375508 -5247975
8973 -5247975 -21480622 -30851627 -13551603 17006680 27849695 12156032 -1852410
8966 -1852410 5473920 17361333 11022498 -6651703 -15269871 -14969401 -18400490 -21332352
8958 -21332352 -10473973 5758928 5149389 -9413936 -9576999 13310343 31874980 24748782
8950 24748782 9135093 12234285 30218732 38882650 32172632 25462065 26227566 25128654
8942B5128654p942847n496796L678084N372388k159618p378199n293890k639511
8934C268265l556270l271047J263984M503674J031907n060887n344033P89172
8926f375235M715613N23872o151236n817133P09912L339029j083260k955891M360881
8917h733448J2404424J0563450L045385K47655j64540p234836j5647035j0438591
8909a5957536O276820J4128635N300287m405407l958836m327209j3108216j4164667
8901c0216129N499685K6334494K1109598k287931j2717212m058129Q78731n620123
8893a077016l594292J3938462K1719290K544368k0814129j8503579K084674J1678320
8885G976098L978835l275376k749909l636086o817598k492707O091468L631537
$$ plain form
8942 25128654 17185807 11689011 15367095 20739483 18579865 11201666 5907776 3268265
8934 3268265 -288005 -3559052 -2295068 2208606 3240513 -1820374 -7164407 -6375235
8926 -6375235 -1659622 -1135750 -7286986 -13104119 -12394207 -9055178 -10138438 -13094329 -8733448
8917 -8733448 3670976 14234426 17279811 17527466 17362926 10128090 -5518945 -15957536
8909 -15957536 -9680716 4447919 9748206 5342799 1383963 -2943246 -16051462 -30216129
8901 -30216129 -24716444 1618050 22727648 20439717 7722505 3664376 4543107 -1077016
8893 -1077016 -4671308 9267154 30986444 33530812 12716683 -5786896 -3702222 7976098
8885 7976098 11954933 8679557 5929648 2293562 -4524036 -7016743 -925275 2706262
8877B706262p777229o703606J1307584K1280908O693883j3360425j3699530o85414
8869b37567K221193p189734j0780430k030680O947407Q202488O336220L810089
8861G278986k577756q718388n169849M759690O634800j331267m222774L817230
8853D70672Q392298q80264j2046204r751201J463582P106567M773324J660629
8845A189403m46929k515211J395382J4736061K5023778J6780868m678678j8427639
8837C3057035j5885438p977632l976718L19689Q823336J4027129P809384n616325
8829C0580460j4894642j4419586p437186o51789J063929j947724m207820j103327
8821a3017685N372065R333839P645150J627446m067404k617208P526909J3971835
$$ plain form
8877 2706262 -5070967 -11774573 -466989 20813919 27507802 14147377 447847 -237567
8869 -237567 1983626 -5206108 -15986538 -18017218 -11069811 -2867323 3468897 7278986
8861 7278986 4701230 -4017158 -9187007 -4427317 2207483 876216 -3346558 470672
8853 470672 8862970 7982706 -4063498 -13814699 -12351117 -5244550 -471226 1189403
8845 1189403 742474 -1772737 -377355 14358706 39382484 56163352 51484674 33057035
8837 33057035 17171597 9193965 5217247 5536936 14360272 28387401 36196785 30580460
8829 30580460 15685818 1266232 -6170954 -6822743 -5758814 -7706538 -11914358 -13017685
8821 -13017685 -7645620 1688219 9333369 10960815 6893411 4276203 11803112 25774947
8813B5774947J810200j9849074k0187804R950682L5225781K0295201j7106187
8806C5913746k9198437p050942J0383291j470577j9447039j4432501O571425J9167713
8798D36679J5927610K437297j7640182l3557328k5818974M686247K6348962J8115266
8790i064423O29196J557587J1452743N219885j0626031r134951Q992332J6247669
8782A5274007L960739q296763r659964j0697419j4992947r862695O390923J6006758
8774a1877361J0397304L108354M956762Q589630O726279M494374M658118O49970
8766C1703430p278265q458951j949478n05238p300100r427082k178940J924204
8758c470420k999508n447684O89668M782119J005313j282493J346583q90997o971987
$$ plain form
8813 25774947 27585147 7736073 -12451731 -2501049 32724732 53019933 35913746
8806 35913746 6715309 -335633 10047658 8577081 -10869958 -25302459 -18731034 436679
8798 436679 16364289 18801586 1161404 -32395924 -58214898 -53528651 -27179689 -9064423
8790 -9064423 -8435227 -6877640 4575103 9794988 -831043 -9965994 -973662 15274007
8782 15274007 19234746 10937983 1278019 -9419400 -24412347 -34275042 -27884119 -11877361
8774 -11877361 -1480057 1628297 6585059 15174689 21900968 26395342 31053460 31703430
8766 31703430 24425165 15966214 14016736 13511498 6211398 -3215684 -5394624 -3470420
8758 -3470420 -6469928 -11917612 -11227944 -6445825 -5440512 -6723005 -5376422 -6267419 -13239406
8749a3239406j203927J4370191J4809658m054911j1154954P796179K0248162N04989
8741B8075981k2061099j0547289J4062970O637407k3823155k7731068J892772
8734c3493481J9810544N969504n704660Q628048K2885971J0746446r207297r395390
8726A0239685R12149m90307o561122J709947J5575648J1689606o891022j5923358
8718A0261226r886585o219389j1415240j1322366O88073J0189149N468617k992189
8710a5228704J273968J5320012J9648972M119470j7671416k3711163j0399555
8703b6648416L236188J897062m331261L142443J9138800J9350164j255841j7462254
8695b933115j0856604L695835M534959k868229k74706R114629O753808p923705
$$ plain form
8749 -13239406 -14443333 -73142 14736516 10681605 -473349 7322830 27570992 28075981
8741 28075981 6014882 -4532407 9530563 16167970 -7655185 -35386253 -33493481
8734 -33493481 -13682937 -7713433 -13418093 -4790045 18095926 28842372 19635075 10239685
8726 10239685 11151834 10661527 4100405 5810352 21386000 33075606 26184584 10261226
8718 10261226 374641 -5844748 -17259988 -28582354 -27894281 -17705132 -12236515 -15228704
8710 -15228704 -13954736 1365276 21014248 25133718 7462302 -16248861 -26648416
8703 -26648416 -23412228 -21515166 -25846427 -22703984 -3565184 15784980 14529139 -2933115
8695 -2933115 -13789719 -10093884 -5558925 -8427154 -8701860 412769 7166577 -757128
8687g57128j6287250j1138654m254813j811153L728735J2125786R612865n388582
8679a4170194j2458361N91739J6013898J2403651k015233l636193Q539321J2977470
8671A8246098J098393j0861212r441552k337756l67193N78041O235943P542414
8663A0693176m804090j8887062j4737260M864550J7009913J2423018N715139P231882
8655A9509266O668792l980490j1699676m361168N304747o6245j0772086n207160
8647d604020J0331664P577469j6858217l1579179j6645369Q250077J6604507J1288965
8639a5634103Q434458O438361m332431j5707874j2112636J379645O355474J714431
8631b3464675K857149J2256348J5242405P205522J772907N983950Q125766r16881
$$ plain form
8687 -757128 -17044378 -28183032 -32437845 -34248998 -30520263 -18394477 -8781612 -14170194
8679 -14170194 -26628555 -26036816 -10022918 2380733 365500 -3270693 5268628 18246098
8671 18246098 19344491 8483279 -958273 -3296029 -3663222 -3085181 3150762 10693176
8663 10693176 5889086 -12997976 -27735236 -22870686 -5860773 6562245 12277384 19509266
8655 19509266 26178058 22197568 10497892 6136724 11441471 11375226 603140 -4604020
8647 -4604020 5727644 13305113 -3553104 -35132283 -51777652 -43527575 -26923068 -15634103
8639 -15634103 -7199645 -761284 -5093715 -20801589 -32914225 -31534580 -25179106 -23464675
8631 -23464675 -20607526 -8351178 6891227 14096749 15869656 21853606 29979372 29062491
8623B9062491j1846054j2877124p205962l891196k810710P66202N338967O146456
8615B683070K607438l193116q565350p330661N215254K0331826K0632557K923059
8607C5304077j5565443k0253158j5318181r100134M72078J3187340J5188666j137519
8599B777726j7559023j1755520Q302912J4324204o35425j3601831p159017Q280595
8591a7025379J4651729J0116388K994646l207142p525135n733181J991201O275056
8583B538183J760450k452975L793095J4073123J2936208j748557j5080903j4268314
8575A550310l144494M597810J504434o776821q865568p18450R609538J2117031
8567I873790P673594M943328N483613J422974q976525j4128209n483357P187182
$$ plain form
8623 29062491 17216437 4339313 -2866649 -6757845 -9568555 -8802353 -3463386 2683070
8615 2683070 5290508 2097392 -6467958 -13798619 -8583365 11748461 32381018 35304077
8607 35304077 19738634 -514524 -15832705 -24932839 -24460761 -11273421 3915245 2777726
8599 2777726 -14781297 -26536817 -18233905 -3909701 -4545126 -18146957 -25305974 -17025379
8591 -17025379 -2373650 7742738 10737384 7530242 5107 -5728074 -3736873 2538183
8583 2538183 4298633 1845658 5638753 19711876 32648084 30899527 15818624 1550310
8575 1550310 -1594184 3003626 4508060 -2268761 -11134329 -11852779 -2243241 9873790
8567 9873790 17547384 22490712 27974325 29397299 20420774 6292565 809208 7996390
8559G996390P632023m595520j4897358j4168710p007964M19121Q558290J6639688
8551E75960J6937937M528220j2240836j8306213q128236Q724492J8143564J5161349
8543B5396237O542817R70324j258291o317609j5421457k0736634j5831832n094035
8535c1750480K943968P396160J2187263J4431104O789638p127286j1255580K320804
8527d064409J9133306J7587778m948397k9053668l4819935j9799135L795804K2053877
8519c0114779K7042587J8154377K129734r696727r582144q33312N181839J429929
8511C711504o561102p068136L492880J5280468J5728901M066893p438136p216060
8503A3997212K733278R949733P001804J14337p45661K657375j328358j5409628
$$ plain form
8559 7996390 15628413 11032893 -3864465 -18033175 -25041139 -24622018 -16063728 575960
8551 575960 17513897 22042117 9801281 -8504932 -16633168 -7908676 10234888 25396237
8543 25396237 31939054 32909378 31651087 25333478 9912021 -10824613 -26656445 -31750480
8535 -31750480 -28806512 -21410352 -9223089 5208015 11997653 4870367 -6385213 -4064409
8527 -4064409 15068897 32656675 27708278 -1345390 -36165325 -55964460 -52168656 -30114779
8519 -30114779 -3072192 15082185 17211919 7515192 -2066952 -2900264 2281575 3711504
8511 3711504 -2849598 -9917734 -6424854 8855614 24584515 28651408 21213272 13997212
8503 13997212 16730490 26680223 33682027 33796364 33050703 35708078 34379720 18970092
8495A8970092k5009442j5987399M986966J7580883J2711181j68614r582138j3484560
8487i983031j2382212m360502P018446J1207166M711423k812925l625547k656353
8479a2883535m774814k985296Q571595J9870606J7545206M646479o139562j1421242
8471A2429437j4258919j0980158N81517O996535m372502j9259478j1873362J3944048
8463b6792882K5990899J0856256p649253p265595J887943Q44786o838988p115985
8455a6082819j297428R92362J730571P435874J2409118P712209j717226o059209
8447E123452p665062j1872655j0991394K281398J4341947P108829j0168700j0818784
8439b2660969P702871J7426063P91026k3952668k8440908r375781J2582120J8315434
$$ plain form
8495 18970092 -6039350 -22026749 -17039783 541100 13252281 13083667 3501529 -9983031
8487 -9983031 -22365243 -26725745 -19707299 -8500133 -3788710 -6601635 -10227182 -12883535
8479 -12883535 -17658349 -20643645 -12072050 7798556 25343762 29990241 23850679 12429437
8471 12429437 -1829482 -12809640 -12228123 -5231588 -9604090 -28863568 -40736930 -26792882
8463 -26792882 -801983 10054273 2405020 -4860575 -2972632 -2127846 -8966834 -16082819
8455 -16082819 -17380247 -16387885 -14657314 -7221440 5187678 12899887 11182661 5123452
8447 5123452 -2541610 -14414265 -25405659 -23124261 -8782314 -1673485 -11842185 -22660969
8439 -22660969 -14958098 2467965 3258991 -20693677 -49134585 -58510366 -45928246 -27612812
8431b7612812O112100j0236968j3391922J305095J8858221K0227464M883033j0318575
8423a0174364j3228783o619891K286999R064106Q238983l055140j4433735r910037
8415c7831862Q533688J9014958Q446215r899146j6159636r159277j251849J912654
8407c6394255L672704M854428K923991Q5710J312590M874692M005278j355467
8399a6020329k775604L914704J0629943P105987m118610r376979j675390R303366
8391c012912R989242J124921m995375k925614J212775L230465N612668O115796
8383A6351966k326825j3903358j0501269Q559140J7089759L0194j8620306j0692791
8375a4013490J0446631J1517006m974069n894286J3913990K0657912j440889k2090691
$$ plain form
8431 -27612812 -21500712 -31737680 -45129602 -43824507 -24966286 -4738822 144211 -10174364
8423 -10174364 -23403147 -30023038 -27736039 -18671933 -10432950 -13488090 -27921825 -37831862
8415 -37831862 -29298174 -10283216 -1837001 -11736147 -27895783 -37055060 -38306909 -36394255
8407 -36394255 -32721551 -27867123 -24943132 -24857422 -23544832 -18670140 -14664862 -16020329
8399 -16020329 -18795933 -14881229 -4251286 2854701 -1263909 -10640888 -12316278 -3012912
8391 -3012912 6976330 8101251 3105876 180262 1393037 4623502 10236170 16351966
8383 16351966 14025141 121783 -10379486 -1820346 15269413 15299607 -3320699 -14013490
8375 -14013490 -3566859 7950147 2976078 -2918208 10995782 31653694 30212805 8122114
8367H122114j2961483R307041J2814171k067735j1396427o187385K910610P438496
8359G979402O132082k471972j4588024j7305934n152681R151122J2942179J0136083
8351F822257P405142n9100j3630958j8769969o133044R227102Q697667l144673
8343i585576j0459794j0115511n502325O673908K2850103K4173786N015301r459259
8335A3590633o68406J0024950k275917j8886626q682767J2362048L844599k6568306
8327a7259792k9846232L609543K7303693J5011570j662530N954758J6564480L635026
8319B3310516j6381421j7075295q433304j2018262j7790471m470307J8344434
8312c4514110K5540458J7186987R759086K830934j1015213j8248971l580732J4384555
$$ plain form
8367 8122114 -4839369 4467672 17281843 15214108 3817681 -2369704 540906 7979402
8359 7979402 14111484 11639512 -2948512 -20254446 -25407127 -16256005 -3313826 6822257
8351 6822257 14227399 14168299 537341 -18232628 -24365672 -15138570 -6440903 -9585576
8343 -9585576 -20045370 -30160881 -35663206 -28989298 -6139195 18034591 23049892 13590633
8335 13590633 12922227 22947177 20671260 1784634 -6898133 5463915 9308514 -17259792
8327 -17259792 -47106024 -43496481 -16192788 -1181218 -2843748 3111010 19675490 23310516
8319 23310516 6929095 -10146200 -18579504 -30597766 -48388237 -52858544 -34514110
8312 -34514110 -8973652 8213335 17972421 20803355 9788142 -8460829 -12041561 2342994
8304B342994N664187j9513308k1469933P061636K8690516J7261936q653668j9247015
8296g862655j1552409n64736N051530M802078K25238k906466J358704Q247447
8288c201269Q065520K885365J221476j888129j7574271l5416838k9159549K947537
8280g2120158K8618913K3911803L298337n981956J06171P539426Q701616N065421
8272h60427j873512p105704o07416J6398160K4243033Q943186j4992333k1188689
8264B956298n317611J1623285J1094099l519885j4720199j0852583J801704N461159
8256a473733p091152j9613215j1955751R944128K0471483J1900642M089786R838172
8248A6110360J4499133M331248p450994l621007O330137K734895j0159638j2437238
$$ plain form
8304 2342994 8007181 -11506127 -32976060 -25914424 2776092 20038028 11384360 -7862655
8296 -7862655 -19415064 -19979800 -14928270 -10126192 -9900954 -12807420 -11448716 -3201269
8288 -3201269 4864251 7749616 8971092 7082963 -10491308 -45908146 -75067695 -72120158
8280 -72120158 -43501245 -19589442 -16291105 -22273061 -22166890 -14627464 -5925848 -860427
8272 -860427 -2733939 -9839643 -10447059 5951101 30194134 39137320 24144987 2956298
8264 2956298 -2361313 9261972 20356071 16836186 2115987 -8736596 -6934892 -1473733
8256 -1473733 -8564885 -28178100 -40133851 -30189723 -9718240 2182402 6272188 16110360
8248 16110360 30609493 34940741 27489747 23868740 30198877 32933772 22774134 10336896
8240A0336896k631476J800699n712731j3592142j3247613p670031l98704O499758
8232b4615344O732722p35418k280821J1263671K3781293J5125519m475692r028650
8224A5767280j83221l066752j9255698k0758894J431391J9054310J1435797m275847
8216A48366o446461k323224n454862o904679M312599J4260538O060702q584001
8208d931022q223894K521521M689928R3336M250762J2963164P640444r568329
8200I435910j6395487o535635L037023L220099M033604R541175P694840n593159
8192H438370j5056525j0355892k842253n387208j0808076m103697J4111917K8656620
8184B653256K8473151J6042134K169207l946351k618863k467656p930262j1949527
$$ plain form
8240 10336896 7705420 9506119 3793388 -9798754 -23046367 -30716398 -31115102 -24615344
8232 -24615344 -17882622 -18618040 -20898861 -9635190 14146103 29271622 24795930 15767280
8224 15767280 15584059 12517307 -6738391 -27497285 -26065894 -7011584 4424213 148366
8216 148366 -6298095 -8621319 -14076181 -20980860 -16668261 -2407723 3652979 -4931022
8208 -4931022 -13154916 -10633395 -5943467 -5850131 -1599369 11363795 19004239 9435910
8200 9435910 -6959577 -13495212 -10458189 -7238090 -3204486 6336689 14031529 8438370
8192 8438370 -6618155 -16974047 -19816300 -25203508 -36011584 -40115281 -26003364 2653256
8184 2653256 31126407 47168541 49337748 45391397 42772534 40304878 32374616 20425089
8176B0425089p783183j440699j337540k679914K921756Q705501K155300j1224956
8168I741354j4353684o623207l382396q129949r043348l892661k374928j426579
8160c9485398J2269514K9660409K2488162r215707k7157045j0511419J2076817
8153i874667J0480587M8858P944524K1144367R085169k0317754l0618844j3974758
8145b6082518K246549K528173j184846r12577l202856n092380N808661K1789868
8137d101926J9099228j362656j0865094L35662P523090l654840j1960106k26660
8129e213302J2128288K565932j5146059j4694832l29532M462725k850178n017126
8121b4094084K663020Q761710Q842943Q160549O587473K669160N476966J9362983
$$ plain form
8176 20425089 12641906 11201207 9863667 7183753 10105509 18811010 20966310 9741354
8168 9741354 -4612330 -11235537 -14617933 -22747882 -31791230 -35683891 -38058819 -39485398
8160 -39485398 -27215884 2444525 24932687 15716980 -11440065 -21951484 -9874667
8153 -9874667 605920 654778 8599302 29743669 38828838 18511084 -12107760 -26082518
8145 -26082518 -23835969 -21307796 -22492642 -23405219 -26608075 -31700455 -25891794 -4101926
8137 -4101926 14997302 13634646 2769552 3105214 10628304 6973464 -4986642 -5213302
8129 -5213302 6914986 9480918 -5665141 -20359973 -20689505 -16226780 -19076958 -24094084
8121 -24094084 -21431064 -12669354 -3826411 4334138 10921611 13590771 19067737 38430720
8113C8430720K5320098M685012k4989972k8850743p489718L064884j1911328k4309549
$$ plain form
8113 38430720 63750818 68435830 43445858 14595115 7105397 10170281 -1741047 -26050596
$$ [...]
##END NTUPLES=NMR SPECTRUM
##END=
