##TITLE=31Pdec_3MEPAN2906
 D2O, 24 sc
 30.6.2022
##JCAMPDX= 6.0         $$ Bruker NMR JCAMP-DX V2.0
##DATA TYPE= NMR SPECTRUM
##DATA CLASS= NTUPLES
##ORIGIN= UXNMR, Bruker Analytische Messtechnik GmbH
##OWNER= root
$$ XWIN-NMR		Version 3.5
$$ Thu Jun 30 14:06:01 2022 Russian Standard Time (UT+4h)  she@DPX200
##.OBSERVE FREQUENCY= 81.013821
##.OBSERVE NUCLEUS= ^31P
##.ACQUISITION MODE= SIMULTANEOUS
##.ACQUISITION SCHEME= undefined
##.AVERAGES= 24
##.DIGITISER RES= 16
##SPECTROMETER/DATA SYSTEM= spect
##.PULSE SEQUENCE= zgpg30
##.SOLVENT NAME= CDCl3
##.SHIFT REFERENCE= (INTERNAL, CDCl3, 0, 248.564)
##AUDIT TRAIL= $$ (NUMBER, WHEN, WHO, WHERE, WHAT)
$$ ##TITLE= Audit trail, XWIN-NMR		Version 3.5
$$ ##JCAMPDX= 5.01
$$ ##ORIGIN= Bruker BioSpin GmbH
$$ ##OWNER= she
$$ F:/spectra/data/she/nmr/P31/1/pdata/1/auditp.txt
$$ ##AUDIT TRAIL=  $$ (NUMBER, WHEN, WHO, WHERE, WHAT)
(   1,<2022-06-30 14:04:35.09 +0400>,<she>,<DPX200>,
      <created by zg, POWCHK disabled, PULCHK disabled
       configuration hash MD5:
       00 E9 B6 7A A2 85 ED C7 34 08 36 98 17 FE 4E 26
       data hash MD5: 32K
       A6 77 1A 92 8D 03 7E C1 67 08 59 33 19 E7 9E E5>)
(   2,<2022-06-30 14:04:43.20 +0400>,<she>,<DPX200>,
      <Start of raw data processing
       efp BC_mod = 2 LB = 1 FT_mod = 6 PKNL = 1 PHC0 = -10446.7 PHC1 = 1416.056 SI = 64K 
       data hash MD5: 64K
       70 12 A7 C4 20 46 E0 28 1E A7 C4 C1 C5 BC 10 28>)
(   3,<2022-06-30 14:05:20.90 +0400>,<she>,<DPX200>,
      <pk PHC0 = -106.7756 PHC1 = 187.8 
       data hash MD5: 64K
       FC E1 45 52 D4 0A 60 20 D4 CD 00 21 A8 E8 30 B7>)
(   4,<2022-06-30 14:05:24.37 +0400>,<she>,<DPX200>,
      <abs ABSG = 5 
       data hash MD5: 64K
       13 ED D0 49 72 49 90 B6 0E E2 7A 88 A7 CB C7 BA>)
$$ ##END=
$$ 
$$ hash MD5
$$ C6 77 FA 5E AD 29 1D 2E 1F A4 54 82 03 CA AA 8D
##$RELAX= 
##$RELAX= 
##$RELAX= 
##$RELAX= 
##$RELAX= 
##$RELAX= 
##$RELAX= 
##$RELAX= 
$$ Bruker specific parameters
$$ --------------------------
##$DU= <F:/spectra>
##$EXPNO= 1
##$NAME= <P31>
##$PROCNO= 1
##$TYPE= <nmr>
##$USER= <she>
##$AMP= (0..31)
100 100 100 100 100 100 100 100 100 100 100 100 100 100 100 100 100 100 
100 100 100 100 100 100 100 100 100 100 100 100 100 100 
##$AQSEQ= 0
##$AQ_mod= 1
##$AUNM= <au_zg>
##$AUTOPOS= <>
##$BF1= 81.014009
##$BF2= 200.13
##$BF3= 200.13
##$BF4= 200.13
##$BF5= 200.13
##$BF6= 200.13
##$BF7= 200.13
##$BF8= 200.13
##$BYTORDA= 1
##$CFDGTYP= 0
##$CFRGTYP= 5
##$CHEMSTR= <none>
##$CNST= (0..31)
1 1 145 1 1 1 1 1 1 1 1 1 1 1 1 1 1 1 1 1 1 1 1 1 1 1 1 1 1 1 1 1 
##$CPDPRG= <waltz16>
##$CPDPRG1= <>
##$CPDPRG2= <waltz16>
##$CPDPRG3= <>
##$CPDPRG4= <mlev>
##$CPDPRG5= <mlev>
##$CPDPRG6= <mlev>
##$CPDPRG7= <mlev>
##$CPDPRG8= <mlev>
##$CPDPRGB= <>
##$CPDPRGT= <>
##$D= (0..31)
0 1 0 0 0 0 0 0 0 0 0 0.03 2e-05 3e-06 0 0 0 0 0 0 0 0 0 0 0 0 0 0 0 0 
0 0 
##$DATE= 1656583474
##$DBL= (0..7)
120 120 120 11 120 120 24 19 
##$DBP= (0..7)
150 150 150 150 150 150 150 150 
##$DBP07= 0
##$DBPNAM0= <>
##$DBPNAM1= <>
##$DBPNAM2= <>
$$ [...]
##$SUBNAM3= <"">
##$SUBNAM4= <"">
##$SUBNAM5= <"">
##$SUBNAM6= <"">
##$SUBNAM7= <"">
##$SUBNAM8= <"">
##$SUBNAM9= <"">
##$SW= 501.771253377433
##$SWIBOX= (0..15)
0 1 3 0 0 0 0 0 0 0 0 0 0 0 0 0 
##$SW_h= 40650.406504065
##$TD= 32768
##$TD0= 1
##$TE= 0
##$TE2= 300
##$TE3= 300
##$TEG= 300
##$TL= (0..7)
0 120 53 12 22 120 120 120 
##$TP= (0..7)
150 150 150 150 150 150 150 150 
##$TP07= 0
##$TPNAME0= <>
##$TPNAME1= <>
##$TPNAME2= <>
##$TPNAME3= <>
##$TPNAME4= <>
##$TPNAME5= <>
##$TPNAME6= <>
##$TPNAME7= <>
##$TPOAL= (0..7)
0.5 0.5 0.5 0.5 0.5 0.5 0.5 0.5 
##$TPOFFS= (0..7)
0 0 0 0 0 0 0 0 
##$TUNHIN= 0
##$TUNHOUT= 0
##$TUNXOUT= 0
##$USERA1= <user>
##$USERA2= <user>
##$USERA3= <user>
##$USERA4= <user>
##$USERA5= <user>
##$V9= 5
##$VALIST= <valist>
##$VCLIST= <CCCCCCCCCCCCCCC>
##$VD= 0
##$VDLIST= <DDDDDDDDDDDDDDD>
##$VPLIST= <PPPPPPPPPPPPPPP>
##$VTLIST= <TTTTTTTTTTTTTTT>
##$WBST= 1024
##$WBSW= 4
##$XGAIN= (0..3)
0 0 0 0 
##$XL= 0
##$YL= 0
##$YMAX_a= 11674
##$YMIN_a= -12224
##$ZGOPTNS= <>
##$ZL1= 120
##$ZL2= 120
##$ZL3= 120
##$ZL4= 120
##$ABSF1= 248.5645
##$ABSF2= -253.2056
##$ABSG= 5
##$ABSL= 3
##$ALPHA= 0
##$AQORDER= 0
##$ASSFAC= 0
##$ASSFACI= 0
##$ASSFACX= 0
##$ASSWID= 0
##$AUNMP= <proc_1d>
##$AZFE= 0.1
##$AZFW= 0.5
##$BCFW= 0
##$BC_mod= 2
##$BYTORDP= 0
##$COROFFS= 0
##$CY= -3
##$DATMOD= 1
##$DC= 0
##$DFILT= <>
##$DTYPP= 0
##$F1P= 0
##$F2P= 0
##$FCOR= 1
##$FTSIZE= 65536
##$FT_mod= 6
##$GAMMA= 0
##$GB= 0
##$INTBC= 1
##$INTSCL= 5.30512e-09
##$ISEN= 30
##$LB= 1
##$LEV0= 0
##$LPBIN= 0
##$MAXI= 10000
##$MC2= 0
##$MEAN= 0
##$ME_mod= 0
##$MI= 50
##$NCOEF= 0
##$NC_proc= -7
##$NLEV= 6
##$NOISF1= 182.463
##$NOISF2= 159.3651
##$NSP= 0
##$NTH_PI= 0
##$NZP= 0
##$OFFSET= 248.5645
##$PC= 4
##$PHC0= -10553.48
##$PHC1= 1603.856
##$PH_mod= 1
##$PKNL= yes
##$PPARMOD= 0
##$PSCAL= 0
##$PSIGN= 0
##$REVERSE= no
##$SF= 81.014009
##$SI= 65536
##$SIGF1= 159.3651
##$SIGF2= -187.1042
##$SINO= 113.3802
##$SIOLD= 16384
##$SREGLST= <1H.CDCl3>
##$SSB= 0
##$STSI= 65536
##$STSR= 0
##$SW_p= 40650.406504065
##$SYMM= 0
##$S_DEV= 0
##$TDeff= 32768
##$TDoff= 0
##$TI= <>
##$TILT= no
##$TM1= 0
##$TM2= 0
##$TOPLEV= 0
##$USERP1= <user>
##$USERP2= <user>
##$USERP3= <user>
##$USERP4= <user>
##$USERP5= <user>
##$WDW= 1
##$XDIM= 65536
##$YMAX_p= 456956978
##$YMIN_p= -45637216
$$ End of Bruker specific parameters
$$ ---------------------------------
##NTUPLES= NMR SPECTRUM
##VAR_NAME=  FREQUENCY,     SPECTRUM/REAL,   SPECTRUM/IMAG
##SYMBOL=    X,             R,               I
##VAR_TYPE=  INDEPENDENT,   DEPENDENT,       DEPENDENT
##VAR_FORM=  AFFN,          ASDF,            ASDF
##VAR_DIM=   65536,         65536,           65536
##UNITS=     HZ,            ARBITRARY UNITS, ARBITRARY UNITS
##FACTOR=    0.620285442955139, 1,           1
##FIRST=     20137.2065510759, 0,            0
##LAST=      -20513.1999529892, 0,           0
##MIN=       -20513.1999529892, -45637216,   0
##MAX=       20137.2065510759, 456956978,    0
$$ Real data points
##PAGE= N=1
##DATA TABLE= (X++(R..R)), XYDATA
$$ [...]
$$ plain form
41310 1122647 1699668 2290877 3353482 4257529 3508495 1645008 952535 1726137 1900846
41301 1900846 973478 848739 1862029 1678944 -315537 -1219232 700807 2980426 3138368
41292 3138368 2643477 3725069 5177438 4869826 4022616 5043246 6784487 6044721 2875623
41283 2875623 453899 25560 -196832 -886612 -89462 3017835 5854007 5619228 2893270
41274 2893270 580820 445976 1817567 2972204 2940059 2178157 1693670 1511013 699524
41265 699524 -583011 -267614 3000743 7222075 8815574 6823778 3774953 2416361
41257 2416361 3072127 4337916 5003174 4890671 4645321 4843060 4846600 3144138 -278247
41248 -278247 -2796627 -1992349 860035 2049290 196287 -2104161 -1899194 510445 2496756
$$ packed form
41310A122647N77021N91209J062605R04047p49034j863487o92473P73602J74709
41301A900846r27368j24739J013290j83085j994481r03695J920039K279619J57942
41292C138368m94891J081592J452369l07612q47210J020630J741241p39766l169098
41283B875623k421724m28339k22392o89780P97150L107297K836172k34779k725958
41274B893270k312450j34844J371591J154637l2145p61902m84487j82657q11489
41265F99524j282535L15397L268357M221332J593499j991796l048825j358592
41257B416361O55766J265789O65258j12503k45350J97739L540j702462l422385
41248b78247k518380Q04278K852384J189255j853003k300448K04967K409639J986311
$$ plain form
41239 2496756 2512022 1462694 1107889 1942492 2819031 2446214 989890 -191230 -317945
41230 -317945 87785 471001 1175147 2458209 3639178 4195807 4770000 5942958 6888682
41221 6888682 6564442 5492772 4948658 5019230 4932943 4711002 4915680 5260139 5090020 4789149
41211 4789149 5031765 5151409 4175782 3037210 3475172 4868161 4699606 2546768 995883
41202 995883 1669682 2878953 2775026 2602530 4553569 7828641 9426309 8400647 6924400
41193 6924400 6817580 7155444 6417463 5404515 6099562 8128924 8576752 6108458 3373634
41184 3373634 3442210 5109168 4523278 1267751 -525856 1713127 5017335 5441556 3963255
41175 3963255 4392569 7012905 8290215 6536759 4000477 2775614 2129711 1108349
$$ packed form
41239B496756J5266j049328l54805Q34603Q76539l72817j456324j181120j26715
41230c17945M05730L83216P04146J283062J180969N56629N74193J172958R45724
41221F888682l24240j071670n44114P0572q6287k21941K04678L44459j70119l00871
41211D789149K42616J19644r75627j138572M37962J392989j68555k152838j550885
41202I95883O73799J209271j03927j72496J951039L275072J597668j025662j476247
41193F924400j06820L37864p37981j012948O95047K029362M47828k468294k734824
41184C373634O8576J666958n85890l255527j793607K238983L304208M24221j478301
41175C963255M29314K620336J277310j753456k536282j224863o45903j021362
$$ plain form
41167 1108349 764591 2000205 3419624 3208881 1650671 279148 -203396 30453 737165
41158 737165 1394410 1349631 988844 1486331 2775166 3371266 2884828 2751276 3526930 3708438
41148 3708438 2677153 2455771 4414757 6317398 5327104 2405468 759974 978560 903998
41139 903998 -146665 -445857 526209 768051 -734183 -1802349 -122190 3251813 5257172
41130 5257172 4662371 2987866 2202207 2849162 4245144 5488946 6141624 6352419 6353179
41121 6353179 5894136 4673736 3290468 2849076 3304279 3254944 2122988 1518209 3156224
41112 3156224 5994660 7038875 5106187 2311209 1212025 1772303 2222011 1916003 1693078
41103 1693078 1703961 772342 -1441133 -3127090 -2386082 246398 2567611 3442418 3449035
$$ packed form
41167A108349l43758J235614J419419k10743j558210j371523m82544K33849P06712
41158G37165O57245m4779l60787M97487J288835N96100m86438j33552P75654J81508
41148C708438j031285k21382J958986J902641r90294k921636j645494K18586p4562
41139I03998j050663k99192R72066K41842j502234j068166J680159L374003K005359
41130E257172n94801j674505p85659O46955J395982J243802O52678K10795P60
41121F353179m59043j220400j383268m41392M55203m9335j131956o04779J638015
41112C156224K838436J044215j932688k794978j099184N60278M49708l06008k22925
41103A693078J0883r31619k213475j685957P41008K632480K321213Q74807O617
$$ plain form
41094 3449035 3152545 2371590 1420847 1510541 3006726 4344241 3818772 1994008 1277115
41085 1277115 3120540 6380330 8631373 8688814 7572733 7085689 7689914 8118582 7186626
41076 7186626 5465275 4537885 4865244 5249364 4477203 2658846 704597 -655834 -847283
41067 -847283 735752 3985173 7429046 9144032 8490017 6589239 5009667 4255655 3739027
41058 3739027 3045641 2676616 3069334 3295194 1897282 -640692 -1566450 868603 4696953
41049 4696953 6279240 4613606 2073811 1104605 1884496 3304837 4415481 4414831 2926367
41040 2926367 1076323 852831 2589751 4430057 5003186 5037068 5304677 4759815 2456962
41031 2456962 42230 223328 3220014 6502198 7916511 7612715 6868077 6288594 5502336
$$ packed form
41094C449035k96490p80955r50743Q9694J496185J337515n25469j824764p16893
41085A277115J843425L259790K251043N7441j116081m87044O04225M28668r31956
41076G186626j721351r27390L27359L84120p72161j818357j954249j360431j91449
41067h47283J583035L249421L443873J714986o54015j900778j579572p54012n16628
41058C739027o93386l69025L92718K25860j397912k537974r25758K435053L828350
41049D696953J582287j665634k539795r69206P79891J420341J110644o50j488464
41040B926367j850044k23492J736920J840306N73129L3882K67609n44862k302853
41031B456962k414732J81098K996686L282184J414313l03796p44638n79483p86258
$$ plain form
41022 5502336 3969010 1949255 783746 1623216 3620362 4445258 3267244 2032051
41014 2032051 2793232 5041113 6958120 7937415 8096567 6681721 3474210 954637 2073070
41005 2073070 5796288 7732338 5834261 2838899 1997249 2994273 3826193 4412588 5774518
40996 5774518 6983983 5844793 2460573 -371641 -920213 -713178 -1880775 -3694527
40988 -3694527 -3352674 164515 4454290 6303090 5120843 3203274 3021366 4872735
40980 4872735 7040173 7644739 6255942 4105930 2840480 2888257 3289653 3371538 3839541
40971 3839541 5286447 6393443 5358811 2922806 1865438 3073062 4310185 3819892
40963 3819892 2851789 3140928 4154366 4884194 6173813 8544119 9637664 7267612 3687197
$$ packed form
41022E502336j533326k019755j165509Q39470J997146Q24896j178014j235193
41014B032051P61181K247881J917007R79295J59152j414846l207511k519573J118433
41005B073070L723218J936050j898077k995362q41650R97024Q31920N86395J361930
40996E774518J209465j139190l384220k832214n48572K07035j167597j813752
40988c694527L41853L517189M289775J848800j182247j917569j81908J851369
40980D872735K167438O04566j388797k150012j265450M7777M01396Q1885M68003
40971C839541J446906J106996j034632k436005j057368J207624J237123m90293
40963C819892r68103K89139J013438P29828J289619K370306J093545k370052l580415
$$ plain form
40954 3687197 2906036 4414567 3897877 374892 -1939054 -171223 3079843 4303114
40946 4303114 4032187 4472605 5282420 4975023 4252805 4631329 5347592 4735197 3410942
40937 3410942 3181037 3918242 4384030 4997919 6687040 7967146 6594424 3581311 2085366
40928 2085366 2565128 2684564 2029044 2797919 5023376 5395950 2698728 496823 1728848
40919 1728848 3958361 3407139 1144290 1260641 4333822 6832180 6684595 5635750 5566528
40910 5566528 5836681 5447419 5045631 5139441 4503401 2304179 253632 503613 2264161
40901 2264161 2647872 680131 -1424682 -1274312 985755 3554909 5233417 5842341 5394731
40892 5394731 4169972 3214419 3435719 4121878 3579976 1686089 688328 2584194 6424796
$$ packed form
40954C687197p81161J508531n16690l522985k313946J767831L251066J223271
40946D303114k70927M40418Q09815l07397p22218L78524P16263o12395j324255
40937C410942k29905P37205M65788O13889J689121J280106j372722l013113j495945
40928B085366M79762J19436o55520P68875K225457L72574k697222k201905J232025
40919A728848K229513n51222k262849J16351L073181K498358j47585j048845o9222
40910E566528K70153l89262m01788R3810o36040k199222k050547K49981J760548
40901B264161L83711j967741k104813J50370K260067K569154J678508O08924m47610
40892E394731j224759r55553K21300O86159n41902j893887r97761J895866L840602
$$ plain form
40883 6424796 9309637 9702991 8619075 7603012 6877376 6040851 5506332 6082416 7389511
40874 7389511 7736987 5966041 2965026 896156 944784 2154407 2676852 1928339 1009946
40865 1009946 944071 1192088 531949 -981646 -1819471 -878973 1081297 2300288 2001093
40856 2001093 1168028 1370915 2975069 4667088 4917973 3785885 2797543 3015498 3955747
40847 3955747 4711208 5175409 5372123 4526531 2142805 -521007 -1580103 -1011346 -563422
40838 -563422 -1115229 -1590267 -782402 1147089 3398371 5379308 6351172 5691965 4214645
40829 4214645 3827342 5040515 6147267 5783713 4869126 4843896 5406745 5495805 5286520
40820 5286520 5485463 5613424 4873606 4038854 4510617 5863474 6233486 5037510 3538002
$$ packed form
40883F424796K884841L93354j083916j016063p25636q36525n34519N76084J307095
40874G389511L47476j770946l001015k068870M8628J209623N22445p48513r18393
40865A009946o5875K48017o60139j513595q37825R40498J960270J218991k99195
40856B001093q33065K02887J604154J692019K50885j132088r88342K17955R40249
40847C955747P55461M64201J96714q45592k383726k663812j059096N68757M47924
40838e63422n51807m75038Q07865J929491K251282J980937R71864o59207j477320
40829D214645l87303J213173J106752l63554r14587k5230N62849Q9060k09285
40820E286520J98943J27961p39818q34752M71763J352857L70012j195976j499508
$$ plain form
40811 3538002 2729545 2423432 2526363 3384135 4434344 4257861 2722978 1637188 2327533
40802 2327533 3660891 3505756 1534715 -348330 -216390 1759607 3499731 3350511 2092849
40793 2092849 1970582 3582653 4967974 4575905 3698971 4362421 6019394 6528141 5617673
40784 5617673 4854720 4567385 3649985 2541331 3324594 6040761 7817846 6988710 5398199
40775 5398199 4989377 4725028 3081607 1265598 1204343 2057635 1732169 754327 1467388
40766 1467388 3756837 4691814 2883739 603766 566580 2505138 4110101 4099894 3181275
40757 3181275 2612941 2795393 3233256 3445041 3659199 4365714 5268388 5397206 4565909
40748 4565909 3892886 4276320 5142511 5478599 5373446 5621305 6381437 7132940 7477847
$$ packed form
40811C538002q08457l06113J02931Q57772J050209j76483j534883j085790O90345
40802B327533J333358j55135j971041j883045J31940J975997J740124j49220j257662
40793B092849j22267J612071J385321l92069q76934O63450J656973N08747r10468
40784E617673p62953k87335r17400j108654P83263K716167J777085q29136j590511
40775E398199m08822k64349j643421j816009o1255Q53292l25466r77842P13061
40766A467388K289449R34977j808075k279973l7186J938558J604963j0207r18619
40757C181275n68334J82452M37863K11785K14158P06515R02674J28818q31297
40748D565909o73023L83434Q66191L36088j05153K47859P60132P51503L44907
$$ plain form
40739 7477847 7212173 6151326 4657860 3792792 4229047 5519787 6825567 7480178 6576629
40730 6576629 3565113 37906 -896676 1618280 4699358 5564612 5110091 5648415 6838472
40721 6838472 6596906 4920940 3839239 4024781 4173180 3567650 2802449 2087355 1152195
40712 1152195 685239 1627999 3271857 4226147 4752705 5738705 6143068 4436808 1910234
40703 1910234 1121743 1550566 701607 -740001 482073 3978640 5244437 2874384 1067719
40694 1067719 2553188 4176682 2977263 1787984 4123237 7419240 6805267 2902357
40686 2902357 324956 282645 288722 72592 1941415 5364403 6803718 5713716 5611972
40677 5611972 7920901 9557479 8469305 7057140 7589171 8160983 6286833 3347827
$$ packed form
40739G477847k65674j060847j493466q65068M36255J290740J305780O54611r03549
40730F576629l011516l527207r34582K514956L081078Q65254m54521N38324J190057
40721F838472k41566j675966j081701J85542J48399o05530p65201p15094r35160
40712A152195m66956R42760J643858R54290N26558R86000M04363j706260k526574
40703A910234p88491M28823q48959j441608J222074L496567J265797k370053j806665
40694A067719J485469J623494j199419j189279K335253L296003o13973l902910
40686B902357k577401m2311O077k16130J868823L422988J439315j090002j01744
40677E611972K308929J636578j088174j412165N32031N71812j874150k939006
$$ plain form
40669 3347827 2160884 2573879 2840498 3411708 5700879 8215194 7649674 3791133 214004
40660 214004 -441347 599624 823772 -93791 -560984 457302 2389984 3929281 4233370
40651 4233370 3546891 2962177 3332285 4363609 5106134 5244462 5382441 6042464 6938352
40642 6938352 7386565 6994868 5789580 4083566 2473260 1654631 1886384 2669769 3137908
40633 3137908 2790258 1834670 901005 497487 692272 1212210 1779954 2321165 2849553
40624 2849553 3264105 3446290 3563615 3960102 4503267 4412100 3368452 2609053 3864496
40615 3864496 6876869 9105812 8749130 7017374 6149444 6166395 5506580 4259131 4179816
40606 4179816 5236941 4924358 2248606 -63422 746707 3543433 5353991 5746914 6395870
$$ packed form
40669C347827j186943M12995K66619N71210K289171K514315n65520l858541l577129
40660B14004o55351J040971K24148r17563m67193J018286J932682J539297L04089
40651D233370o86479n84714L70108J031324P42525J38328J37979O60023Q95888
40642F938352M48213l91697j205288j706014j610306q18629K31753P83385M68139
40633C137908l47650r55588r33665m03518J94785N19938N67744N41211N28388
40624B849553M14552J82185J17325L96487N43165r1167j043648p59399J255443
40615C864496L012373K228943l56682j731756q67930J6951o59815j247449p9315
40606D179816J057125l12583k675752k312028Q10129K796726J810558L92923O48956
$$ plain form
40597 6395870 7343414 6946553 5436316 5286003 7164668 8280986 6307543 2937048 1679217
40588 1679217 3357884 5599935 6168474 5181559 4110669 3856690 4199649 4505272 4501623
40579 4501623 4387491 4388357 4499529 4728367 5127837 5326220 4667616 3342541 2596714 2990178
40569 2990178 3351237 2712656 2359513 4064921 6806943 7534570 5324769 2522427 1260369
40560 1260369 1141363 1271180 2237632 4475907 6564742 7070256 6692797 6660970 6241030
40551 6241030 4118715 1505624 1351061 4305133 7477662 7801684 5286723 2413799
40543 2413799 1295991 1910034 2546497 1797369 347644 346937 2475467 4507050 3977998
40534 3977998 1578074 254202 1260600 2934179 3499202 3185724 2956752 2856101 2650599
$$ packed form
40597F395870R47544l96861j510237j50313J878665J116318j973443l370495j257831
40588A679217J678667K242051N68539r86915j070890k53979L42959L05623l649
40579D501623j14132Q66J11172K28838L99470J98383o58604j325075p45827L93464
40569B990178L61059o38581l53143J705408K742022P27627k209801k802342j262058
40560A260369j19006J29817R66452K238275K088835N05514l77459l1827m19940
40551F241030k122315k613091j54563K954072L172529L24022k514961k872924
40543B413799j117808O14043O36463p49128j449725p07K128530K031583n29052
40534C977998k399924j323872J006398J673579N65023l13478k28972j00651k05502
$$ plain form
40525 2650599 2803550 3646777 4499888 4651469 4434301 4368371 4056016 3026921 1931308
40516 1931308 1607677 1550503 777515 -143536 322323 1925602 2263631 12402 -2829129
40507 -2829129 -3163015 -514786 2677945 4127771 3888980 3532460 4195137 5752657 7155640
40498 7155640 7156479 5249473 2397564 537085 914167 2999244 5249511 6679731 7363996
40489 7363996 7705087 7847652 7877083 8014563 8227327 7925930 6499086 4176144 2089289
40480 2089289 1352505 2095895 3313922 3583317 2215287 140317 -459995 1882856 5985751
40471 5985751 8665620 8008750 5583766 4495839 5433133 5894774 3770273 494989 -491491
40462 -491491 2034393 5543009 6550980 4230915 991281 -110434 1714357 4483402
$$ packed form
40525B650599J52951Q43227Q53111J51581k17168o5930l12355j029095j095613
40516A931308l23631n7174p72988r21051M65859J603279L38029k251229k841531
40507b829129l33886K648229L192731J449826k38791l56520O62677J557520J402983
40498G155640Q39j907006k851909j860479L77082K085077K250267J430220O84265
40489G363996L41091J42565K9431J37480K12764l01397j426844k322942k086855
40480B089289p36784P43390J218027K69395j368030k074970o00312K342851M102895
40471E985751K679869o56870k424984j087927R37294M61641k124501l275284r86480
40462d91491K525884L508616J007971k320065l239634j101715J824791K769045
$$ plain form
40454 4483402 5656420 4605145 2638874 1005269 -117937 -585683 300326 2404749
40446 2404749 3923762 3338766 1600681 1011099 2319645 4192668 5127444 4527493 2376411
40437 2376411 -454052 -1835369 -193379 3243475 5685459 6174619 5860711 5174548 3364334
40428 3364334 1155301 895603 2946865 4660948 4347128 3512303 3442463 2589677 -43644
40419 -43644 -1757010 49160 2957969 2503940 -985253 -2658174 -81002 3995253 6259762
40410 6259762 6587716 6121885 4876408 2913787 1487439 1336705 1573538 1473679 1677498
40401 1677498 2548967 3118384 2840829 2717614 3382570 3656537 2465815 878275 700121
40392 700121 2016241 3486357 4250633 4268051 3487397 1951579 285626 -916327 -1813783
$$ packed form
40454D483402J173018j051275j966271j633605j123206m67746Q86009K104423
40446B404749J519013n84996j738085n89582J308546J873023R34776n99951k151082
40437B376411k830463j381317J641990L436854K441984M89160l13908o86163j810214
40428C364334k209033k59698K051262J714083l13820q34825o9840q52786k633321
40419d3644j713366J806170K908809m54029l489193j672921K577172M076255K264509
40410F259762L27954m65831j245477j962621j426348j50734K36833r9859K03819
40401A677498Q71469N69417k77555j23215O64956K73967j190722j587540j78154
40392G00121J316120J470116P64276J7418p80654j535818j665953j201953q97456
$$ plain form
40383 -1813783 -2697410 -3155505 -2581346 -1041449 973878 3166208 5241798 6641661 7047481
40374 7047481 6782534 6312098 5720506 4911664 3886166 2708484 1685093 1510021 2579556
40365 2579556 4251011 5451206 5777453 5307234 3969377 2241202 1685177 3112272 4807344
40356 4807344 4556253 2921981 2153339 2284700 1351132 -428269 -231754 2601036 4910102
40347 4910102 4572574 3686290 4498334 5302545 3724376 1676078 2982570 7188138 9680842
40338 9680842 7960209 4464827 2661535 3105478 4313805 5362038 6262029 6915997 6834039
40329 6834039 5678920 3811536 2287341 1859265 1863564 1025025 -388303 -700797 260901
40320 260901 372464 -1301102 -2291197 -253536 2870623 3031932 -338317 -3637141 -3764650
$$ packed form
40383a813783q83627m58095N74159J539897K015327K192330K075590J399863M05820
40374G047481k64947m70436n91592q08842j025498j177682j023391j75072J069535
40365B579556J671455J200195L26247m70219j337857j728175n56025J427095J695072
40356D807344k51091j634272p68642J31361r33568j779401J96515K832790K309066
40347D910102l37528q86284Q12044Q04211j578169k048298J306492M205568K492704
40338I680842j720633l495382j803292M43943J208327J048233Q99991O53968q1958
40329F834039j155119j867384j524195m28076M299q38539j413328l12494R61698
40320B60901J11563j673566r90095K037661L124159J61309l370249l298824j27509
$$ plain form
40311 -3764650 -1049657 2470471 5311098 6698245 6500484 5685367 5517116 5982935 6063666
40302 6063666 5371217 4278946 2862804 1264510 669629 2051608 4094280 4299417 2331732
40293 2331732 529240 806739 2585966 4102676 4416493 3816478 3283769 3647643 4496018
40284 4496018 4356039 2861085 1845127 2935138 5050126 5969799 5356054 4284360 2958400
40275 2958400 1311281 747866 2325601 3999472 2964371 256023 -539222 1049114
40267 1049114 1945067 1021542 729327 2221593 3190411 2346511 1943175 3465212 4658752
40258 4658752 3775941 3195433 5228606 7389954 6088872 2850308 2292818 5042092 7080692
40249 7080692 5901754 3292059 1616096 893148 474765 674181 1492923 1941774 1785661
$$ packed form
40311c764650K714993L520128K840627J387147j97761q15117j68251M65819Q0731
40302F063666o92449j092271j416142j598294n94881J381979K042672K05137j967685
40293B331732j802492K77499J779227J516710L13817o00015n32709L63874Q48375
40284D496018j39979j494954j015958J090011K114988R19673o13745j071694j325960
40275B958400j647119n63415J577735J673871j035101k708348p95245J588336
40267A049114Q95953r23525k92215J492266R68818q43900m03336J522037J193540
40258D658752q82811n80508K033173K161348j301082l238564n57490K749274K038600
40249G080692j178938k609695j675963p22948m18383J99416Q18742M48851j56113
$$ plain form
40240 1785661 2236279 3929209 5684674 6193474 5711112 5207972 4799221 3872850 2248885
40231 2248885 649144 208425 1492839 3631056 4715529 3686800 1541566 69307
40223 69307 -148663 259120 841494 1631979 2425305 2830674 2902804 2909162 2782691 2547734
40213 2547734 2709936 3307252 3310138 2173524 1238372 2024286 3665559 3883412 2352452
40204 2352452 1191271 1846859 3267657 3757618 3122328 2189209 1426255 929783 910786
40195 910786 1375683 1897767 2261767 2787172 3581302 4053900 3639869 2557681 1482728
40186 1482728 843820 694784 906623 1259913 1596231 1913368 2078764 1679524 610521
40177 610521 -461741 -832347 -700116 -681030 -670408 -61151 1123709 2317919 3491040
$$ packed form
40240A785661M50618J692930J755465N08800m82362n03140m08751r26371j623965
40231B248885j599741m40719J284414K138217J084473j028729k145234j472259
40223F9307k17970M07783N82374P90485P93326M05369P2130O358j26471k34957
40213B547734J62202N97316K886j136614r35152P85914J641273K17853j530960
40204B352452j161181O55588J420798M89961o35290r33119p62954m96472j8997
40195I10786M64897N22084L64000N25405P94130M72598m14031j082188j074953
40186A482728o38908j49036K11839L53290L36318L17137J65396l99240j069003
40177F10521j072262l70606J32231J9086J0622O09257J184860J194210J173121
$$ plain form
40168 3491040 4981145 6215962 5908896 3935488 1867531 1061667 1206381 1427099 1884879
40159 1884879 3318309 5551458 7418819 8040041 7558777 6729126 6229320 6293807 6641727
40150 6641727 6729684 6231831 5345733 4750677 5242696 6887876 8213964 7061669 3237202
40141 3237202 -315472 -498820 2021078 3712447 3139629 2721171 4508300 6624376 6152950
40132 6152950 3862497 3006941 4062289 4027363 1500169 -801339 -284944 1380763 955098
40123 955098 -1234767 -1913211 -26203 1832158 1629393 774448 1512522 3545603 4945244
40114 4945244 5010056 4467616 3807252 3138935 3069538 4056383 5253817 5453638 4797159 4194769
40104 4194769 3667679 2936579 2945879 4550642 6083285 4965386 1921455 585546 2103942
$$ packed form
40168C491040J490105J234817l07066j973408k067957q05864J44714K20718M57780
40159A884879J433430K233149J867361O21222m81264q29651m99806O4487L47920
40150F641727Q7957m97853q86098n95056M92019J645180J326088j152295l824467
40141C237202l552674j83348K519898J691369n72818m18458J787129K116076m71426
40132F152950k290453q55556J055348l4926k527194k301508N16395J665707m25665
40123I55098k189865o78444J887008J858361k02765q54945P38074K033081J399641
40114D945244O4812n42440o60364o68317o9397R86845J197434J99821o56479o02390
40104D194769n27090p31100R300J604763J532643j117899l043931j335909J518396
$$ plain form
40095 2103942 3321296 1950806 338741 1410009 3578736 3330251 1189820 1026558
40087 1026558 3877625 6405697 6005092 3986270 2606425 1952290 1336150 1310286 2383392
40078 2383392 3500993 3641782 3637989 4790045 6758128 8314314 9174419 9585864 9028571
40069 9028571 6991418 4470757 3152364 3425192 4444228 5648577 6810147 7059362
40061 7059362 5629617 3627998 3400661 5583460 7970382 7943050 5230933 1832109 -34736
40052 -34736 530489 2819638 5085575 5841455 5179642 4571572 4988917 5557866 4621713
40043 4621713 2038810 -169127 175855 2886852 5298639 4953444 2228458 -153897
40035 -153897 -214718 1323912 2446282 2470157 2506077 3693582 5879292 7974353 8816183
$$ packed form
40095B103942J217354j370490j612065J071268K168727k48485k140431j63262
40087A026558K851067K528072m00605k018822j379845o54135o16140k5864J073106
40078B383392J117601J40789l793J152056J968083J556186Q60105M11445n57293
40069I028571k037153k520661j318393K72828J019036J204349J161570K49215
40061G059362j429745k001619k27337K182799K386922k7332k712117l398824j866845
40052c4736N65225K289149K265937P55880o61813o08070M17345N68949r36153
40043D621713k582903k207937L44982K710997K411787l45195k724986k382355
40035a53897o0821J538630J122370K3875L5920J187505K185710K095061Q41830
$$ plain form
40026 8816183 7670527 4781222 1714288 400010 1362767 3316388 4676592 4857693
40018 4857693 3964833 2280704 755796 1028714 3689606 6877697 7848435 6003223 3382548
40009 3382548 2042447 1944325 1754542 767879 -561395 -1323171 -795471 1061018 3190555
40000 3190555 4067675 3384198 2648705 3392351 5171763 6160146 5445484 3855841 2598982
39991 2598982 1979852 1605737 1141263 621482 432366 951662 1810840 1907826 952343 560992
39981 560992 2507555 5964062 8034035 7374757 5676626 4846067 4477987 3475218 2601983
39972 2601983 3330617 4938589 5011580 2823724 312490 -559748 280738 2046160 4194084
39963 4194084 5789983 5528096 3625871 2373645 3389038 5302504 5648821 4307552
$$ packed form
40026H816183j145656k889305l066934j314278R62757J953621J360204J81101
40018D857693q92860j684129j524908K72918K660892L188091R70738j845212k620675
40009C382548j340101r8122j89783r86663j329274p61776N27700J856489K129537
40000C190555Q77120o83477p35493P43646J779412R88383p14662j589643j256859
39991B598982o19130l74115m64474n19781j89116N19296Q59178R6986r55483l91351
39981E60992J946563L456507K069973o59278j698131q30559l68080j002769q73235
39972B601983P28634J607972P2991k187856k511234q72238Q40486J765422K147924
39963D194084J595899k61887j902225j252226J015393J913466L46317j341269
$$ plain form
39955 4307552 3424406 4295130 5983930 7014186 6885454 5692385 3683519 1655555 557917
39946 557917 251368 -143371 -316732 1149168 3901188 4882260 2113392 -1861342 -2651522
39937 -2651522 353256 3464780 3930321 3187066 3925461 6048546 7274931 6507810 4798726
39928 4798726 3452255 2633030 1787482 508541 -985341 -1778821 -1064519 660250 2011212
39919 2011212 2759728 4218028 6719910 8199644 6889963 4277878 3312152 4329778
39911 4329778 4998589 4108650 3109905 3494143 4660108 5139927 4484762 3279029 2384653
39902 2384653 2460164 3183972 3128000 1779576 1176796 3411461 6812187 7407268 4519180
39893 4519180 1839130 1982266 3195310 3145900 2730021 3482389 3995541 2383273 453819
$$ packed form
39955D307552q83146Q70724J688800J030256j28732j193069k008866k027964j097638
39946E57917l06549l94739j73361J465900K752020R81072k768868l974734p90180
39937b651522L004778L111524M65541p43255P38395K123085J226385p67121j709084
39928D798726j346471q19225q45548j278941j493882p93480P14302J724769J350962
39919B011212P48516J458300K501882J479734j309681k612085r65726J017626
39911D329778O68811q89939r98745L84238J165965M79819o55165j205733q94376
39902B384653P5511P23808n5972j348424o02780K234665L400726N95081k888088
39893D519180k680050J43136J213044m9410m15879P52368N13152j612268j929454
$$ plain form
39884 453819 1621320 5431446 7703107 6101949 2599658 178221 -226696 944675
39876 944675 3123296 5288468 6129451 5332276 3702320 2000244 804021 1046804 3002111
39867 3002111 5068639 5387636 4356684 3604974 2973805 1051384 -1425893 -1697899 820786
39858 820786 3252987 3346613 2375153 2453177 3177415 2901234 1745864 1255389 1967962 3094133
39848 3094133 4005587 4554606 4373479 3221728 1826865 1254709 1446919 1230675 -30962
39839 -30962 -1267977 -542133 2736185 6522840 7800771 5971482 3682558 3389994 4192200
39830 4192200 3629044 1656701 596803 1493982 2938732 3676601 4071016 4498911 4445063
39821 4445063 3821046 3277210 2783462 1915565 1741584 3845882 6988545 7702478 5248656
$$ packed form
39884D53819J167501L810126K271661j601158l502291k421437m04917J171371
39876I44675K178621K165172Q40983p97175j629956j702076j196223K42783J955307
39867C002111K066528L18997j030952p51710o31169j922421k477277k72006K518685
39858H20786K432201R3626r71460P8024P24238k76181j155370m90475P12573J126171
39848C094133R11454N49019j81127j151751j394863n72156J92210k16244j261637
39839c0962j237015P25844L278318L786655J277931j829289k288924k92564Q02206
39830D192200n63156j972343j059898Q97179J444750P37869L94415M27895n3848
39821D445063o24017n43836m93748q67897j73981K104298L142663P13933k453822
$$ plain form
39812 5248656 2955227 3194982 4170991 3690177 3011237 4196824 6252850 7018750 6844512
39803 6844512 7237746 7645124 6881979 6225012 7517495 9292849 8489274 5455820 3598154
39794 3598154 4136161 4707671 3506734 1576077 347296 -196692 -116948 1075259 2667049
39785 2667049 2746557 1022117 -292388 618372 2971060 4784485 5000468 3728806 1865864
39776 1865864 885827 1679591 3421802 4771443 5769352 6953262 7395551 5989801 4103831
39767 4103831 4075178 5272449 4835018 2495966 1199964 2234827 3312094 2698125 1739199
39758 1739199 1633488 1155790 -278890 -612241 1173053 2410398 859843 -1192435 -376985
39749 -376985 2396340 3683216 2899796 2139971 1859816 792755 -428355 391789 2949377
$$ packed form
39812E248656k293429K39755R76009m80814o78940J185587K056026P65900j74238
39803F844512L93234M07378p63145o56967J292483J775354q03575l033454j857666
39794C598154N38007N71510j200937j930657j228781n43988P9744J192207J591790
39785B667049P9508j724440j314505R10760K352688J813425K15983j271662j862942
39776A865864r80037P93764J742211J349641R97909J183910M42289j405750j885970
39767D103831k8653J197271m37431k339052j296002J034863J077267o13969r58926
39758A739199j05711m77698j434680l33351J785294J237345j550555k052278Q15450
39749c76985K773325J286876p83420p59825k80155j067061j221110Q20144K557588
$$ plain form
39740 2949377 4404838 3887122 3609737 4692954 5143031 3339184 797916 -150701 648805
39731 648805 2004977 3473296 5205587 6971540 8368382 8962016 7834193 4571907
39723 4571907 1103030 478165 2935999 5198546 4774457 2861103 1587470 721676 -644598
39714 -644598 -1116260 1240629 5068765 6782437 5511871 4238100 5324636 7247754
39706 7247754 6990872 4004870 325628 -2209152 -3375972 -3640731 -3149315 -1840870 118086
39697 118086 2236623 3810632 4274986 3802955 3404586 3956620 5156619 5936942 5979990
39688 5979990 6171709 7159165 8108818 7771175 6492439 6012152 7008061 7967547 7231743
39679 7231743 5297200 4071560 4377109 5301122 5768250 5641448 5238346 4707239 4062647
$$ packed form
39740B949377J455461n17716k77385J083217M50077j803847k541268r48617P99506
39731F48805J356172J468319J732291J765953J396842N93634j127823l262286
39723D571907l468877o24865K457834K262547m24089j913354j273633q65794j366274
39714f44598m71662K356889L828136J713672j270566j273771J086536J923118
39706G247754k56882k986002l679242k534780j166820k64759M91416J308445J958956
39697A18086K118537J574009M64354m72031l98369N52034J199999P80323M3048
39688E979990J91719R87456R49653l37643j278736m80287R95909R59486p35804
39679G231743j934543j225640L05549R24013M67128j26802m03102n31107o44592
$$ plain form
39670 4062647 3230359 2135090 1272653 1672421 3362030 4526034 3622212 1818833 1493488
39661 1493488 2644734 3155288 2728440 3655823 6631761 8771587 7849634 5996577 6396274
39652 6396274 8187393 8002576 5561501 4112489 5293514 6932943 6791481 5623278
39644 5623278 5148308 5214001 4628111 3331492 2225305 1781456 1967833 2802012 4125031
39635 4125031 5469136 6633733 7604452 7736402 6336496 4456047 4474252 6962786 9392717
39626 9392717 9147820 6663678 4343543 3408071 3208195 2857042 2066327 786629 -691223
39617 -691223 -1459978 -803412 849688 2420800 3321615 3632409 3709889 4109855 5190613
39608 5190613 6279241 6083678 4494244 2984454 2604189 2748095 2656191 2733675 3326861
$$ packed form
39670D062647q32288j095269q62437L99768J689609J164004r03822j803379l25345
39661A493488J151246N10554m26848R27383K975938K139826r21953j853057L99697
39652F396274J791119j84817k441075j449012J181025J639429j41462j168203
39644E623278m74970O5693n85890j296619j106187m43849J86377Q34179J323019
39635D125031J344105J164597R70719J31950j399906j880449J8205K488534K429931
39626I392717k44897k484142k320135r35472j99876l51153p90715j279698j477852
39617f91223p68755O56566J653100J571112R00815L10794P7480L99966J080758
39608E190613J088628j95563j589434j509790l80265J43906r1904P7484N93186
$$ plain form
39599 3326861 3644170 3254154 3269827 4470232 5569107 5122597 3907631 3484729 3689396
39590 3689396 3780668 4782645 7869254 11244741 11728563 9242947 6796987 6010514 5665603
39581 5665603 5014480 5329745 7107327 8482107 7910595 6417081 5892546 6793219 8454099
39572 8454099 10088479 10737620 9790760 8063881 6828669 5794390 4108851 3064602
39564 3064602 4808218 8149665 9160154 6794894 4257110 3489636 2389459 -347829
39556 -347829 -1807003 418601 3641070 4171882 3137238 3910862 6048112 6466935 5137172
39547 5137172 4791967 5768165 5795985 4651013 4489411 5387452 4955437 2994892 2304537
39538 2304537 3866240 5282472 5297803 5862786 7880880 8725209 6482986 3479052 2784908
$$ packed form
39599C326861L17309l90016J5673J200405J098875m46510j214966m22902K04667
39590C689396R1272J001977L086609L375487M83822k485616k445960p86473l44911
39581E665603o51123L15265J777582J374780n71512j493514n24535R00673J660880
39572H454099J634380O49141r46860j726879j235212j034279j685539j044249
39564C064602J743616L341447J010489k365260k537784p67474j100177k737288
39556c47829j459174K225604L222469N30812j034644P73624K137250M18823j329763
39547E137172l45205R76198K7820j144972j61602Q98041m32015j960545o90355
39538B304537J561703J416232J5331N64983K018094Q44329k242223l003934o94144
$$ plain form
39529 2784908 3815107 4263689 4199809 5091016 6346266 6084123 4530505 3720498 4194173
39520 4194173 4650819 4797570 5910532 8052820 9060018 7465884 4864900 3958744 5107397
39511 5107397 6241688 5969363 5360046 6091072 7843332 8720733 7919237 6620204 6054192
39502 6054192 6089410 6289898 6846786 7479614 6999723 5413548 4891626 6701887 8636447
39493 8636447 7945118 5578772 4519085 4810887 3899892 1725389 1451852 4284762 7324008
39484 7324008 8089360 7794018 8201830 8351342 6821706 4712326 3828798 3925386 4017047
39475 4017047 4378913 4956712 4056517 1399998 356796 3737112 8863750 10473527 7709702
39466 7709702 4657526 4247813 5177849 5205741 4223330 3127144 2287984 2269645 3969559
$$ packed form
39529B784908J030199M48582o3880Q91207J255250k62143j553618q10007M73675
39520D194173M56646J46751J112962K142288J007198j594134k600984r06156J148653
39511E107397J134291k72325o09317P31026J752260Q77401q01496j299033n66012
39502F054192L5218K00488N56888O32828m79891j586175n21922J810261J934560
39493H636447o91329k366346j059687K91802r10995k174503k73537K832910L039246
39484G324008P65352k95342M07812J49512j529636k109380q83528R6588R1661
39475D017047L61866N77799r00195k656519j043202L380316N126638J609777k763825
39466G709702l052176m09713R30036K7892r82411j096186q39160j8339J699914
$$ plain form
39457 3969559 6911698 9021431 9058413 7951867 7013542 6167908 4783194 3163481 2284475
39448 2284475 2574048 3503259 4173267 4293371 4733444 6537984 9005284 9822334 8052744
39439 8052744 5791030 5407667 6306437 6300987 5194397 4625339 4966702 5020057 4716603 5495210
39429 5495210 7628199 9561726 10434549 10992141 11444366 10790111 9105328 8143786 8497173
39420 8497173 8346054 6445808 4359872 4059305 4970934 5205357 4440013 3849653 4109921
39411 4109921 4929659 5725115 5615193 3841401 1338232 517952 2081567 3559762 2879667
39402 2879667 1865620 3607099 7288215 8749410 6341518 3319784 3354990 5904915
39394 5904915 7636017 7001297 5550448 5136035 5474184 5076688 3864229 3764070 6137913
$$ packed form
39457C969559K942139K109733L6982j106546r38325q45634j384714j619713q79006
39448B284475K89573R29211O70008J20104M40073J804540K467300Q17050j769590
39439H052744k261714l83363Q98770n450j106590n69058L41363N3355l03454P78607
39429E495210K132989J933527Q72823N57592M52225o54255j684783r61542L53387
39420H497173j51119j900246k085936l00567R11629K34423p65344n90360K60268
39411D109921Q19738P95456j09922j773792k503169q20280J563615J478195o80095
39402B879667j014047J741479L681116J461195k407892l021734L5206K549925
39394E904915J731102o34720j450849m14413L38149l97496j212459j00159K373843
$$ plain form
39385 6137913 9246100 9784079 7368625 5767601 8108174 12128485 12579935 8005500
39377 8005500 2520821 366579 1269830 2516231 3246386 4379831 5745627 6060263 5410909
39368 5410909 5292148 5960701 5976710 4961410 4664198 6129142 7609335 6921612 4611412
39359 4611412 3031499 3170592 4212283 5551814 7153990 8171201 7486061 5945527
39351 5945527 5873150 7615437 8632093 7136718 4688035 3619382 3691810 3376727 3010333
39342 3010333 4012970 5706502 5874707 4655912 4951690 7845252 10106550 8250134
39334 8250134 3537026 597972 1570096 3811773 3848679 1765720 435140 1389548 3185045
39325 3185045 3949134 3948458 4595094 5948845 6772462 6679742 6511768 6536545 6141221 5712751
$$ packed form
39385F137913L108187N37979k415454j601024K340573M020311M51450m574435
39377H005500n484679k154242R03251J246401P30155J133445J365796L14636o49354
39368E410909j18761O68553J6009j015300k97212J464944J480193o87723k310200
39359D611412j579913J39093J041691J339531J602176J017211o85140j540534
39351E945527p2377J742287J016656j495375k448683j068653P2428l15083l66394
39342C010333J002637J693532J68205j218795K95778K893562K261298j856416
39334H250134m713108k939054R72124K241677L6906k082959j330580R54408J795497
39325C185045P64089o76O46636J353751Q23617r2720j67974K4777l95324m28470
$$ plain form
39315 5712751 6667537 8617364 8827537 6275473 4066737 5264068 8111589 8631204 6722820
39306 6722820 5840267 7034472 7603393 6333421 5772595 7431274 8511688 6195057 2315531
39297 2315531 661458 1731101 3314206 4593874 6221493 7319354 6015051 2931393
39289 2931393 1053379 1688053 3093717 3561393 3382259 3013167 1657381 -982715 -3190590
39280 -3190590 -2896452 15895 3869762 6755527 7375238 5542615 2787324 1556645
39272 1556645 2756253 4554397 4468840 2365494 712371 1899594 5653265 9162218
39264 9162218 9835470 7989460 6366990 6710781 7701094 7233592 5753106 5464052 6628271
39255 6628271 7074008 5952298 5549420 7799929 10842162 11214494 8506896 5624670 4763222
$$ packed form
39315E712751R54786J949827K10173k552064k208736J197331K847521N19615j908384
39306F722820q82553J194205N68921j269972n60826J658679J080414k316631l879526
39297B315531j654073J069643J583105J279668J627619J097861j304303l083658
39289B931393j878014O34674J405664M67676j79134l69092j355786k640096k207875
39280c190590K94138K912347L853867K885765O19711j832623k755291j230679
39272A556645J199608J798144q5557k103346j653123J187223L753671L508953
39264I162218O73252j846010j622470L43791R90313m67502j480486k89054J164219
39255F628271M45737j121710m02878K250509L042233L72332k707598k882226q61448
$$ plain form
39246 4763222 5198886 5229092 4394676 3148390 1889424 1273972 2321554 5110956 8093749
39237 8093749 9687486 9980915 9922621 9461400 7835044 5461783 3987584 4075911 4510943
39228 4510943 4240225 4080564 5186687 6740377 6845388 5459111 4638495 5488296 6534249
39219 6534249 6076546 4792168 4585438 5732599 6808671 7048852 7034800 6963972 6035276
39210 6035276 4226782 3121026 3813414 5156568 5475065 5173837 5941151 7764549 8715186
39201 8715186 7985700 7201655 7745254 8461497 7652856 6211825 6635500 9185379 11143009
39192 11143009 10382279 7952621 6263403 6158847 6936119 8039713 9186287 9494912 8190991
39183 8190991 6169763 5501184 7006750 9131925 9518896 7301709 3936396 2109988
$$ packed form
39246D763222M35664L0206q34416j246286j258966o15452J047582K789402K982793
39237H093749J593737K93429n8294m61221j626356k373261j474199Q8327M35032
39228D510943k70718j59661J106123J553690J05011j386277q20616Q49801J045953
39219F534249m57703j284378k06730J147161J076072K40181j4052p0828r28696
39210F035276j808494j105756O92388J343154L18497l01228P67314J823398R50637
39201H715186p29486p84045N43599P16243q08641j441031M23675K549879J957630
39192A1143009p60730k429658j689218j04556P77272J103594J146574L08625j303921
39183H190991k021228o68579J505566K125175L86971k217187l365313j826408
$$ plain form
39175 2109988 3358908 6208897 7381610 5692676 3813570 4768903 7627701 8843040
39167 8843040 7475783 6378057 7614589 9364562 8881187 6506480 4821835 5138499
39159 5138499 6726634 8575730 9998658 10060379 8314804 6021942 5060733 5548252 5852802
39150 5852802 5101837 4426049 5280387 7406257 9050657 8951075 7809850 7612608 9201647
39141 9201647 10838101 10141699 7440811 5740128 6852312 9184115 10321096 10068829
39133 10068829 9450201 8469501 7078598 6922671 9304624 12179714 12221776 9741705 8464179
39124 8464179 10004105 11658860 10748852 8304359 6852033 6993485 8093803 10214347
39116 10214347 13026975 14433720 12853031 9923913 8488852 8526644 7593661 5065359
$$ packed form
39175B109988J248920K849989J172713j688934j879106R55333K858798J215339
39167H843040j367257j097726J236532J749973m83375k374707j684645L16664
39159E138499J588135J849096J422928O1721j745575k292862r61209M87519L04550
39150E852802p50965o75788Q54338K125870J644400r9582j141225j97242J589039
39141I201647J636454o96402k700888j700683J112184K331803J136981k52267
39133A0068829o18628r80700j390903j55927K381953K875090M2062k480071j277526
39124H464179J539926J654755r10008k444493j452326J41452J100318K120544
39116A0214347K812628J406745j580689k929118j435061L7792r32983k528302
$$ plain form
39108 5065359 3298564 4075629 6208306 7711661 8504990 9534636 10528531 10350749 9095497
39099 9095497 8291614 8893714 10102499 10478466 9547725 8021169 6966123 7079626 8292617
39090 8292617 9630038 9823577 8673871 7654675 8483255 11004958 13149361 13253733 11844535
39081 11844535 10720494 10807118 11477435 11620301 10775176 9413540 8597563 9177594 10909484
39072 10909484 12577462 13276919 13131949 12421841 10814818 8304642 6221420 6094199 7717726
39063 7717726 9391480 9950266 9614364 9033333 8572910 8511223 8948143 9532982 10106193
39054 10106193 11300190 13464979 15430899 15708691 14609582 13667496 13297191 12851561 12719915
39045 12719915 14014645 15951086 16082904 13890849 11675207 10906456 10356980 9309590
$$ packed form
39108E065359j766795P77065K132677J503355P93329J029646R93895j77782j255252
39099I095497q03883O02100J208785L75967r30741j526556j055046J13503J212991
39090H292617J337421J93539j149706j019196Q28580K521703K144403J04372j409198
39081A1844535j124041Q6624O70317J42866q45125j361636q15977N80031J731890
39072A0909484J667978O99457j44970p10108j607023k510176k083222j27221J623527
39063G717726J673754N58786l35902n81031m60423o1687M36920N84839N73211
39054A0106193J193997K164789J965920K77792j099109r42086l70305m45630j31646
39045A2719915J294730J936441J31818k192055k215642p68751n49476j047390
$$ plain form
39037 9309590 9722534 12784968 15776644 15476034 13018351 12064436 13293311 14222200 13881590
39028 13881590 13907973 14803194 14792145 13371685 12700724 13956121 15144858 14366564 12771420
39019 12771420 12150612 11778737 10242985 8760583 9690403 12542077 14386548 14107871 13543700
39010 13543700 14056072 14558751 13927368 13139666 13474120 14176412 13720996 12446773 12137229
39001 12137229 13402516 15132610 16457230 17666601 18916852 19460350 18815027 17648787
38993 17648787 16822868 16434030 16470709 17473720 19564551 21513212 21889244 20760025 19288343
38984 19288343 18113906 17308491 17562391 19853535 23660264 26779112 27516645 26317167
38976 26317167 24899841 24502030 25144289 25784058 24979030 22279281 19225292 18095435 19403255
$$ packed form
39037I309590M12944L062434K991676l00610k457683r53915J228875R28889l40610
39028A3881590K6383Q95221j1049j420460o70961J255397J188737p78294j595144
39019A2771420o20808l71875j535752j482402R29820K851674J844471k78677n64171
39010A3543700N12372N02679o31383p87702L34454P02292m55416j274223l09544
39001A2137229J265287J730094J324620J209371J250251N43498o45323j166240
38993A7648787q25919l88838L6679J003011K090831J948661L76032j129219j471682
38984A9288343j174437q05415K53900K291144L806729L118848P37533j199478
38976B6317167j417326l97811O42259O39769q05028k699749l053989j129857J307820
$$ plain form
38967 19403255 21484753 22673209 22778850 22227660 21112304 19671628 18494562 17613108
38959 17613108 16516242 15536590 15777150 16977069 17146742 15485627 14049552 14953336 17242960
38950 17242960 18313499 17421730 16004628 15320263 15537113 16482527 17563646 17554251 16112948
38941 16112948 14805724 14930942 15289630 14216140 12835848 13583938 16023331 17205211
38933 17205211 16243487 15384707 15950944 16372695 15418286 14405115 14504040 14476240 13177193
38924 13177193 12056814 12753630 14011400 13647739 12281555 12295091 13841777 14715464 14029680
38915 14029680 13371244 13951443 14966588 15494415 15961821 16696437 16708567 15205186 13127718
38906 13127718 11934729 11781338 12109343 13102008 14959771 16354225 15636115 13703083 13575562
$$ packed form
38967A9403255K081498J188456J05641n51190j115356j440676j177066q81454
38959A7613108j096866r79652K40560J199919J69673j661115j436075R03784K289624
38950A7242960J070539q91769j417102o84365K16850R45414J081119r395j441303
38941A6112948j307224J25218L58688j073490j380292P48090K439393J181880
38933A7205211r61724q58780N66237M21751r54409j013171R8925k7800j299047
38924A3177193j120379O96816J257770l63661j366184J3536J546686Q73687o85784
38915A4029680o58436N80199J015145N27827M67406P34616J2130j503381k077468
38906A3127718j192989j53391L28005R92665J857763J394454p18110j933032j27521
$$ plain form
38897 13575562 16230186 18736801 18106704 15431998 13918573 13825899 12417323 9024862
38889 9024862 6856353 8379576 11687926 13560548 13887460 14465032 15191210 14590978 13100370
38880 13100370 12590533 13033190 12766457 11969841 12652063 14879139 16276177 16022031 16121338
38871 16121338 17569469 18454097 17525604 16676199 17771205 19612380 20342518 20507127 21206794
38862 21206794 21341609 19534508 17140393 16490080 17436153 18306570 18945508 19967280 20285357
38853 20285357 18617829 16574823 16871665 18910472 19499193 17861797 16586113 17339638
38845 17339638 18899742 19969277 20741257 20836112 18893622 15575268 14097775 16041654
38837 16041654 18940733 19723210 18505166 17333411 17117376 17614508 18810475 20465071
$$ packed form
38897A3575562K654624K506615o30097k674706j513425r2674j408576l392461
38889I024862k168509J523223L308350J872622L26912N77572P26178o00232j490608
38880A3100370n09837M42657k66733p96616O82222K227076J397038k54146R9307
38871A6121338J448131Q84628r28493q49405J095006J841175P30138J64609O99667
38862B1206794J34815j807101k394115o50313R46073Q70417O38938J021772L18077
38853B0285357j667528k043006K96842K038807N88721j637396j275684P53525
38845A7339638J560104J069535P71980R4855j942490l318354j477493J943879
38837A6041654K899079P82477j218044j171755k16035M97132J195967J654596
$$ plain form
38829 20465071 21514719 21434951 21043096 20846870 20198371 19318610 20151847 23350447 26254782
38820 26254782 26163113 24122876 23008144 23157611 22813094 22022652 22817788 25465046 27600438
38811 27600438 27789239 27345231 27613167 27779870 26811631 25678733 25876726 26965593 27400903
38802 27400903 27149515 27681136 29362971 30381855 28907186 25554962 22970831 23133029
38794 23133029 25547301 28118563 29330366 29276243 28970722 29285247 30399606 31557080 31432658
38785 31432658 29675327 28059448 28754520 31159175 32240570 30968594 30363248 33129760
38777 33129760 36972939 37319260 34061196 32108175 34610392 38883291 40699992 39955868
38769 39955868 39643500 40975611 42344873 42458350 41941355 41715530 41757619 41860347 42171731
$$ packed form
38829B0465071J049648p9768l91855j96226o48499q79761Q33237L198600K904335
38820B6254782r1669k040237j114732J49467l44517p90442P95136K647258K135392
38811B7600438J88801m44008K67936J66703r68239j132898J97993J088867M35310
38802B7400903k51388N31621J681835J018884j474669l352224k584131J62198
38794B3133029K414272K571262J211803n4123l05521L14525J114359J157474j24422
38785C1432658j757331j615879O95072K404655J081395j271976o05346K766512
38777C3129760L843179L46321l258064j953021K502217M272899J816701p44124
38769C9955868l12368J332111J369262J13477n16995k25825M2089J02728L11384
$$ plain form
38760 42171731 42644577 43121594 44063012 45896007 47591464 47543876 46336037 46858080 50581459
38751 50581459 55160180 57197529 56311841 54742940 53743150 52616540 51365986 51920048
38743 51920048 55555798 60607492 64127102 64957093 64025603 62594098 61791307 63117718
38735 63117718 67176046 71699132 73007965 70477856 67912683 69065683 73063797 76072245
38727 76072245 76678922 77369040 80525799 85087156 88215771 88958820 88982452 90285922 93254946
38718 93254946 96785471 99564435 101171984 102276672 103817371 106096892 108932051 112327417
38710 112327417 116201924 119720417 122176942 124591578 128792513 134433711 138900178 141337018
38702 141337018 144624334 151183600 158613914 162629395 163495226 166012426 172951607 181995822
$$ packed form
38760D2171731M72846M77017R41418J832995J695457m7588j207839N22043L723379
38751E0581459M578721K037349q85688j568901r99790j126610j250554N54062
38743E1920048L635750N051694L519610Q29991r31490j431505q02791J326411
38735F3117718M058328M523086J308833k530109k565173J153000L998114L008448
38727G6072245O06677O90118L156759M561357L128615P43049K3632J303470K969024
38718I3254946L530525K778964J607549J104688J540699K279521K835159L395366
38710A12327417L874507L518493K456525K414636M200935N641198M466467K436840
38702A41337018L287316O559266P430314M015481Q65831K517200O939181R044215
$$ plain form
38694 181995822 190056923 197083370 203890875 209668838 214379825 220767068 230473559 240306481
38686 240306481 246476613 251264164 260761070 275924670 290532738 299397391 304610065 311496953
38678 311496953 321772357 333515681 345289583 356869269 367354925 375876927 383673660
38671 383673660 392764397 402799622 411608680 418699317 425799921 433761642 441249279 447053621
38663 447053621 451583885 455198083 456956978 456338385 454809497 454195251 454198859 452850493 449153979
38654 449153979 444292894 440172762 437322545 434303086 429007073 420705952 410983540 402484386
38646 402484386 396602963 392406367 387631552 380596179 371533585 362423348 355066347 348872905
38638 348872905 341192711 330536102 318651324 308251472 299481859 290382977 280429395
$$ packed form
38694A81995822Q061101P026447O807505N777963M710987O387243R706491R832922
38686B40306481O170132M787551R496906J5163600J4608068Q864653N212674O886888
38678C11496953J0275404J1743324J1773902J1579686J0485656Q522002P796733
38671C83673660R090737J0035225Q809058P090637P100604P961721P487637N804342
38663D47053621M530264L614198J758895o18593j528888o14246L608j348366l696514
38654D49153979m861085m120132k850217l019459n296013q301121r722412q499154
38646D02484386n881423m196596m774815p035373r062594r110237p357001o193442
38638C48872905p680194j0656609j1884778j0399852q769613r098882r953582
$$ plain form
38631 280429395 271387389 264320767 257894456 250557955 242556390 234604369 226312057 217509264
38623 217509264 209636924 203780901 198248140 190313117 180092342 170633244 164017867 159216837
38615 159216837 154213582 148508886 142684037 136923917 131200321 126079748 122145250 118993010
38607 118993010 115742855 112271727 109071480 106096671 102747611 99072115 96002581 93990178
38599 93990178 92194215 89626586 86490484 83675298 81448079 79547044 78178421 77770079
38591 77770079 77837250 77309010 76047858 74727588 73086492 70055665 66181816 63850577
38583 63850577 63830779 63656801 61368261 58875240 58877739 60061838 58943657 55688043 53984232
38574 53984232 54936528 55366562 53405393 51581053 52146878 53178317 52391546 51537331 53086650
$$ packed form
38631B80429395r042006p066622o426311p336501q001565p952021q292312q802793
38623B17509264p872340n856023n532761p935023j0220775r459098o615377m801030
38615A59216837n003255n704696n824849n760120n723596n120573l934498l152240
38607A18993010l250155l471128l200247k974809l349060l675496l069534k012403
38599I3990178j795963k567629l136102k815186k227219j901035j368623m08342
38591G7770079O7171n28240j261152j320270j641096l030827l873849k331239
38583F3850577j9798j73978k288540k493021K499J184099j118181l255614j703811
38574E3984232R52296M30034j961169j824340N65825J031439p86771q54215J549319
$$ plain form
38565 53086650 55022429 53499201 49414690 47657813 49912280 52500438 52129003 50028089
38557 50028089 49035862 49680187 50876508 52124742 53190062 53294695 52263042 51351169 51811358
38548 51811358 53597958 56109658 58931134 61261216 62112907 61885407 62364019 64384119
38540 64384119 66835011 68658698 70292839 72240310 73759341 74151296 74109630 74673214 75877000
38531 75877000 77280762 78644074 79343619 78648070 77528369 78441807 81877815 84726631
38523 84726631 83888555 80239175 77084514 75723925 74699680 72854572 70906920 69871613
38515 69871613 69571675 69064181 67601525 65180466 62783432 61630832 61556471 60919955 58876390
38506 58876390 56589714 55146254 53658277 51019824 48265620 47174620 47422588 47181677
$$ packed form
38565E3086650J935779j523228m084511j756877K254467K588158l71435k100914
38557E0028089r92227O44325J196321J248234J065320J04633j031653r11873M60189
38548E1811358J786600K511700K821476K330082Q51691k27500M78612K020100
38540F4384119K450892J823687J634141J947471J519031L91955m1666N63584J203786
38531G5877000J403762J363312O99545o95549j119701R13438L436008K848816
38523H4726631q38076l649380l154661j360589j024245j845108j947652j035307
38515F9871613k99938n07494j462656k421059k397034j152600p4361o36516k043565
38506E8876390k286676j443460j487977k638453k754204j091000K47968k40911
$$ plain form
38498 47181677 45869575 44304942 42855014 41574961 41437919 42948664 44086713 42376763
38490 42376763 38786429 36721210 37114086 37479605 36143307 34280050 33056708 31943752
38482 31943752 31004855 31711042 33856760 34600439 32580694 30393856 30796909 32806401 33870947
38473 33870947 33645192 33041291 31696594 29392876 28225340 30028165 32808167 33058153
38465 33058153 30904062 29741384 31155996 33356544 34584196 35039470 35146154 34685654
38457 34685654 34138509 34424938 34863237 33681056 30886076 28316528 26636236 24895964
38449 24895964 23454672 24337827 27584032 29914761 28586539 24595539 20875627 19248135
38441 19248135 20090012 22723767 24877444 24020714 20688871 18360033 18700435 19395497 18344898
$$ packed form
38498D7181677j312102j564633j449928j280053j37042J510745J138049j709950
38490D2376763l590334k065219L92876L65519j336298j863257j223342j112956
38482C1943752r38897P06187K145718P43679k019745k186838M03053K009492J064546
38473C3870947k25755o03901j344697k303718j167536J802825K780002K49986
38465C3058153k154091j162678J414612K200548J227652M55274J06684m60500
38457C4685654n47145K86429M38299j182181k794980k569548j680292j740272
38449B4895964j441292Q83155L246205K330729j328222l991000l719912j627492
38441A9248135Q41877K633755K153677q56730l331843k328838L40402O95062j050599
$$ plain form
38432 18344898 17213103 18333532 20554002 21238722 20577516 20661349 21562124 21558118 20374167
38423 20374167 19096120 17560822 14951211 12480318 12229076 13427487 13087518 10575271
38415 10575271 8560415 8999148 10973921 12943115 14326161 14413416 12696861 10936478
38407 10936478 11747133 14189210 14098831 10220204 6609205 6933955 9693694 11723760 13264657
38398 13264657 15952750 18215014 17041369 13293737 11055887 11769956 12762780 12088502
38390 12088502 11302256 12119504 13280355 12794291 11423847 11695329 14178012 16559810 16475223
38381 16475223 14163945 11960398 11585338 12400110 12531206 11356500 10016015 9357875 8707051
38372 8707051 7572034 7238416 8873256 10754608 9693314 5546423 2277097 3417483
$$ packed form
38432A8344898j131795J120429K220470O84720o61206Q3833R00775m006j183951
38423B0374167j278047j535298k609611k470893k51242J198411l39969k512247
38415A0575271k014856M38733J974773J969194J383046Q7255j716555j760383
38407A0936478Q10655K442077r0379l878627l610999L24750K759739K030066J540897
38398A3264657K688093K262264j173645l747632k237850P14069R92824o74278
38390A2088502p86246Q17248J160851m86064j370444K71482K482683K381798q4587
38381A6475223k311278k203547l75060Q14772J31096j174706j340485o58140o50824
38372H707051j135017l33618J634840J881352j061294m146891l269326J140386
$$ plain form
38364 3417483 7793144 11057604 10729436 8335847 6725177 6641049 6714965 6156727 6144898
38355 6144898 8057598 11198655 13360418 13346389 11769808 9480278 6746717 4340110
38347 4340110 3652291 4701528 5497917 4680371 3442314 3354575 3696215 3015052 2258892
38338 2258892 3791134 7617865 11047954 12218142 11713933 10443764 8287991 5650495
38330 5650495 4217542 4904715 6499757 7422401 7631386 7900714 8402420 8923545 9421157
38321 9421157 9501272 8343277 5958861 3612007 2301584 1795927 1769119 2677140 4617778
38312 4617778 6421604 6932034 6404932 5808401 5543442 5573558 5903302 6229020 6108588
38303 6108588 6058867 7140222 8726562 8477277 5852356 3785972 4816657 7126743 7117598
$$ packed form
38364C417483M375661L264460l28168k393589j610670q4128P3916n58238j1829
38355F144898J912700L141057K161763j4029j576581k289530k733561k406607
38347D340110o87819J049237P96389q17546j238057q7739L41640o81163p56160
38338B258892J532242L826731L430089J170188n04209j270169k155773k637496
38330E650495j432953O87173J595042R22644K08985K69328N01706N21125M97612
38321I421157Q0115j157995k384416k346854j310423n05657k6808R08021J940638
38312D617778J803826N10430n27102n96531k64959L0116L29744L25718j20432
38303F108588m9721J081355J586340k49285k624921k066384J030685K310086r145
$$ plain form
38294 7117598 4940404 4279472 6655546 9141827 8719189 6232058 4469237 4406768 5235600
38285 5235600 6525269 8125051 8804229 7332265 4795787 3780726 4929630 6132365
38277 6132365 5712370 4575548 4120050 3819967 2749861 2143184 3812149 6513728 6905321
38268 6905321 4648142 3499323 5783203 8634539 8338206 6121353 6076075 8577147 9851785
38259 9851785 8079001 5848527 5488499 5694076 4794107 4182577 5697652 7801577 7460374
38250 7460374 4644508 2204646 1933098 3141340 4655147 5901836 6204327 5167277
38242 5167277 3911935 4106063 5527866 6147446 4878451 2885300 1895871 2390986 3713668
38233 3713668 4994007 5750132 6217741 6951571 7595952 6792726 4288806 2239651 2876321
$$ packed form
38294G117598k177194o60932K376074K486281m22638k487131j762821o2469Q28832
38285E235600J289669J599782O79178j471964k536478j015061J148904J202735
38277F132365m19995j136822m55498l00083j070106o06677J668965K701579L91593
38268F905321k257179j148819K283880K851336k96333k216853m5278K501072J274638
38259I851785j772784k230474l60028K05577q99969o11530J515075K103925l41203
38250G460374k815866k439862k71548J208242J513807J246689L02491j037050
38242E167277j255342J94128J421803O19580j268995j993151r89429M95115J322682
38233C713668J280339P56125M67609P33830O44381q03226k503920k049155O36670
$$ plain form
38224 2876321 5444981 7156463 6824842 5771246 5278702 5095438 4697257 4237684 3780411
38215 3780411 3130108 2819069 3653510 4775473 3950933 804749 -1713604 -516417 3779921
38206 3779921 7520897 8206473 6939503 6612943 8419910 10681219 11049636 9268680 7066695
38197 7066695 5636826 4586146 3737715 4241103 6571993 8836804 8935469 7494042 6672553
38188 6672553 6815538 6552749 5754999 5811252 6866521 7284752 6387221 5497131 5567130 5776708
38178 5776708 5231488 4228924 3183285 2093683 1594359 2522743 3871001 3420061 1238201
38169 1238201 190166 1850362 4276848 5212725 5095397 5173896 5006616 4022111 3545594
38160 3545594 4811405 6517490 6742528 5896294 5358090 4561028 2201423 -569349 -1019821
$$ packed form
38224B876321K568660J711482l31621j053596m92544j83264l98181m59573m57273
38215C780411o50303l11039Q34441J121963q24540l146184k518353J197187M296338
38206C779921L740976O85576j266970l26560J806967K261309L68417j780956k201985
38197G066695j429869j050680q48431N03388K330890K264811R8665j441427q21489
38188F672553J42985k62789p97750N6253J055269M18231q97531q90090O9999K09578
38178E776708n45220j002564j045639j089602m99324R28384J348258m50940k181860
38169A238201j048035J660196K426486R35877j17328P8499j67280r84505m76517
38160C545594J265811J706085K25038q46234n38204p97062k359605k770772m50472
$$ plain form
38151 -1019821 1393390 4497146 6360739 6665161 5580903 3589452 2209398 2699732
38143 2699732 4107332 4524187 3942949 3778831 4033209 3466719 2430555 2743577 4390910
38134 4390910 5031124 3567667 1805563 1582231 2436238 3240010 4108089 5305558 5952957
38125 5952957 5356438 4497528 4913239 6830421 9124344 10280337 9137330 6059982 3683537
38116 3683537 4644552 7855701 9046665 6155886 2159081 920194 2163845 2828670
38108 2828670 1982598 1624749 3076372 5200619 6521961 7047302 7343812 7367038 6951185
38099 6951185 6358201 5710473 4778481 3876636 4085007 5832772 7873807 8516996 7628849
38090 7628849 6652528 6642341 7033944 6747069 5922600 5757892 6738088 7963318 8519164
$$ packed form
38151a019821K413211L103756J863593L04422j084258j991451j380054M90334
38143B699732J407600M16855n81238j64118K54378n66490j036164L13022J647333
38134D390910O40214j463457j762104k23332Q54007Q03772Q68079J197469O47399
38125E952957n96519q58910M15711J917182K293923J155993j143007l077348k376445
38116C683537R61015L211149J190964k890779l996805j238887J243651O64825
38108B828670q46072l57849J451623K124247J321342N25341K96510K3226m15853
38099F951185n92984o47728r31992r01845K08371J747765K041035O43189q88147
38090G628849r76321j0187L91603k86875q24469j64708R80196J225230N55846
$$ plain form
38081 8519164 8564627 8423026 7577938 5696912 3874004 3371221 3640138 3334612 2927484
38072 2927484 4054662 6083311 6019766 2960419 99507 388830 2331439 2626241 1336652
38063 1336652 1213774 2662259 3015210 1285403 246313 2192477 5210930 5872766 3992235
38054 3992235 2364865 2635552 3722327 4183113 4081621 4044844 4046344 3895963 3873071 4095522
38044 4095522 4044348 3493755 3267571 4139242 5358195 5322585 3753405 2267214 2439475
38035 2439475 3981361 5311880 5457445 4847460 4515193 5036291 6134926 6908537 6502983
38026 6502983 4930628 3233993 2639186 3578453 5517258 7337926 7791165 6287959 3790336
38017 3790336 2307263 2749847 3775438 3600665 2412858 1808679 2227567 2473490 1881935
$$ packed form
38081H519164M5463j41601q45088j881026j822908n02783K68917l05526m07128
38072B927484J127178K028649o3545l059347k860912K89323J942609K94802j289589
38063A336652j22878J448485L52951j729807j039090J946164L018453O61836j880531
38054C992235j627370K70687J086775M60786j01492l6777J500j50381k2892K22451
38044D095522n1174n50593k26184Q71671J218953l5610j569180j486191J72261
38035B439475J541886J330519J45565o09985l32267N21098J098635P73611m05554
38026F502983j572355j696635n94807R39267J938805J820668M53239j503206k497623
38017C790336j483073M42584J025591j74773j187807o04179M18888K45923n91555
$$ plain form
38008 1881935 1424010 2106336 3509534 4604960 5058027 5090047 4870902 4537006 4021116
37999 4021116 2694357 392462 -1032322 932268 5667502 8946439 7831491 4429081
37991 4429081 2834994 3779188 4731377 4285027 3505261 3170637 2663687 2109304 2909490
37982 2909490 5138809 6737513 6582341 6308550 7534252 9058915 8676906 6453443 4281145
37973 4281145 3145646 2726547 2943426 3843814 4346797 3215510 1369149 1246926 3344480
37964 3344480 5077319 3982309 849851 -1283479 -499231 2412787 5119517 5789630
37956 5789630 4373006 2438107 1635767 2225182 3402013 4764595 6470440 7968005
37948 7968005 7998481 6482916 5105556 5043600 5326995 4774983 4381728 5798229 8126318
$$ packed form
38008A881935m57925O82326J403198J095426M53067L2020k19145l33896n15890
37999D021116j326759k301895j424784J964590M735234L278937j114948l402410
37991D429081j594087R44194R52189m46350p79766l34624n06950n54383Q00186
37982B909490K229319J598704j55172k73791J225702J524663l82009k223463k172298
37973D281145j135499m19099K16879R00388N02983j131287j846361j22223K097554
37964C344480J732839j095010l132458k133330P84248K912018K706730O70113
37956E789630j416624j934899q02340N89415J176831J362582J705845J497565
37948G968005L0476j515565j377360o1956K83395n52012l93255J416501K328089
$$ plain form
37939 8126318 8683296 7070467 5909025 6620646 6998170 4844816 1987291 1871856 4136263
37930 4136263 4729814 1710929 -1930222 -2435717 -18154 2330010 3154777 3445027 3961790
37921 3961790 4002690 3088481 2034896 1548972 1030280 -206263 -1298330 -618038 1951096
37912 1951096 4516770 5306244 4680417 4424149 5259269 5872272 4784396 2535456 1127948
37903 1127948 1486140 2517224 2944132 3001374 3627950 4875178 6120882 7230892 8307787
37894 8307787 8656300 7385899 5092019 3602633 3658021 3983821 3240693 1885656 1310757
37885 1310757 1890530 2784350 3252373 3365915 3599568 4282802 5313923 6100608 6074063
37876 6074063 5435294 4814178 3998745 2024486 -823601 -2289528 -784022 2046247 3110608
$$ packed form
37939H126318N56978j612829j161442P11621L77524k153354k857525j15435K264407
37930D136263N93551l018885l641151n05495K417563K348164Q24767K90250N16763
37921C961790M0900r14209j053585m85924n18692j236543j092067O80292K569134
37912A951096K565674P89474o25827k56268Q35120O13003j087876k248940j407508
37903A127948L58192J031084M26908N7242O26576J247228J245704J110010J076895
37894H307787L48513j270401k293880j489386N5388L25800p43128j355037n74899
37885A310757N79773Q93820M68023J13542K33653O83234J031121P86685k6545
37876F074063o38769o21116q15433j974259k848087j465927J505506K830269J064361
$$ plain form
37867 3110608 1928402 1005030 2008472 3617942 4024964 3688630 4057072 4891096 4823347
37858 4823347 3953522 3874541 5106319 6293652 6323810 5601857 4556506 2520549 -596306
37849 -596306 -2735275 -1652014 1818540 4158731 3216190 605450 -574398 543631
37841 543631 2090730 2139806 772323 -634857 -1278697 -1429268 -1386522 -774891 703136
37832 703136 2256096 2557607 1477894 526313 988448 2170224 2406353 1560457 1308778
37823 1308778 2632249 4223112 4298174 3218822 3063094 4768230 6881223 7444196 6212466
37814 6212466 4443544 3093608 1979646 608381 -779756 -1275914 -328909 1390847
37806 1390847 2317268 1492945 -175796 -598681 1157020 3508900 4045068 2603639 1799085
$$ packed form
37867C110608j182206r23372J003442J609470M07022l36334L68442Q34024o7749
37858D823347q69825p8981J231778J187333L0158p21953j045351k035957l116855
37849e96306k138969J083261L470554K340191r42541k610740j179848J118029
37841E43631J547099M9076j367483j407180o43840j50571M2746O11631J478027
37832G03136J552960L01511j079713r51581M62135J181776K36129q45896k51679
37823A308778J323471J590863P5062j079352j55728J705136K112993N62973j231730
37814F212466j768922j349936j113962j371265j388137m96158R47005J719756
37806A390847R26421q24323j668741m22885J755701K351880N36168j441429q04554
$$ plain form
37797 1799085 3882271 7760793 10224415 9887712 8533280 8211324 8521416 7863572 6158972
37788 6158972 4634108 3576819 2287454 1111880 1366850 2803890 3277632 1906163
37780 1906163 604657 1129636 2431854 2711216 2437316 3059246 3990975 3550820 2189447
37771 2189447 1987001 3164860 3882224 3573289 3578987 4038403 3288529 1397814 1124106
37762 1124106 3553901 5660513 4651028 2395175 2632299 5460551 7660332 7405904
37754 7405904 5650008 3552018 1598814 990105 2806944 5541398 6250017 4644233
37746 4644233 3385139 3743065 3863508 2523393 1734072 3515421 6211163 6557536 4265700
37737 4265700 2136630 2057566 2970379 2919859 1507459 -146646 -897417 -573465 64075
$$ packed form
37797A799085K083186L878522K463622l36703j354432l21956L10092o57844j704600
37788F158972j524864j057289j289365j175574K54970J437040M73742j371469
37780A906163j301506N24979J302218K79362k73900O21930R31729m40155j361373
37771B189447k02446J177859P17364l08935N698M59416p49874j890715k73708
37762A124106K429795K106612j009485k255853K37124K828252K199781k54428
37754G405904j755896k097990j953204o08709J816839K734454P08619j605784
37746D644233j259094L57926J20443j340115p89321J781349K695742L46373k291836
37737D265700k129070p9064R12813n0520j412400j654105p50771L23952O37540
$$ plain form
37728 64075 162856 -255926 -297433 730557 2582459 4547931 6140297 7032342 6840916
37719 6840916 5454423 3379869 1557983 916834 1811597 3397229 3910754 2422021 94657
37710 94657 -1191179 -1150863 -905866 -920455 -734368 -525206 -931885 -1136125 692048 4398083
37700 4398083 7404840 8108325 7584990 6980437 5680624 3571443 2555112 3625282 4630743
37691 4630743 3477006 1614641 1521835 2481726 2160774 1049459 1655080 3985168 5582085
37682 5582085 5829107 6437839 7451602 6693407 4075842 2682577 4018931 5526582 4749221
37673 4749221 3052976 2979215 4302581 5040114 4483589 3124433 1313051 -24455 840001
37664 840001 3776203 5654313 4278815 1917397 2232320 4952386 6592293 5769492 4665169
$$ packed form
37728F4075R8781m18782m1507J027990J851902J965472J592366Q92045j91426
37719F840916j386493k074554j821886o41149Q94763J585632N13525j488733k327364
37710I4657j285836M0316K44997j4589J86087K09162m06679k04240J828173L706035
37700D398083L006757P03485n23335o04553j299813k109181j016331J070170J005461
37691D630743j153737j862365r2806R59891l20952j111315O05621K330088J596917
37682E582085K47022O08732J013763p58195k617565j393265J336354J507651p77361
37673D749221j696245p3761J323366P37533n56525j359156j811382j337506Q64456
37664H40001K936202J878110j375498k361418L14923K720066J639907q22801j104323
$$ plain form
37655 4665169 5118111 6101548 5816816 4174916 2338567 1304967 1581758 3010254 4388256
37646 4388256 4339207 2998704 1987423 2447514 3859140 4941598 5064561 4700058 4870750
37637 4870750 5857708 6220352 4108900 258307 -1749024 271190 3842051 4907412
37629 4907412 3267905 2302854 3564626 4688640 3448456 1157082 424990 1483654
37621 1483654 2649879 3246660 4095059 5491471 6332159 5546059 3551218 1892235 1598325
37612 1598325 2070756 1905299 1009292 1196868 3760843 7000553 7676877 4999932 1678623
37603 1678623 579207 1733638 3332036 4332237 4967671 5529491 5843843 5700987 5107027
37594 5107027 4326765 3956510 4388555 4889219 3995522 1406497 -1194829 -1860545 -376484
$$ packed form
37655D665169M52942R83437k84732j641900j836349j033600K76791J428496J378002
37646D388256m9049j340503j011281M60091J411626J082458J22963l64503J70692
37637D870750R86958L62644k111452l850593k007331K020214L570861J065361
37629D907412j639507r65051J261772J124014j240184k291374p32092J058664
37621A483654J166225N96781Q48399J396412Q40688p86100j994841j658983k93910
37612A598325M72431j65457q96007J87576K563975L239710O76324k676945l321309
37603A678623j099416J154431J598398J000201O35434N61820L14352j42856n93960
37594E107027p80262l70255M32045N00664q93697k589025k601326o65716J484061
$$ plain form
37585 -376484 2031532 4320271 6098382 6942014 6392959 4861844 3756626 4097147 5136262
37576 5136262 4922325 2605217 -167102 -954133 355400 1258478 38579 -1807791 -1765053
37567 -1765053 142142 1746146 2060230 2124205 2646138 2981734 2881453 3244280 4375651
37558 4375651 5215933 5104217 4698699 4363206 3372671 1696740 756758 1090064 990578
37549 990578 -845858 -2783788 -2297314 473503 3138841 4277356 4352802 3968265 3155002
37540 3155002 2280238 1987566 2137558 2100226 2072587 2877492 4448864 5663014 5805581
37531 5805581 5331416 5084736 5383103 5805930 5515958 4160534 2693277 2521982 3566846
37522 3566846 4359378 4468684 5081493 6295501 6017280 3285559 617449 626580 2038874
$$ packed form
37585c76484K408016K288739J778111Q43632n49055j531115j105218L40521J039115
37576E136262k13937k317108k772319p87031J309533R03078j219899j846370M2738
37567a765053J907195J604004L14084O3975N21933L35596j00281L62827J131371
37558D375651Q40282j11716m05518l35493r90535j675931r39982L33306r9486
37549I90578j836436j937930M86474K770817K665338J138515P5446l84537q13263
37540C155002q74764k92672J49992l7332k7639Q04905J571372J214150J42567
37531E805581m74165k46680K98367M22827k89972j355424j467257j71295J044864
37522C566846P92532J09306O12809J214008k78221k731721k668110R131J412294
$$ plain form
37513 2038874 1942578 549073 312563 1285820 1229408 105444 389854 2354737 3029665
37504 3029665 1136477 -612511 110989 1952143 3054589 4329396 6820762 8531092
37496 8531092 7154751 4173034 3030025 4421199 6283765 7423346 8176016 8159209 6424613
37487 6424613 3795638 2416644 2799478 3543223 4023499 5055152 6647193 7395616 6709546
37478 6709546 5680741 5093357 4379154 3294311 2944385 4161826 6132247 7483251 7704306
37469 7704306 6911616 5387060 4007290 3928157 4984265 5392283 3956737 1822936 1180225
37460 1180225 2719091 4996262 5893940 4333318 1107824 -1610416 -2110524 -734958
37452 -734958 833848 1710312 2272881 2652230 2313192 1614510 2171967 4547717 6745658
$$ packed form
37513B038874r6296j393505k36510R73257n6412j123964K84410J964883O74928
37504C029665j893188j748988P23500J841154J102446J274807K491366J710330
37496H531092j376341k981717j143009J391174J862566J139581P52670j6807j734596
37487F424613k628975j378994L82834P43745M80276J031653J592041P48423o86070
37478F709546j028805n87384p14203j084843l49926J217441J970421J351004K21055
37469G704306p92690j524556j379770p9133J056108M08018j435546k133801o42711
37460A180225J538866K277171Q97678j560622l225494k718240n00108J375566
37452g34958J568806Q76464N62569L79349l39038o98682N57457K375750K197941
$$ plain form
37443 6745658 6389013 3789911 1617919 1772647 3533470 4705611 3953340 2072491 1229544
37434 1229544 2650712 5065730 6179531 5666576 5401829 6340907 6858079 5344122 2982966
37425 2982966 2183334 3124403 3779912 3073841 2188783 2491152 3551057 3797627 2481601
37416 2481601 661144 349266 2351315 4900373 5395295 3755509 2526104 2949574 3020197
37407 3020197 1059041 -954500 -275811 2039446 2727154 1406657 460930 445128 -262967
37398 -262967 -1147761 557009 4546374 6506301 4547278 2401240 3452659 5505346
37390 5505346 5075888 3443719 3924871 5593707 4754492 1460434 -342968 1013250 2993676
37381 2993676 3430348 3086247 2958479 2538833 1729815 1532489 1995291 2138703 2346374
$$ packed form
37443F745658l56645k599102k171992J54728J760823J172141p52271j880849q42947
37434A229544J421168K415018J113801n12955k64747R39078N17172j513957k361156
37425B982966p99632R41069O55509p06071q85058L02369J059905K46570j316026
37416B481601j820457l11878K002049K549058M94922j639786j229405M23470P0623
37407C020197j961156k013541O78689K315257O87708j320497r45727j5802p08095
37398b62967q84794J704770L989365J959927j959023k146038J051419K052687
37390E505346m29458j632169M81152J668836q39215l294058j803402J356218J980426
37381B993676M36672l44101j27768m19646q09018j97326M62802J43412K07671
$$ plain form
37372 2346374 3867087 5562347 4658379 1637168 658233 3515869 6756217 6970318 5571200
37363 5571200 5480993 6024614 4686770 1993622 874764 1974100 2878297 1903908 67727
37354 67727 -861435 -300897 1302492 3036842 3819921 3221669 1988932 1181002 1240512
37345 1240512 2196398 3669277 4291560 2784775 334978 -113364 1961616 3471591 2322898
37336 2322898 743734 1673160 4111156 5089932 4524514 4679040 5886157 6267454 5230405
37327 5230405 4036905 3130165 1926023 1125553 2181197 4307676 4916423 3389712 1831466
37318 1831466 1774561 2633277 3622894 4681633 5270533 4733000 3915074 3910605 3510327 1021326
37308 1021326 -1666603 -775254 3200429 5323411 3416733 1088719 1573132 2830562
$$ packed form
37372B346374J520713J695260r03968l021211r78935K857636L240348K14101j399118
37363E571200r0207N43621j337844k693148j118858J099336R04197r74389j836181
37354F7727r29162N60538J603389J734350P83079n98252j232737q07930N9510
37345A240512R55886J472879O22283j506785k449797m48342K074980J509975j148693
37336B322898j579164R29426K437996R78776n65418J54526J207117L81297j037049
37327E230405j193500r06740j204142q00470J055644K126479O08747j526711j558246
37318A831466n6905Q58716R89617J058739N88900n37533q17926m469m00278k489001
37308A021326k687929Q91349L975683K122982j906678k328014M84413J257430
$$ plain form
37300 2830562 1793958 -188820 31963 1951018 2525565 1175616 56050 266353 928588
37291 928588 1469627 2162037 2811390 3049809 3339617 3833840 3206581 617841 -2176714
37282 -2176714 -2759170 -1118381 1145937 3350023 5200637 5288595 3072675 1258212 2866141
37273 2866141 6440634 7516646 4783386 1471623 291420 345272 30372 -99304 949407
37264 949407 2312654 2558108 1919339 1808944 2955997 4861954 6324014 6167900 4472342
37255 4472342 3132076 3870539 5691714 5992609 4344366 3153578 4039027 5664452 6164849
37246 6164849 5739472 5395720 4784583 3147678 1423336 1504756 3628076 5905962 6538497
37237 6538497 5548113 4162614 3137013 2096662 481485 -1226547 -1828668 -1062052 1546
$$ packed form
37300B830562j036604j982778K20783J919055N74547j349949j119566K10303O62235
37291I28588N41039O92410O49353K38419K89808M94223o27259k588740k794555
37282b176714n82456J640789K264318K204086J850614Q7958k215920j814463J607929
37273B866141L574493J076012k733260l311763j180203N3852l14900j29676J048711
37264I49407J363247K45454o38769j10395J147053J905957J462060j56114j695558
37255D472342j340266P38463J821175L00895j648243j190788Q85449J625425N00397
37246F164849m25377l43752o11137j636905j724342Q1420K123320K277886O32535
37237F538497r90384j385499j025601j040351j615177j708032o02121P66616J063598
$$ plain form
37228 1546 718273 1751089 3059807 2597577 -720372 -3850221 -2584781 2361028 5566092
37219 5566092 4047949 932322 330512 1618852 1514117 -341811 -1152038 566713 3186647
37210 3186647 4547841 4131706 2579519 807858 -238019 -278843 -147424 -513010 -588633
37201 -588633 667814 2613226 3663831 3566766 3365371 3411569 3066982 2250009 1676630
37192 1676630 1627531 1985849 3234275 5609942 7504005 6906813 4524234 3003061 2663952
37183 2663952 878383 -3153365 -6002815 -4625599 -1017440 565009 -579055 -1653974
37175 -1653974 -1257240 -810842 -1164188 -1047575 245097 1316135 1046386 392230 464464
37166 464464 617668 -52518 -754307 -115942 1741226 3563224 4520439 4350486 3056920
$$ packed form
37228A546P16727J032816J308718m62230l317949l129849J265440M945809L205064
37219E566092j518143l115627o01810J288340j04735j855928q10227J718751K619934
37210C186647J361194m16135j552187j771661j045877m0824J31419l65586p5623
37201e88633J256447J945412J050605r7065k01395M6198l44587q16973n73379
37192A676630m9099L58318J248426K375667J894063n97192k382579j521173l39109
37183B663952j785569m031748k849450J377216L608159J582449j144064j074919
37175a653974L96734M46398l53346J16613J292672J071038k69749o54156P2234
37166D64464J53204o70186p01789O38365J857168J821998R57215j69953j293566
$$ plain form
37157 3056920 1636149 1852726 3822112 5011712 3364853 309392 -1322597 -1328077 -1649010
37148 -1649010 -2551895 -2176964 4802 2074384 2713509 2981686 4097893 5537354 6409140
37139 6409140 6866364 7027738 6216322 4420249 2891618 2173734 1214507 -357556 -916400
37130 -916400 642990 2795350 3639598 3730563 4576303 5619924 5119949 3250579 1946523
37121 1946523 1992928 2382029 2409129 2460965 2699010 2684016 2440621 2476458 2712803 2636014
37111 2636014 2381048 2489878 2866765 3111831 3428210 4004982 4167567 3517562 3126525
37102 3126525 3975317 5016283 4646994 3352728 2833715 3222204 3408103 3394884 3739605
37093 3739605 3294131 595660 -2691159 -3080124 -355093 1999147 2152833 2218772 3927889
$$ packed form
37157C056920j420771K16577J969386J189600j646859l055461j631989n480l20933
37148a649010r02885L74931K181766K069582O39125K68177J116207J439461Q71786
37139F409140M57224J61374q11416j796073j528631p17884r59227j572063n58844
37130i16400J559390K152360Q44248R0965Q45740J043621m99975j869370j304056
37121A946523M6405L89101K7100N1836K38045j4994k43395L5837K36345p6789
37111B636014k54966J08830L76887K45066L16379N76772J62585o50005l91037
37102C126525Q48792J040966l69289j294266n19013L88489J85899j3219L44721
37093C739605m45474k698471l286819l88965K725031K354240J53686O5939J709117
$$ plain form
37084 3927889 5538585 5128094 3951494 3982261 4492954 3781165 2438004 2134693 2489186
37075 2489186 1849088 414108 157181 1958647 4653247 6610145 6871941 5324682 3079494
37066 3079494 2027283 2803843 3977971 4293144 4495861 5612307 6822275 6857416 6311011
37057 6311011 6474764 6794860 5738376 3646705 2459599 2770914 3304204 3448062 4290847
37048 4290847 6544420 8955247 9554232 7682657 4417962 1610126 599666 1330340
37040 1330340 2650428 3627097 4123056 4016496 2954086 1418005 780328 1370736 1697543
37031 1697543 734995 -188821 815572 3451085 5643310 5907529 4189965 1408395 -657354
37022 -657354 -322841 1721036 2490734 681371 -1088435 -52581 2423920 3041820 1570367
$$ packed form
37084C927889J610696m10491j176600L0767N10693p11789j343161l03311L54493
37075B489186o40098j434980k56927J801466K694600J956898K61796j547259k245188
37066C079494j052211P76560J174128L15173K02717J116446J209968L5141n46405
37057F311011J63753L20096j056484k091671j187106L11315N33290J43858Q42785
37048D290847K253573K410827N98985j871575l264695k807836j010460P30674
37040A330340J320088R76669M95959j06560j062410j536081o37677N90408L26807
37031A697543r62548r23816J004393K635513K192225K64219j717564k781570k065749
37022f57354L34513K043877P69698j809363j769806J035854K476501O17900j471453
$$ plain form
37013 1570367 418156 213935 -510122 -1531914 -697468 1991296 3642098 2996998 2525733
37004 2525733 4382286 6924471 7210998 5016565 2457033 1002036 560019 611525 864162
36995 864162 1240506 1907838 2861365 3470388 3349046 3362234 4307077 4965142 3520122 849515
36985 849515 -9209 1933052 4372067 5279238 5165268 4896061 3980057 2466748 1984272
36976 1984272 3041583 3574876 2242368 1063502 2391927 5048170 6132188 5337356
36968 5337356 4621392 4429218 3203991 563317 -1687084 -2198435 -1689396 -1238568 -574551
36959 -574551 1025149 3116516 4321683 3991144 3128443 3328463 4675875 5275897 3683159
36950 3683159 1208541 279538 841890 604594 -937985 -1505063 -124314 684851 -1128733
$$ packed form
37013A570367j152211k04221p24057j021792Q34446K688764J650802o45100m71265
37004B525733J856553K542185K86527k194433k559532j454997m42017N1506K52637
36995H64162L76344O67332R53527O09023j21342J3188R44843O58065j445020k670607
36985H49515q58724J942261K439015R07171j13970k69207r16004j513309m82476
36976A984272J057311N33293j332508j178866J328425K656243J084018p94832
36968E337356p15964j92174j225227k640674k250401n11351N09039M50828O64017
36959e74551J599700K091367J205167l30539q62701K00020J347412O00022j592738
36950C683159k474618r29003N62352k37296j542579n67078J380749Q09165j813584
$$ plain form
36941 -1128733 -3550058 -3571065 -1834584 -1095458 -1582629 -1335556 -165838 388800 641663
36932 641663 2466369 5192521 5617107 3099312 1093507 2032247 3900313 4002823 3280047
36923 3280047 4097974 5844737 5911616 3998662 2421158 2413677 2793226 2547809 2448427 3337604
36913 3337604 4562240 5090850 5003235 4907708 4700991 3885580 2731214 2330706 3550296
36904 3550296 6248677 9288178 11071713 10563961 8332227 6232599 5454089 5224349 4274783
36895 4274783 3214414 4004910 6781733 8814372 7781583 4881525 3072498 2998895 2678539
36886 2678539 1058918 -375874 -222764 575514 386189 -514935 -489725 991740 2686871
36877 2686871 3098526 1837232 -219565 -1560646 -1250144 103853 1133195 1578644 2332399
$$ packed form
36941a128733k421325k1007J736481P39126m87171K47073J169718N54638K52863
36932F41663J824706K726152M24586k517795k005805R38740J868066J02510p22776
36923C280047Q17927J746763O6879j912954j577504p481L79549k45417r9382Q89177
36913C337604J224636N28610q7615r5527k06717q15411j154366m00508J219590
36904C550296K698381L039501J783535n07752k231734k099628p78510k29740r49566
36895D274783j060369P90496K776823K032639j032789k900058j809027p3603l20356
36886B678539j619621j434792J53110P98278j89325r01124K5210J481465J695131
36877B686871M11655j261294k056797j341081L10502J353997J029342M45449P53755
$$ plain form
36868 2332399 3379769 3251108 1358057 -631595 -952681 59489 1247475 2688310
36860 2688310 4715441 6053494 5036415 2132340 -533042 -1677583 -1361316 127897
36852 127897 1994461 2430202 664216 -1143665 -525714 1361354 1344198 -473730 -507142
36843 -507142 2564793 5392643 4990859 3143006 3321667 5412606 6371941 4953215 2996757
36834 2996757 2295765 2516192 2587518 2430423 2500951 2529048 1611130 -427471 -2218178 -2003606
36824 -2003606 143327 1975619 1737262 478040 454985 1831082 2757055 2503660 2337939
36815 2337939 2926335 3080498 2025523 1020928 1485363 2917967 3775767 3267727 1598776
36806 1598776 -203988 -288272 2282527 5199001 4751201 1085781 -1143292 861991 3936729
$$ packed form
36868B332399J047370j28661j893051j989652l21086J012170J187986J440835
36860B688310K027131J338053j017079k904075k665382j144541L16267J489213
36852A27897J866564M35741j765986j807881O17951J887068j7156j817928l3412
36843e07142L071935K827850m01784j847853J78661K090939R59335j418726j956458
36834B996757p00992K20427P1326j57095P0528K8097r17918k038601j790707K14572
36824b003606K146933J832292k38357j259222k3055J376097R25973k53395j65721
36815B337939N88396J54163j054975j004595M64435J432604Q57800n08040j668951
36806A598776j802764q4284K570799K916474m47800l665420k229073K005283L074738
$$ plain form
36797 3936729 3856331 1633745 1239873 2954005 3418046 1706899 878631 2783850 5091610
36788 5091610 4925630 2672420 661923 169134 1033280 2491976 3274455 2434579 1015848
36779 1015848 1344519 3839716 6137343 6266653 5044422 4259597 4081790 3608111 2738628
36770 2738628 2147779 2206193 2905019 4051586 4868173 4410239 2971475 1868235 1337019
36761 1337019 283376 -1168408 -977819 1545833 3827957 3444830 1783229 1810342 3471364
36752 3471364 4229820 3565408 3748664 5824657 7713720 7330560 5331908 3520951 2350294
36743 2350294 1397696 847367 920060 786995 -401403 -1851883 -1776378 363107 3056593
36734 3056593 4172585 2840861 223571 -1358414 -577899 1436303 2458727 2010990
$$ packed form
36797C936729q0398k222586l93872J714132M64041j711147q28268J905219K307760
36788E091610j65980k253210k010497m92789Q64146J458696P82479q39876j418731
36779A015848L28671K495197K297627J29310j222231p84825j77807m73679q69483
36770B738628n90849N8414O98826J146567Q16587m57934j438764j103240n31216
36761A337019j053643j451784J90589K523652K282124l83127j661601K7113J661022
36752C471364P58456o64412J83256K075993J889063l83160j998652j810957j170657
36743B350294r52598n50329P2693j33065j188398j450480P5505K139485K693486
36734C056593J115992j331724k617290j581985P80515K014202J022424m47737
$$ plain form
36726 2010990 1685492 2420527 3169620 3185762 3749857 5838656 7568745 6402939 3127129
36717 3127129 1038081 1431755 2546490 3055534 3656560 4493780 4102334 2452055 2186046
36708 2186046 4640105 7123943 6855097 5390376 5822708 7356297 6798236 4583917 4647129
36699 4647129 7820213 9892989 7885627 4338996 3016681 3652028 3832933 3397141 3645045
36690 3645045 4117866 3564458 2823994 3460902 4474661 3663049 1614816 929331 1729343
36681 1729343 1524971 -194730 -893502 543642 1743471 870931 -275650 725665 3219696
36672 3219696 5007501 5616723 5735689 5034730 3104542 1498868 2284459 4937076 6745857
36663 6745857 6117701 3835869 1376180 -369703 -903280 -201803 1009879 2103550 3218627
$$ packed form
36726B010990l25498P35035P49093J6142N64095K088799J730089j165806l275810
36717C127129k089048L93674J114735N09044O01026Q37220l91446j650279k66009
36708B186046K454059K483838k68846j464721M32332J533589n58061k214319O3212
36699D647129L173084K072776k007362l546631j322315O35347J80905m35792K47904
36690C645045M72821n53408p40464O36908J013759q11612k048233o85485Q00012
36681A729343k04372j719701o98772J437144J199829q72540j146581J001315K494031
36672C219696J787805O09222J18966p00959j930188j605674P85591K652617J808781
36663F745857o28156k281832k459689j745883n33577P01477J211682J093671J115077
$$ plain form
36654 3218627 4112819 3433571 822654 -1340592 -698744 1214075 712515 -2449584 -4375153
36645 -4375153 -2712631 77475 803331 77227 309895 1386218 1475046 827397 1273257
36636 1273257 2269758 1053901 -2486882 -4407810 -2026633 1854784 2560803 -181850
36628 -181850 -2355696 -1382795 1064506 2217457 1660529 691323 224118 629661 2154604
36619 2154604 4053599 4482936 2807422 1048311 1320087 2608766 2146736 -365144 -2184297
36610 -2184297 -1423058 685221 2191507 3077044 4178225 5073881 4793562 3776351 3463814
36601 3463814 4203753 4781228 3976210 1831143 -422227 -1187327 252747 2773989 4316364
36592 4316364 4263582 4058449 4848258 5748688 5521414 4683122 4316266 3812983 1867953
$$ packed form
36654C218627Q94192o79248k610917k163246O41848J912819n01560l162099j925569
36645d375153J662522K790106P25856p26104K32668J076323Q8828o47649M45860
36636A273257R96501j215857l540783j920928K381177L881417P06019k742653
36628a81850k173846R72901K447301J152951n56928r69206m67205M05543J524943
36619B154604J898995M29337j675514j759111K71776J288679m62030k511880j819153
36610b184297P61239K108279J506286Q85537J101181Q95656k80319j017211l12537
36601C463814P39939N77475q05018k145067k253370p65100J440074K521242J542375
36592D316364n2782k05133P89809R00430k27274q38292l66856n03283j945030
$$ plain form
36583 1867953 -792857 -1858028 -632143 1144271 1869939 1647025 998502 -39971 -923450
36574 -923450 -482997 1324006 3044293 3869075 4550725 5336494 4877192 2661077 816444
36565 816444 1389838 2942250 2274447 -814112 -2915801 -1615685 1332434 2520240 1221745
36556 1221745 -187403 403652 2414421 3754351 3522390 2739838 2558068 2648086 2017934
36547 2017934 926556 854019 2366697 4043475 4173534 2793934 1252618 298809 -425650
36538 -425650 -1244505 -1815901 -1785366 -1309651 -661538 118946 847837 906774 -201909 -2127667
36528 -2127667 -3859608 -4666211 -4565367 -3813780 -2448598 -863363 -382669 -2026715 -4421575
36519 -4421575 -4374653 -699155 3583918 4522000 2102632 -110341 10694 883875 495354
$$ packed form
36583A867953k660810j065171J225885J776414P25668k22914o48523j038473q83479
36574i23450M40453J807003J720287Q24782O81650P85769m59302k216115j844633
36565H16444N73394J552412o67803l088559k101689J300116K948119J187806j298495
36556A221745j409148N91055K010769J339930k31961p82552j81770R0018o30152
36547B017934j091378p2537J512678J676778J30059j379600j541316r53809p24459
36538d25650q18855n71396L0535M75715O48113P80484P28891N8937j108683j925758
36528b127667j731941q06603J00844P51587J365182J585235M80694j644046k394860
36519d421575M6922L675498M283073R38082k419368k212973J21035Q73181l88521
$$ plain form
36510 495354 -478197 -275957 1029423 1996497 2011764 1407904 391143 -610536 -516966
36501 -516966 876466 1902644 1252804 180757 534117 1651501 1654565 996800 1784272
36492 1784272 3836670 4596956 3293357 2018743 1892411 1413377 -12638 -215001 1916970
36483 1916970 3721648 2721222 868958 1485743 3753246 4106884 2226430 1604554 3961255
36474 3961255 6769991 7315208 6135081 5061686 4405078 3752336 3580376 4314850 5152535
36465 5152535 5280723 5140037 5310525 5323100 4665674 3717030 2601895 571310 -2124241
36456 -2124241 -3245371 -1263448 2044727 3577584 2679788 1190874 599354 1094232 2658421
36447 2658421 4839849 5887249 4517948 2454309 2781799 5567616 7525128 6564066
$$ packed form
36510D95354r73551K02240J305380R67074J5267o03860j016761j001679R3570
36501e16966J393432J026178o49840j072047L53360J117384L064o57765P87472
36492A784272K052398P60286j303599j274614j26332m79034j426015k02363K131971
36483A916970J804678j000426j852264O16785K267503L53638j880454o21876K356701
36474C961255K808736N45217j180127j073395o56608o52742j71960P34474Q37685
36465E152535J28188j40686J70488J2575o57426r48644j115135k030585k695551
36456b124241j121130J981923L308175J532857q97796j488914n91520M94878J564189
36447B658421K181428J047400j369301k063639L27490K785817J957512r61062
$$ plain form
36439 6564066 4312971 3268935 3673933 4359247 4657962 4152866 2401314 440211 868502
36430 868502 4633816 8995217 10427164 8630780 6227762 5470922 6647085 8670000
36422 8670000 9785987 8691672 6319982 5388660 6896034 8638375 8797234 8954186 11061568
36413 11061568 13365616 12815581 10368437 9927307 12169224 13382390 11164360 7735205
36405 7735205 6305149 7146227 8767280 10402453 11674078 11862187 11039083 10285309 9816189
36396 9816189 8773169 7549438 7838540 9376706 9479368 7377283 6104934 7876489
36388 7876489 10249930 9639790 6489076 3939558 3017720 2303136 1321246 1189654 2282679
36379 2282679 3679157 4613797 4713419 3700565 2625356 3908996 7864366 10794310 9477376
$$ packed form
36439F564066k251095j044036M04998O85314K98715n05096j751552j961103M28291
36430H68502L765314M361401J431947j796384k403018p56840J176163K022915
36422H670000J115987j094315k371690r31322J507374J742341J58859J56952K107382
36413A1061568K304048n50035k447144m41130K241917J213166k218030l429155
36405G735205j430056Q41078J621053J635173J271625J88109q23104p53774m69120
36396I816189j043020j223731K89102J538166J02662k102085j272349J771555
36388G876489K373441o10140l150714k549518r21838p14584r81890j31592J093025
36379B282679J396478R34640R9622j012854j075209J283640L955370K929944j316934
$$ plain form
36370 9477376 6156776 5645555 8443876 10543888 9712326 7977887 7472958 7567943 7156896
36361 7156896 6584569 6129697 5315702 4697734 5620252 7313602 7160204 4945503 3724711
36352 3724711 4910084 5676936 3536613 690803 890230 3919670 6351901 6676549 6600565
36343 6600565 7482779 8190213 7191987 5060787 3819806 4319988 5045112 3982301 1634875
36334 1634875 1098351 4098434 7974118 8568730 5645075 3029479 3342510 5235609 6421458
36325 6421458 6685213 6662110 6055894 4660473 3296601 2406861 1448255 634255 1158640
36316 1158640 2681364 3104182 2161013 2424164 4917912 6663171 5104030 2340667 1961045
36307 1961045 3847126 5346992 5779423 6325709 6786574 5949869 4417118 3935247 4528603
$$ packed form
36370I477376l320600n11221K798321K100012q31562j734439n04929R4985m11047
36361G156896n72327m54872q13995o17968R22518J693350j53398k214701j220792
36352C724711J185373P66852k140323k845810J99427L029440K432231L24648p5984
36343F600565Q82214P07434r98226k131200j240981N00182P25124j062811k347426
36334A634875n36524L000083L875684N94612k923655k615596L13031J893099J185849
36325F421458K63755k3103o06216j395421j363872q89740r58606q14000N24385
36316A158640J522724M22818r43169K63151K493748J745259j559141k763363l79622
36307A961045J886081J499866M32431N46286M60865q36705j532751m81871N93356
$$ plain form
36298 4528603 5059163 5754087 7286351 8320738 7162938 5053195 4499073 5026858 4166446
36289 4166446 2190661 1954703 3906614 5166969 4270447 3251791 3999484 5686320 6893819
36280 6893819 7488123 7492575 6784701 6566360 8282181 10527016 10212921 7479889 5896082
36271 5896082 6780756 7255295 5593280 4439458 6114900 8337444 7849971 5404616 3724175
36262 3724175 2969946 1935283 1790218 4514442 8493960 9565025 6511582 2501349
36254 2501349 820706 1692920 3599867 5450359 6730504 7075389 6445424 5119300 3511584
36245 3511584 2328994 2174862 2519007 2252898 1893952 3454369 6903576 8801028 6492669
36236 6492669 2056017 -238101 920007 3626137 6297129 8547861 9406367 7860790
$$ packed form
36298D528603N30560O94924J532264J034387j157800k109743n54122N27785q60412
36289D166446j975785k35958J951911J260355q96522j018656P47693J686836J207499
36280F893819N94304M452p07874k18341J715821K244835l14095k733032j583807
36271E896082Q84674M74539j662015j153822J675442K222544m87473k445355j680441
36262C724175p54229j034663j45065K724224L979518J071065l053443m010233
36254B501349j680643Q72214J906947J850492J280145L44885o29965j326124j607716
36245C511584j182590j54132L44145k66109l58946J560417L449207J897452k308359
36236F492669m436652k294118J158108K706130K670992K250732Q58506j545577
$$ plain form
36228 7860790 5123141 3537673 3100642 1717416 -832389 -1974640 -196464 2606052
36220 2606052 3829052 3383236 3032497 3867099 5472252 6692278 6580698 5352038 4581326
36211 4581326 5526171 7268902 7684446 6226278 4453868 3754439 3894373 4001024 3743653
36202 3743653 3295645 2999571 2986023 2521244 628726 -1652158 -1238549 2778559 6577448
36193 6577448 6275033 3827998 4346317 8125488 10064504 7624975 4464062 4293833 5699978
36184 5699978 5875797 5452046 6044117 6387796 5011169 4038075 5870570 8189494 7118229
36175 7118229 3976723 3634393 6570119 8023022 5785714 3570141 4665824 6861912
36167 6861912 6580073 4431101 3272276 3413734 3349022 3397947 4888010 6682962 6191332
$$ packed form
36228G860790k737649j585468m37031j383226k549805j142251J778176K802516
36220B606052J223000m45816l50739Q34602J605153J220026j11580j228660p70712
36211D581326R44845J742731M15544j458168j772410o99429J39934J06651k57371
36202C743653m48008k96074j3548m64779j892518k280884M13609M017108L798889
36193F577448l02415k447035N18319L779171J939016k439529l160913j70229J406145
36184E699978J75819m23751N92071L43679j376627r73094J832495K318924j071265
36175G118229l141506l42330K935726J452903k237308k215573J095683K196088
36167F861912k81839k148972j158825J41458o4712M8925J490063J794952m91630
$$ plain form
36158 6191332 3706912 2371499 3286690 3783625 1817848 -638680 -667392 1067720 1510891
36149 1510891 67866 -596789 1047867 2815476 2091028 -107961 -568747 1356270 2813556
36140 2813556 1563660 -1023608 -2023033 -435999 2535199 5357501 6878388 6252283
36132 6252283 3914369 2057516 2458506 4145822 4752986 3766838 2651844 2071377 1180687
36123 1180687 -102405 -360355 1018496 2656075 3178510 2746133 1828486 298608 -1258178
36114 -1258178 -1310910 137819 725508 -883201 -2565061 -1811202 360287 1130809 334649
36105 334649 272164 1683528 2960425 3361185 3984251 4963728 4555759 2202046 120921
36096 120921 340766 1990821 3058194 3281683 3663793 4273939 4196083 3015806 1117781
$$ packed form
36158F191332k484420j335413R15191M96935j965777k456528k8712J735112M43171
36149A510891j443025o64655J644656J767609p24448k198989m60786J925017J457286
36140B813556j249896k587268r99425J587034K971198K822302J520887o26105
36132F252283k337914j856853M00990J687316O07164r86148j114994n80467q90690
36123A180687j283092k57950J378851J637579N22435m32377r17647j529878j556786
36114a258178n2732J448729N87689j608709j681860P53859K171489P70522p96160
36105C34649o2485J411364J276897M00760O23066R79477m07969k353713k081125
36096A20921K19845J650055J067373K23489L82110O10146p7856j180277j898025
$$ plain form
36087 1117781 -894147 -2077272 -1227933 1743914 5020463 6480639 5777850 4169634
36079 4169634 2863088 2235057 2093799 1994920 1764786 2072489 3650268 5606152 5791509
36070 5791509 3583467 977657 -61834 34262 -64196 -207823 413423 1294228 1481054
36061 1481054 1596701 2896405 4774479 5270204 3875123 1980273 685939 -26275 -111524
36052 -111524 632773 1499368 1566019 1434137 2362213 3737976 3621398 1960558 869753
36043 869753 1245496 1626169 1240029 1551370 3368896 4859402 4380642 3316448 3872243
36034 3872243 5508656 5870647 4307852 2295145 965023 223279 -64191 149527 297205
36025 297205 -228256 -819527 -354062 1039004 2236247 2923889 3796678 5106602 6303707
$$ packed form
36087A117781k011928j183125Q49339K971847L276549J460176p02789j608216
36079D169634j306546o28031j41258r8879k30134L07703J577779J955884J85357
36070E791509k208042k605810j039491R6096r8458j43627O21246Q80805J86826
36061A481054J15647J299704J878074M95725j395081j894850j294334p12214q5249
36052a11524P44297Q66595O6651j31882R28076J375763j16578j660840j090805
36043H69753L75743L80673l86140L11341J817526J490506m78760j064194N55795
36034C872243J636413L61991j562795k012707j330122p41744k87470K13718J47678
36025B97205n25461n91271M65465J393066J197243O87642Q72789J309924J197105
$$ plain form
36016 6303707 6984998 6987980 5848512 3612770 1932645 2596321 4848453 5959757 4922418
36007 4922418 3838902 4797320 6928665 7817749 6719062 4953637 3759703 3163252 2794815
35998 2794815 2602010 2574861 2596721 2748548 3120442 3249655 2514472 1336792 1155184 2583771
35988 2583771 4264455 4475496 3504098 3259692 4520296 5850972 5726263 4483114 3288312
$$ packed form
36016F303707O81291K982j139468k235742j680125O63676K252132J111304j037339
36007D922418j083516R58418K131345Q89084j098687j765425j193934n96451l68437
35998B794815j92805k7149K1860J51827L71894J29213p35183j177680j81608J428587
35988B583771J680684K11041r71398k44406J260604J330676j24709j243149j194802
$$ [...]
##END NTUPLES=NMR SPECTRUM
##END=
