##TITLE=31Pdec_3MBPA2401x
 CDCl3, 64 sc
 25.1.2023
##JCAMPDX= 6.0         $$ Bruker NMR JCAMP-DX V2.0
##DATA TYPE= NMR SPECTRUM
##DATA CLASS= NTUPLES
##ORIGIN= UXNMR, Bruker Analytische Messtechnik GmbH
##OWNER= root
$$ XWIN-NMR		Version 3.5
$$ Wed Jan 25 14:10:58 2023 Russian Standard Time (UT+4h)  she@DPX200
##.OBSERVE FREQUENCY= 81.013821
##.OBSERVE NUCLEUS= ^31P
##.ACQUISITION MODE= SIMULTANEOUS
##.ACQUISITION SCHEME= undefined
##.AVERAGES= 64
##.DIGITISER RES= 16
##SPECTROMETER/DATA SYSTEM= spect
##.PULSE SEQUENCE= zgpg30
##.SOLVENT NAME= CDCl3
##.SHIFT REFERENCE= (INTERNAL, CDCl3, 0, 248.564)
##AUDIT TRAIL= $$ (NUMBER, WHEN, WHO, WHERE, WHAT)
$$ ##TITLE= Audit trail, XWIN-NMR		Version 3.5
$$ ##JCAMPDX= 5.01
$$ ##ORIGIN= Bruker BioSpin GmbH
$$ ##OWNER= she
$$ F:/spectra/data/she/nmr/P31/1/pdata/1/auditp.txt
$$ ##AUDIT TRAIL=  $$ (NUMBER, WHEN, WHO, WHERE, WHAT)
(   1,<2023-01-25 14:10:00.96 +0400>,<she>,<DPX200>,
      <continue with go, POWCHK disabled, PULCHK disabled
       configuration hash MD5:
       00 E9 B6 7A A2 85 ED C7 34 08 36 98 17 FE 4E 26
       data hash MD5: 32K
       E5 27 24 9B 60 56 51 C6 12 8B CC 38 43 B4 D3 25>)
(   2,<2023-01-25 14:10:02.37 +0400>,<she>,<DPX200>,
      <Start of raw data processing
       efp BC_mod = 2 LB = 1 FT_mod = 6 PKNL = 1 PHC0 = -11027.09 PHC1 = 195.6578 SI = 64K 
       data hash MD5: 64K
       1B 08 A9 52 24 E1 E1 A8 CB 0F 4B A7 8F B4 67 C9>)
(   3,<2023-01-25 14:10:19.64 +0400>,<she>,<DPX200>,
      <pk PHC0 = 4.526957 PHC1 = 8 
       data hash MD5: 64K
       20 08 F2 86 A1 8C 4A F4 14 EF 79 FC F2 7F 05 35>)
$$ ##END=
$$ 
$$ hash MD5
$$ BA 6A 3F E9 46 D2 0F F8 5E C1 C8 D4 AD A3 BC B2
##$RELAX= 
##$RELAX= 
##$RELAX= 
##$RELAX= 
##$RELAX= 
##$RELAX= 
##$RELAX= 
##$RELAX= 
##$RELAX= 
$$ Bruker specific parameters
$$ --------------------------
##$DU= <F:/spectra>
##$EXPNO= 1
##$NAME= <P31>
##$PROCNO= 1
##$TYPE= <nmr>
##$USER= <she>
##$AMP= (0..31)
100 100 100 100 100 100 100 100 100 100 100 100 100 100 100 100 100 100 
100 100 100 100 100 100 100 100 100 100 100 100 100 100 
##$AQSEQ= 0
##$AQ_mod= 1
##$AUNM= <au_zg>
##$AUTOPOS= <>
##$BF1= 81.014009
##$BF2= 200.13
##$BF3= 200.13
##$BF4= 200.13
##$BF5= 200.13
##$BF6= 200.13
##$BF7= 200.13
##$BF8= 200.13
##$BYTORDA= 1
##$CFDGTYP= 0
##$CFRGTYP= 5
##$CHEMSTR= <none>
##$CNST= (0..31)
1 1 145 1 1 1 1 1 1 1 1 1 1 1 1 1 1 1 1 1 1 1 1 1 1 1 1 1 1 1 1 1 
##$CPDPRG= <waltz16>
##$CPDPRG1= <>
##$CPDPRG2= <waltz16>
##$CPDPRG3= <>
##$CPDPRG4= <mlev>
##$CPDPRG5= <mlev>
##$CPDPRG6= <mlev>
##$CPDPRG7= <mlev>
##$CPDPRG8= <mlev>
##$CPDPRGB= <>
##$CPDPRGT= <>
##$D= (0..31)
0 1 0 0 0 0 0 0 0 0 0 0.03 2e-05 3e-06 0 0 0 0 0 0 0 0 0 0 0 0 0 0 0 0 
0 0 
##$DATE= 1674641319
##$DBL= (0..7)
120 120 120 11 120 120 24 19 
##$DBP= (0..7)
150 150 150 150 150 150 150 150 
##$DBP07= 0
##$DBPNAM0= <>
##$DBPNAM1= <>
##$DBPNAM2= <>
##$DBPNAM3= <>
##$DBPNAM4= <>
##$DBPNAM5= <>
##$DBPNAM6= <>
##$DBPNAM7= <>
##$DBPOAL= (0..7)
0.5 0.5 0.5 0.5 0.5 0.5 0.5 0.5 
##$DBPOFFS= (0..7)
$$ [...]
##$SUBNAM2= <"">
##$SUBNAM3= <"">
##$SUBNAM4= <"">
##$SUBNAM5= <"">
##$SUBNAM6= <"">
##$SUBNAM7= <"">
##$SUBNAM8= <"">
##$SUBNAM9= <"">
##$SW= 501.771253377433
##$SWIBOX= (0..15)
0 1 3 0 0 0 0 0 0 0 0 0 0 0 0 0 
##$SW_h= 40650.406504065
##$TD= 32768
##$TD0= 1
##$TE= 0
##$TE2= 300
##$TE3= 300
##$TEG= 300
##$TL= (0..7)
0 120 53 12 22 120 120 120 
##$TP= (0..7)
150 150 150 150 150 150 150 150 
##$TP07= 0
##$TPNAME0= <>
##$TPNAME1= <>
##$TPNAME2= <>
##$TPNAME3= <>
##$TPNAME4= <>
##$TPNAME5= <>
##$TPNAME6= <>
##$TPNAME7= <>
##$TPOAL= (0..7)
0.5 0.5 0.5 0.5 0.5 0.5 0.5 0.5 
##$TPOFFS= (0..7)
0 0 0 0 0 0 0 0 
##$TUNHIN= 0
##$TUNHOUT= 0
##$TUNXOUT= 0
##$USERA1= <user>
##$USERA2= <user>
##$USERA3= <user>
##$USERA4= <user>
##$USERA5= <user>
##$V9= 5
##$VALIST= <valist>
##$VCLIST= <CCCCCCCCCCCCCCC>
##$VD= 0
##$VDLIST= <DDDDDDDDDDDDDDD>
##$VPLIST= <PPPPPPPPPPPPPPP>
##$VTLIST= <TTTTTTTTTTTTTTT>
##$WBST= 1024
##$WBSW= 4
##$XGAIN= (0..3)
0 0 0 0 
##$XL= 0
##$YL= 0
##$YMAX_a= 2128
##$YMIN_a= -3845
##$ZGOPTNS= <>
##$ZL1= 120
##$ZL2= 120
##$ZL3= 120
##$ZL4= 120
##$ABSF1= 0
##$ABSF2= 0
##$ABSG= 0
##$ABSL= 0
##$ALPHA= 0
##$AQORDER= 0
##$ASSFAC= 0
##$ASSFACI= 0
##$ASSFACX= 0
##$ASSWID= 0
##$AUNMP= <proc_1d>
##$AZFE= 0.1
##$AZFW= 0.5
##$BCFW= 0
##$BC_mod= 2
##$BYTORDP= 0
##$COROFFS= 0
##$CY= -3
##$DATMOD= 1
##$DC= 0
##$DFILT= <>
##$DTYPP= 0
##$F1P= 0
##$F2P= 0
##$FCOR= 1
##$FTSIZE= 65536
##$FT_mod= 6
##$GAMMA= 0
##$GB= 0
##$INTBC= 1
##$INTSCL= 6.047779e-11
##$ISEN= 30
##$LB= 1
##$LEV0= 0
##$LPBIN= 0
##$MAXI= 10000
##$MC2= 0
##$MEAN= 0
##$ME_mod= 0
##$MI= 50
##$NCOEF= 0
##$NC_proc= -10
##$NLEV= 6
##$NOISF1= 182.463
##$NOISF2= 159.3651
##$NSP= 0
##$NTH_PI= 0
##$NZP= 0
##$OFFSET= 248.5645
##$PC= 4
##$PHC0= -11022.56
##$PHC1= 203.6578
##$PH_mod= 1
##$PKNL= yes
##$PPARMOD= 0
##$PSCAL= 0
##$PSIGN= 0
##$REVERSE= no
##$SF= 81.0140089999694
##$SI= 65536
##$SIGF1= 159.3651
##$SIGF2= -187.1042
##$SINO= 113.3802
##$SIOLD= 16384
##$SREGLST= <1H.CDCl3>
##$SSB= 0
##$STSI= 65536
##$STSR= 0
##$SW_p= 40650.406504065
##$SYMM= 0
##$S_DEV= 0
##$TDeff= 32768
##$TDoff= 0
##$TI= <>
##$TILT= no
##$TM1= 0
##$TM2= 0
##$TOPLEV= 0
##$USERP1= <user>
##$USERP2= <user>
##$USERP3= <user>
##$USERP4= <user>
##$USERP5= <user>
##$WDW= 1
##$XDIM= 65536
##$YMAX_p= 518283083
##$YMIN_p= -178876618
$$ End of Bruker specific parameters
$$ ---------------------------------
##NTUPLES= NMR SPECTRUM
##VAR_NAME=  FREQUENCY,     SPECTRUM/REAL,   SPECTRUM/IMAG
##SYMBOL=    X,             R,               I
##VAR_TYPE=  INDEPENDENT,   DEPENDENT,       DEPENDENT
##VAR_FORM=  AFFN,          ASDF,            ASDF
##VAR_DIM=   65536,         65536,           65536
##UNITS=     HZ,            ARBITRARY UNITS, ARBITRARY UNITS
##FACTOR=    0.620285442955139, 1,           1
##FIRST=     20137.2065510682, 0,            0
##LAST=      -20513.1999529968, 0,           0
##MIN=       -20513.1999529968, -178876618,  0
##MAX=       20137.2065510682, 518283083,    0
$$ Real data points
##PAGE= N=1
##DATA TABLE= (X++(R..R)), XYDATA
$$ [...]
39713B7627703j364872l634656q61814J0182631J0852221o693687k4454924k6852550
$$ 27627703 26262831 22628175 21766361 31948992 42801213 36107526 11652602 -15199948
39705a5199948j8832032p217828J0297216K7651109K7835513J0516491k335978
$$ -15199948 -34031980 -41249808 -30952592 -3301483 24534030 35050521 32714543
39698C2714543j924332o865831k3980381k4720514R641931M4000069L0490102
$$ 32714543 30790211 23924380 -56001 -24776515 -15134584 28865485 59355587
39691E9355587j9146519m5304441k3040213R951849J6102308O994695R751896
$$ 59355587 40209068 -5095373 -28135586 -18183737 -2081429 4913266 14665162
39684A4665162J9683534J5744221k90696j0269151j0174053p396776m56947J2547260
$$ 14665162 34348696 50092917 49802221 39533070 29359017 21962241 21505294 34052554
39676C4052554J7777591N717899m389788Q998315K9801705K7251617J0566189
$$ 34052554 51830145 57548044 53158256 62156571 91958276 119209893 129776082
39669A29776082J5899832L8092880K7348519k9183485p2314790m9908590P482617
$$ 129776082 145675914 183768794 211117313 181933828 109619038 59710448 67193065
39662F7193065L0642227M842360k4751789k5508716j0453294j322698J688792
$$ 67193065 97835292 102677652 77925863 52417147 41963853 40641155 42329947
39655D2329947M460852K031209r506755k0416338j7455687l80371J5078465R697538
$$ 42329947 46790799 48822008 39315253 18898915 1443228 1062857 16141322 25838860
39647B5838860j7831344m0906154l0375748N975514K9125160K1643174Q490697
$$ 25838860 8007516 -32898638 -63274386 -57298872 -28173712 -6530538 1960159
39640A960159J0871563J1715064o704047k2764843j0794631R804229N395380j2285773
$$ 1960159 12831722 24546786 17842739 -4922104 -15716735 -5912506 -517126 -12802899
39632a2802899p731356J1727297P666186j6968540j8364533J0210893K3167972
$$ -12802899 -20534255 -8806958 -1140772 -18109312 -36473845 -26262952 -3094980
39625c094980J111296j6014718l59007J6686531N486270n364593J8311648M7482495
$$ -3094980 -1983684 -17998402 -18357409 -1670878 3815392 -1549201 16762447 64244942
39617F4244942L0201565k2778889m8882315k2478610J6134955K3178171K920439
$$ 64244942 94446507 71667618 22785303 306693 16441648 39619819 42540258
39610D2540258j3219946j0304187J359358O101158N25023n852668n460095m140480
$$ 42540258 29320312 19016125 20375483 26476641 27001664 21148996 15688901 11548421
39602A1548421q543048p565567J2681555L6672511L2013076O53374j6762458k216743
$$ 11548421 3005373 -4560194 8121361 44793872 76806948 77460322 60697864 58481121
39594E8481121J0766807o841291l0695730k3804346L658527J4511646K987686
$$ 58481121 69247928 62406637 31710907 7906561 11565088 26076734 29064420
39587B9064420o515911l455831L158246R813235J4966269N323089j9868041k8746476
$$ 29064420 22548509 19092678 22250924 32064159 47030428 52353517 32485476 3739000
39579C739000k23957L1261934K0465202j5286480k0879126Q277504K2291815R55916
$$ 3739000 3515043 34776977 55242179 39955699 19076573 27354077 49645892 50601808
39571E0601808k0214678j8507160j7171203k9250031k6352481N375949K8874096
$$ 50601808 30387130 11879970 -5291233 -34541264 -60893745 -55517796 -26643700
39564b6643700J3585775j3182447j3233856J033995k296720j2484259K668786
$$ -26643700 -13057925 -26240372 -39474228 -38440233 -40736953 -53221212 -50552426
39557e0552426L1645729L0207473n362366k6457012l758589L0436819L0568344
$$ -50552426 -18906697 11300776 5938410 -20518602 -24277191 6159628 36727972
39550C6727972q74736k3852199j5365250J0238969K9069128L3632327K6838266
$$ 36727972 35853236 12001037 -3364213 6874756 35943884 69576211 96414477
39543I6414477P787498k1803161m4694329m0898809j5846300K612690K624404
$$ 96414477 104201975 82398814 37704485 -3194324 -19040624 -16427934 -13803530
39536a3803530L227554J7745765K6781143J2167708n414077J290912J4376201
$$ -13803530 -10575976 7169789 33950932 46118640 40704563 41995475 56371676
39529E6371676j945914l1448049j9832187L4875893O4616569K7269616l1818309
$$ 56371676 54425762 22977713 3145526 38021419 102637988 129907604 98089295
39522I8089295m7965379k2530423J46350M204085M292120K799863p389652j4238318
$$ 98089295 50123916 27593493 27739843 31943928 36236048 39035911 31646259 17407941
39514A7407941l829392O953562n061126k5573639k4132694o081627K55249l218984
$$ 17407941 13578549 20532111 15470985 -10102654 -34235348 -40316975 -40061726 -43280710
39506d3280710P824916K6100832J9440487p113896j0696108J6960892K9830748
$$ -43280710 -35455794 -9354962 10085525 2971629 -7724479 9236413 39067161
39499C9067161J047628l2432375k7747145J734432J6158445R142364J726479j12227
$$ 39067161 40114789 7682414 -20064731 -18330299 -2171854 6970510 8696989 8584762
39491H584762n298224r772160k286832R933312R485817k121228p137333K79241
$$ 8584762 3286538 -6485622 -8772454 1160858 10646675 8525447 1388114 1667355
39483A667355Q610305R132803M914624J495513Q82963K036797k49363r957471
$$ 1667355 10277660 19410463 24325087 25820600 26703563 28740360 28490997 18533526
39475A8533526j8297541j0876615P109061J1752309k777811j1350387Q94100R526001
$$ 18533526 235985 -10640630 -3531569 8220740 5442929 -5907458 -5013358 4512643
39467D512643j0061890l6239747k9312771O862431K9810442K0555836L128845
$$ 4512643 -5549247 -41788994 -71101765 -64239334 -34428892 -13873056 -10744211
39460a0744211k88642K272270j916596p452129o449161k690413J436830J0796678
$$ -10744211 -11032853 -8760583 -10677179 -18129308 -24578469 -27268882 -25832052 -15035374
39452a5035374K0938540J7419162R62621r093097o278489p676536k0622628k4617427
$$ -15035374 5903166 23322328 24284949 15191852 8913363 1236827 -19385801 -44003228
39444d4003228n273224J6515707J3107028q286342j6657369k1945K3690008L2117383
$$ -44003228 -49276452 -32760745 -19653717 -27940059 -44597428 -44619373 -20929365 11188018
39436A1188018J8607647o811660k4138672j8951348m57959P361456q07079n525949
$$ 11188018 29795665 22984005 -1154667 -20106015 -20563974 -13202518 -14009597 -19535546
39428a9535546J863178M314148m553764p34973K6446648M1722147J3392886k9294262
$$ -19535546 -17672368 -13358220 -17911984 -18646957 7799691 49521838 62914724 33620462
39420C3620462l4524181o351815P156873n305720p246679J3655201K2506076K308168
$$ 33620462 -903719 -7255534 -98661 -5404381 -12651060 1004141 23510217 25818385
39412B5818385j3495833n88790J2585250m305238k8626303k1071799J1812506
$$ 25818385 12322552 11733762 24319012 20013774 -8612529 -29684328 -17871822
39405a7871822L1378213K3243719L657132j4636289k8813589l0733287j6938376
$$ -17871822 13506391 36750110 40407242 25770953 -3042636 -33775923 -50714299
39398e0714299l982630n872521p844407R024633L0004097K6113624K077793r674223
$$ -50714299 -54696929 -60569450 -68413857 -59389224 -29385127 -3271503 -1193710 -10867933
39390a0867933J110309J2453344J0159584N366530P108892O323901l890738j4742870
$$ -10867933 -9757624 2695720 12855304 18221834 25330726 31654627 27763889 13021019
39382A3021019j6890206j1558452j877175J0064020J5190885M586717j2553567
$$ 13021019 -3869187 -15427639 -17304814 -7240794 7950091 12536808 -16759
39375a6759j6219834m453961K818756n951197j6339846q920219J3326465K7264128
$$ -16759 -16236593 -20690554 -17871798 -23822995 -40162841 -49083060 -35756595 -8492467
39367h492467J6300110p957749j3713597J3109326M1754225K7848206k3645855
$$ -8492467 7807643 -150106 -13863703 -754377 40999848 68848054 45202199
39360D5202199n5361156l3137678P034992J4777519l570886q799720L172349P190286
$$ 45202199 -10158957 -43296635 -36261643 -21484124 -25055010 -33854730 -30682381 -23492095
39352b3492095N018580J9152381L7838093K5026061j2913116k8984367j2304962
$$ -23492095 -18473515 678866 38516959 63543020 50629904 21645537 9340575
39345I340575l524553j8910228k1568661N877630K1980178j514067k4235564l260258
$$ 9340575 5816022 -13094206 -34662867 -28785237 -6805059 -8319126 -32554690 -35814948
39337c5814948L1579180K5667054j1105177k3760836K65377K2713560K2791263
$$ -35814948 -4235768 21431286 10326109 -13434727 -13169350 9544210 32335473
39330C2335473J6971516J2412992n737976l2672105l6336079o958603K2422316
$$ 32335473 49306989 61719981 55982005 23309900 -13026179 -19984782 2437534
39323B437534K2395548N310095j348407L124861r97328j7657500k6112900r875516
$$ 2437534 24833082 30143177 28794770 31919631 30922303 13264803 -12848097 -22723613
39315b2723613J6921270K2150776l059237k6839276j5587331J6636609K4363048
$$ -22723613 -5802343 16348433 13289196 -13550080 -29137411 -12500802 11862246
39308A1862246j778716j8514579L370062L1252274K0003895j8421781l4191184
$$ 11862246 10083530 -8431049 -5060987 26191287 46195182 27773401 -6417783
39301f417783j2962889J0902610J0069963m248381j0385640n511911J665517O562705
$$ -6417783 -19380672 -8478062 1591901 -2656480 -13042120 -18554031 -16888514 -10325809
39293a0325809R197694J0894233J2386454Q844063n498508k0705797j5619435
$$ -10325809 -1128115 9766118 22152572 30996635 25498127 4792330 -10827105
39286a0827105Q321935J9091202l16062k1430934j2572565J1096263J4530763
$$ -10827105 -2505170 16586032 16269970 -5160964 -17733529 -6637266 7893497
39279G893497P71411N48227J6017665J9388744L600604q994953r664554j3407740
$$ 7893497 8664908 9213135 25230800 44619544 48220148 39225195 29560641 16152901
39271A6152901k1211241j2686074J3513508K8310506J4604041r250270k0588284
$$ 16152901 -5058340 -17744414 -4230906 24079600 38683641 29433371 8845087
39264H845087j9844678j5340132n491120J1346249K6995591L0674936J4664660
$$ 8845087 -10999591 -26339723 -31830843 -20484594 6510997 37185933 51850593
39257E1850593k0775408n2016236l9845664J7342598N8731494L3010152k2703798
$$ 51850593 31075185 -20941051 -60786715 -43444117 15287377 48297529 25593731
39250B5593731l1869936N862984J8621433j6484561l7466181o738542K4279950
$$ 25593731 -6276205 -413221 18208212 1723651 -35742530 -42481072 -18201122
39243a8201122N796372k4793149r838405K9577210L2623982J799441o266463K2605587
$$ -18201122 -12404750 -37197899 -47036304 -17459094 15164888 16964329 10697866 33303453
39235C3303453M0247825J3561483l1377332n0207746k8298017J5286332M3818736
$$ 33303453 73551278 87112761 55735429 5527683 -22770334 -7484002 36334734
39228C6334734K7761374j9937735m4540996j4265199L1678972L5117554K036295
$$ 36334734 64096108 44158373 -382623 -14647822 17031150 52148704 54184999
39221E4184999j1890093J0171120K4602798R91761l0574256k6843301O795895
$$ 54184999 42294906 52466026 77068824 78060585 47486329 20643028 27438923
39214B7438923K6693355P468471k9614768m0834926q121452L6039271M0829207
$$ 27438923 54132278 61600749 31985981 -8848945 -16970397 19068874 59898081
39207E9898081n03955l9259327l5290332o983566O566060N414557J3187239K3789111
$$ 59898081 59394126 20134799 -15155533 -22139099 -15573039 -10158482 3028757 26817868
39199B6817868J1677973j4770811j9549849K141381J7366560J0517948K68100
$$ 26817868 38495841 23725030 4175181 6316562 23683122 34201070 34469170
39192C4469170l231126j2116463k3258157j4121342J0128315J2701674j2423605
$$ 34469170 31238044 19121581 -4136576 -18257918 -8129603 4572071 -7851534
39185g851534k1419525R490283L9831884K5648739j3174471k6597565o860207
$$ -7851534 -29271059 -19780776 20051108 45699847 32525376 5927811 -932396
39178i32396J3766597J6638349Q526504n058779k1242049k5461735r308161P040713
$$ -932396 12834201 29472550 37999054 32940275 11698226 -13763509 -23071670 -16030957
39170a6030957J460828j1887686m142414J8141486K1503587L60522j4462907n139827
$$ -16030957 -14570129 -26457815 -30600229 -12458743 9044844 9405366 -5057541 -10197368
39162a0197368R866277J0013157n028q002004j3387946j5902232o982453J3897734
$$ -10197368 -331091 9682066 9677038 1675034 -11712912 -27615144 -34597597 -20699863
39154b0699863L0633951L0026906J7304139M483669l797007p260198p052805j0655730
$$ -20699863 9934088 39960994 57265133 61748802 57951795 50691597 43638792 32983062
39146C2983062k4159561l5587391k4904810L279842J9174078J0301125K34751
$$ 32983062 8823501 -26763890 -51668700 -48388858 -29214780 -18913655 -18678904
39139a8678904P895830J3091698r401850l9343443l1343306J7742948N7104965
$$ -18678904 -10783074 2308624 -7093226 -46436669 -77779975 -60037027 -2932062
39132b932062M6294800L407362k4992709k0362385p13431J1993090J1975740L451756
$$ -2932062 43362738 46770100 21777391 1415006 701575 12694665 24670405 28122161
39124B8122161o763077r959036k333713O739485L557553j0156405j5766820j238199
$$ 28122161 21359084 11400048 9066335 15805820 19363373 9206968 -6559852 -7798051
39116g798051K0704342K5689011P028838j5623716j9670996o069777M358292q33896
$$ -7798051 12906291 38595302 45624140 30000424 10329428 4259651 8617943 7784047
39108G784047j1383415j2206839m495265J984517Q592328K2141885L3304564K3316522
$$ 7784047 -3599368 -15806207 -20301472 -18316955 -9724627 12417258 45721822 69038344
39100F9038344l415432j6987643m115057R746616j080110k1985524k2114262m242102
$$ 69038344 65622912 48635269 44520212 54266828 53186718 31201194 9086932 4844830
39092D844830J576379j1590644j7644658j661502J7152500J7082277L030168q183256
$$ 4844830 6421209 -5169435 -22814093 -24475595 -7323095 9759182 12789350 4606094
39084D606094j0344302m095609R339505J9242231J0013338j3318055k3872438
$$ 4606094 -5738208 -9833817 -494312 18747919 28761257 15443202 -8429236
39077h429236r375329J0588932J5948408J1460886O490906l279330j4305418n082653
$$ -8429236 -17804565 -7215633 8732775 20193661 26684567 23405237 9099819 4017166
39069D017166K4588580L3198749o358780n3876878m9867724j459936K8653682
$$ 4017166 28605746 61804495 55445715 1568837 -48298887 -49758823 -21105141
39062b1105141J3376263r418832l636837J7145531K3747750J3523071p47498j3114523
$$ -21105141 -7728878 -17147710 -20784547 -3639016 20108734 33631805 32884307 19769784
39054A9769784j8580393j1244682r01541m985067j5151959l589727K7327106L8934359
$$ 19769784 1189391 -10055291 -10956832 -15941899 -31093858 -34683585 -7356479 31577880
39046C1577880J5512182j0023124j1522455r101481k2769821k8160417j124459
$$ 31577880 47090062 37066938 25544483 16443002 -6326819 -34487236 -35611695
39039c5611695K8107643J6944532j7354208k3009485L070926J5917677K606722
$$ -35611695 -7504052 9440480 -7913728 -30923213 -27852287 -11934610 -9327888
39032i327888J088617K7935334M3490080J4452876l2422926n0279049l4299653
$$ -9327888 -8239271 19696063 63186143 77639019 45216093 -5062956 -39362609
39025c9362609j2772223M05125J1961022K1781282J9468283N133002p489465q527848
$$ -39362609 -52134832 -51729707 -39768685 -17987403 1480880 6613882 -875583 -9403431
39017i403431r8364R881963J2528002K171664j5121118k2871861j2339526N978074
$$ -9403431 -9501795 380168 12908170 15079834 -41284 -22913145 -35252671 -29274597
39009b9274597J5476365J1726046K045846n541397p036828l701828l242432j0923093
$$ -29274597 -13798232 -2072186 -26340 -5567737 -12604565 -16306393 -19548825 -30471918
39001c0471918j6245694j882086K7373661M0134441J5933708k4562129m2223704
$$ -30471918 -46717612 -48599698 -21226037 18908404 34842112 10279983 -31943721
38994c1943721k4855407M843627K1309423K0592518J3702517Q722532L599098
$$ -31943721 -56799128 -51955501 -30646078 -10053560 3648957 12371489 15970587
38987A5970587p910642k3872568k9127049j1151172J7716555K8500417J3493619
$$ 15970587 8059945 -15812623 -44939672 -56090844 -38374289 -9873872 3619747
38980C619747o16851Q728906K5072487J8400865o722243j7040488j715868J2131450
$$ 3619747 3002896 11731802 36804289 55205154 48482911 31442423 29726555 41858005
38972D1858005J699283j9404360k4894535j2712698j561888j927397o658058n999949
$$ 41858005 43557288 24152928 -741607 -13454305 -15016193 -16943590 -23601648 -29601597
38964b9601597p3841L387864j505673j0623798j1356925J989781J6109532J2858178
$$ -29601597 -29675438 -26287574 -27793247 -38417045 -49773970 -47784189 -31674657 -18816479
38956a8816479m149290j1493444R39275J4305159Q072620j0218859j6122144j153746
$$ -18816479 -22965769 -34459213 -33519938 -19214779 -11142159 -21361018 -37483162 -38636908
38948c8636908J8983304K5178004J3247017o064001j7372136j2984803J35985
$$ -38636908 -19653604 5524400 18771417 12707416 -4664720 -17649523 -17513538
38941a7513538Q845941J0140956J0526520Q762709m872286k6071252l2201795
$$ -17513538 -8667597 1473359 11999879 20762588 15890302 -10180950 -42382745
38934d2382745j3430121R665890J6352408J5325420K1891422K4369205N161912
$$ -42382745 -55812866 -46146976 -29794568 -14469148 7422274 31791479 36953391
38927C6953391j7756133j0473126J8388298K2146774j2127200l8957931k2141658
$$ 36953391 19197258 8724132 27112430 49259204 37132004 -1825927 -23967585
38920b3967585J0853760J3155518j1804247k2982662p053510R341758P982318
$$ -23967585 -13113825 41693 -11762554 -34745216 -41798726 -32456968 -24474650
38913b4474650K168789N725591R821648L478627m905859j961383Q219257J0446621
$$ -24474650 -22305861 -16580270 -6758622 -3279995 -8185854 -10147237 -1927980 8518641
38905H518641M89586j0675934j2594035p408750m753480q150456j0566509n602024
$$ 8518641 9008227 -1667707 -14261742 -21670492 -26423972 -34574428 -45140937 -50742961
38897e0742961J589178L064068M888602J9691622L9187677L4089615n370418m6190095
$$ -50742961 -49153783 -46089715 -41201113 -21509491 17678186 51767801 46397383 207288
38889B07288m9399570j7710815J4661683K8098437K7719199J7129092m549814
$$ 207288 -49192282 -66903097 -52241414 -24142977 3576222 20705314 16155500
38882A6155500k0521087p565223K1878861K3942227j3566393m4846636k8028219
$$ 16155500 -4365587 -11930810 9948051 33890278 20323885 -24522751 -52550970
38875e2550970J4423644L0573872J4080562L142928J1926376Q882401k4739446
$$ -52550970 -38127326 -7553454 6527108 9670036 21596412 30478813 5739367
38868E739367n3627849l4034278J9960104M8265042K0588462k5854437l4185176
$$ 5739367 -47888482 -81922760 -61962656 -13697614 6890848 -18963589 -53148765
38861e3148765K992579L9077389L4031737J169497j6381840m323791Q062831n400521
$$ -53148765 -50156186 -11078797 22952940 24122437 7740597 3416806 11479637 6079116
38853F079116k7269999k0791114J5000206L8906288K1117979j7277062l2977012
$$ 6079116 -21190883 -41981997 -26981791 11924497 33042476 15765414 -17211598
38846a7211598j6125242L132319J342074p459681J718115K3836044K9738380R231930
$$ -17211598 -33336840 -30204521 -28862447 -36322128 -34604013 -10767969 18970411 28202341
38838B8202341j2865455j0752159Q497536J8111249Q189169p079347j4182986
$$ 28202341 15336886 4584727 13082263 31193512 39382681 32303334 18120348
38831A8120348j4984190j5006101j2348815m657166L535848P235226P259501N395584
$$ 18120348 3136158 -11869943 -24218758 -28875924 -25340076 -18104850 -10845349 -5449765
38823e449765J395966p78312O314169J9848518K3995819J0756677n542065p125252
$$ -5449765 -4053799 -4832111 1482058 21330576 45326395 56083072 50541007 43415755
38815D3415755R87240r72468j6816186k9035699k5317139j3258809l374886N527845
$$ 43415755 44402995 43430527 26614341 -2421358 -27738497 -40997306 -44372192 -38844347
38807c8844347J3714761R569686j0915620k4720555o104229L1127442M2040082
$$ -38844347 -25129586 -15559900 -26475520 -51196075 -57300304 -26172862 15867220
38800A5867220J0562787k3408174j6908066J4806097K0177412j2623964l7885239
$$ 15867220 26430007 3021833 -13886233 919864 21097276 8473312 -29411927
38793b9411927j9189283K0017783L5443659K5214634K0355488K6336953J5319608
$$ -29411927 -48601210 -28583427 6860232 32074866 52430354 78767307 94086915
38786I4086915k0026526m3880036k7420598O389618J4665671n613496j9189776
$$ 94086915 74060389 30180353 2759755 9149373 23815044 18201548 -988228
38779i88228p451888Q607606N835949o646042o105290P194939J2244534k60757
$$ -988228 -8440116 167490 6003439 -642603 -6747893 447046 12691580 12430823
38771A2430823j7360403k6170825k8213149k5500709j0938595J3650614K5906628
$$ 12430823 -4929580 -31100405 -59313554 -84814263 -95752858 -82102244 -56195616
38764e6195616J1279413o929335N678974L9596765M6783413J0607727k4476101
$$ -56195616 -44916203 -51845538 -46166564 -6569799 40213614 50821341 26345240
38757B6345240j5745646J5829645J9934982r040883l2964932l2294284k2783253
$$ 26345240 10599594 26429239 46364221 37323338 4358406 -27935878 -50719131
38750e0719131j2884218Q692312L4819636L4278597K026781k3728402j6846555
$$ -50719131 -63603349 -54911037 -20091401 14187196 16213977 -7514425 -24360980
38743b4360980m75753l383459j2895055l953593J3550832J4585948M904754P038491
$$ -24360980 -24836733 -28220192 -41115247 -45068840 -31518008 -16932060 -12027306 -4988815
38735d988815J5130508N331659j6484482j9008146K600909J7344351O436583j2403397
$$ -4988815 10141693 15473352 -1011130 -20019276 -17418367 -74016 6362567 -6040830
38727f040830j6710584o885592O260514J6604060J8037568P534632k025182M729208
$$ -6040830 -22751414 -29637006 -23376492 -6772432 11265136 18799768 16774586 21503794
38719B1503794J6552659O947303k1134795l3354341j6245198J899502j013582
$$ 21503794 38056453 45003756 23868961 -9485380 -25730578 -23831076 -24844658
38712b4844658m745258J5534584M1472987L4616286n855471l9502254l6054776
$$ -24844658 -29589916 -14055332 27417655 62033941 56178470 16676216 -19378560
38705a9378560p421725J3267610R563744m286031j811701K1961352L8538005K0546661
$$ -19378560 -26800285 -13532675 -3968931 -8254962 -10066663 11894689 50432694 70979355
38697G0979355j5292069k4668845R15108J9325490J324694k5001454k0380955
$$ 70979355 55687286 31018441 31933549 51259039 52583733 27582279 7201324
38690G201324N117324J4606920M914489J119011M272910p471422k8367131k4545316
$$ 7201324 12318648 26925568 31840057 32959068 37231978 29760556 1393425 -23151891
38682b3151891P343060K5722919N645115k3833512k6334208r003938L85713m59388
$$ -23151891 -15808831 9914088 15559203 -8274309 -34608517 -43612455 -43226742 -43686130
38674d3686130L141473Q072184J196131r018437j621226J9348257K6361797R900125
$$ -43686130 -40544657 -32472473 -31276342 -40294779 -41916005 -22567748 3794049 13694174
38666A3694174p613315o520997L470175L194058n665315n677602Q160410K0027439
$$ 13694174 6080859 -440138 3030037 6224095 558780 -5118822 3041588 23069027
38658B3069027J4739719j156578o715059N484409J6677381N612569j9004363k5234996
$$ 23069027 37808746 36652168 29937109 35421518 52098899 57711468 38707105 13472109
38650A3472109j826594K1932254J4941667j0828725j7238009L772744J8957242
$$ 13472109 11645515 33577769 48519436 37690711 20452702 24225446 43182688
38643D3182688N265073j4644622p780955J7066891K0985625o322757k9534191
$$ 43182688 48447761 33803139 26022184 43089075 64074700 57751943 28217752
38636B8217752j8674942P980487J2744690n484971j2933809M080693J7798357
$$ 28217752 9542810 17523297 30267987 24783016 11849207 15929900 33728257
38629C3728257N024240j3336404m271869K3412261K9993507M084457k3273770
$$ 33728257 38752497 25416093 21144224 44556485 74549992 78634449 55360679
38622E5360679k7949765k2317304k2391777j7401968M885532K7713759K8282411
$$ 55360679 27410914 5093610 -17298167 -34700135 -29814603 -2100844 26181567
38615B6181567J3064886J736590q041861k7401809m0907137k2803231J6108021
$$ 26181567 39246453 40983043 32941182 5539373 -35367764 -58170995 -42062974
38608d2062974L6593715K6831012J1947358N046024q151464k6025012j9778410
$$ -42062974 -5469259 21361753 33309111 38355135 30203671 4178659 -15599751
38601a5599751J2817171K7547917l31645l0479097j7919354J5688834J9786212
$$ -15599751 -2782580 24765337 24433692 -6045405 -23964759 -8275925 11510287
38594A1510287l289588j0732335K655948P12303k1689606k4573538O139058K9768049
$$ 11510287 8220699 -2511636 144312 856615 -20832991 -45406529 -39267471 -9499422
38586i499422J6384362o538863k825651J6296269J8539794K408312j1756267j8854557
$$ -9499422 6884940 346077 -2479574 13816695 32356489 34764801 23008534 4153977
38578D153977k3728305j8150365L729969K2139957J6114145j022199k001961R363266
$$ 4153977 -19574328 -37724693 -33994724 -11854767 4259378 3237179 1235218 10598484
38570A0598484O825328j1634914k0723323j0791669o43678k529489m146950N066905
$$ 10598484 17423812 5788898 -14934425 -25726094 -26369772 -28899261 -33046211 -27979306
38562b7979306J4463996J1223110R50834k253735N076875J3652067J0925860p147708
$$ -27979306 -13515310 -2292200 -1341366 -3595101 1481774 15133841 26059701 18911993
38554A8911993k5588138j9141334J3644450L5801698J5305410k5327421l4814429
$$ 18911993 -6676145 -25817479 -12173029 23628669 38934079 13606658 -21207771
38547b1207771o128993J5147189L444067q671687J1355377L7701362K4601955
$$ -21207771 -27336764 -12189575 -8745508 -17417195 -6061818 31639544 56241499
38540E6241499k0053171m4315821k8274101o558538p502024j0184096J3883974
$$ 56241499 36188328 -8127493 -36401594 -42960132 -50462156 -60646252 -46762278
38533d6762278M4281453L3970568j8116612n4189942l1749662J7514581L1424593
$$ -46762278 -2480825 31489743 13373131 -40816811 -72566473 -55051892 -23627299
38526b3627299L443688j4709904M089856K4173341J1913200p256229K451810J8362969
$$ -23627299 -20183611 -34893515 -30803659 -6630318 5282882 -1973347 478463 18841432
38518A8841432k471109l8094281k5607312L1361045N5050440J2735643l0364759
$$ 18841432 16370323 -21723958 -47331270 -15970225 39080215 51815858 21451099
38511B1451099j5414029K0499546J4737945j7415635j9733581M711418Q268404
$$ 21451099 6037070 26536616 41274561 23858926 4125345 8836763 17105167
38504A7105167r722249o567786J7147198J4995505j6245265k3469118Q987794
$$ 17105167 7382918 815132 17962330 32957835 16712570 -6756548 2231246
38497B231246K6888130k773936l6128148k7747971j647115Q16624p302630O498436
$$ 2231246 29119376 26345440 -9782708 -37530679 -39177794 -38361170 -45663800 -39165364
38489c9165364K7911633K2186838k778113j5257850j7213270k7907903l2286574
$$ -39165364 -11253731 10933107 8154994 -7102856 -24316126 -52224029 -84510603
38482h4510603n347809K8461884K4151834m658770l166127K8805580L1309406
$$ -84510603 -89858412 -61396528 -37244694 -41903464 -45069591 -16264011 15045395
38475A5045395j2359431m1008749j4613399K0110437Q931713k2008923j5126096
$$ 15045395 2685964 -38322785 -52936184 -32825747 -23894034 -45902957 -61029053
38468f1029053K3470290M1361125K6402983J1711712P368967q508718l0645932
$$ -61029053 -37558763 3802362 30205345 41917057 49286024 40777306 10131374
38461A0131374k1284669K1377195M4643510J7224431k1440714k1181250N113789
$$ 10131374 -11153295 10223900 54867410 72091841 50651127 29469877 34583666
38454C4583666Q407349j8234974l2950629j1034595K1975262L0230868J1346996
$$ 34583666 42991015 24756041 -8194588 -19229183 2746079 32976947 44323943
38447D4323943j1862920k2761322j9828504p520577P182755J4436925Q170438
$$ 44323943 32461023 9699701 -10128803 -17649380 -10466625 3970300 12140738
38440A2140738p966019k4771841l3694475k7772573n523588K0950573L1287189
$$ 12140738 4174719 -20597122 -54291597 -82064170 -87587758 -66637185 -35349996
38433c5349996J9228760K351885l65539O855477P284905j06114j353344N976697
$$ -35349996 -16121236 -13769351 -14134890 -7279413 5492 -100622 -1453966 4522731
38425D522731Q030001l78028p519624q575026j4594569k5273720j7935781J4882035
$$ 4522731 12552732 12174704 4655080 -3919946 -18514515 -43788235 -61724016 -46841981
38417d6841981L9908173K5471516q247886j8179230n373198p870298k9308561
$$ -46841981 -6933808 18537708 10289822 -7889408 -13262606 -21132904 -50441465
38410e0441465k7798511J0013338L6744361J6514526j6411839j3475061J1118834
$$ -50441465 -78239976 -68226638 -31482277 -14967751 -31379590 -44854651 -33735817
38403c3735817J2183836m353290N111829L5937341L1551146k2338552o3006251
$$ -33735817 -21551981 -25905271 -20793442 15143899 46695045 24356493 -38649758
38396c8649758l9826425J2440393K8997116N660249j1521225k278084J1080281
$$ -38649758 -78476183 -66035790 -37038674 -31378425 -42899650 -45177734 -34097453
38389c4097453J2261031J0319981R632851O75380j1238608k847329K7147342M3460382
$$ -34097453 -21836422 -11516441 -1883590 -1208210 -12446818 -15294147 11853195 55313577
38381E5313577J8966818k5531401m6648866l1480449o423079O42153j0008558
$$ 55313577 74280395 48748994 2100128 -29380321 -35803400 -35161247 -45169805
38374d5169805j7587199o251451J9266118L8092110L3163760Q836792j4234906
$$ -45169805 -62757004 -69008455 -49742337 -11650227 21513533 30350325 16115419
38367A6115419k2020837j7669359q168077O581121K3555841K8811721J5178178
$$ 16115419 -5905418 -23574777 -31742854 -25161733 -1605892 27205829 42384007
38360D2384007n32777L272454J9555242J8970535p427729l2335407k8558856l989367
$$ 42384007 41851230 45123684 64678926 83649461 76221732 43886325 15327469 11338102
38352A1338102J3301700J1415511K65311q742503j1097555m530672N920827M209845
$$ 11338102 24639802 36055313 36320624 27578121 16480566 11949894 17870721 22080566
38344B2080566j5400471k8843892r395709K6768438L2516598n135556m2863474
$$ 22080566 6680095 -22163797 -31559506 -4791068 27725530 22589974 -20273500
38337b0273500l9983928j0325272Q514822J1130560J6433225K2970014J2354176
$$ -20273500 -60257428 -70582700 -62067878 -50937318 -34504093 -11534079 820097
38330H20097r664190j5224657Q59622J4271111J3765653J4279662J9052192P955705
$$ 820097 -8844093 -24068750 -23209128 -8938017 4827636 19107298 38159490 46115195
38322D6115195j9243435k7105019N62375K4750914O986371k6765156k3456029
$$ 46115195 26871760 -233259 329116 25080030 32066401 5301245 -18154784
38315a8154784J2734516K5551236n181737l2423319j4107937K6702348L9859058
$$ -18154784 -5420268 20130968 14949231 -17474088 -31582025 -4879677 34979381
38308C4979381J5566905j5603653k9596376k6234754j2313885M339235R733922
$$ 34979381 50546286 34942633 5346257 -20888497 -33202382 -28863147 -19129225
38301a9129225k296514j3369726o96202K6698585L5275172J3522440j2561417
$$ -19129225 -21425739 -34795465 -35491667 -8793082 26482090 40004530 27443113
38294B7443113j8697303j3868623j7687924k6085219k1824879p294311j066425
$$ 27443113 8745810 -5122813 -22810737 -48895956 -70720835 -78015146 -79081571
38287g9081571m590107K040885K4803498L8335775J8673853j9588499l6637850
$$ -79081571 -83671678 -81630793 -56827295 -18491520 182333 -19406166 -56044016
38280e6044016j5339592J8206686K6098269L001970j8650772r157860J9534825
$$ -56044016 -71383608 -53176922 -27078653 -24076683 -42727455 -51885315 -32350490
38273c2350490K7183833k08356k6510177j2678296K5599420L6531661O448037
$$ -32350490 -5166657 -5375013 -31885190 -44563486 -18964066 17567595 24015632
38266B4015632j9868994n774450K4027749K3157172q624142l1127048k2984587
$$ 24015632 4146638 -1627812 22399937 45557109 36932967 5805919 -17178668
38259a7178668m00287J6471064K1785817J0644267j8173880m2435752l2488332
$$ -17178668 -17578955 -1107891 20677926 31322193 13148313 -29287439 -61775771
38252f1775771M252329K5072330R494607j3782490j1638998R618718K3596038
$$ -61775771 -57523442 -32451112 -22956505 -36738995 -48377993 -38759275 -15163237
38245a5163237K2204010J3033490r94610j6020572j7755890j177356J3009296
$$ -15163237 7040773 20074263 19079653 3059081 -14696809 -15874165 -2864869
38238b864869M148054j6452725k1005441m232058J3857588J7699447R621312j117689
$$ -2864869 1283185 -15169540 -36174981 -40407039 -26549451 -8850004 771308 -346381
38230c46381n834940J516405J4962368J6699840J045587j2301906n576739Q845339
$$ -346381 -6181321 -4664916 10297452 26997292 28042879 15740973 10164234 19009573
38222A9009573Q457956k864536m059528N283367M998333r518916j9206725j2655270
$$ 19009573 27467529 24602993 20543465 25826832 30825165 21306249 2099524 -10555746
38214a0555746q77610M734823P344997J0625396Q866789r28669j2002550j8579722
$$ -10555746 -11433356 -6698533 646464 11271860 20138649 19209980 7207430 -11372292
38206a1372292k0676510j6189626l138967R108067Q049993o55366J141275J4145769
$$ -11372292 -32048802 -48238428 -51377395 -42269328 -34219335 -34874701 -33733426 -19587657
38198a9587657J8273914N345870o887414m316880O14788q247804k1092561j5228697
$$ -19587657 -1313743 4032127 -2855287 -7172167 -6557379 -14805183 -35897744 -51126441
38190e1126441J0082834L0027257K4117422k430589k6690803k8874337o345931
$$ -51126441 -41043607 -11016350 13101072 10670483 -16020320 -44894657 -51240588
38183e1240588K5096430M2488080L3282199N229425k0431124k6419377j3404050
$$ -51240588 -26144158 16343922 49626121 54855546 34424422 8005045 -5399005
38176e399005J317503J870269q726861j4969876j2742932j3706096k0066342j2852959
$$ -5399005 -4081502 -2211233 -10938094 -25907970 -38650902 -52356998 -72423340 -85276299
38168h5276299J7946715M6359036L8850145L294717j8445118p961882Q032838
$$ -85276299 -67329584 -20970548 17879597 21174314 2729196 -5232686 2800152
38161B800152K233371j3732901j2313680O169673J5864958M099610j3475182j7509228
$$ 2800152 5033523 -8699378 -21013058 -14843385 1021573 5121183 -8353999 -25863227
38153b5863227q072690L659914J4586566K6978240L1063284R753513l0226648
$$ -25863227 -33935917 -30276003 -15689437 11288803 42352087 52105600 21878952
38146B1878952n0057912k3591318K0363721L0606142N034661q686956R056631
$$ 21878952 -28178960 -51770278 -31406557 -800415 4234246 -4452710 4603921
38139D603921J7611580j3287848m5623053k9397419J6516890L3408422J2422517
$$ 4603921 22215501 8927653 -36695400 -66092819 -49575929 -16167507 -3744990
38132c744990k136306R465434J9487420R677446l571857r770973j9246157k6242117
$$ -3744990 -5881296 3584138 23071558 32749004 29177147 19406174 160017 -26082100
38124b6082100p734884K5848884L0306256j174186j8337471O635714L0891476
$$ -26082100 -33816984 -7968100 22338156 21163970 2826499 9462213 40353689
38117D0353689R977362l0120158l6410158r388000R638971O960952K638001L838181
$$ 40353689 50331051 20210893 -16199265 -25587265 -15948294 -8987342 -6349341 -2511160
38109b511160j140717r768955p393455O18203n731158k4330242l0001958j1330217
$$ -2511160 -3651877 -13420832 -20814287 -20196084 -25927242 -50257484 -80259442 -91589659
38101i1589659J5407260K9012737K2350942L285468q599161L793114K9965139
$$ -91589659 -76182399 -47169662 -24818720 -21533252 -30132413 -26339299 3625840
38094C625840L6180854J0292377j8524279k3770621j8988428k4268135k4248310
$$ 3625840 39806694 50099071 31574792 7804171 -11184257 -35452392 -59700702
38087e9700702J643728L0097848K2474538r595971j6026809J5969139M3367041
$$ -59700702 -58056974 -27959126 -5484588 -15080559 -31107368 -15138229 28228812
38080B8228812L0900034n085265k6150621j5609134J4343803L5362662K1719617
$$ 28228812 59128846 54043581 27892960 12283826 26627629 61990291 83709908
38073H3709908k0096862m5565640k3784376J3875796J3102015k2501389l6015453
$$ 83709908 63613046 18047406 -5736970 8138826 21240841 -1260548 -37276001
38066c7276001n300514K4063627J0845482k2180764k8375164l133235K1216901
$$ -37276001 -42576515 -18512888 -7667406 -29848170 -58223334 -61356569 -40139668
38059d0139668K3879633J0985811k776949n708069O613098K2372353K0374436
$$ -40139668 -16260035 -5274224 -8051173 -13759242 -7146144 15226209 35600645
38052C5600645j570565j8773801j2437280M353700P177948o174234j7290377j3120544
$$ 35600645 34030080 15256279 2818999 7172699 14350647 8176413 -9113964 -22234508
38044b2234508J973729J4254395J3452648L311944O81635J4438243K7338602J5000792
$$ -22234508 -20260779 -6006384 7446264 10758208 11439843 25878086 53216688 68217480
38036F8217480j7642344l9364775l4471420j8390475n962810R051907K9714957
$$ 68217480 50575136 11210361 -23261059 -41651534 -47614344 -38562437 -8847480
38029h847480L6827521J5779655j4551499k2799268n879844J1123187J0620760
$$ -8847480 27980041 43759696 29208197 6408929 529085 11652272 22273032
38022B2273032K70188m047648J479383Q946804J0984043O960614j407086j4386750
$$ 22273032 22543220 18495572 19974955 28921759 39905802 46866416 45459330 31072580
38014C1072580k7759379k6461637q58766K7674958K0850376k2166887m9525409
$$ 31072580 3313201 -23148436 -24007202 3667756 24518132 2351245 -47174164
38007d7174164k2566352K5339550L3510710J343769j6574647K890003K3441218
$$ -47174164 -69740516 -44400966 -10890256 -9546487 -26121134 -23231131 210087
38000B10087J6287871J674199K427428L735254j0605496k1396128q352351R785404
$$ 210087 16497958 18172157 20599585 24334839 13729343 -7666785 -16019136 -6233732
37992f233732M885216j4855071k1674530j0153752P039615K3726074L1829371
$$ -6233732 -1348516 -16203587 -37878117 -48031869 -40992254 -17266180 14563191
37985A4563191J3280731k6495103m2317485o149380M1663899M2744912M544825
$$ 14563191 27843922 1348819 -40968666 -47118046 -5454147 37290765 41835590
37978D1835590j6303810k989042N725110j0411224k0909349k397966K0520505
$$ 41835590 25531780 22542738 28267848 17856624 -3052725 -5450691 15069814
37971A5069814J7331577k991732j4990768j5493942j3600352o489652Q516795
$$ 15069814 32401391 29409659 14418891 -1075051 -14675403 -21165055 -12648260
37964a2648260J6559395M869150j4019352j9999631j3646330p192708o03395J1741825
$$ -12648260 3911135 8780285 -5239067 -25238698 -38885028 -46077736 -46681131 -34939306
37956c4939306K1404415J6059827K671603j244390N031468P676743M080059L796147
$$ -34939306 -13534891 2524936 5196539 3952149 8983617 16660360 20740419 24536566
37948B4536566M985281n154084k1985886k0831264N346512K7490996J7527854
$$ 24536566 29521847 24367763 2381877 -18449387 -13102875 14388121 31915975
37941C1915975j2148669k7198047j8445765o635287m792503k076392J0249602
$$ 31915975 19767306 -7430741 -25876506 -32511793 -37304296 -39380688 -29131086
37934b9131086K0372430J5790829M802767L215806J0360866J2858576N503988
$$ -29131086 -8758656 7032173 11834940 15050746 25411612 38270188 43774176
37927D3774176m765523j1678157j5441913j8220774k1067430k1637407j1590283
$$ 43774176 39008653 27330496 11888583 -6332191 -27399621 -49037028 -60627311
37920f0627311J3783290L8570962L4918737K1440l2211803l2103282r861079Q041335
$$ -60627311 -46844021 -8273059 26645678 26667118 -5544685 -37647967 -47509046 -39467711
37912c9467711J7038561K2455911J2248439j8789592l5084291j361945M9410917
$$ -39467711 -22429150 26761 12275200 -6514392 -41598683 -42960628 6450289
37905F450289M7511112q680199m2319207j2451036K6220157J5228814j7100253
$$ 6450289 53961401 45281202 2961995 -9489041 16731116 31959930 14859677
37898A4859677j2857268J6627396J8772636n154595r012421Q779188K937221k9486018
$$ 14859677 2002409 18629805 37402441 32247846 23235425 32014613 34951834 5465816
37890E465816l4286163O770374L8331025J9577006j1570599o546391J3053044
$$ 5465816 -28820347 -22049973 16281052 35858058 24287459 17741068 30794112
37883C0794112j281079l7022807l9449228k049781K4249744J2928340l512801
$$ 30794112 29513033 -7509774 -46959002 -49008783 -24759039 -11830699 -15343500
37876a5343500N044362J9039538R915513q907592o986744R736035Q994809j2619379
$$ -15343500 -10299138 8740400 18655913 9748321 2761577 12497612 21492421 8873042
37868H873042k2196815l280205J6710649Q055399j6825925k4153533q910129L552716
$$ 8873042 -13323773 -16603978 106671 8162070 -8663855 -32817388 -41727517 -38174801
37860c8174801N84885k180711P242545J6254160J0781697j938228q818250j1071292
$$ -38174801 -37589916 -39770627 -32528082 -16273922 -5492225 -7430453 -16248703 -27319995
37852b7319995j1998243k287071K0754148L4270726J6972459j4136400k2663091
$$ -27319995 -39318238 -41605309 -20851161 13419565 30392024 16255624 -6407467
37845f407467l723214J3388374J1820324M773554L211300n52462p058067l59650
$$ -6407467 -10130681 3257693 15078017 19851571 23062871 22510409 15452342 15092692
37837A5092692J9221154K3306186k322637l0759632l3435644k0605708j3691549
$$ 15092692 34313846 57620032 55297395 24537763 -8897881 -29503589 -43195138
37830d3195138l074843K7894545N5912564M1762483m851881l1641886j8401534
$$ -43195138 -46269981 -18375436 37537128 79299611 74447730 42805844 24404310
37823B4404310N4496l726967j0193419K745387J6614082O007531j5020901j6249788
$$ 24404310 24458806 20731839 10538420 13283807 29897889 35905420 20884519 4634731
37815D634731m72523O024538j821829o705011l127705k90353K762175J3650774
$$ 4634731 4162208 10186746 8364917 1659906 -1467799 -1758152 1004023 14654797
37807A4654797K3028625J5304042q34795m358916n95908j2113247l1865969k6724562
$$ 14654797 37683422 52987464 52152669 47793753 47197845 35084598 3218629 -23505933
37799b3505933N494264K5320220J2579358l540930L311307J4356357M270994j3783924
$$ -23505933 -18011669 7308551 19887909 16346979 19658286 34014643 38285637 24501713
37791B4501713j6292939j2025589j8178869j9917621L551115L2369291L0899874
$$ 24501713 8208774 -3816815 -21995684 -41913305 -38362190 -5992899 24906975
37784B4906975O003694n239358K704537J891203j2392246j2753088O404009J3348615
$$ 24906975 30910669 25671311 28375848 30267051 17874805 5121717 11525726 24874341
37776B4874341q501125l3200291l4151277j7872506L55096J9513357L2894731
$$ 24874341 16373216 -16827075 -50978352 -68850858 -68495762 -48982405 -16087674
37769a6087674K0424281j4402159l1388210p152134K3777097J4741453k4076177
$$ -16087674 4336607 -10065552 -41453762 -48605896 -24828799 -10087346 -34163523
37762c4163523l8127800l184527M4334072N4786933K0586114k2953576l8808411
$$ -34163523 -72291323 -75475850 -31141778 23645155 44231269 21277693 -17530718
37755a7530718k2071468M118486J9833765K6543691L0568608K3977457K73631
$$ -17530718 -39602186 -35483700 -15649935 10893756 41462364 65439821 65713452
37748F5713452k2622349k2269095q627371r309477k0512104j1432415J8010774
$$ 65713452 43091103 20822008 12194637 2885160 -17626944 -29059359 -11048585
37741a1048585K8618973O335923j0673037M141116J8481349m082666l8737372
$$ -11048585 17570388 23906311 13233274 17374390 35855739 31773073 -6964299
37734f964299l6156506K93913K4566526K0832686J5572182K1326157J8148772
$$ -6964299 -43120805 -42826892 -18260366 2572320 18144502 39470659 57619431
37727E7619431j850876j4796631n190123P762573K476757j1169236j0261112M544734
$$ 57619431 55768555 40971924 35781801 43544374 46021131 34851895 24590783 29135517
37719B9135517J0046834o958903l1048768l4530318r710524J9329750K3892779
$$ 29135517 39182351 32223448 1174680 -33355638 -43066162 -23736412 156367
37712A56367P086035k216423N979078P664513j2913496l1444206j8968010J0519861
$$ 156367 7242402 5025979 11005057 18669570 5756074 -25688132 -44656142 -34136281
37704c4136281J9950175N197329l835716N061107R595380m969035j8538757p524656
$$ -34136281 -14186106 -8988777 -12824493 -7763386 1831994 -3137041 -21675798 -29200454
37696b9200454J7463554K4982660N181341j7340039j4125449J2325832L1394296
$$ -29200454 -11736900 13245760 18427101 1087062 -13038387 -712555 30681741
37689C0681741K3016903L976989K899029J5744313J0608007j9382337l7656939
$$ 30681741 53698644 57675633 60574662 76318975 86926982 67544645 29887706
37682B9887706j6242236J9087729K2581934q325684l2455388k0845183J1729177
$$ 29887706 13645470 32733199 55315133 46989449 14534061 -6311122 5418055
37675E418055L0384557J7690841j2333175k8232746j3574456J1268134J3243493
$$ 5418055 35802612 53493453 41160278 12927532 -646924 10621210 23864703
37668B3864703n681383r996502J2552982K9343981J6701396o54670N961756J8246879
$$ 23864703 18183320 8186818 20739800 50083781 66785177 66130507 72092263 90339142
37660I0339142L853568k4856810k8759115k952609K0852400K1705728M426640
$$ 90339142 94192710 69335900 40576785 37624176 58476576 80182304 84608944
37653H4608944j8906623l0389685r555372K9871200L3668107j8726051o4342091
$$ 84608944 65702321 35312636 25757264 55628464 89296571 70570520 6228429
37646F228429l7565910K6863743M1443408k505013l1147131j0661011J2681889
$$ 6228429 -31337481 -4473738 36969670 34464657 3317526 -7343485 5338404
37639E338404O008775j855219Q290089N945914j9929841k3464946J8930801N3694224
$$ 5338404 11347179 9491960 17782049 23727963 3798122 -19666824 -736023 52958201
37631E2958201K8661385k3481071l6912937q793478J2720523P483436l939315
$$ 52958201 81619586 58138515 21225578 12432100 25152623 32636059 28696744
37624B8696744p753879r125536q114224j241979K757087k940957p389596k973293
$$ 28696744 20942865 11817329 3703105 2461126 5218213 2277256 -5112340 -8085633
37616h085633j930479r812961q771119Q262694J7118084M214759m827155Q118850
$$ -8085633 -10016112 -19829073 -28600192 -20337498 -3219414 995345 -3831810 4287040
37608D287040J4700383r779068l2100763r820336L2967637L8085430M527198j5013360
$$ 4287040 18987423 9208355 -22892408 -32712744 254893 38340323 42867521 27854161
37600B7854161j964060P359138o183746j3307765M388370J7115380k118175k9368709
$$ 27854161 25890101 33249239 27065493 13757728 18146098 35261478 33143303 3774594
37592C774594k5929152L838867K2758788J3451538o758073j5773741r368607L792593
$$ 3774594 -22154558 -18315691 4443097 17894635 11136562 -4637179 -14005786 -10213193
37584a0213193J3335626J2576607L600454k046300M150139J3743548R005161j1216831
$$ -10213193 3122433 15699040 19299494 17253194 21403333 35146881 44152042 32935211
37576C2935211k3397480r011244J4928396J5749048m680292q889741J5183647
$$ 32935211 9537731 526487 15454883 31203931 26523639 17633898 32817545
37569C2817545K7061054l062582l6891946k1371035K2639630K5672026k2356667
$$ 32817545 59878599 56816017 19924071 -1446964 21192666 46864692 24508025
37562B4508025n5260074l1646464J1520609K8166974K4595893K0664118P258903
$$ 24508025 -30752049 -62398513 -50877904 -22710930 1884963 22549081 29807984
37555B9807984j7632238k2083462N872574K4160642K803652k2476588j3807973
$$ 29807984 12175746 -9907716 -4035142 20125500 22929152 452564 -13355409
37548a3355409N41430j6360774l1430371J779167M4447745K2536872m2335768
$$ -13355409 -12813979 -29174753 -60605124 -58825957 -14378212 8158660 -34177108
37541c4177108n1077676J8440925P1854080M1311185j8104177k2540378J8341458
$$ -34177108 -85254784 -66813859 5040221 46351406 28247229 5706851 24048309
37534B4048309L4834962R149742j2074735r38250J3759700j077172l1128217l5849804
$$ 24048309 58883271 68033013 55958278 55020028 68779728 67702556 36574339 724535
37526G24535o449972J9450712Q085875k0524488j7336278K2280029M5164635J7130324
$$ 724535 -5725437 13725275 21811150 1286662 -16049616 6230413 51395048 68525372
37518F8525372k3830313k4203092O933960K1598062J1265296P852105J8464959
$$ 68525372 44695059 20491967 27425927 49023989 60289285 68141390 86606349
37511H6606349J6127251m326321j4621609m685332J955866o086868j1576574q027219
$$ 86606349 102733600 98407279 83785670 79100338 81056204 74969336 63392762 55365543
37503E5365543j1789834k3170769j8961708K143523R438795p549919j7786828
$$ 55365543 43575709 20404940 1443232 3586755 13025550 5475631 -12311197
37496a2311197M48562K5235316K8600450J4385958j213197j4303081j9932285
$$ -12311197 -11862635 13372681 41973131 56359089 55145892 40842811 20910526
37489B0910526o850635J5739932J8554821k622202j5392676k373914J1292861
$$ 20910526 14059891 29799823 48354644 45732442 30339766 27965852 39258713
37482C9258713L235219r283505l029611J3352917K1112285K1007863J7082231
$$ 39258713 42493932 33210427 30180816 43533733 64646018 85653881 102736112
37475A02736112J690608j9344050j9406884N416126J9610385K787691j5074768
$$ 102736112 104426720 85082670 65675786 71091912 90702297 93489988 78415220
37468G8415220m628889J4453851J4291553J0536913K6844550M1168617K2592436
$$ 78415220 73786331 88240182 102531735 113068648 139913198 181081815 203674251
37461B03674251l371861J2572506N8881842P3633952L8964251O087969J5289693
$$ 203674251 200302390 212874896 271756738 345390690 384354941 390442910 405732603
37454D05732603M2544291M5635476K2869563J501150n006908n824054j4532953
$$ 405732603 448276894 493912370 516781933 518283083 513276175 507452121 492919168
37447D92919168l6000734o1342109p2255831o1839218m7533249m6968931m8524774
$$ 492919168 456918434 395576325 323320494 261481276 213948027 166979096 118454322
37440A18454322l0018414l63075Q884802o177230j4529532j682758O025421j3400608
$$ 118454322 88435908 88072833 96957635 90780405 76250873 74568115 80593536 67192928
37432F7192928l7560184l1365994J21750K0116972J3350803K251764P545052J7665784
$$ 67192928 29632744 -1733250 -1611500 18505472 31856275 34108039 41653091 59318875
37424E9318875J0641280r293053j6748493l277347R663899K642901j3716667j6927314
$$ 59318875 69960155 60667102 43918609 40641262 50305161 52948062 39231395 22304081
37416B2304081o344461J157892J586976N944363J4013891J2069642l61368q086408
$$ 22304081 15959620 17117512 18704488 24648851 38662742 50732384 50371016 42284608
37408D2284608j0018817k1608334l7711219k7256288J5291432M6159992K9314191
$$ 42284608 32265791 10657457 -27053762 -54310050 -39018618 7141374 36455565
37401C6455565r369864j9566287J883506J4947708K8339k1049571k4568745j1612965
$$ 36455565 27085701 7519414 9402920 24350628 24378967 3329396 -21239349 -32852314
37393c2852314O391434K1260933K4794872J3886203p65574p944807j1441179j5214531
$$ -32852314 -26460880 -5199947 19594925 33481128 32715554 24770747 13329568 -1884963
37385a884963p626229J4887964K5635453L372731k4003690j3541842K2866131
$$ -1884963 -9511192 5376772 31012225 34384956 10381266 -3160576 19705555
37378A9705555L0535750m652158l4857156k4147485L380147R805675l496234j4384119
$$ 19705555 50241305 45589147 10731991 -13415494 -10035347 -229672 -3725906 -18110025
37370a8110025j6951600j2971499L814054K7366408L0072658K100524k4114037
$$ -18110025 -35061625 -48033124 -44219070 -16852662 13219996 15320520 -8793517
37363h793517j7839685M136397P282161n588893n359581J1130653J8282302O444130
$$ -8793517 -26633202 -22496805 -15214644 -20803537 -26163118 -15032465 3249837 9693967
37355I693967n435052l394305M144454O525731N184575L897394L086104N303313
$$ 9693967 4258915 864610 5009064 11534795 16719370 20616764 23702868 29006181
37347B9006181J0697167R495498m395154j7202518j1781129M921864J2015651
$$ 29006181 39703348 49198846 44803692 27601174 15820045 20741909 32757560
37340C2757560P056723M492275O134902O09469q849708n667471P857321R280954
$$ 32757560 39814283 44306558 50441460 51050929 42201221 36533750 44391071 53672025
37332E3672025o589280j8203456j3770187p626655r011286n142616R423451J6856753
$$ 53672025 47082745 28879289 15109102 7482447 -1528839 -6671455 2751996 19608749
37324A9608749P955885L84271M520737K597360j3056549j4969226J2538365L3922475
$$ 19608749 27564634 27948905 32469642 35067002 22010453 7041227 19579592 53502067
37316E3502067J2828369k5386662l1097548q333662Q64310o289168L798021K7145739
$$ 53502067 66330436 40943774 9846226 1512564 2376874 -3912294 -114273 27031466
37308B7031466K1972341j0345674j6737545J4888758K6847402j0631223m2565922
$$ 27031466 49003807 38658133 21920588 36809346 63656748 53025525 10459603
37301A0459603j8380669K4341592K5623628K26722j173861J2962250k276455l5833090
$$ 10459603 -7921066 16420526 42044154 42270876 41097015 54059265 51782810 15949720
37293A5949720l3442599N363187K2022641m010610k5183980p545972K1557284
$$ 15949720 -17492879 -12129692 9892949 5882339 -19301641 -26847613 -5290329
37286e290329K8269521J9316903J1265927N08138j3310504j5030337l910906J697812
$$ -5290329 22979192 42296095 53562022 54070160 40759656 25729319 21818413 23516225
37278B3516225O48196Q270831J3724842r016148l8834069k0698440L8597630N8875132
$$ 23516225 24164421 32435252 46160094 37143946 -1690123 -22388563 16209067 75084199
37270G5084199O443045m5279244k6756649K1293977K0050545k1744476l3786813
$$ 75084199 81527244 36248000 9491351 30785328 50835873 29091397 -4695416
37263d695416j953243K2049675J3465195R15304K692404L236447k651492P32020
$$ -4695416 -6648659 15401016 28866211 29781515 32473919 35710366 33058874 33790894
37255C3790894J0526933N167588j2059437j5491114n064022n840295j8251902
$$ 33790894 44317827 49485415 37425978 21934864 16870842 11030547 -7221355
37248g221355j6233966J735912P832859k981223m018612J1024976J4585081l160535
$$ -7221355 -23455321 -21719409 -13886550 -16867773 -20886385 -9861409 4723672 1563137
37240A563137j4176655j70867K0131430K6874012K4225292J6001943m757516k7352848
$$ 1563137 -12613518 -12784385 7347045 34221057 58446349 74448292 69690776 42337928
37232D2337928k4300342K950142J8273069P641877P45028J5942997K6008327N735734
$$ 42337928 18037586 20987728 39260797 46902674 47647702 63590699 89599026 95334760
37224I5334760k4123472l1121758j8200731p451689m036375k698290m953846o929627
$$ 95334760 71211288 40089530 21888799 14437110 10400735 7702445 2748599 -4181028
37216d181028M043215K1668135J9961738j507876q323458J1577841K3761703P648931
$$ -4181028 -137813 21530322 41492060 39984184 31660726 43238567 67000270 74649201
37208G4649201o071402N079517Q209127k3079146m6841183j6654437L0425293
$$ 74649201 68577799 73657316 81866443 58787297 11946114 -4708323 25716970
37201B5716970K4585356k2268141l4273036M504562K7931950o25718l3983498
$$ 25716970 50302326 28034185 -6238851 -1734289 26197661 25571943 -8411555
37194h411555k4644598N533097J5596021R775300R830316P268937j1931117k6725269
$$ -8411555 -33056153 -27523056 -11927035 -2151735 7678581 14947518 3016401 -23708868
37186b3708868r454849K4997588L6877015J5515234j5230559l3463639l3440063
$$ -23708868 -33163717 -8166129 28710886 44226120 28995561 -4468078 -37908141
37179c7908141j4850243J4155348L0411242J7010008j2649986l0456091k6576238
$$ -37908141 -52758384 -38603036 -8191794 8818214 -3831772 -34287863 -60864101
37172f0864101j0767376P834348K2053477J9316658k253424j8083399m217721
$$ -60864101 -71631477 -63797129 -41743652 -22426994 -24680418 -42763817 -46981538
37165d6981538K3939783K8651698O033845o316987J3014487L4816048K2709103
$$ -46981538 -23041755 5609943 11643788 5326801 18341288 53157336 75866439
37158G5866439j2265261k8617270j4146243J974623k853761j3587264o885624
$$ 75866439 63601178 34983908 20837665 22812288 19958527 6371263 -514361
37151e14361R997048J0981355p539692j9891084p327303J7263298K8704589K0382579
$$ -514361 9482687 20464042 12924350 -6966734 -14294037 2969261 31673850 52056429
37143E2056429M907806p098247j5381104k0042119j6067179j482936J5965206
$$ 52056429 56964235 49865988 34484884 14442765 -1624414 -3107350 12857856
37136A2857856K4462128J8378820J960107j5204910k5469951k6235406j6996608
$$ 12857856 37319984 55698804 57658911 42454001 16984050 -9251356 -26247964
37129b6247964J654395K1361679K4888651M803324j8271558j3844962J6734072
$$ -26247964 -24593569 -3231890 21656761 26460085 8188527 -5656435 11077637
37122A1077637L5614679J7180590j6575931k7174163j0664531N881127P968044
$$ 11077637 46692316 63872906 47296975 20122812 9458281 15339408 23307452
37115B3307452N683729N960512K427134l273089K439983J8430026K2393580L849569
$$ 23307452 28991181 34951693 37378827 34105738 36545721 54975747 77369327 81218896
37107H1218896j7006968j8380916p085943k493935m957196p10254J0087761J1195215
$$ 81218896 64211928 45831012 38745069 36251134 31293938 30583684 40671445 51866660
37099E1866660m068736k0701341j9898988j421290J5456638J2205170p279788
$$ 51866660 47797924 27096583 7197595 5776305 21232943 33438113 26158325
37092B6158325j8201574m474403J7249459J6500777r010461k8551040k0297047
$$ 26158325 7956751 3482348 20731807 37232584 28222123 -328917 -20625964
37085b0625964J329640J0396449L298979o327286j0995588j1348019p007004q69820
$$ -20625964 -19296324 -8899875 -5600896 -11928182 -22923770 -34271789 -41278793 -42148613
37077d2148613j097329n335750J955146K0932046K4736081p77937k5536642j4756922
$$ -42148613 -43245942 -48581692 -46626546 -25694500 -958419 -1736356 -27272998 -42029920
37069d2029920J5999668K3690456N709213k45794J6108388J9307314r576341l8665676
$$ -42029920 -26030252 -2339796 3369417 3123623 19232011 38539325 28962984 -9702692
37061i702692l6434895j6811802m507547P463106K9310724L6253046M785604l4887147
$$ -9702692 -46137587 -62949389 -67456936 -59993830 -30683106 5569940 10355544 -24531603
37053b4531603l3533156P81905J3368661j0897045k6136738k611106K6311021
$$ -24531603 -58064759 -57282854 -43914193 -54811238 -80947976 -83559082 -57248061
37046e7248061K1091209k449660n401227J0505481J3521717q99738o638649M098014
$$ -57248061 -36156852 -38606512 -44007739 -33502258 -19980541 -20880279 -27518928 -23420914
37038b3420914Q723006l000813r194500O934785K7235321K5057681L142872j4543238
$$ -23420914 -14697908 -17698721 -26893221 -19958436 7276885 32334566 35477438 20934200
37030B0934200j6327399q840990J758062J3928830J9552003R393144p697646r641239
$$ 20934200 4606801 -4234189 -2476127 11452703 31004706 40397850 32700204 23058965
37022B3058965P929387K1686549J2102310q658480j4876940l670419M630377j567604
$$ 23058965 30988352 52674901 64777211 56118731 41241791 37571372 42201749 40634145
37014D0634145j1881685j4389054j1071978o420231K673540J4877340J6669906
$$ 40634145 28752460 14363406 3291428 -3128803 -455263 14422077 31091983
37007C1091983J301253j5391317j5303029o116066q437878j8906895j1447278
$$ 31091983 32393236 17001919 1698890 -4417176 -12855054 -31761949 -43209227
37000d3209227J9187093L9994186K2145317j6033172l0059616o492483K1847369
$$ -43209227 -24022134 15972052 38117369 22084197 -7975419 -14467902 7379467
36993G379467J9364356j0505243l4283240k8988973m502554J1491490M169768
$$ 7379467 26743823 16238580 -18044660 -47033633 -51536187 -40044697 -35874929
36986c5874929j4595982k1408176p437738J3963658K4563191J9362244N532960
$$ -35874929 -50470911 -71879087 -79316825 -65353167 -40789976 -21427732 -15894772
36979a5894772p578628j0963988J820653K2916221K7945344K479900l1434174
$$ -15894772 -23473400 -34437388 -32616735 -9700514 18244830 20724730 -10709444
36972a0709444l4657844p96142L2713711L2536884R748451k839022L035863R569452
$$ -10709444 -45367288 -46163430 -13449719 19087165 28835616 25996594 29032457 38601909
36964C8601909P111170L292025J52362j0822231k5665067k5104237n555129R562920
$$ 38601909 45713079 49005104 49157466 38335235 12670168 -12434069 -17989198 -8426278
36956h426278M430515l788262O065125K2604936K0024735O63066j0336013q010953
$$ -8426278 -3995763 -7784025 -1718900 20886036 40910771 41573837 31237824 23226871
36948B3226871j3064020l0468258l4242034p670334K6202918L3892271J4986735
$$ 23226871 10162851 -20305407 -54547441 -62217775 -36014857 -2122586 12864149
36941A2864149l060302k992601P496874J2872519O318760p486708j5553030p304496
$$ 12864149 9803847 6811246 14308120 27180639 33499399 26012691 10459661 3155165
36933C155165R626182J2618958o948636k7553165k3173418L133628K4885975K4125555
$$ 3155165 12781347 25400305 18451669 -9101496 -32274914 -29141286 -4255311 19870244
36925A9870244M385802k0009315l2665837k1768923M619740J7679996J281185
$$ 19870244 24256046 4246731 -28419106 -50188029 -45568289 -27888293 -26607108
36918b6607108k1339699j6207932J3274895L3288663L0077126K1618841J7298478
$$ -26607108 -47946807 -64154739 -50879844 -17591181 12485945 34104786 51403264
36911E1403264K162814k6072027l8677850j7626896J0551088J0391357j1104291
$$ 51403264 53566078 27494051 -11183799 -28810695 -18259607 -7868250 -18972541
36904a8972541j8098592J48538J9472222K1994832J7791297J9188676J7643993
$$ -18972541 -37071133 -36922595 -17450373 4544459 22335756 41524432 59168425
36897E9168425P37837k1711769k5833497n729633J6261190J6867871J181722o403975
$$ 59168425 59906262 38194493 12360996 6631363 22892553 39760424 40942146 34538171
36889C4538171J919658O940465n404741j9594395j5633328l471194o025225j7254855
$$ 34538171 36457829 43398294 37993553 18399158 2765830 -705364 -6730589 -23985444
36881b3985444j0908430J0103914J2276105j0731434j9573644R303354M0610358
$$ -23985444 -34893874 -24789960 -12513855 -23245289 -42818933 -33515579 7094779
36874G094779L1512453l330778j7931047n607839J224316q625061j1987641K31962
$$ 7094779 38607232 35276454 17345407 11737568 12961884 4336823 -7650818 -7418856
36866g418856N746150o821482j6404132p489476K331467n603452j7571621j1498910
$$ -7418856 -1672706 -8494188 -24898320 -32387796 -30056329 -35659781 -53231402 -64730312
36858f4730312N043659R415533M411442J2672663L2354136L0699582n560720l9216448
$$ -64730312 -59686653 -50271120 -45859678 -33187015 -832879 29866703 24305983 -14910465
36850a4910465k7419948J4856665K8929724n614631l7007633j2952199L9949287
$$ -14910465 -42330413 -27473748 1455976 -4158655 -41166288 -54118487 -14169200
36843a4169200M8632891l698176n4195828m8501697o816253K1089329K5655379
$$ -14169200 34463691 30765515 -23430313 -71932010 -78748263 -57658934 -32003555
36836c2003555K6001903K0849961k171070k5463575j7711619J3622473K8694965
$$ -32003555 -6001652 14848309 12677239 -12786336 -30497955 -16875482 11819483
36829A1819483J4268029l042581m923204l450813p770027o181930O043749J3138386
$$ 11819483 26087512 23044931 18121727 14670914 6900887 718957 6762706 19901092
36821A9901092O354698k624404n901604r223009j0238349J220886J3134431r86024
$$ 19901092 26255790 23631386 17729782 8506773 -1731576 -510690 12623741 11637717
36813A1637717l1731422l3494088M090488K8546022J515648l7115593k6897418
$$ 11637717 -20093705 -53587793 -49497305 -20951283 -19435635 -56551228 -83448646
36806h3448646K1755658M5891400K2808026q480586j4141180m519864k70185j385827
$$ -83448646 -61692988 -15801588 7006438 -1474148 -15615328 -20135192 -20405377 -21791204
36798b1791204k464661o586293j1110877m829223J0826753J9882950J7386959
$$ -21791204 -24255865 -30842158 -41953035 -46782258 -35955505 -16072555 1314404
36791A314404J3666139Q734637r169839l0819588k3738177J8682960N3695593
$$ 1314404 14980543 23715180 14545341 -16274247 -40012424 -21329464 32366129
36784C2366129M0923593k425784k6981611j8181898n890884j2603949k5792512
$$ 32366129 73289722 70863938 43882327 25700429 19809545 7205596 -18586916
36777a8586916k7561084k1732400j6565268m203358K1095067L9901203K8763178
$$ -18586916 -46148000 -67880400 -84445668 -88649026 -67553959 -27652756 1110422
36770A110422j504268j4919707J00488J5389272O574337j1582417j1288445M866508
$$ 1110422 -393846 -15313553 -15213065 176207 6750544 -4831873 -16120318 -11253810
36762a1253810J1022698p33909j2292716j1138570n464490l325005J564146J4119083
$$ -11253810 -231112 -965021 -13257737 -24396307 -29860797 -33185802 -31621656 -17502573
36754a7502573K4455174K0435292L242276j5336184k1816635p276318K0591436
$$ -17502573 6952601 27387893 30630169 15293985 -6522650 -13798968 6792468
36747F792468L2919985Q808893k8676760l2815511J680480K5058251K931395l0959499
$$ 6792468 39712453 48521346 19844586 -12970925 -11290445 13767806 16699201 -14260298
36739a4260298k4577453J3016214K5058781p243442l7025202k0545314K1584820
$$ -14260298 -38837751 -25821537 -762756 -8006198 -45031400 -65576714 -43991894
36732d3991894L4792853K957821l4351701l3367150L555543L5827144L4572981
$$ -43991894 -9199041 -6241220 -40592921 -73960071 -70404528 -34577384 -4403
36725d403J2440729n83280J378611O10491p058248l227263J5866690K1861023
$$ -4403 12436326 11853046 13231657 13842148 6783900 3556637 19423327 41284350
36717D1284350l356123l0420048j9238696K0418851M0447083K1895232n501555
$$ 41284350 37928227 7508179 -11730517 8688334 49135417 71030649 65529094
36710F5529094j4579401j4481897j9449752j7402428N148230K8828490K1926922
$$ 65529094 50949693 36467796 17018044 -384384 4763846 33592336 55519258
36703E5519258j2840428l8098898k9619669m750132L898040r648209k0632728
$$ 55519258 42678830 4579932 -25039737 -29789869 -25891829 -35540038 -56172766
36696e6172766q357437J6406192K6241184J4032415J174109N098470J4320105
$$ -56172766 -64530203 -48124011 -21882827 -7850412 -6676303 -1577833 12742272
36689A2742272R498234l090971j172973J4896972J9242326K082005j0812045L345486
$$ 12742272 22240506 19149535 17976562 32873534 52115860 54197865 43385820 46731306
36681D6731306K4704310J4163631k9505729o1396912m6411795l800033K0722506
$$ 46731306 71435616 85599247 56093518 -5303394 -51715189 -55515222 -34792716
36674c4792716J5972558J3430576L1818117M2196578J1142031l9872402n4395605
$$ -34792716 -18820158 -5389582 26428535 68625113 79767144 39894742 -14500863
36667a4500863j8498318K0343889K3588927J2038300J9898079L3085682J5178113
$$ -14500863 -32999181 -12655292 10933635 22971935 42870014 75955696 91133809
36660I1133809k5178177m0873415j6383783J3055022J7273715O054305k337434
$$ 91133809 65955632 25082217 8698434 21753456 39027171 45081476 42744042
36653D2744042r887043j8639422j3773457J0659601L2149496K6884020k83790
$$ 42744042 32856999 14217577 444120 11103721 43253217 70137237 69853447
36646F9853447k7760477m0847294l1856456n42250L0155804K5238463j3939085
$$ 69853447 42092970 1245676 -30610780 -31153030 -997226 24241237 10302152
36639A0302152l7571548j0491499L5162318M2197497N502778k8774886k9873752
$$ 10302152 -27269396 -37760895 -2598577 39598920 45101698 16326812 -13546940
36632a3546940j0789312O102997J5354201J6632544P555055m262192n691515O54424
$$ -13546940 -24336252 -18233255 -2879054 13753490 21308545 17046353 11354838 12009262
36624A2009262Q38134m001371K82296J1321214R454824r459202k6445856k9019272
$$ 12009262 12847396 8846025 9128321 20449535 29904359 20445157 -6000699 -35019971
36616c5019971k1971758o068137K1458177L9483167J6102653l4735642n1189013
$$ -35019971 -56991729 -63059866 -41601689 -2118522 13984131 -20751511 -71940524
36609g1940524o127566M5284861L8188685j1488898l4084795m344583L5818140
$$ -71940524 -78068090 -32783229 5405456 -6083442 -40168237 -44512820 -8694680
36602h694680M4873025K5587954J00360j7844354j9368230l797937Q225540m200485
$$ -8694680 36178345 61766299 61866659 44022305 24654075 20856138 29081678 24881193
36594B4881193k5483164k1121324O499140J9018047M011023p835370J047222Q568214
$$ 24881193 -601971 -21723295 -15224155 3793892 7804915 -30455 1016767 9584981
36586I584981J803102L702637K2484999K2582613j4549934m4589767k3978038
$$ 9584981 11388083 15090720 37575719 60158332 45608398 1018631 -22959407
36579b2959407J7869374K5351862M366622L32315J2553105K487761k3607525j7678341
$$ -22959407 -5090033 20261829 24628451 24960766 37513871 40001632 16394107 -1284234
36571a284234J9658238K8287189j1684996m0639911j2954170L2253430L6055431
$$ -1284234 18374004 46661193 34976197 -5663714 -18617884 13635546 49690977
36564D9690977M508034j7931517j8900013j3941130l828033J5991085K6884912
$$ 49690977 54199011 36267494 17367481 3426351 -401682 15589403 42474315
36557D2474315J2209016q293666r231098m195174j7925314l4098700j9034641
$$ 42474315 54683331 46389665 37158567 32963393 15038079 -19060621 -38095262
36550c8095262J5168368K1976915p061855k8204732j0705705K3046021L4141002
$$ -38095262 -22926894 -949979 -8011834 -36216566 -46922271 -23876250 10264752
36543A0264752J4664480j2643442k2267622p108379J4723845J6056763n384191
$$ 10264752 24929232 12285790 -9981832 -17090211 -2366366 13690397 8306206
36536H306206k0910770j2885974j982198r384738j6743319J342103K7009279K5019706
$$ 8306206 -12604564 -25490538 -27472736 -36857474 -53600793 -52258690 -25249411 -229705
36528b29705L028596k587106R167699O896656r733597o274450K0588663K9502093
$$ -229705 2798891 211785 9379484 16276140 6542543 268093 20856756 50358849
36520E0358849K457323k4638569k0369793j227808O761130P838782J1702326O591027
$$ 50358849 52816172 28177603 7807810 6580002 13341132 21179914 32882240 39473267
36512C9473267j3917587k8001015j6691569P184195K2190808K5001732J7620391
$$ 39473267 25555680 -2445335 -19136904 -11952709 10238099 35239831 52860222
36505E2860222k413280k2916254k0792290j189820K860922j4140408j8068621
$$ 52860222 50446942 27530688 6738398 5548578 8409500 -5730908 -23799529
36498b3799529J368944O031293k0509209l2148051M624283M4248951K9143429
$$ -23799529 -22430585 -16399292 -36908501 -69056552 -64432269 -20183318 8960111
36491H960111j6584433k7011407O30238J2693657m993788j1943978P264966J7930098
$$ 8960111 -7624322 -34635729 -34005491 -21311834 -26305622 -38249600 -30984634 -13054536
36483a3054536J657060j2667563l082187J0840971Q687744K153959O165361J2502183
$$ -13054536 -11397476 -24065039 -27147226 -16306255 -7618511 -5464552 700809 13202992
36475A3202992J1258334P851428L409632j1514334k9942713k6500832K041937
$$ 13202992 24461326 32312754 35722386 24208052 -5734661 -32235493 -30193556
36468c0193556K4067684J7585424n39746o946212o046778j1798040j8687511j3181066
$$ -30193556 -6125872 11459552 10919806 3973594 -2073184 -13871224 -32558735 -45739801
36460d5739801J862648J2521113J2129525L067325p691539r067294K955950J2775526
$$ -45739801 -43877153 -31356040 -19226515 -16159190 -23850729 -32918023 -29962073 -17186547
36452a7186547L606575j2121530p616173J2715123J6920333k42835p505183N261555
$$ -17186547 -13579972 -25701502 -33317675 -20602552 -3682219 -3925054 -11430237 -6168682
36444f168682M632638k5703537m5159802j5356259L4703317M7053035J5509706
$$ -6168682 -1536044 -27239581 -72399383 -87755642 -53052325 -5999290 9510416
36437I510416j6785756k4679151k0148735j2414681N334367K7326440L2384722
$$ 9510416 -7275340 -31954491 -52103226 -64517907 -59183540 -31857100 527622
36430E27622J6814480k91131r107320j7801412k5853423j8789992L409573K0326011
$$ 527622 17342102 17050971 7943651 -9857761 -35711184 -54501176 -51091603 -30765592
36422c0765592K1814422J9054212J7185830M610834j8569993k8826324j3508858
$$ -30765592 -8951170 10103042 27288872 31899706 13329713 -15496611 -29005469
36415b9005469N928728N393463n498229q81566K0703572L6099545L0664915J1042062
$$ -29005469 -23076741 -17683278 -23181507 -24063073 -3359501 32740044 63404959 74447021
36407G4447021j0740043k6606503k8032167j1946809O329602L785829j9483658
$$ 74447021 63706978 37100475 9068308 -2878501 3451101 7236930 -12246728
36400a2246728l4338432j7969660J4955184L0161476J7691027J541310L186325
$$ -12246728 -46585160 -64554820 -49599636 -19438160 -1747133 -205823 2980502
36393B980502J2748751Q672321o516533j0237283L713330J4726735O329146j1985924
$$ 2980502 15729253 24401574 17885041 7647758 11361088 26087823 32416969 20431045
36385B0431045k2635628k1529013j1312146P214182K2895055J5426674j1479186
$$ 20431045 -2204583 -23733596 -35045742 -27831560 -4936505 10490169 -989017
36378i89017k1604718K151622K2606696K814618k7490791j3229352L1390362L6067770
$$ -989017 -22593735 -20442113 2164583 4979201 -22511590 -35740942 -4350580 31717190
36370C1717190j2680141m3600541j1370370L3592831K9912671n87113k449915
$$ 31717190 19037049 -24563492 -35933862 -2341031 27571640 26984527 24534612
36363B4534612J7814183J5384830o844089j0305513J289697p964488k8208113
$$ 24534612 42348795 57733625 50889536 40584023 41873720 33909232 5701119
36356E701119j4525277K3799880K5831149j6020429l4985380o56835K8619656
$$ 5701119 -8824158 14975722 40806871 24786442 -10198938 -10855773 17763883
36349A7763883N110823l0268516k4059541m4237o387103k4699061p337942K9944346
$$ 17763883 22874706 -7393810 -31453351 -31497588 -37884691 -62583752 -69921694 -39977348
36341c9977348L0896054n061148k4055807p055109J1382039J2803446J7382443
$$ -39977348 -9081294 -14142442 -38198249 -45253358 -33871319 -21067873 -3685430
36334c685430K9672778K2760783q649390l1003655k4207297p522023K08508N146240
$$ -3685430 25987348 48748131 40098741 9095086 -15112211 -22634234 -22425726 -17279486
36326a7279486J1506299R677666J929675K284139M765254p183453j7555610N033111
$$ -17279486 -5773187 3904479 5834154 8118293 12883547 5700094 -11855516 -6822405
36318f822405M1220316L2478112k4170661n7032903k5059857K0254237J9669331
$$ -6822405 34397911 66876023 42705362 -14327541 -39387398 -19133161 536170
36311E36170n819379n703842J1386956M909040j6721441j1848086J6411906K3632532
$$ 536170 -5283209 -10987051 399905 5308945 -11412496 -23260582 -6848676 16783856
36303A6783856r31889k1556417j8511650j0370367q558085J861018K3936594L2121263
$$ 16783856 15851967 -5704450 -24216100 -34586467 -43144552 -41283534 -17346940 14774323
36295A4774323J0813942j9329937k8696633j2811901R791409J8985369R178918
$$ 14774323 25588265 6258328 -22438305 -35250206 -25458797 -6473428 2705490
36288B705490m482690j54414J9862716K5543397J981708k3493419k0847803l214755
$$ 2705490 -1777200 -1931614 17931102 43474499 45456207 21962788 1114985 -2099770
36280b099770r27471q264021L193183K9075389L4465167R939689j5907727k2938775
$$ -2099770 -3027241 -11291262 -8098079 20977310 55442477 65382166 49474439 26535664
36272B6535664k0560123j7505064p097881Q667263J2615427L68553j0935537q860477
$$ 26535664 5975541 -11529523 -18627404 -9960141 2655286 3023839 -7911698 -16772175
36264a6772175J339803J0820396J2405871k083073k3798855j8901315K5498421
$$ -16772175 -15432372 -4611976 7793895 5710822 -18088033 -36989348 -11490927
36257a1490927O1527390L4842743k9819428n5248218k4155820J376746j3303118
$$ -11490927 50036463 84879206 55059778 -188440 -24344260 -22967514 -36270632
36250c6270632k1248497J8040415O1340939M7069433p492634l4280096j2577766
$$ -36270632 -57519129 -39478714 21862225 68931658 61439024 27158928 14581162
36243A4581162J7512883K4663227J7048924P641397o059961k2398382k8634443
$$ 14581162 32094045 56757272 73806196 81447593 75387632 52989250 24354807
36236B4354807k0959891r767848j723474O510862J5463818J7228542M682746j8824271
$$ 24354807 3394916 -6372932 -8096406 -1585544 13878274 31106816 35789562 16965291
36228A6965291l6807282k9151556L994185L1983834K7353059N846551M665911
$$ 16965291 -19841991 -48993547 -44999362 -13015528 14337531 20184082 24849993
36221B4849993K3102006K3092541o272642k9724607k5146485j4510307j4165332
$$ 24849993 47951999 71044540 64771898 35047291 9900806 -4609501 -18774833
36214a8774833m570303J9789826K2681838q991151k3084292J9173794O6080495
$$ -18774833 -23345136 -3555310 19126528 10135377 -12948915 6224879 72305374
36207G2305374M4872784k2872041n0156803j2707426K7561268K4493495K9690
$$ 72305374 117178158 94306117 44149314 31441888 59003156 83496651 83526341
36200H3526341j4789281k4153090l3223833k6220173l012125P993811l898202
$$ 83526341 68737060 44583970 11360137 -14860036 -17872161 -9878350 -13776552
36193a3776552j1692604L279693K1294037J8710581P14977j5453943k0854444
$$ -13776552 -25469156 -22189463 -895426 17815155 18530132 3076189 -17778255
36186a7778255r479734J6202640L0354443J1205975j5502154o348639K4394209
$$ -17778255 -27257989 -11055349 19299094 30505069 15002915 8654276 33048485
36179C3048485J7674860k9930648m6755670K572360N3509867L7878946j4132523
$$ 33048485 50723345 20792697 -25962973 -23390613 30119254 67998200 53865677
36172E3865677k9777151o481846K052022j5926514k0135944K988446J9587989
$$ 53865677 24088526 17606680 19658702 3732188 -16403756 -13415310 6172679
36165F172679J0859871q08774J477538M166142k283985m972272J163910n54852
$$ 6172679 17032550 16223776 17701314 21867456 19583471 14611199 15775109 15220257
36157A5220257j7404046l0944849k5222663p555259Q658438J9994445K4801623
$$ 15220257 -2183789 -33128638 -58351301 -65906560 -57248122 -37253677 -12452054
36150a2452054K0271924J2730589J0310815M847184j4381408l0709551j6809307
$$ -12452054 7819870 20550459 30861274 35708458 21327050 -9382501 -26191808
36143b6191808J5433241K0281383j3891959m0694119k2143381J5814468K5160598
$$ -26191808 -10758567 9522816 -4369143 -45063262 -67206643 -51392175 -26231577
36136b6231577N532136n600816M498917J1805033K295148o524170J219762J3055425
$$ -26231577 -20699441 -26300257 -21801340 -9996307 -7701159 -14225329 -13005567 49858
36128D9858Q935991p517881j2994940N430226L2339413L7122978O736292l4037966
$$ 49858 8985849 1467968 -11526972 -6096746 26242667 63365645 70101937 36063971
36120C6063971m3505512j0995493K5909325K4727225r201888l1167239j5566190
$$ 36063971 -7441541 -18437034 7472291 32199516 22997628 -8169611 -23735801
36113b3735801J5014043K4931250J0645855l560388l570675R2713l982377p137450
$$ -23735801 -8721758 16209492 26855347 23294959 19724284 19816997 15834620 8697170
36105H697170M615610K2103551J6850281j9399835n2394557m0781336Q635594
$$ 8697170 13312780 35416331 52266612 32866777 -19527780 -60309116 -51673522
36098e1673522M2345368K5113749j6010098k9898089q183481J2685409J0641022
$$ -51673522 -9328154 15785595 -224503 -30122592 -38306073 -25620664 -14979642
36091a4979642O191177K0147465L1857465P190694m3363647o5793303k8883206
$$ -14979642 -8788465 11359000 43216465 50407159 7043512 -58749791 -87632997
36084h7632997L2391558N6368196K7295327j1350833j6276010M210868J2188502
$$ -87632997 -55241439 1126757 28422084 17071251 795241 5006109 17194611
36077A7194611k025615j1179184J40485R236981n210333k2892929j1244464J9171697
$$ 17194611 15168996 3989812 4130297 13367278 8156945 -14735984 -25980448 -6808751
36069f808751K5844848n54673k1254138j0111347Q487979M640889p411041J809777
$$ -6808751 19036097 18481424 -2772714 -12884061 -4396082 244807 -7166234 -5356457
36061e356457K1973367J7807060j1298746k7901441j3453157Q874278J5567134
$$ -5356457 16616910 34423970 23125224 -4776217 -18229374 -9355096 6212038
36054F212038J2548372J0651271K626449j5913952k7262769j5878655N026358
$$ 6212038 18760410 29411681 32038130 16124178 -11138591 -27017246 -21990888
36047b1990888J1627842J139179j2065320j8493327j4388881M935268L2310497
$$ -21990888 -10363046 -9223867 -21289187 -39782514 -54171395 -49236127 -16925630
36040a6925630M2183999J9861835j2429304k2339819j1978408r563722k1996105
$$ -16925630 25258369 45120204 32690900 10351081 -1627327 -11191049 -33187154
36033c3187154k5838766p934718J3856161J9813037J4507225J1361349R889713
$$ -33187154 -59025920 -66960638 -53104477 -33291440 -18784215 -7422866 2466847
36026B466847K545563q699168j5361973j3616499m324580R376801J8737306J4083150
$$ 2466847 5012410 -3686758 -19048731 -32665230 -36989810 -27613009 -8875703 5207447
36018E207447r97718j0453967o258931K703453O616797N951318P93632j4546405
$$ 5207447 4209729 -6244238 -12503169 -9799716 -3182919 2768399 3562031 -10984374
36010a0984374l5218248l9372175j3903909K2921770L9825025K7543460L561686
$$ -10984374 -46202622 -85574797 -99478706 -76556936 -36731911 -9188451 -5626765
36003e626765j1128525p876062R385322K5661662K2411051k140109k4456275k1380214
$$ -5626765 -16755290 -24631352 -15246030 10415632 32826683 30686574 6230299 -15149915
35995a5149915j74648J2298461P003582R32581O457075J1761820J377833j7035763
$$ -15149915 -15324563 -3026102 3977480 4910061 11367136 23128956 24506789 7471026
35987G471026k0462596j955450J6892787R941090k0085217l9850141k3164396
$$ 7471026 -12991570 -14947020 1945767 11886857 -8198360 -48048501 -71212897
35980g1212897J4605471L3030103J7891443k157181J189000J5768725J1568304
$$ -71212897 -56607426 -23577323 -5685880 -7843061 -6654061 9114664 20682968
35973B0682968j0564089j9725555j478956K2048110K3598428K813514j9895504
$$ 20682968 10118879 -9606676 -11085632 10962478 34560906 37374420 17478916
35966A7478916k6706182j4210105N664376J3378466K117925r954706k167497J6509580
$$ 17478916 -9227266 -23437371 -17772995 -4394529 -2276604 -12231310 -14398807 2110773
35958B110773J7915352l137079k1959148k3245218j9249417j8872693q565916
$$ 2110773 20026125 16889046 -5070102 -28315320 -47564737 -66437430 -75003346
35951g5003346J7449244L5051717K3775412J619422j706393R605401Q194828j1214494
$$ -75003346 -57554102 -22502385 1273027 2892449 1186056 10791457 18986285 7771791
35943G771791k7093312k5163571r862462J2319431L3673135L5601266Q396451
$$ 7771791 -19321521 -44485092 -54347554 -42028123 -8354988 27246278 35642729
35936C5642729k2817940k3922187k163631M321426j1111711j2688325J4864750
$$ 35642729 12824789 -11097398 -13261029 -8939603 -20051314 -32739639 -17874889
35929a7874889L4326650J1433120l0818880m3969907j7822818J6852270L2649473
$$ -17874889 16451761 27884881 -2933999 -46903906 -64726724 -47874454 -15224981
35922a5224981K5235795K307710k0351375k1270661M132621L0454438L1219313
$$ -15224981 10010814 12318524 -8032851 -29303512 -25170891 5283547 36502860
35915C6502860J1272205p404019j7206329k0283336j0016424J3464773K4262115
$$ 36502860 47775065 40371046 23164717 2881381 -7135043 6329730 30591845
35908C0591845K225037k7075652k2704595P836892J8960880P82556p066654J3440630
$$ 30591845 32816882 5741230 -16963365 -9126473 9834407 10616963 3550309 16990939
35900A6990939K5297981N56194k7469252j5466231J9081223K4459246n884428
$$ 16990939 42288920 42845114 15375862 -90369 18990854 43450100 37565672
35893C7565672k6947941j1186008J6908932K1487167n87940k6364141l4853501
$$ 37565672 10617731 -568277 16340655 37827822 37239882 10875741 -23977760
35886b3977760j8980447J2607344L6173219K9183209m092295l1668763k6556179
$$ -23977760 -42958207 -30350863 5822356 35005565 30913270 -755493 -27311672
35879b7311672L516532K3892424J0174295k3228292l5355409o119198L3337597
$$ -27311672 -23795140 97284 10271579 -12956713 -48312122 -54431320 -21093723
35872b1093723L4855688j873300k5196887l875522K7232957K0362421j3667839
$$ -21093723 13761965 11888665 -13308222 -17183744 10049213 30411634 16743795
35865A6743795k7326153j2245614l747986j3361932j0375542J7176064L3430001
$$ 16743795 -10582358 -22827972 -26575958 -39937890 -50313432 -33137368 292633
35858B92633J2224613j7153960j4150712J4112394L1232721K3652863K206791
$$ 292633 12517246 -4636714 -18787426 -4675032 26557689 50210552 52417343
35851E2417343k3908729m0250684j9989393L3884469O2073847J7019291n7008658
$$ 52417343 28508614 -11742070 -31731463 2153006 64226853 81246144 24237486
35844B4237486p1325726j5934475L0623248K2326006L391828J6662752K7708607
$$ 24237486 -47088240 -63022715 -32399467 -10073461 -6681633 9981119 37689726
35837C7689726n323242m5306439l2525550J0615782J3112776k4021112k7565722
$$ 37689726 32366484 -12939955 -45465505 -34849723 -21736947 -45758059 -73323781
35830g3323781K2316930N2288389J1542020m7018045m9645911q511081J3240008
$$ -73323781 -51006851 1281538 12823558 -34194487 -83840398 -92351479 -79111471
35823g9111471L009904L46501J8391528K7960381J5981527L971665L345042J80028
$$ -79111471 -76101567 -75755066 -57363538 -29403157 -13421630 -9449965 -6104923 -5924895
35815e924895p420087j332465J5838540J5209108p019496j4914146P748042K4032219
$$ -5924895 -13344982 -14677447 1161093 16370201 9350705 -5563441 2184601 26216820
35807B6216820J519149l1982660l0840570l311637O008183r448050j1947070J2923424
$$ 26216820 27735969 -4246691 -35087261 -38398898 -32390715 -41838765 -53785835 -40862411
35799d0862411L0841973J4666459j3973164k1211095r184987j082707P24875J0671338
$$ -40862411 -10020438 4646021 -9327143 -30538238 -39723225 -40805932 -40081057 -29409719
35791b9409719K4246880J8133247j0741879l2013492k0206849R898916K2515347
$$ -29409719 -5162839 12970408 2228529 -29784963 -49991812 -40092896 -17577549
35784a7577549P968883p456867o44390J6352437J5698244m543657j6862196l910918
$$ -17577549 -9608666 -17065533 -17709923 -1357486 14340758 9797101 -7065095 -10976013
35776a0976013J6226065J5423335n479054j8963883q661745J0864750J6067671
$$ -10976013 5250052 20673387 15194333 -3769550 -12431295 -1566545 14501126
35769A4501126M671133m704273Q38951J0823120M319380k1470431m2012640l1222518
$$ 14501126 19172259 14467986 15306937 26130057 30449437 8979006 -33033634 -64256152
35761f4256152N282875L2218182K3913312o527621k4455957j4101760P666819
$$ -64256152 -58973277 -26755095 -2841783 -9369404 -33825361 -47927121 -40260302
35754d0260302J5896636O190628m547071j211548J1238994J5523206O015043l803793
$$ -40260302 -24363666 -18173038 -22720109 -23931657 -12692663 2830543 8845586 5041793
35746E041793l224901k361606j3260588k2158258n974654K4353092K8590447m329206
$$ 5041793 1816892 -544714 -13805302 -35963560 -41938214 -17585122 11005325 6676119
35738F676119l4630397k8474773n417160M74516j741591J7032079M4877469M1824048
$$ 6676119 -27954278 -56429051 -61846211 -61371695 -63113286 -46081207 -1203738 40620310
35730D0620310Q273677j1623765p59999P442556q687469k2332626q922234J0321273
$$ 40620310 48893987 37270222 36510223 43952779 35265310 12932684 4010450 14331723
35722A4331723Q647448n6665N975240J0026317j0945057l2672362j4668192K8051840
$$ 14331723 22979171 22922506 28897746 38924063 27979006 -4693356 -19361548 8690292
35714H690292L9046905N441152k4217408j6790157J095259l253359j4448014j345824
$$ 8690292 47737197 53178349 28960941 12170784 13266043 10012684 -4435330 -5781154
35706e781154K6841234L3776140J0118958j7680874k5972888j5669849R00905
$$ -5781154 21060080 54836220 64955178 47274304 21301416 5631567 6532472
35699F532472J3124893J3056298P56003j1453071j2917704r021247q436240l915110
$$ 6532472 19657365 32713663 33469666 22016595 9098891 77644 -8358596 -12273706
35691a2273706J3890561K8485856J1290653l0908113n0703437k0218104K5560523
$$ -12273706 1616855 30102711 41393364 10485251 -40218186 -60436290 -34875767
35684c4875767L2404387J096887j5330800J0929426M3305123L6009994q38298
$$ -34875767 -2471380 -1374493 -16705293 -5775867 37529256 73539250 72700952
35677G2700952k1481308j2802126m169935j1250093j0689423J4190940L6625106
$$ 72700952 51219644 38417518 34247583 22997490 12308067 26499007 63124113
35670F3124113K2785021j6455156m0094741l1198500q416766P895198J2529128
$$ 63124113 85909134 69453978 29359237 -1839263 -10256029 -2360831 10168297
35663A0168297M678711r562355q250817J9606008M0679387J1296357m9776950
$$ 10168297 14847008 5284653 -2966164 16639844 57319231 68615588 18838638
35656A8838638o9067039j8070899M0172648L6320024j2992673m0685649k5638287
$$ 18838638 -50228401 -68299300 -28126652 8193372 -4799301 -45484950 -71123237
35649g1123237j733012R989166K0745165K9983610J7916646r251678j5382352
$$ -71123237 -72856249 -62867083 -42121918 -12138308 5778338 -3473340 -18855692
35642a8855692R186797K9621289K2433988R039630J1231019J1093514j4520363
$$ -18855692 -9668895 19952394 42386382 51426012 62657031 73750545 59230182
35635E9230182m8769343n6613608l2378310J881360K8324614L9124449K8183392
$$ 59230182 10460839 -46152769 -78531079 -76649719 -48325105 -9200656 18982736
35628A8982736K734367j1741679j707749J3773708J2681010J140169o742822j5836869
$$ 18982736 21717103 9975424 8267675 22041383 34722393 35862562 29119740 13282871
35620A3282871k8563697k2618603J2390143L8433411J4671833l4628754m6364625
$$ 13282871 -15280826 -37899429 -25509286 12924125 27595958 -7032796 -53397421
35613e3397421o822946L4140207L6565943J1274046j5981648l4360144l3530966
$$ -53397421 -60220367 -26080160 10485783 21759829 5778181 -28581963 -62112929
35606f2112929m603030L1460927L6908610J1231173o999072j923340P43577j0659767
$$ -62112929 -66715959 -35255032 1653578 12884751 5885679 3962339 4705916 -5953851
35598e953851r958732J3139028K6263825J1328231l4598J5822160K8037024O504177
$$ -5953851 -15912583 -2773555 23490270 34818501 34783903 50606063 78643087 85147264
35590H5147264j9390378j0497115R124950r749915n3768969o2136458k1085782
$$ 85147264 65756886 55259771 64384721 54634806 865837 -61270621 -82356403
35583h2356403J7766739J6888799k459621o079643O150343J5047003J2921280
$$ -82356403 -64589664 -47700865 -50160486 -56240129 -50089786 -35042783 -22121503
35576b2121503N272513P14248M697654J0510068L360991j2529466r463828J8597734
$$ -22121503 -16848990 -16134742 -11437088 -927020 2433971 -10095495 -19559323 -961589
35568i61589L1579232j045868m4288269m2943030m123608J8147252Q359478Q91236
$$ -961589 30617643 29571775 -14716494 -57659524 -61783132 -43635880 -35276402 -34385166
35560c4385166J0082170J1373987j033806R31251K0901346K2009882q579966l1397607
$$ -34385166 -24302996 -12929009 -13962815 -13031564 7869782 29879664 21299698 -10097909
35552a0097909j7417715P834299J1208799K28134m462171n118884o194633M407296
$$ -10097909 -27515624 -19681325 -8472526 -8244392 -12706563 -17825447 -24020080 -19612784
35544a9612784K3967080K2297342q861926l1025544j6425262O800561L387529
$$ -19612784 4354296 26651638 17789712 -13235832 -29661094 -22860533 -19473004
35537a9473004j1328719m682920J4031168J4156821n40412l293918O034698O737707
$$ -19473004 -30801723 -35484643 -21453475 -7296654 -7837066 -11130984 -5096286 1641421
35529A641421o16098J631876J2482935J6452719J2382118O741058n815656k3490561
$$ 1641421 1025323 2657199 15140134 31592853 43974971 50716029 44900373 21409812
35521B1409812k0543763J2999940L7906590J6743159k2549698k5388073L844500
$$ 21409812 866049 13865989 51772579 68515738 45966040 20577967 24422467
35514B4422467J2974269j0051349k3374549q000362M123329p325231j7651001
$$ 24422467 37396736 27345387 3970838 -4029524 93805 -7231426 -24882427
35507b4882427p970963J163213o565905j0258811P460578K4495878J6428115j276248
$$ -24882427 -32853390 -31690177 -38256082 -48514893 -41054315 -16558437 -130322 -1406570
35499a406570r73742J1960560J3653421K274294n829521n466537j225723R310023
$$ -1406570 -2380312 9580248 23233669 25507963 19678442 14211905 12986182 22296205
35491B2296205K4716808K5031035l458940l6794494l6013969n9549L0006353K3167442
$$ 22296205 47013013 72044048 68585108 31790614 -4223355 -4282904 25723449 48890891
35483D8890891p295055k8229883k5850001r581935Q039194J9268427J6625017
$$ 48890891 41595836 13365953 -12484048 -22065983 -14026789 5241638 21866655
35476B1866655j231457j8160221j2297634J2963786K5391129N824385k0364072
$$ 21866655 20635198 2474977 -9822657 3141129 28532258 34356643 13992571
35469A3992571j6721682R103306J5809163o867028k2804505j0008882M810015
$$ 13992571 -2729111 6374195 22183358 15316330 -7488175 -17497057 -12687042
35462a2687042l553414j3119940M161811K8161587K2996512l92766n072310N132324
$$ -12687042 -16240456 -29360396 -25198585 2963002 25959514 25566748 20494438 25626762
35454B5626762m149824k8680746k6833835O375313K5901236J0543820o498907
$$ 25626762 21476938 -7203808 -34037643 -27662330 -1761094 8782726 2283819
35447B283819j460935O20492k0053277l5119529j7605295P575624N754576q563590
$$ 2283819 822884 1443376 -18609901 -53729430 -71334725 -63759101 -58004525 -66568115
35439f6568115m42276K3763065L0250603J5578808N163782N443405J085138o556962
$$ -66568115 -67010391 -43247326 -12996723 2582085 7745867 13189272 14274410 7717448
35431G717448n20966J3429894J0145019q719914j0107102J7194683L7791351J7264731
$$ 7717448 7196482 20626376 30771395 22051481 11944379 29139062 66930413 84195144
35423H4195144k7799419m8414020k1961329K3100272L9307416J0270087l1684717
$$ 84195144 56395725 7981705 -13979624 9120648 48428064 58698151 27013434
35416B7013434l9798542o371155K7185256K2007629q522710j8642246O886682
$$ 27013434 -12785108 -19156263 8028993 30036622 21513912 2871666 9758348
35409I758348L3418831K4356651j1863507l5541086k5552189n75183Q714147k869395
$$ 9758348 43177179 67533830 55670323 20129237 -5422952 -5998135 2716012 -153383
35401a53383j3256105n781449Q192390P098467q887385j8664708j1164036J035041
$$ -153383 -13409488 -19190937 -10998547 -3900080 -12787465 -31452173 -42616209 -41581168
35393d1581168K466460n721718j2281634q780954P673547K9876375L6359607J1660563
$$ -41581168 -39114708 -44836426 -57118060 -65899014 -58225467 -28349092 8010515 19671078
35385A9671078k4210517l0759007j734497K1667578Q846964j6547914j5711265
$$ 19671078 -4539439 -35298446 -37032943 -15365365 -6518401 -23066315 -38777580
35378c8777580P681814K1600491J8389611J5071913J2110391o102658l0524977
$$ -38777580 -31095766 -9495275 8894336 23966249 36076640 29973982 -550995
35371e50995k9012650J865644K3374187R990076j2376844o754783J8868354K4339782
$$ -550995 -29563645 -27698001 -4323814 5666262 -6710582 -13465365 5402989 29742771
35363B9742771l729700l3023559k8372546M842032K9467291K0725815q785035
$$ 29742771 26013071 -7010488 -35383034 -30541002 -1073711 19652104 10867069
35356A0867069k8884293k7311062j5906805n550195P997079K6590107L4842446
$$ 10867069 -18017224 -45328286 -61235091 -66785286 -58788207 -32198100 2644346
35349B644346J9151378p825161k0131315j2210726k433535l993114r131318n239612
$$ 2644346 21795724 13970563 -6160752 -18371478 -20805013 -24798127 -33929445 -39169057
35341c9169057O767753J4511570O414146j7981407m1607421l7797383J989475
$$ -39169057 -32401304 -17889734 -11475588 -29456995 -71064416 -108861799 -106872324
35334a06872324M9805917O5339859M0056727L952705j3487556j3936196j5867415
$$ -106872324 -57066407 8273452 48330179 52282884 38795328 24859132 8991717
35327H991717k3463561k2491710l396246K1501036K8300775Q562231j8172047
$$ 8991717 -14471844 -36963554 -40359800 -18858764 9442011 18004242 -167805
35320a67805k5053386r188720Q607502J5139209J8019639K1154909J0207810j9020924
$$ -167805 -25221191 -34409911 -25802409 -10663200 7356439 28511348 38719158 19698234
35312A9698234l7939028j9128391J8571963L0254376O354297j7278519j2672251
$$ 19698234 -18240794 -37369185 -18797222 11457154 17811451 532932 -12139319
35305a2139319P010638J5143855O041749r244920j9615421j5592786O102204K9365508
$$ -12139319 -5128681 10015174 16056923 6812003 -12803418 -28396204 -22294000 7071508
35297G071508K8653763K211405k2309322k4268482j2836912m214747J625900P757233
$$ 7071508 35725271 37936676 15627354 -8641128 -21478040 -25692787 -24066887 -16309654
35289a6309654N831893o675566j2738937O91532J9570528K2219826R531602k018038
$$ -16309654 -10477761 -17153327 -29892264 -29200732 -9630204 12589622 22121224 20103186
35281B0103186n029778j558990P185514J3024974j016366l1968862m3712873j2820232
$$ 20103186 15073408 13514418 20699932 33724906 32708540 739678 -42973195 -55793427
35273e5793427K6370252K0778994k2469749l9289183R90270M9654737M5067295
$$ -55793427 -29423175 -8644181 -31113930 -70403113 -69412843 -19758106 25309189
35266B5309189n478775l9897531k1223803K4564271M6234945K2536976k1319995
$$ 25309189 19830414 -20067117 -41290920 -16726649 29508296 52045272 30725277
35259C0725277m1351194j8632561K0533820L2875554P678761k3055381k7130829
$$ 30725277 -10625917 -29258478 -8724658 24150896 31829657 8774276 -18356553
35252a8356553q715685O754630P658965R12845n632909p611486N62827J7160079
$$ -18356553 -27072238 -20317608 -12658643 -11745798 -17378707 -24990193 -24427366 -7267287
35244g267287K5973214J4527314n913295j5231776j3340072j5006143k0565272
$$ -7267287 18705927 33233241 27319946 12088170 -1251902 -16258045 -36823317
35237c6823317j4172963Q573084L2052486M1309678L2682824N641527l2144813
$$ -36823317 -50996280 -42423196 -10370710 30938968 63621792 69263319 37118506
35230C7118506n2238650k8548486K0059498M1893634J9831859n896364q09131
$$ 37118506 -15120144 -43668630 -23609132 18284502 38116361 32219997 31410866
35223C1410866J2861779j277153l0160836l1394414J97628K8477124L0852352
$$ 31410866 44272645 42995492 12834656 -18559758 -18362130 10114994 40967346
35216D0967346J8032689K543509j3968253k1609021q426337J0196842N196880
$$ 40967346 59000035 61543544 47575291 25966270 17539933 27736775 32933655
35209C2933655j7459447k0506178L229168J5958570j412975j5152117K798588
$$ 32933655 15474208 -5031970 -1802802 14155768 12742793 -2409324 389264
35202C89264K2687271M888194k9578318k6697481J5381663L9480242J1308413
$$ 389264 23076535 27964729 -1613589 -28311070 -12929407 26550835 37859248
35195C7859248l4702991m6683906k0505025Q490504J9185455K3226555L2816668
$$ 37859248 3156257 -43527649 -64032674 -55542170 -36356715 -13130160 19686508
35188A9686508L3964692P381926l2163428m0923207k188664M1485108L6984305
$$ 19686508 53651200 61033126 28869698 -12053509 -14242173 27242935 64227240
35181F4227240q031631l4972944j5503452J4425932J3376636r926389k2606144
$$ 64227240 56195609 21222665 5719213 20145145 33521781 23595392 989248
35174I89248j7724817q952756K75188J1058955J2183443m68586o399799O375503
$$ 989248 -16735569 -25688325 -25413137 -14354182 -2170739 -2639325 -9039124 -2663621
$$ [...]
##END NTUPLES=NMR SPECTRUM
##END=
