##TITLE=31Pdec_3MBPA2401A
 D2O, 64 sc
 25.1.2023
##JCAMPDX= 6.0         $$ Bruker NMR JCAMP-DX V2.0
##DATA TYPE= NMR SPECTRUM
##DATA CLASS= NTUPLES
##ORIGIN= UXNMR, Bruker Analytische Messtechnik GmbH
##OWNER= root
$$ XWIN-NMR		Version 3.5
$$ Wed Jan 25 15:54:54 2023 Russian Standard Time (UT+4h)  she@DPX200
##.OBSERVE FREQUENCY= 81.013821
##.OBSERVE NUCLEUS= ^31P
##.ACQUISITION MODE= SIMULTANEOUS
##.ACQUISITION SCHEME= undefined
##.AVERAGES= 64
##.DIGITISER RES= 16
##SPECTROMETER/DATA SYSTEM= spect
##.PULSE SEQUENCE= zgpg30
##.SOLVENT NAME= D2O
##.SHIFT REFERENCE= (INTERNAL, D2O, 0, 248.564)
##AUDIT TRAIL= $$ (NUMBER, WHEN, WHO, WHERE, WHAT)
$$ ##TITLE= Audit trail, XWIN-NMR		Version 3.5
$$ ##JCAMPDX= 5.01
$$ ##ORIGIN= Bruker BioSpin GmbH
$$ ##OWNER= she
$$ F:/spectra/data/she/nmr/P31/1/pdata/1/auditp.txt
$$ ##AUDIT TRAIL=  $$ (NUMBER, WHEN, WHO, WHERE, WHAT)
(   1,<2023-01-25 15:53:55.96 +0400>,<she>,<DPX200>,
      <continue with go, POWCHK disabled, PULCHK disabled
       configuration hash MD5:
       00 E9 B6 7A A2 85 ED C7 34 08 36 98 17 FE 4E 26
       data hash MD5: 32K
       A6 98 FA 7D 64 32 95 73 28 F6 71 37 68 C5 81 D6>)
(   2,<2023-01-25 15:53:58.21 +0400>,<she>,<DPX200>,
      <Start of raw data processing
       efp BC_mod = 2 LB = 1 FT_mod = 6 PKNL = 1 PHC0 = -11039.89 PHC1 = 194.0578 SI = 64K 
       data hash MD5: 64K
       47 D9 13 7E D7 D3 64 2D 32 0A 90 2B 10 4E D6 F8>)
(   3,<2023-01-25 15:54:11.37 +0400>,<she>,<DPX200>,
      <pk PHC0 = -13.33617 PHC1 = 28.2 
       data hash MD5: 64K
       3E 58 85 72 BB 14 5D 7F 42 E3 4B 84 41 F6 1F 04>)
(   4,<2023-01-25 15:54:15.34 +0400>,<she>,<DPX200>,
      <abs ABSG = 5 
       data hash MD5: 64K
       04 2B F0 FB 9D 1B 7A 8D C7 DF 85 E6 C4 92 25 7A>)
$$ ##END=
$$ 
$$ hash MD5
$$ 59 60 AA 0A 20 4E 42 FA 4E F3 BE 0F A9 DC F1 5D
##$RELAX= 
##$RELAX= 
##$RELAX= 
##$RELAX= 
##$RELAX= 
##$RELAX= 
##$RELAX= 
##$RELAX= 
##$RELAX= 
$$ Bruker specific parameters
$$ --------------------------
##$DU= <F:/spectra>
##$EXPNO= 1
##$NAME= <P31>
##$PROCNO= 1
##$TYPE= <nmr>
##$USER= <she>
##$AMP= (0..31)
100 100 100 100 100 100 100 100 100 100 100 100 100 100 100 100 100 100 
100 100 100 100 100 100 100 100 100 100 100 100 100 100 
##$AQSEQ= 0
##$AQ_mod= 1
##$AUNM= <au_zg>
##$AUTOPOS= <>
##$BF1= 81.014009
##$BF2= 200.13
##$BF3= 200.13
##$BF4= 200.13
##$BF5= 200.13
##$BF6= 200.13
##$BF7= 200.13
##$BF8= 200.13
##$BYTORDA= 1
##$CFDGTYP= 0
##$CFRGTYP= 5
##$CHEMSTR= <none>
##$CNST= (0..31)
1 1 145 1 1 1 1 1 1 1 1 1 1 1 1 1 1 1 1 1 1 1 1 1 1 1 1 1 1 1 1 1 
##$CPDPRG= <waltz16>
##$CPDPRG1= <>
##$CPDPRG2= <waltz16>
##$CPDPRG3= <>
##$CPDPRG4= <mlev>
##$CPDPRG5= <mlev>
##$CPDPRG6= <mlev>
##$CPDPRG7= <mlev>
##$CPDPRG8= <mlev>
##$CPDPRGB= <>
##$CPDPRGT= <>
##$D= (0..31)
0 1 0 0 0 0 0 0 0 0 0 0.03 2e-05 3e-06 0 0 0 0 0 0 0 0 0 0 0 0 0 0 0 0 
0 0 
##$DATE= 1674647558
##$DBL= (0..7)
120 120 120 11 120 120 24 19 
##$DBP= (0..7)
150 150 150 150 150 150 150 150 
##$DBP07= 0
##$DBPNAM0= <>
##$DBPNAM1= <>
$$ [...]
##$SUBNAM3= <"">
##$SUBNAM4= <"">
##$SUBNAM5= <"">
##$SUBNAM6= <"">
##$SUBNAM7= <"">
##$SUBNAM8= <"">
##$SUBNAM9= <"">
##$SW= 501.771253377433
##$SWIBOX= (0..15)
0 1 3 0 0 0 0 0 0 0 0 0 0 0 0 0 
##$SW_h= 40650.406504065
##$TD= 32768
##$TD0= 1
##$TE= 0
##$TE2= 300
##$TE3= 300
##$TEG= 300
##$TL= (0..7)
0 120 53 12 22 120 120 120 
##$TP= (0..7)
150 150 150 150 150 150 150 150 
##$TP07= 0
##$TPNAME0= <>
##$TPNAME1= <>
##$TPNAME2= <>
##$TPNAME3= <>
##$TPNAME4= <>
##$TPNAME5= <>
##$TPNAME6= <>
##$TPNAME7= <>
##$TPOAL= (0..7)
0.5 0.5 0.5 0.5 0.5 0.5 0.5 0.5 
##$TPOFFS= (0..7)
0 0 0 0 0 0 0 0 
##$TUNHIN= 0
##$TUNHOUT= 0
##$TUNXOUT= 0
##$USERA1= <user>
##$USERA2= <user>
##$USERA3= <user>
##$USERA4= <user>
##$USERA5= <user>
##$V9= 5
##$VALIST= <valist>
##$VCLIST= <CCCCCCCCCCCCCCC>
##$VD= 0
##$VDLIST= <DDDDDDDDDDDDDDD>
##$VPLIST= <PPPPPPPPPPPPPPP>
##$VTLIST= <TTTTTTTTTTTTTTT>
##$WBST= 1024
##$WBSW= 4
##$XGAIN= (0..3)
0 0 0 0 
##$XL= 0
##$YL= 0
##$YMAX_a= 7284
##$YMIN_a= -11032
##$ZGOPTNS= <>
##$ZL1= 120
##$ZL2= 120
##$ZL3= 120
##$ZL4= 120
##$ABSF1= 248.5645
##$ABSF2= -253.2056
##$ABSG= 5
##$ABSL= 3
##$ALPHA= 0
##$AQORDER= 0
##$ASSFAC= 0
##$ASSFACI= 0
##$ASSFACX= 0
##$ASSWID= 0
##$AUNMP= <proc_1d>
##$AZFE= 0.1
##$AZFW= 0.5
##$BCFW= 0
##$BC_mod= 2
##$BYTORDP= 0
##$COROFFS= 0
##$CY= -3
##$DATMOD= 1
##$DC= 0
##$DFILT= <>
##$DTYPP= 0
##$F1P= 0
##$F2P= 0
##$FCOR= 1
##$FTSIZE= 65536
##$FT_mod= 6
##$GAMMA= 0
##$GB= 0
##$INTBC= 1
##$INTSCL= 6.047779e-11
##$ISEN= 30
##$LB= 1
##$LEV0= 0
##$LPBIN= 0
##$MAXI= 10000
##$MC2= 0
##$MEAN= 0
##$ME_mod= 0
##$MI= 50
##$NCOEF= 0
##$NC_proc= -7
##$NLEV= 6
##$NOISF1= 182.463
##$NOISF2= 159.3651
##$NSP= 0
##$NTH_PI= 0
##$NZP= 0
##$OFFSET= 248.5645
##$PC= 4
##$PHC0= -11053.23
##$PHC1= 222.2578
##$PH_mod= 1
##$PKNL= yes
##$PPARMOD= 0
##$PSCAL= 0
##$PSIGN= 0
##$REVERSE= no
##$SF= 81.0140089999694
##$SI= 65536
##$SIGF1= 159.3651
##$SIGF2= -187.1042
##$SINO= 113.3802
##$SIOLD= 16384
##$SREGLST= <1H.CDCl3>
##$SSB= 0
##$STSI= 65536
##$STSR= 0
##$SW_p= 40650.406504065
##$SYMM= 0
##$S_DEV= 0
##$TDeff= 32768
##$TDoff= 0
##$TI= <>
##$TILT= no
##$TM1= 0
##$TM2= 0
##$TOPLEV= 0
##$USERP1= <user>
##$USERP2= <user>
##$USERP3= <user>
##$USERP4= <user>
##$USERP5= <user>
##$WDW= 1
##$XDIM= 65536
##$YMAX_p= 381788406
##$YMIN_p= -67144761
$$ End of Bruker specific parameters
$$ ---------------------------------
##NTUPLES= NMR SPECTRUM
##VAR_NAME=  FREQUENCY,     SPECTRUM/REAL,   SPECTRUM/IMAG
##SYMBOL=    X,             R,               I
##VAR_TYPE=  INDEPENDENT,   DEPENDENT,       DEPENDENT
##VAR_FORM=  AFFN,          ASDF,            ASDF
##VAR_DIM=   65536,         65536,           65536
##UNITS=     HZ,            ARBITRARY UNITS, ARBITRARY UNITS
##FACTOR=    0.620285442955139, 1,           1
##FIRST=     20137.2065510682, 0,            0
##LAST=      -20513.1999529968, 0,           0
##MIN=       -20513.1999529968, -67144761,   0
##MAX=       20137.2065510682, 381788406,    0
$$ Real data points
##PAGE= N=1
##DATA TABLE= (X++(R..R)), XYDATA
$$ [...]
39078F832252r47704K685326M896374J601403l043894k149120K966121M476390
39070A7317148k7661m449038l749484r8798K181379K042034n436l730371o833697
39061B646076n560016m05158L073207J827006n28544K7882J893350J665893P2818
39052D712514j48328P17649O81191Q7736L60331O09238p47987k577628k692105
39043A002611j401820k19602J185648L272567L725239M42116l695960l482083
39035H28716J237985M816479L163833j329255l424165j391447J619168J669888
39027G191202j310046l299163j293328K064274J532775k808286m549546P0209
39019b401909O033961O130039P95973l233405k462378J14107R46199M13809L83125
$$ plain form
39078 6832252 5884548 8569874 13466248 15067651 12023757 9874637 12840758 17317148
39070 17317148 17289487 12840449 9090965 8992167 11173546 13215580 13210144 9479773 2646076
39061 2646076 -2913940 -3319098 -245891 1581115 1052571 1080453 2973803 4639696 4712514
39052 4712514 4564186 5281835 5963026 6050762 6411093 7020331 6272344 3694716 1002611
39043 1002611 -399209 -618811 566837 3839404 7564643 8006759 4310799 828716
39035 828716 2066701 6883180 10047013 8717758 5293593 3902146 5521314 7191202
39027 7191202 5881156 2581993 1288665 3352939 4885714 2077428 -2472118 -2401909
39019 -2401909 3632052 9762091 10558064 7324659 4862281 4976388 5922587 6336396 6719521
39010F719521Q91142R24430L72901j09566q6391L37575M81354l87157j858323
39001G285486k489855j762573p55064k94837r7729k18537j014695j212073O96922
38992A37045K432078j20451n293359n706256P07021N932108L443891j467598l23805
38983b59326M666744M704882p97274l937510j888743j80408j490531j444336J783115
38974A156613L278666P01978r62905J306305K677499n22871l443643j049966K718570
38965E860246J703475j867011j658179J859587L104057J220947m7703m44844k648668
38956G081907m523010q95738O061824P138072l08106o971882m503713K706358
38948E785712M771248P41594j550799J693160N022801K749134k592933m343066
$$ plain form
39010 6719521 7610663 8535093 8907994 8798428 8712037 9049612 9530966 9143809 7285486
39001 7285486 4795631 3033058 2277994 1983157 1885428 1666891 652196 -559877 137045
38992 137045 2569123 2448672 -2844687 -8550943 -7843922 -1911814 1532077 64479 -259326
38983 -259326 4407418 9112300 8315026 4377516 2488773 2308365 817834 -626502 1156613
38974 1156613 4435279 5137257 4174352 5480657 8158156 7635285 4191642 3141676 5860246
38965 5860246 7563721 5696710 4038531 5898118 9002175 10223122 10175419 9730575 7081907
38956 7081907 2558897 1663159 7724983 14863055 14554949 7583067 3079354 5785712
38948 5785712 10556960 11298554 9747755 11440915 16463716 19212850 16619917 12276851
38940A2276851j071285K315636J914729n45831j292690K04215J591445J584449
38932A6977519J037908O03497k65521j626073k261696j360947K04360Q70663p7969
38923A4101741k028283l388493k872464j355018j423936l562541m233083l76377
38915e138454N343955P245584M057076j34074k146256k536093j886621N51243
38907E356360L066696J756878k775588m226161K72568M788824L090542j923636
38899I406483l110063M2132K057225R09874j23288N78902P42901o22428j579460
38890H302278j565118k060896k304485J29033L516169K833739j722501l425351
38882C702868O19459M032102Q34836m860378n123943l01434K425931O67042n94851
$$ plain form
38940 12276851 11205566 13521202 15435931 14890100 13597410 13801625 15393070 16977519
38932 16977519 18015427 18618924 18353403 16727330 14465634 13104687 13309047 14179710 14101741
38923 14101741 12073458 8684965 5812501 4457483 3033547 -528994 -4762077 -5138454
38915 -5138454 205501 7451085 11508161 11374087 9227831 6691738 4805117 5356360
38907 5356360 8423056 10179934 7404346 3178185 3450753 8239577 11330119 9406483
38899 9406483 6296420 6338552 8395777 9305651 9182363 9761265 10504166 9881738 8302278
38890 8302278 6737160 4676264 2371779 2500812 6016981 8850720 7128219 3702868
38882 3702868 4322327 8354429 9189265 4328887 -795056 -1096490 1329441 1996483 1401632
38873A401632J665779L685393J718472j987468l422856k802914k431345j698884
38865c872191J292141M766074M583966M87181k940785k493915k39265L88157l98149
38856A573214q7980J496451J875863p4569k289983k362150n87908Q16345O84997
38847A044280O8994N02260J743493J851256k10120k671420k852573q33554N47393
38838h09991m2420l56637J565581L513382J948257k304856m499547k217345J725994
38829a477582L341752K063997L12224K24771J681974K471775M06004l547111n186018
38820B91786k226024J801077K082574k38727M467L229446M096391N02343k577060
38811F966273j128774J740932J732302K06577Q0421m04282l595987n893757k529232
$$ plain form
38873 1401632 3067411 6752804 8471276 6483808 3060952 258038 -2173307 -3872191
38865 -3872191 -2580050 2186024 6769990 7257171 4316386 1822471 1583206 1971363 1573214
38856 1573214 1485234 2981685 4857548 4782979 2492996 130846 -457062 359283 1044280
38847 1044280 1113274 1615534 3359027 5210283 5000163 2328743 -523830 -1357384 -809991
38838 -809991 -852411 -1209048 356533 3869915 5818172 3513316 -986231 -3203576 -1477582
38829 -1477582 1864170 3928167 4240391 4465162 6147136 8618911 9024915 5477804 291786
38820 291786 -1934238 -133161 1949413 1710686 1715153 4944599 9040990 9543333 6966273
38811 6966273 5837499 7578431 9310733 9517310 9597731 9193449 5597462 -296295 -2825527
38802b825527L385410M180213q02214m384809k644466L92300O61535o1558J053655
38793a045461K782423K769384J326124m82730k729371m208411k183336K741445
38785a029933N437555L002478r70094k043318j083157r64956q21884J552147M260957
38776G339795L668755P33496k77833J255747J765931p3713j509793j206159j540535
38767A0155691l411115l441736K88199L465538J060651m454849n543746j35332
38759b016699N196905M271592o15572k855680q87976J050849M54659j99364J182333
38750E581047K205175J51296k897743k853211J75137K263613J517214j54313j035741
38741D952474j719164k447746j707143R03819K942058K246307J35910m46085R39809
$$ plain form
38802 -2825527 559883 4740096 3937882 -446927 -3091393 -2699093 -2037558 -2099116 -1045461
38793 -1045461 1736962 4506346 5832470 5349740 2620369 -1588042 -3771378 -1029933
38785 -1029933 4407622 7410100 6440006 4396688 3313531 2348575 1526691 3078838 7339795
38776 7339795 11008550 11742046 11464213 12719960 14485891 14412178 12902385 11696226 10155691
38767 10155691 6744576 3302840 3591039 7056577 8117228 3662379 -1881367 -2016699
38759 -2016699 3180206 7451798 6836226 3980546 3092570 4143419 4598078 4398714 5581047
38750 5581047 7786222 7937518 5039775 2186564 2361701 4625314 6142528 5988215 4952474
38741 4952474 3233310 785564 -921579 -17760 2924298 5170605 5306515 4860430 5800239
38732E800239J724770p7113k889860k993447P80558M595931L706645r88819l525473
38723F133431j309178R73685q59448k997104K24328N668026M868602k352734o443358
38714C906250k288741L507614L472458k08729j650886j208126k274183l054248
38706B01409K90987N120231N120557N07571k253850q81403n3879k582697m674629
38697G94297k635943J201705K589110J433235M89479P27989R38692K81582r35308
38688D884838j972596j989725p46228N38569L91463o84739p79007O21322K083977
38679B347874K334550J185978j157058l774378m664933k840548l1078J702949
38671d896644K584102K970355J058010l465899n993117k473042L513250N256565
$$ plain form
38732 5800239 7525009 7447896 4558036 1564589 2345147 6941078 10647723 9658904 6133431
38723 6133431 4824253 5797938 4938490 1941386 2165714 7833740 12702342 10349608 3906250
38714 3906250 1617509 5125123 8597581 8388852 6737966 5529840 3255657 201409
38706 201409 492396 5612627 10733184 11240755 8986905 8105502 8051623 5468926 794297
38697 794297 -1841646 -639941 1949169 3382404 3871883 4599872 5538564 5820146 4884838
38688 4884838 2912242 922517 176289 714858 1106321 421582 -357425 263897 2347874
38679 2347874 4682424 5868402 4711344 936966 -3727967 -6568515 -6599593 -4896644
38671 -4896644 -2312542 657813 1715823 -1750076 -7743193 -10216235 -6702985 -1446420
38663a446420L069873K662493M122076J539488n025071p041403j035474M568290
38655A413852K276816k828042k047946K926877M160169J078084O5990K608145
38647I653945L288770m37286m505078n125453l002315j13113K120668J593861
38639C473999j872702l363230J289353P204778N550238k924246p863624m408082
38631b913516M35162j46614k827716j593939J988493K655935N59059l21993M65815
38622a699314L48418o56013l89243R03735J242914Q38628J240995J876855J118964
38613D825939n56494j703673k462060l037213k066096K87410O68351k083168l258899
38604i385903R50406O117585N165178q77462m402016k377113Q23975J510187Q75124
$$ plain form
38663 -1446420 1623453 4285946 8408022 9947510 4922439 -2118964 -3154438 1413852
38655 1413852 3690668 862626 -1185320 1741557 5901726 6979810 7045800 9653945
38647 9653945 12942715 12505429 8000351 2874898 -127417 -240530 1880138 3473999
38639 3473999 1601297 -1761933 -472580 6732198 12282436 9358190 1494566 -2913516
38631 -2913516 -2478354 -2624968 -5452684 -7046623 -5058130 -2402195 -1843136 -2165129 -1699314
38622 -1699314 -1350896 -2006909 -2396152 -1492417 -249503 589125 1830120 3706975 4825939
38613 4825939 4269445 2565772 103712 -2933501 -4999597 -4712187 -4043836 -6127004 -9385903
38604 -9385903 -8435497 -2317912 2847266 1969804 -2432212 -4809325 -3985350 -2475163 -1600039
38595a600039M97208j14338m02069J118381K673943Q44068k828048k960891Q35311
38586a936474K884189Q58481q25646M81771J227066o40106j053686K136867L740929
38577F873391L4445l650400j550615K187261M77914m083064l459972J865556L720024
38568B414540J69269j924567N84756K147950q55330l525812j208156K509034K205201
38559B516885n59408p98687J538938K656640J802070J562388K476383K096748
38551A3291957n99520l254418l048747J62876L548504L484595p54986n108369
38543G721892m716152l42436K300676O74010j232121O1152J646183m85273m004709
38534A623222l600426L45583K283817Q3465k431125j965348K03112J768530K516635
$$ plain form
38595 -1600039 -1102831 -1217169 -1619238 -500857 2173086 3017154 189106 -2771785 -1936474
38586 -1936474 947715 1806196 980550 1462321 2689387 2049281 995595 3132462 6873391
38577 6873391 6907836 3257436 1706821 3894082 4371996 288932 -3171040 -1305484 2414540
38568 2414540 2583809 659242 1243998 3391948 2536618 -989194 -2197350 311684 2516885
38559 2516885 1957477 1158790 2697728 5354368 7156438 8718826 11195209 13291957
38551 13291957 12692437 9438019 6389272 6552148 10100652 13585247 12830261 7721892
38543 7721892 3005740 2663304 4963980 5637990 4405869 4467021 6113204 5627931 1623222
38534 1623222 -1977204 -1631621 652196 735661 -1695464 -3660812 -3457700 -1689170 827465
38525H27465K345422K49141k706188l055505J2930K527718J362701j042558q98752
38516c77626O87469j6993k462855k193234J738380M537297K606696j197859k097007
38507A224268l21404J71852j571229k208108K45347L207142L502544J665706M9120
38498E965238j166000l112642m602518k835775J934760N443848M467198Q09688
38490F903797j340253o59262M61851l21905k355517l050347j126316J655444K204179
38481B371671l07424l169161l304434j094904M63965O3316n25886M35082K370568
38472b697207L873199M241582K732820j085956m887293m474573N23497M598833
38464B824902L124760j230846k669537p53085J53067j207720j411955P96693J928926
$$ plain form
38525 827465 3172887 3422028 715840 -2339665 -2326735 200983 1563684 521126 -377626
38516 -377626 309843 292850 -2170005 -4363239 -2624859 1912438 4519134 3321275 1224268
38507 1224268 902864 1074716 -496513 -2704621 -2459274 747868 4250412 5916118 5965238
38498 5965238 4799238 1686596 -2915922 -5751697 -3816937 1626911 6094109 6903797
38490 6903797 5563544 4904282 5366133 5044228 2688711 -361636 -1487952 167492 2371671
38481 2371671 2064247 -1104914 -4409348 -5504252 -5040287 -4976971 -5502857 -5067775 -2697207
38472 -2697207 1175992 5417574 8150394 7064438 2177145 -2297428 -1773931 2824902
38464 2824902 5949662 4718816 2049279 1296194 1449261 241541 -1170414 -373721 1555205
38455A555205R5928j347563K64781J940131K22904k400194j445240J830999K401414
38446C118365j56229j342913K15351O60141j629438k503398P64997L892430J896080
38437D915386k721193l689747p20230O00799j754170l184913m31493K914549K180548
38428a890464j156005k195471n7206J844458J737684J293693J563717J266424
38420B406830O8312j13236J194964J239180j551397l978066k233926J918692L013003
38411A964356l34665l477925k699739m01988o82457k529725j539767K524162M544134
38402b633614J663869j967905j082992K856310L850586K71938l026257k087334
38394b155399J001963K300087J620689R54935K65060j270575j848400N77550L402333
$$ plain form
38455 1555205 1651133 303570 568351 2508482 2731386 331192 -1114048 716951 3118365
38446 3118365 2962136 1619223 1834574 2494715 865277 -1638121 -873124 3019306 4915386
38437 4915386 2194193 -1495554 -2215784 -1614985 -3369155 -6554068 -6985561 -4071012 -1890464
38428 -1890464 -3046469 -5241940 -5299146 -3454688 -1717004 -423311 1140406 2406830
38420 2406830 2475142 2361906 3556870 4796050 3244653 -733413 -2967339 -1048647 1964356
38411 1964356 1629691 -1848234 -4547973 -4949961 -5632418 -8162143 -9701910 -7177748 -2633614
38402 -2633614 -969745 -2937650 -4020642 -1164332 2686254 2958192 -68065 -2155399
38394 -2155399 -1153436 1146651 2767340 3722275 3987335 2716760 868360 1445910 4848243
38385D848243J807526l455434n630588j171714M888016N705290J424188k324893
38377F090634k285822J5545K257497L527725K862839m56036m460511n633368l586887
38368a668384j757470k102678j982626J436616N975203O780185K933474j420214
38360H194106k712403j903228j754831k532742k423910q79012P97199J779490
38352a435331K371271K142436j38008l589029m527254r43762L743799M276072
38344A900194M93352k384107j024075J617177J120057j710904k278097O20535
38336a645868K745371N95736l262705l519829N44720L991223K853847p46511j921561
38327c65577J63630J556524m89608l608567l734585m35972L038337L862133J959817
$$ plain form
38385 4848243 6655769 3200335 -2430253 -3601967 1286049 6991339 8415527 6090634
38377 6090634 3804812 3820357 6077854 9605579 12468418 12012382 7551871 1918503 -1668384
38368 -1668384 -3425854 -5528532 -7511158 -6074542 -99339 6680846 9614320 8194106
38360 8194106 5481703 3578475 1823644 -709098 -3133008 -4012020 -3214821 -1435331
38352 -1435331 935940 3078376 2940368 -648661 -5175915 -6119677 -2375878 1900194
38344 1900194 2393546 9439 -1014636 602541 1722598 11694 -2266403 -1645868
38336 -1645868 1099503 1695239 -1567466 -5087295 -4542575 -551352 2302495 1555984 -365577
38327 -365577 -201947 1354577 864969 -2743598 -6478183 -6914155 -3875818 -13685 1946132
38318A946132q94227k462490j214275J988488L876999K313769p05668j613496
38310C235232j67613P63110o2801p77847j7297R75790Q00367j02972r04754j494826
38300B246389j281242N95214K881354K765326O2108j896315r95400Q64573J339278
38291F581285R61171Q13475P802j865209k677243j178890K41208m88940j153893
38282A240766Q30354L038050J379256k773608l984978q22164K364233K050399
38274C322308m18298k141179k226202j103959N43804J426907R28942Q01605K594277
38265C728205L883393J088610m009190n386105j411069K550757K152282n6556
38257B540327K02497K050610J834162m55987j601610o17902K46497l12567q00314
$$ plain form
38318 1946132 1051905 -1410585 -2624860 -636372 3240627 5554396 4848728 3235232
38310 3235232 3067619 3830729 3767928 2990081 2972784 3948574 4748941 4645969 3741215 2246389
38300 2246389 965147 1560361 4441715 7207041 7269149 5372834 4377434 5242007 6581285
38291 6581285 7542456 8355931 8363733 6498524 3821281 2642391 2883599 2394659 1240766
38282 1240766 2071120 5109170 6488426 3714818 -270160 -1092324 1271909 3322308
38274 3322308 2904010 762831 -1463371 -2567330 -2023526 -596619 332323 1133928 3728205
38265 3728205 7611598 8700208 4691018 -695087 -2106156 444601 2596883 2540327
38257 2540327 2742824 4793434 6627596 6171609 4569999 3952097 4198594 3886027 3085713
38248C085713K12457J648971J313049j218229l686043l258678R7875K837851J712547
38239B745513j914395l595163j604536J308166K436806K400402K561054K092516
38231F430363p3860k492504k896328j315102N73277J985692K984768L046482J678904
38222I921692l03107j723807k464021k667854j722057M87302K417759K483835
38214F429742R27824r75530k294477k140464K8954K521991K220428q61260k470618
38205C386590j77633K248815L15276l619704l258170J973793N590264L241847
38197I701078j621849l373970j525269M92725R65684Q60715O58530l80488j910201
38188C866955k095575k31836J846958J926155J88215j102246n53090O04198L40657
$$ plain form
38248 3085713 3298170 4947141 6260190 5041961 1355918 -1902760 -1804885 1032966 2745513
38239 2745513 831118 -2764045 -4368581 -3060415 -623609 1776793 4337847 6430363
38231 6430363 6356503 3863999 967671 -347431 225846 2211538 5196306 8242788 9921692
38222 9921692 9618585 7894778 5430757 2762903 1040846 1528148 3945907 6429742
38214 6429742 7357566 6382036 4087559 1947095 1976049 4498040 6718468 5857208 3386590
38205 3386590 3208957 5457772 5773048 2153344 -1104826 868967 6459231 9701078
38197 9701078 8079229 4705259 3179990 3672715 4638399 5499114 6157644 5777156 3866955
38188 3866955 1771380 1539544 3386502 5312657 5500872 4398626 3845536 4449734 4790391
38179D790391j123188j440647L72320K117812J346437j056521k068101p51937
38171B186566P96160P62777k20381q64591j293135k098035k612104j609557P21161
38162d231139K617454K559631P68965j035650j270635j14272P02979K29461k00151
38153B6643R33029K266509R29489k565703l638896J98409M865800M583911p2952
38144G526239k907943q88336K063399J619999o79888r43556L70039k26056k704789
38135C229108l326373j096594N05738l00916l86648K502461M783728K127466l084259
38126D953711m379620m29496L212700K231170q97404j406677Q67025J923012m60101
38117E614320l819075m229726j065168K225439K039835j174703l429923j937147
$$ plain form
38179 4790391 3667203 2226556 2598876 4716688 6063125 5006604 2938503 2186566
38171 2186566 2982726 3745503 3525122 2660531 1367396 -730639 -3342743 -4952300 -4231139
38162 -4231139 -1613685 945946 1714911 679261 -591374 -705646 -2667 226794 26643
38153 26643 959672 3226181 4155670 1589967 -2048929 -1850520 3015280 7599191 7526239
38144 7526239 4618296 3729960 5793359 7413358 6733470 5789914 6159953 5933897 3229108
38135 3229108 -97265 -1193859 -688121 -989037 -1375685 1126776 5910504 8037970 4953711
38126 4953711 574091 144595 3357295 5588465 4691061 3284384 4151409 6074421 5614320
38117 5614320 1795245 -2434481 -3499649 -1274210 765625 -409078 -3839001 -5776148
38109e776148J842059M351034L751371Q26015k289929l221622j055685J798915
38101B26010J687900q85414j060063K786398N141408J248487m745557n408126
38093a008957j123244J456222M77967K94180J887190Q27044l258327m087553N54721
38084c980757L808440P86880k967654q91508L354107K398022k014427k149385
38076a656282K432750M336152P25459k567662q81662K658178L031418L41268j936563
38067F483056j933205l34876J011244K28501k602056m430953k721510O04582J756095
38058a939122O82711K97427J002889O04866p09562m07478J140533P87512j185911
38049B73865o47946K869162L990274j40031m491122l315215J289773K753032n48724
$$ plain form
38109 -5776148 -3934089 416945 4168316 4994331 2704402 -517220 -1572905 226010
38101 226010 1913910 1028496 -31567 2754831 7896239 9144726 4399169 -1008957
38093 -1008957 -2132201 -675979 -198012 96168 1983358 2810402 -447925 -4535478 -3980757
38084 -3980757 -172317 614563 -2353091 -3244599 109508 2507530 493103 -1656282
38076 -1656282 776468 5112620 5838079 3270417 2388755 5046933 8078351 8419619 6483056
38067 6483056 4549851 4214975 5226219 5454720 2852664 -1578289 -4299799 -3695217 -1939122
38058 -1939122 -1256411 -958984 43905 648771 -60791 -468269 672264 1459776 273865
38049 273865 -374081 2495081 6485355 6345324 1854202 -1461013 -171240 2581792 2033068
38040B033068l967168l557938k93986K580559L246918J859896n00254k621599
38032a220504l679512l314319j449871J202427K759164J792757n70302j763848
38024f244008j048757J09058Q37301J726786K652049K251576L30954j410894j753937
38015b549872j095445N801J147774J041317r32289k197708K97246M531222M982913
38006E230959Q37461k258023p19800J795578J053698q45858K5206K018029Q93709
37997H030959k253295k298385J535845M395697L162040N1024j988570k937780
37989G697535l351223k269470N19295K960875L254780J823818k24994k255995
37981H154621k893953n57665L337582M578087J626518j671694j406922P38305
$$ plain form
38040 2033068 -1934100 -5492038 -5786024 -3205465 41453 1901349 1401095 -1220504
38032 -1220504 -4900016 -8214335 -9664206 -8461779 -5702615 -3909858 -4480160 -6244008
38024 -6244008 -7292765 -7183707 -6346406 -4619620 -1967571 284005 614959 -795935 -2549872
38015 -2549872 -3645317 -3639516 -2491742 -1450425 -2382714 -4580422 -4283176 248046 5230959
38006 5230959 6068420 3810397 3090597 4886175 5939873 5094015 5119221 7137250 8030959
37997 8030959 5777664 3479279 5015124 9410821 12572861 12623885 10635315 7697535
37989 7697535 4346312 2076842 2596137 5557012 8811792 10635610 10410616 8154621
37981 8154621 5260668 4703003 8040585 12618672 14245190 12573496 11166574 11904879
37973A1904879N48193j715542j737342J551097L651130J183661k803517l164689
37965I417870J56768K836448K805471K240738K823090K863348O97195k005459
37957B1835469k561299j018710N23333R13484L50491q02936j582049k13986L307337
37948B0751134N741890M434896J600610J664625M945111P451204O967549N613965
37940E9170984N420204M850978J663476l239791o907990p853394o963027n976734
37932D0164706n989399o461351n394469j876617J575655J322801k431386n385940
37924A5524000m635220k055931j110344k472361m201957m443350k632613M60751
37916e567025K873261L036730J789841J181558J221152K68681j204846o62649
$$ plain form
37973 11904879 12453072 10737530 9000188 10551285 14202415 15386076 12582559 9417870
37965 9417870 9574638 12411086 15216557 17457295 20280385 23143733 23840928 21835469
37957 21835469 19274170 18255460 18778793 19692277 20042768 19239832 17657783 17443797 20751134
37948 20751134 26493024 30927920 32528530 34193155 39138266 46589470 53557019 59170984
37940 59170984 64591188 69442166 71105642 67865851 60957861 53104467 46141440 40164706
37932 40164706 34175307 27713956 22319487 20442870 22018525 23341326 20909940 15524000
37924 15524000 10888780 8832849 7722505 5250144 1048187 -3395163 -6027776 -5567025
37916 -5567025 -2693764 342966 2132807 3314365 4535517 4804198 3599352 2936703
37908B936703J665833J767393k111449n698842m062127J535165N300954M020749
37900E354379k60444l620639l865897j416140J412404K337866J398552N75798
37892A915879P30057O19024m26690j124931n69654M13520J286037K488490L052965
37883H384697R40339k565355k747010J542117M675608J824319l642939m876174
37875C535602j139478K220320J784479q57377l199039m303004l334553J53587
37867e139463M030700N059930K970622M42687p51950r87379p57030k29477k30356
37858D408284r36111n31310J862178L241119M79759l965842m500554l40232L399668
37849C116959L045603N80805n82117k87410m18510j701784l183185l167888l90333
$$ plain form
37908 2936703 4602536 6369929 4258480 -1440362 -5502489 -3967324 1333630 5354379
37900 5354379 5093935 1473296 -2392601 -3808741 -2396337 -58471 1340081 1915879
37892 1915879 2645936 3264960 2838270 1713339 1143685 1557205 2843242 5331732 8384697
37883 8384697 9325036 6759681 4012671 5554788 10230396 12054715 8411776 3535602
37875 3535602 2396124 4616444 6400923 5543546 2344507 -1958497 -5293050 -5139463
37867 -5139463 -1108763 3951167 6921789 7364476 6612526 5625147 4868117 4638640 4408284
37858 4408284 3472173 2940863 4803041 8044160 8523919 4558077 57523 -282709 3116959
37849 3116959 6162562 6743367 6161250 5873840 5455330 3753546 570361 -2597527 -2987860
37840b987860L871151N496464K169864k393340k534181J380260L403017P80216
37832I185591k500289k395341l74752L55872L19110J867222M244754M227091Q75571
37823A5804829l005376m068774j639487K051652M066207L513340K296719K603953
37815B1623063M098143M675510L397004J254575k61880J34187L037388O596715
37807D4554705O904291K919046p58022K90361L348664K247806k979075n935252
37799E0592524l751987j038105k023248m376135m037444j734085r52591k525560
37791C0153369m531084n281809l976667p17611K218813J840458j133057k523675
37783A6048737j124021q77062m072142o714082m582489k15916R49554j157995
$$ plain form
37840 -2987860 883291 6379755 8549619 6156279 3622098 5002358 8405375 9185591
37832 9185591 6685302 4289961 3915209 4271081 4590191 6457413 10702167 14929258 15804829
37823 15804829 12799453 8730679 7091192 9142844 13209051 16722391 19019110 21623063
37815 21623063 25721206 30396716 33793720 35048295 34786415 34920602 37957990 44554705
37807 44554705 51458996 54378042 53620020 53910381 57259045 59506851 56527776 50592524
37799 50592524 46840537 45802432 43779184 39403049 35365605 33631520 32678929 30153369
37791 30153369 25622285 20340476 16363809 15646198 17865011 19705469 18572412 16048737
37783 16048737 14924716 14047654 9975512 3261430 -1321059 -1536975 -587421 -1745416
37775a745416j929131L60539K536077J881230m52002j807424j027792J147102
37767a036817K759649J987531o93126k506545j757820K44429J795412K983853
37759C776566L606501J893670j959603l901411j266943K450203K112237j612182
37751E099038l626100j951442N53544J352611P65166m59128j979532k186248L56576
37742b075515L438942L005868r21254l741779k565004M22401J962034J823938
37734A349631J429912J195636R53120R43009J020128N61419m3970L35510J310691
37725I055086J175696q5016n18238K44682o2412k395728m073946k561389M37506
37716A216241J215410p19175k123571m79281K970380M959015L755735N02724k362202
$$ plain form
37775 -1745416 -3674547 -3314008 -777931 1103299 651297 -1156127 -2183919 -1036817
37767 -1036817 1722832 3710363 3017237 510692 -1247128 -1002699 792713 3776566
37759 3776566 7383067 9276737 7317134 3415723 2148780 4598983 6711220 5099038
37751 5099038 1472938 -478504 75040 1427651 2192817 1733689 -245843 -2432091 -2075515
37742 -2075515 1363427 4369295 3448041 -293738 -2858742 -2436341 -474307 1349631
37734 1349631 2779543 3975179 4928299 5871308 6891436 7452855 7408885 7744395 9055086
37725 9055086 10230782 10145766 9627528 9872210 9809798 7414070 3340124 778735 1216241
37716 1216241 2431651 1712476 -411095 -890376 2080004 7039019 10794754 11297478 8935276
37707H935276l407641k875097j559556R3435J569912K019354J191767j00277j090068
37698D777105j640514j222683Q71677L182014K384812j783347m371145j476715
37690G21204L282496L141151j945644n128649k687571J355208K347392J310906
37682B396493J044873O99978j430547l249335j900035P95316Q65038j233212j480494
37673c491925Q60939K225334Q84429o35845m61487k95447j441943j820622K26237
37664c950330K263467J293202j225706j550112M52930J408720J02986p52812P81261
37655a176394K694467K238571m8132j568112j386418p05507n49457q57553j410370
37646b768905k030528k122355j394283p09622p63383k77293K565199O643863P864980
$$ plain form
37707 8935276 5527635 2652538 1092982 1186417 2756329 4775683 5967450 5867173 4777105
37698 4777105 3136591 1913908 2785585 5967599 8352411 6569064 2197919 721204
37690 721204 4003700 7144851 5199207 70558 -2617013 -1261805 1085587 2396493
37682 2396493 3441366 4141344 2710797 -538538 -2438573 -1643257 -778219 -2011431 -3491925
37673 -3491925 -2630986 -405652 478777 -157068 -618555 -914002 -2355945 -4176567 -3950330
37664 -3950330 -1686863 -393661 -1619367 -3169479 -2716549 -1307829 -1204843 -1957655 -1176394
37655 -1176394 1518073 3756644 3708512 2140400 753982 48475 -500982 -1358535 -2768905
37646 -2768905 -4799433 -6921788 -8316071 -9025693 -9789076 -10066369 -7501170 -857307 7007673
37637G007673L790849k824880o475841m623401j07854K252782R26364j085540
37629a139848m79553J847917K231273n8587j437689K52472J816354k43563l360361
37620e71585k467676J408882K189767j207532k535786J527926N311802L017381
37612F673179j846840k307736P90176J028201k174225k883950M49778J970885
37604A699468j215830l478833q2510M232442K422051l435795n124452o89985L421290
37595b252154K763314O63734J421840L255579J889294k206472m434477k586786
37587a486128Q27292K529663J969444N47222n22067q27553n16573k9105N03233
37578B995428J423076K386846J822520r18342l522026l048181j90718J344276
$$ plain form
37637 7007673 10798522 7973642 1497801 -3125600 -3233454 -980672 -54308 -1139848
37629 -1139848 -1619401 228516 2459789 2401202 963513 1215985 3032339 2788776 -571585
37620 -571585 -3039261 -1630379 559388 -648144 -3183930 -1656004 3655798 6673179
37612 6673179 4826339 2518603 3308779 4336980 2162755 -721195 -271417 1699468
37604 1699468 483638 -2995195 -3077705 1154737 3576788 140993 -4983459 -5673444 -2252154
37595 -2252154 511160 1174894 2596734 5852313 7741607 5535135 1100658 -1486128
37587 -1486128 -658836 1870827 3840271 4387493 3865426 3037873 2521300 2492195 2995428
37578 2995428 4418504 6805350 8627870 7709528 4187502 1139321 948603 2292879
37570B292879R9951j364697r75096k25231p85303j117573N20434K231363J338930
37561B015657p54021o73699J200270J551117K15o09909J69942m27283k673365
37552b01076k936777Q1981K482399J293652p31720J36134K502650K352529o71700
37543D308072l140983k632204J03786K634689K692921Q7661k048098l40356L474204
37534E139692L823292m75917l709291j765283J558350Q87398k308119k832990
37526C17132j62168J776465J126662n74497j844984j697040J105459M941606M537662
37517I526297j682270o880554m540903J499957L038787L68543K64824L080799
37509D675480K149464l575162o591306l050447J336788J232131o42069j29779
$$ plain form
37570 2292879 2392830 1028133 53037 -172194 -957497 -2075070 -1554636 676727 2015657
37561 2015657 1261636 587937 1788207 3339324 3339539 2729630 2899572 2472289 -201076
37552 -201076 -3137853 -3055872 -573473 720179 -11541 124593 2627243 4979772 4308072
37543 4308072 1167089 -1465115 -1361329 1273360 3966281 4053942 2005844 1665488 5139692
37534 5139692 8962984 8487067 4777776 3012493 4570843 5458241 3150122 317132
37526 317132 154964 1931429 3058091 2483594 638610 -1058430 47029 4988635 9526297
37517 9526297 7844027 963473 -3577430 -2077473 961314 1329857 1594681 4675480
37509 4675480 6824944 3249782 -3341524 -6391971 -5055183 -3823052 -4465121 -4594900
37501d594900J115874k6384k136843k248777n24226J588568L748006M747287K746087
37492D414692n40556j106707L48742r32530m458362l703563K427846N991520K364975
37483D806057k398985k299473q27243k519764l451998R20703N623207L906418
37475C758922p01016o60674K083527J91151m994275n326882j13399L085855J505845
37466a170946O739N30658m10817k526483p82040M098775M582704r21559m174320
37457g67289k97476M402234L188916q18710j451278L64767J61762j681119j903950
37448A197857q72741r84749j502971l75510J218693R10747m19007m73318K58339
37439a042660N6660k71314R39854K458228J765785p29892k271868j710265l96129
$$ plain form
37501 -4594900 -3479026 -3505410 -5642253 -7891030 -8415256 -6826688 -3078682 1668605 4414692
37492 4414692 3874136 2767429 3116171 2183641 -2274721 -5978284 -3550438 2441082 4806057
37483 4806057 2407072 107599 -719644 -3239408 -6691406 -5770703 -147496 3758922
37475 3758922 3057906 2397232 4480759 4671910 -322365 -5649247 -5762646 -2676791 -1170946
37466 -1170946 -1164207 -633549 -1044366 -3570849 -4352889 -254114 4328590 3407031 -767289
37457 -767289 -1064765 3337469 6526385 5707675 4256397 4621164 4782926 3101807 1197857
37448 1197857 325116 -659633 -2162604 -2538114 -1319421 -408674 -827681 -1300999 -1042660
37439 -1042660 -986000 -1257314 -317460 2140768 3906553 3176661 904793 -805472 -1201601
37430a201601J18988m86801j297060o69805J786470L525055J847120j501341k054419
37421F6606N89628K106074O26431n57481N01810P36996j853559l777487j926774
37412c487756Q89030J049498L44828J742380K982609N59452l080638k901213L36132
37403a565678J578829p9861r10470L55584J243339J038837J474495J859828l98095
37394D596808l882633l824862J94280L028405K054436P36872J853628K784886
37386G541820Q74695j391615p23343J153288M56414k341696l498890j909072j01640
37377E9961J54141j07481L88390J146040J137518L44643o88559j757431k645787
37368a968565k476337m97192K252411L208415J451362k81712R56291L234714J648246
$$ plain form
37430 -1201601 -1082613 -1569414 -2866474 -3536279 -1749809 1775246 3622366 2121025 66606
37421 66606 656234 2762308 3388739 2831258 3333068 4070064 2216505 -1560982 -3487756
37412 -3487756 -2598726 -1549228 -1204400 537980 3520589 4080041 999403 -1901810 -1565678
37403 -1565678 13151 -66710 -977180 -621596 621743 1660580 3135075 4994903 4596808
37394 4596808 714175 -3110687 -2916407 111998 2166434 2903306 4756934 7541820
37386 7541820 8416515 7024900 6301557 7454845 7911259 5569563 2070673 161601 59961
37377 59961 214102 106621 495011 1641051 2778569 3123212 2434653 677222 -1968565
37368 -1968565 -4444902 -4942094 -2689683 518732 1970094 1688382 2644673 5879387 7527633
37359G527633l792913o604273k953411K084782K033305j097193q42694K490879
37351a153885K692467r33032j904083J895987L748221p12827n519203l550534
37343e436889K278853M025847P85749j601812m95785J113023J229508J320612
37335C219106J870446J091862j037753k057574j198555l24139k09870J79802L82092
37326A915417j262319l331385k002487K547912M984241K282303j766316k322324
37318A045042j05702J143681P58553P12365J106314K59063j492543j793663q1873
37309A551237J602360J903185J672333J652909R11421j337748l818935m295305
37301a58543k052315J295491L201152K274525o36363l269411l869238k247407
$$ plain form
37359 7527633 3734720 -2869553 -5822964 -3738182 -1704877 -2802070 -3644764 -1153885
37351 -1153885 1538582 605550 -1298533 597454 4345675 3632848 -1886355 -5436889
37343 -5436889 -3158036 867811 1653560 51748 -444037 668986 1898494 3219106
37335 3219106 5089552 6181414 5143661 3086087 1887532 1563393 1353523 1533325 1915417
37326 1915417 653098 -2678287 -4680774 -2132862 2851379 5133682 3367366 1045042
37318 1045042 939340 2083021 2841574 3553939 4660253 4919316 3426773 1633110 1551237
37309 1551237 3153597 5056782 6729115 8382024 9293445 7955697 4136762 -158543
37301 -158543 -2210858 -915367 2285785 4560310 3923947 654536 -3214702 -5462109
37293e462109O03604L133694L797355K372844P85418J053925K259269J563679
37285A0107679j334116l370675k841130j962864k679094k978313o28842J996371
37277c690984J077210k218004l066495j46611L115031M318976M324316L316096
37269G029535q5086m292650m609167l14468K763385K03042m493153n217600j601435
37260a0617597K222746M130938M518002K817839j157262l945814j906189K701223
37252a236114M117556J202796j762954k123329j409547o55178J169407K931114
37244B233751J244042l332362n334391k364325R49267K88319j741023n34671K891566
37235e699827M094477K294377M13149j96462n26368o06106L67491J280815K30238
$$ plain form
37293 -5462109 -4858505 -1724811 2072544 4445388 5230806 6284731 8544000 10107679
37285 10107679 8773563 5402888 2561758 598894 -2080200 -5058513 -5687355 -3690984
37277 -3690984 -2613774 -4831778 -7898273 -8044884 -4929853 -610877 3713439 7029535
37269 7029535 6944449 2651799 -1957368 -2271836 491549 694591 -3798562 -9016162 -10617597
37260 -10617597 -8394851 -4263913 254089 3071928 1914666 -2031148 -3937337 -1236114
37252 -1236114 2881442 4084238 2321284 197955 -1211592 -1866770 -697363 2233751
37244 2233751 3477793 145431 -5188960 -7553285 -6604018 -6315699 -8056722 -8591393 -5699827
37235 -5699827 -1605350 689027 1102176 905714 379346 -226760 140731 1421546 1651784
37226A651784k016041k884255j816870l80242O20835J281828R27167o35849j348614
37217d600257L44296K235499J443368o29365o37045O91290o4829k300269j859928
37208e377240J373674K494632j72920j814942J002489M619587M342949J654823
37200H123052O80242R80085q09420m210438n125934k340431O73445Q66677q32440
37191a995162j773129r83164L83977O11292p05708j677934l6423L136788L646629
37182F07166j8454l465252j980004K501984L856499L02131l677181m015034j605431
37173g493576P46496K111246K438705J032807j576250k650267p37620J628345
37165d500114J427684o3032P70384L713504M331566P99461k449294p81524L259515
$$ plain form
37226 1651784 -364257 -3248512 -5065382 -5445624 -4824789 -3542961 -2615794 -3251643 -4600257
37217 -4600257 -4255961 -2020462 -577094 -1206459 -1843504 -1152214 -1217043 -3517312 -5377240
37208 -5377240 -4003566 -1508934 -1681854 -3496796 -2494307 2125280 6468229 8123052
37200 8123052 8803294 9783379 8973959 4763521 -362413 -2702844 -2029399 -1162722 -1995162
37191 -1995162 -3768291 -4751455 -4367478 -3756186 -4461894 -6139828 -6176251 -3039463 607166
37182 607166 588712 -2876540 -4856544 -2354560 1501939 1804070 -1873111 -5888145 -7493576
37173 -7493576 -6747080 -4635834 -2197129 -1164322 -2740572 -5390839 -6128459 -4500114
37165 -4500114 -3072430 -3135462 -2365078 1348426 5679992 6479453 4030159 3248635 6508150
37156F508150K899974k875600p087235m510579O80855J193680k493476l417334
37148i101565O35276L968426K563040J95320J235811L057320J193644k177133
37140A570139j679480J846668K663743r0600j449678J09001J50929k803564l431678
37131c114520J176545N076059K125328l867919m560230M61362L900631K130436
37123C327692q65470j344448r01542j708513k242151q00931R25234J060364J003134
37114a546631K350790L181353J150537j813541k042559j16582P1076j998995k309548
37105c074100J003246M009814K629175j201667k442244k12675J678051R61052
37097C350652j99239N11409J632267M46515k511984l936070k083631J247107K934159
$$ plain form
37156 6508150 9408124 6532524 -554711 -5065290 -4384435 -3190755 -5684231 -9101565
37148 -9101565 -8466289 -4497863 -1934823 -1739503 -503692 2553628 3747272 1570139
37140 1570139 -109341 1737327 4401070 4310470 2860792 2969793 3120722 317158 -3114520
37131 -3114520 -1937975 3138084 5263412 1395493 -3164737 -2703375 1197256 3327692
37123 3327692 2462222 1117774 216232 -1492281 -3734432 -4535363 -3610129 -2549765 -1546631
37114 -1546631 804159 3985512 5136049 3322508 1279949 1163367 1234443 -764552 -3074100
37105 -3074100 -2070854 1938960 4568135 3366468 924224 711549 2389600 3350652
37097 3350652 3151413 3662822 5295089 5741604 3229620 -706450 -2790081 -1542974 1391185
37088A391185J471743k016757m589556l718617Q6376L243378K886731K49325j106258
37079b102450Q4845J757932J951361J178686Q78665J258544J455372O58679j255904
37070E865730l043540k369482J228056L999527J696897l900374n933058j644960
37062d101204L278871K630557j593820k867636l3335K066144J030101L4628J462751
37053A907057K728118J018408j787330k098040J09841J908268J546130l99353
37045D933099k452561k842101l78141L258919L933121J08870m142237l812273
37037a393304O41780M246637L843364P37612k195009l223089j971486M17741J487784
37028B592030J00988j596468j147746K53857j55555j627058j006150J240422R63616
$$ plain form
37088 1391185 2862928 846171 -3743385 -7462002 -7375626 -4132248 -1245517 -996192 -2102450
37079 -2102450 -2017605 -259673 1691688 2870374 3749039 5007583 6462955 7121634 5865730
37070 5865730 2822190 452708 1680764 5680291 7377188 3476814 -2456244 -4101204
37062 -4101204 -822333 1808224 214404 -2653232 -2686567 -620423 409678 444306 1907057
37053 1907057 4635175 5653583 3866253 1768213 1878054 3786322 5332452 4933099
37045 4933099 2480538 -361563 -739704 2519215 6452336 6561206 2418969 -1393304
37037 -1393304 -751524 3495113 7338477 8076089 5881080 2657991 686505 1104246 2592030
37028 2592030 2693018 1096550 -51196 202661 47106 -1579952 -2586102 -1345680 -382064
37019c82064k501728m038115l30648M441921M339186R8534k508642j055565J216078
37010g21043J050250p65013j697595j018589M9629J72210p67489j385637p2921
37001e156198K658231M001800K277573n61672j473510k98319P53813N89689n6592
36992B734815o61589j251002j161472J48594J382870Q85130m59794k92126J449502
36983B774928K425653J528713k2346j226087k135266k052589M052K548547K491848
36974F337453m00377k889960k934544j855392r51511M91953K350955K468826M06492
36965C023895j001629k29089J34449k015127m099017k738160P85616K668995K147188
36956a322879J270278Q71507M05198L44792J179492J319375n61593k456056j781149
$$ plain form
37019 -382064 -2883792 -6921907 -7252555 -2810634 1528552 1627086 -881556 -1937121 -721043
37010 -721043 329207 -435806 -2133401 -3151990 -3102361 -2930151 -3697640 -5083277 -5156198
37001 -5156198 -2497967 1503833 3781406 3219734 1746224 1447905 2201718 2791407 2734815
36992 2734815 2073226 822224 -339248 -190654 1192216 2077346 1617552 1325426 2774928
36983 2774928 5200581 6729294 6706948 5480861 3345595 1293006 1297058 3845605 6337453
36974 6337453 5937076 3047116 112572 -1742820 -2694331 -2202378 148577 2617403 3023895
36965 3023895 2022266 1793177 1927626 -87501 -4186518 -6924678 -6139062 -3470067 -1322879
36956 -1322879 -52601 818906 1224104 1568896 2748388 4067763 3506170 1050114 -731035
36947g31035K77444Q67360K84665N66367R61248l76132j613602K54281L016722
36938C507318J660828k820975l884009J12327K992430R08811j575833K16160K923275
36929D040332J137477l021717l089260J414908M422414K540877q02559j223217
36921E419255R12364K174091Q24420j591116k349082o86296J032162L1366k972177
36912B794987m473919l141810j298174n11924P13787K905510L231099L25639k203662
36903a658467j140312R25893L87588n38077K016085N149576K700952l612759n044941
36894h14462P55832N446902K608775k816872l069232N52968J312060j494455k506007
36885b4491j90599R26451j339788k950995o51506K491604K199032j99582m07541
$$ plain form
36947 -731035 -453591 413769 698434 1264801 2226049 1849917 236315 490596 3507318
36938 3507318 5168146 2347171 -1536838 -1424511 1567919 2476730 900897 1117057 4040332
36929 4040332 5177809 2156092 -933168 481740 4904154 7445031 6642472 5419255
36921 5419255 6331619 8505710 9330130 7739014 5389932 4703636 5735798 5767164 2794987
36912 2794987 -1678932 -4820742 -6118916 -6630840 -5917053 -3011543 219556 545195 -1658467
36903 -1658467 -2798779 -1872886 -1485298 -2023375 -7290 5142286 7843238 4230479 -814462
36894 -814462 -58630 5388272 7997047 5180175 2110943 2663911 3975971 2481516 -24491
36885 -24491 -215090 711361 -628427 -3579422 -4230928 -1739324 459708 260126 -147415
36876a47415J639551J955431o22033k264518n1668L533067M223038J643354j232160
36867H676647k621969k973971k378763k37210K360736K945249J110098r10734
36859E970083j832297k700502l669623k632758R42012L792176L171545Q96968
36851C937604J28196M69070j94231j074506j2522J730959R99154j373315j192701
36842C417708J967824L196460l95169m947686n141377j115456K716715L595403
36834C294422K396113R68226n2341j028581k230995k923888j590653J943129M982275
36825E757707M452125R69663j674541j381792Q5051K06536j234409k756551k852311
36816A571478p79212K319315L332729P39006k325839j851369Q65613J222128q23766
$$ plain form
36876 -147415 1492136 3447567 2825534 561016 509348 4042415 8265453 9908807 8676647
36867 8676647 6054678 3080707 701944 464734 2825470 5770719 6880817 5970083
36859 5970083 4137786 1437284 -2232339 -4865097 -3923085 -130909 3040636 3937604
36851 3937604 4065800 4534870 4340639 3266133 3253611 4984570 5983724 4610409 3417708
36842 3417708 5385532 8581992 8186823 3239137 -1902240 -3017696 -300981 3294422
36834 3294422 5690535 6658761 6606420 5577839 3346844 422956 -1167697 775432 5757707
36825 5757707 10209832 11179495 9504954 8123162 8208213 8414749 7180340 4423789 1571478
36816 1571478 792266 3111581 6444310 7183316 4857477 3006108 3871721 5093849 4270083
36807D270083o13484K558848L229098j011541m499312k197005K125890K043181
36799E905758j569799k956335o66141J984042L293906L808862K455913j557315
36791A0698891m358412j613007L562695L799119j292677m217440j157832K671461
36783H092798J905828j140971j520397M57257J019752n64711j628863n96457J399677
36774G423913K467550J641657l46135j162804N82317K692273J874933j066941
36766A4106763k153592p23971l87520k186900k179324J363823L743556J232087
36758A2814922j994332j33647M378945M086415j843019o114813m030512M37505
36750G601464J451435o16971j170928J441692M142583L616684K44828k662270
$$ plain form
36807 4270083 3656599 6215447 9444545 8433004 3933692 1736687 3862577 5905758
36799 5905758 4335959 1379624 713483 2697525 5991431 9800293 12256206 10698891
36791 10698891 6340479 4727472 8290167 12089286 10796609 6579169 5421337 8092798
36783 8092798 9998626 8857655 7337258 7794515 8814267 8249556 6620693 6024236 7423913
36774 7423913 9891463 11533120 11186985 10024181 10606498 13298771 15173704 14106763
36766 14106763 11953171 11229200 10841680 8654780 6475456 7839279 11582835 12814922
36758 12814922 10820590 10686943 15065888 19152303 17309284 11194471 7163959 7601464
36750 7601464 9052899 8435928 7265000 8706692 12849275 16465959 16710787 14048517
36742A4048517k598556l82459J272618J404239J613238K707616K714046K11878
36734B0991137k237301j104302K555747M032396J509984j676261k143230o96603
36726B1231567O5222k00747j4614J147262K588528L915190N036948N246399L813239
36717D2828994J269070q76321j381251L34334M105669Q250458R779528P091147
36709G1401628K365559k14587J067537L951005N486834N486606N712349O649088
36701A01906019O736329M869671K308043J371797K896140N583174P430407P283789
36693A40385369N465598L580393L448325N532959Q406345J0065504R562516P268190
36685A93715199M335014K299802K065047K352123L78161m563731r439329j1238863
$$ plain form
36742 14048517 11449961 11067502 12340120 13744359 15357597 18065213 20779259 20991137
36734 20991137 18753836 17649534 20205281 24237677 25747661 24071400 21928170 21231567
36726 21231567 21296789 21096042 21081428 22228690 24817218 28732408 33769356 39015755 42828994
36717 42828994 44098064 43221743 41840492 42174826 46280495 54530953 64310481 71401628
36709 71401628 73767187 73552600 74620137 78571142 84057976 89544582 95256931 101906019
36701 101906019 108642348 113512019 115820062 117191859 120087999 125671173 133101580 140385369
36693 140385369 145850967 149431360 152879685 158412644 166818989 176884493 186447009 193715199
36685 193715199 198050213 200350015 202415062 204767185 205145346 200581615 191142286 179903423
36677A79903423j1137066j2259108j4264179j3769005j0280350p727840q656325
36670A01809550j0420752r426039o278472m017100l478288l346712l149097l244593
36662E8448497k999146j761118q00145j709192l650100m597287m397839m041070
36654C4492600k959137j80775K502419K017169j296416l758053l488245k285554
36646B5044008j743946q17243J417570L470150L648762K321660M14395k204668
36638C1550688n149957o323373m304817o02361K097054K650315J196417j906648
36630A9207318m960556m645560K55318N772710O427349J961892k387335k813019
36622A8818117j220473j083444j725138O1676L743127M490518L62566l346137
$$ plain form
36677 179903423 168766357 156507249 142243070 128474065 118193715 110465875 101809550
36670 101809550 91388798 81962759 75684287 71667187 68188899 64842187 61693090 58448497
36662 58448497 55449351 53688233 52888088 51178896 47528796 42931509 38533670 34492600
36654 34492600 31533463 31352688 33855107 35872276 34575860 30817807 27329562 25044008
36646 25044008 23300062 22482819 23900389 27370539 31019301 33340961 33755356 31550688
36638 31550688 26400731 20077358 15772541 15170180 17267234 19917549 21113966 19207318
36630 19207318 14246762 9601202 9856520 15629230 22056579 24018471 21631136 18818117
36622 18818117 17597644 16514200 14789062 14850738 18593865 23084383 23446949 20100812
36614B0100812n14675O577134R054912L192161m231369n038962l15238K461635
36606C1286410N14453j692556o67872J275391J235076P15512K046888L451388
36598C8164690J830573j579240k505805J07145K783028K625194P68472p2072O68426
36589D2790411J262975J86142k034532l153667j531319J542234K718393O60748
36581D2441385j943682k037452p08892j501201m535910n484121j611053L746201
36573B8365275N058808J596959k025800j955534Q01987K970759L272674K391079
36565D0476207M78952k512087m556076k823107J847816M600878K633182o76699
36557C9469066l67169L095329M761159K354508j156768k294458q79047J639691
$$ plain form
36614 20100812 19586137 26163271 35218183 38410344 34178975 29140013 28824775 31286410
36606 31286410 31800863 30108307 29440435 30715826 31950902 32666414 34713302 38164690
36598 38164690 39995263 38416023 35910218 36017363 38800391 41425585 42194057 42121985 42790411
36589 42790411 44053386 44239528 42204996 39051329 37520010 39062244 41780637 42441385
36581 42441385 40497703 38460251 37751359 36250158 31714248 26230127 24619074 28365275
36573 28365275 33424083 35021042 32995242 31039708 31841695 34812454 38085128 40476207
36565 40476207 40955159 38443072 33886996 31063889 32911705 37512583 40145765 39469066
36557 39469066 39101897 42197226 46958385 49312893 48156125 45861667 44982620 46622311
36549D6622311M279573N664650M317519J669454J797275N817360R206233P510678
36541H6885053K518444l76188P85979L460148N274112O158552O356188N835052
36533A16897340N841138P968667J1244888J2804113J1931530J0957587J1654126
36526A89299389J3195890J4282578J4813293J4700332J3556772J2630712J4453180
36519B86932146J8862259K1580620J8951812J2673386P675659O174714N797370
36512C78647966L140440k526303q981740j3237037j4159423j3753508j5228565
36505C13901830j8864852k0904758j8288808j3552284j2284605j5601515j8279654
36498A96125354j5940515j1272867j0076085j2825248j4260182j1353342p344687
$$ plain form
36549 46622311 50901884 56566534 60884053 62553507 64350782 70168142 79374375 86885053
36541 86885053 89403497 89027309 89813288 93273436 98547548 104706100 111062288 116897340
36533 116897340 122738478 130707145 141952033 154756146 166687676 177645263 189299389
36526 189299389 202495279 216777857 231591150 246291482 259848254 272478966 286932146
36519 286932146 305794405 327375025 346326837 359000223 366675882 372850596 378647966
36512 378647966 381788406 379262103 370280363 357043326 342883903 329130395 313901830
36505 313901830 295036978 274132220 255843412 242291128 230006523 214405008 196125354
36498 196125354 180184839 168911972 158835887 146010639 131750457 120397115 113052428
36491A13052428o111523o452223n272388l476296m133243o302345n842728k440441
36483G3021241p47323l161835o138982o000270m255033m052401m890512m523483
36475C9251402l289953k629853j635870Q05104K442971P07355k233351k273331
36467C1144474k28014o91702m208621n959291l233051O35860J481021n58927k829776
36458A5551973l580971k077190J315640L725690J889643k866368n245325l039848
36450E673244J39751P65599j34917m90560p67055j233884J3571K879689L316393
36441A0161831m43698l758550k363814O01626m0197k566060j533042K398337L332936
36432E789369J11635k102626q32888L32170q70895j408919P14057K175216J97332
$$ plain form
36491 113052428 106940905 100488682 95216294 91739998 87606755 81304410 75461682 73021241
36483 73021241 72273918 69112083 62973101 56972831 52717798 48665397 43774885 39251402
36475 39251402 35961449 33331596 31695726 32500830 34943801 35651156 33417805 31144474
36467 31144474 30916460 30224758 26016137 20056846 16823795 17459655 18940676 18381749 15551973
36458 15551973 11971002 9893812 11209452 14935142 16824785 13958417 8713092 5673244
36450 5673244 5812995 6578594 6443677 5953117 5186062 3952178 3965749 6845438 10161831
36441 10161831 9718133 5959583 3595769 4197395 4157198 1591138 58096 2456433 5789369
36432 5789369 5901004 3798378 2965490 3297660 2426765 1017846 1731903 3907119 4104451
36423D104451k302512j674992M83267Q26976K62066J488901L163803J906859j254309
36414G004510j858148P24232K068198k41860k798264j806693J023304J093011
36406E208290k289372m879373l220020J017358L496389K663725J009607J034610
36398D041214J900516J330383n76303j637252j188342p83971r83752k66197J626566
36389C462862K048862n98743l495916k908182L58303K208554J177622l54355p68527
36380A130480j285308k441036k075385R20517L548672K382808j242041k854998
36372a916291j086275Q17600P4846j860100j901574L98698K979812M299165M255573
36363F061454K901886M36956j626939j484432K01814N09447j743336l989852l464817
$$ plain form
36423 4104451 1801939 126947 610214 1437190 1699256 3188157 6351960 8258819 7004510
36414 7004510 5146362 5870594 7938792 7696932 4898668 3091975 4115279 5208290
36406 5208290 2918918 -1960455 -5180475 -4163117 -666728 1996997 3006604 4041214
36398 4041214 5941730 7272113 6695810 5058558 3870216 3086245 2102493 1836296 3462862
36389 3462862 5511724 4912981 1417065 -1491117 -1132814 1075740 2253362 1899007 1130480
36380 1130480 -154828 -2595864 -4671249 -3750732 -202060 2180748 938707 -1916291
36372 -1916291 -3002566 -2184966 -2110120 -3970220 -5871794 -5473096 -2493284 1805881 6061454
36363 6061454 8963340 9400296 7773357 6288925 6490739 7000186 5256850 1266998 -2197819
36354b197819j208366k70988q83479l15231K289982L912564J943113j739919l150901
36345a621044j444108N61796P36383J37330N16935J291032O40997j190306j655162
36336b026147O06182L530792M153436K480477J022964P01337l31869k891019m414046
36327B832107k691752J23046M92003q13083l7161K853372L523794M54182k050717
36318D685791o46007J620065N37771k165283j929632P77772J332037j208034k769482
36309B34998j193951P10428L91569p85670j039525j269618k250535k177783K63083
36300g117004L050380L591290K149226M60645p49556j015309L75497K046407P55343
36291C546919l469709n658123k612431J877370K479276K7541q90147M65878J197847
$$ plain form
36354 -2197819 -3406185 -3677173 -4560652 -4875883 -2585901 1326663 3269776 1529857 -1621044
36345 -1621044 -3065152 -2503356 -1766973 -1629643 -1112708 178324 819321 -370985 -2026147
36336 -2026147 -1419965 2110827 6264263 8744740 9767704 10469041 10137172 7246153 2832107
36327 2832107 140355 263401 755404 -57679 -94840 2758532 6282326 6736508 4685791
36318 4685791 4039784 5659849 6197620 4032337 2102705 2880477 4212514 3004480 234998
36309 234998 -958953 -248525 143044 -642626 -1682151 -2951769 -5202304 -7380087 -7117004
36300 -7117004 -4066624 -475334 1673892 2134537 1384981 369672 745169 2791576 3546919
36291 3546919 77210 -5580913 -8193344 -6315974 -3836698 -3809157 -4699304 -4233426 -3035579
36282c035579Q14832J257118J878433L59300j853087j222102Q75813l31339l904456
36273e161067l344610K104496M594982K44851l473434O18167P094806N765683
36265H443874k489914p087275l334054K325654L267263R15348l15225Q3368K46102
36256B055141m1843j21238l51980p60114j20717J715158K694973J376888r94351
36247E451917k483763k731570k187654r41491O01172J477439J486069J358888
36239B031007J208342M25709o55453r12616n21788q44120j904412k127335r99418
36230d300084J55660M76285M82424L71142l07020r35372k37382J210620J392781
36221a690946J73544m24411L87737J306867J747277K354573K431938N19605j914733
$$ plain form
36282 -3035579 -2220747 -963629 914804 1274104 -578983 -1801085 -925272 -1256611 -5161067
36273 -5161067 -8505677 -6401181 -1806199 -1561348 -5034782 -4416615 2678191 8443874
36265 8443874 5953960 -1133315 -4467369 -2141715 1125548 2040896 1725671 1809039 2055141
36256 2055141 2013298 1892060 1540080 779966 659249 2374407 5069380 6446268 5451917
36247 5451917 2968154 236584 -1951070 -2892561 -2291389 -813950 672119 2031007
36239 2031007 3239349 3665058 3009605 2096989 1575201 731081 -1173331 -3300666 -4300084
36230 -4300084 -4144424 -3668139 -3185715 -2814573 -3121593 -4056965 -4294347 -3083727 -1690946
36221 -1690946 -1517402 -1941813 -1554076 -247209 1500068 3854641 6286579 6806184 4891451
36212D891451j508603J303002K159758j95761j753763l55975L74827k287262m690936
36203b063262k718248J101319J777252k33740j034758n11920j387794k767149
36195g838300r80910L570014O193748M820470K184786P85208K85606K68074J007795
36186A0296491R97174j771080n292311m848935j0915M005613L613593J448523
36178H438153J541561L345481L210986l46718m960607o741363l521166K686869
36170C653196O469770M398024o93293l416545k954177k668186l350113k222566
36162g83890O78297J145720j771596k721462J668264O402848N175108P0288j881212
36153G982365L18182Q42382k800216n386148k202536L345104M489910P81875j746394
$$ plain form
36212 4891451 3382848 4685850 6845608 6649847 4896084 4540109 4914936 2627674 -2063262
36203 -2063262 -4781510 -3680191 -1902939 -2136679 -3171437 -3683357 -5071151 -7838300
36195 -7838300 -8819210 -5249196 944552 5765022 7949808 8735016 9020622 9288696 10296491
36186 10296491 11293665 9522585 4230274 -618661 -629576 3376037 6989630 8438153
36178 8438153 9979714 13325195 16536181 16189463 11228856 4487493 966327 3653196
36170 3653196 10122966 14520990 13827697 10411152 7456975 4788789 1438676 -783890
36162 -783890 -105593 1040127 -731469 -3452931 -1784667 4618181 9793289 9863577 7982365
36153 7982365 8300547 9142929 6342713 956565 -1245971 2099133 6589043 7370918 5624524
36144E624524K14740K512393K28703m265934m316899R37378M643738J956555l051815
36135D483383l770531o23566Q00032j045443k230643o35521J191397J351090J473087
36126I93285K533905K427795o2153k743380l598858l374876k764491q00395J923055
36117e466113K427364K05631j041290P55593K517412J523801K25572J467392K744879
36108E360241K52116m119642n086655j613849K440818M013098K936152j54962
36100D027317l639664m038771M770L968046K552834k255053l550950K15910L122194
36091D06633J075434k382751k282672K93720Q04291j379307k336846K64805L714417
36082a822276L943392R13273j490329q98914K48785j304281l874944k743978K144023
$$ plain form
36144 5624524 5839264 8351657 8580360 4314426 -2473 934905 5578643 7535198 4483383
36135 4483383 712852 89286 889318 -156125 -2386768 -3022289 -1830892 -479802 993285
36126 993285 3527190 5954985 5892832 3149452 -449406 -3824282 -6588773 -7389168 -5466113
36117 -5466113 -3038749 -2833118 -3874408 -3118815 -601403 922398 1147970 2615362 5360241
36108 5360241 5612357 1492715 -3593940 -5207789 -2766971 1246127 4182279 4027317
36100 4027317 387653 -3651118 -3646348 321698 2874532 619479 -2931471 -2715561 406633
36091 406633 1482067 -900684 -3183356 -2889636 -2085345 -3464652 -5801498 -5536693 -1822276
36082 -1822276 2121116 3034389 1544060 645146 893931 -410350 -4285294 -7029272 -4885249
36073d885249M972663K383463j599685k204941r56329j366378j663376J716470
36065c603362N995955M927256r01076m154381j964537K31550j723701m125649
36057e317945k229472J879389L101974J297731M80281K102687L532230K454735
36049G301610m85345l242789m378920l629689j762222K83069K265264L763515
36041A14493L078823n96684m170311l249295J480843M167837J714565j925321
36033F14950j925730M15580N45242j954877l221391j429120Q45872R38151m41365
36024e612688j068788k89690J030410K252082L309285L790332K817363K53019
36016F481325k458330l456722k572306j365281p48746Q0569J523335K168258J170170
$$ plain form
36073 -4885249 87414 2470877 871192 -1333749 -2290078 -3656456 -5319832 -3603362
36065 -3603362 2392593 7319849 6418773 2264392 299855 531405 -1192296 -5317945
36057 -5317945 -7547417 -5668028 -2566054 -1268323 -788042 1314645 4846875 7301610
36049 7301610 6816265 3573476 -805444 -4435133 -6197355 -5914286 -3649022 114493
36041 114493 3193316 2596632 -1573679 -4822974 -3342131 825706 2540271 614950
36033 614950 -1310780 -895200 -349958 -2304835 -5526226 -6955346 -6109474 -5171323 -5612688
36024 -5612688 -6681476 -6971166 -5940756 -3688674 -379389 3410943 6228306 6481325
36016 6481325 4022995 566273 -2006033 -3371314 -4120060 -4039491 -2516156 -347898 822272
36007H22272K48166Q95350J309386o48509k885413j689230J765444K436515o30428
35998A623553k520963k51873K572312J646057j640318l055544j623655M54590
35990b795841J475940Q69834j479602l807191k884933J299205L999919K050768
35982a271901j117619o94830J981389K017750p52568j734291N07237J891693l29169
35973D97691l064000k149025J588108L815550K561046J36453l48459J293617K515515
35964F846496J331971j342796l107748l087820k162253p41414J308760K491419
35956A536615O51355k844558l488561k33338K004401m38175l846760k625080J932183
35947g351918L764020J324373j086744r52875o70746j982815k476678J21162L941015
$$ plain form
36007 822272 1070438 1965788 3275174 2626665 -258748 -1947978 -182534 2253981 1623553
35998 1623553 -897410 -1149283 1423029 3069086 1428768 -1626776 -3250431 -2795841
35990 -2795841 -1319901 -450067 -1929669 -5736860 -8621793 -7322588 -3322669 -1271901
35982 -1271901 -2389520 -3084350 -1102961 914789 162221 -1572070 -1064833 826860 497691
35973 497691 -2566309 -4715334 -3127226 688324 3249370 3385823 3037364 4330981 6846496
35964 6846496 8178467 6835671 3727923 640103 -1522150 -2263564 -954804 1536615
35956 1536615 2187970 -656588 -4145149 -4378487 -2374086 -2812261 -6659021 -9284101 -7351918
35947 -7351918 -3587898 -2263525 -3350269 -4303144 -4973890 -6956705 -9433383 -9312221 -5371206
35938e371206N577402M097501Q33311k475315m081574l007020m56546J402674
35930c480773K261688K961445K475775p29298m254567l266757K219410O046122
35922D233045M145958o1012j369520m2329L19729r51694j729868j560177j837094
35913A147038k493516k044331l80858J301929K638858L624481L095374M48384
35905G337359k176070k367760j159971j200214k152975j468792P63848J611446
35897h13129K31321o44611R24647L323626M047655K598033o2333k544989l116122
35888C944098j371375L4715j471603l487650j190406M431314O212127J146138
35880H247358m239815l050912J989783L315968j0994k229208p70164O61910o65893
$$ plain form
35938 -5371206 206196 4303697 5137008 2661693 -1419881 -4426901 -4883447 -3480773
35930 -3480773 -1219085 1742360 4218135 3488837 -765730 -4032487 -1813077 4233045
35922 4233045 8379003 8317991 6948471 6906142 7225871 6274177 4544309 2984132 1147038
35913 1147038 -1346478 -3390809 -3771667 -2469738 169120 3793601 6888975 7337359
35905 7337359 5161289 2793529 1633558 433344 -1719631 -3188423 -2424575 -813129
35897 -813129 -581808 -1226419 -301772 3021854 7069509 9667542 9605209 7060220 3944098
35888 3944098 2572723 2607438 1135835 -2351815 -3542221 889093 7101220 8247358
35880 8247358 4007543 956631 2946414 6262382 6251388 4022180 3252016 3913926 3248033
35871C248033k346236j680111J91247J197896J555171J955293J678999L68908
35863F169200r03573j566155j972961j436302Q76361K825470J307883k105272
35855C194651k656384m89358r50479m697458m912574J382262O737671M420167
35847B028498o45214l39769L016402J660663l048959k851276K161233K948028
35839D929606k623846n533146r07274L740904J479526k679033j084509L653561
35831I75789L857860m39019k683206o50315J741546J768597M88529r18171k103495
35822B038115k040411q28460j010359l090151k862524J930830N873122L021154
35814C031316l284328m974868j438415Q08947m32488n37026K312843L407392k7778
$$ plain form
35871 3248033 901797 -778314 -587067 610829 2166000 4121293 5800292 6169200
35863 6169200 5265627 3699472 1726511 290209 1166570 3992040 5299923 3194651
35855 3194651 538267 48909 -901570 -5599028 -10511602 -9129340 -2391669 2028498
35847 2028498 1383284 1043515 4059917 5720580 2671621 -179655 1981578 4929606
35839 4929606 2305760 -3227386 -4134660 -393756 1085770 -1593263 -2677772 975789
35831 975789 4833649 4394630 1711424 1061109 2802655 4571252 5059781 4141610 2038115
35822 2038115 -2296 -830756 -1841115 -4931266 -7793790 -5862960 10162 3031316
35814 3031316 -253012 -5227880 -6666295 -5857348 -6289836 -6826862 -4514019 -1106627 -1134405
35805a134405l790543l535518q47271J004186K264869L893382L996503J245168
35797C096371j509602j133028P57046M73187j860475k822699j131365P61063M91910
35788b877592j272372k314596j790800o97253K05184J693437M123972N011908
35780B081888J468628m305619n764468o96072M633529L903738l01215j300571
35772b80162J067184J666558J5735O71898L601393K937915k512637n829187k706570
35763a367873J822115K027727N5515K52155R87498j118624l540278j819792J970418
35754g31139K145327j089363k238804J48048J682125J11430j285401L6547J532806
35745C11576Q4448k895661l708105j496496J263532K268048J568023N44560r3922
$$ plain form
35805 -1134405 -4924948 -8460466 -9307737 -8303551 -6038682 -2145300 1851203 3096371
35797 3096371 1586769 453741 1210787 1683974 -176501 -2999200 -4130565 -3369502 -2877592
35788 -2877592 -4149964 -6464560 -8255360 -8952613 -8747429 -7053992 -2930020 2081888
35780 2081888 3550516 -755103 -6519571 -7215643 -2582114 1321624 1020409 -280162
35772 -280162 787022 2453580 2469315 3141213 6742606 9680521 7167884 1338697 -1367873
35763 -1367873 454242 2481969 2537484 2789639 3777137 2658513 -881765 -2701557 -731139
35754 -731139 1414188 324825 -1913979 -1765931 -83806 27624 -1257777 -1221230 311576
35745 311576 396024 -2499637 -6207742 -7704238 -6440706 -4172658 -2604635 -2060075 -2153997
35736b153997o59315r84600J37287K687722L851564J441933j843413j468440J657031
35727B665772J952811j624362l135232N93240L955328J307818l741891m364889
35719b391405j473279q68759k411755q10285L834366N258559J719956q93911J030484
35710B993971L256806J368824k383444l903485l598827l623993l120411o15867
35702i626426K148936K847114K326062K267371J829266P0003j029839K83481J796731
35693B912699O53896j691763j952755o36035p24254j936853j150202J640539K585298
35684b99430J70472k087624j056027J244545R14593j868722l098880o07944K908555
35675c780462L282679J29241k545253j201570K761548M678445K500459q73278
$$ plain form
35736 -2153997 -2813312 -3797912 -3660625 -972903 2878661 4320594 2477181 1008741 2665772
35727 2665772 4618583 2994221 -141011 452229 4407557 5715375 1973484 -2391405
35719 -2391405 -3864684 -4733443 -7145198 -7955483 -4121117 1137442 2857398 1963487 2993971
35710 2993971 6250777 7619601 5236157 1332672 -2266155 -5890148 -9010559 -9626426
35702 -9626426 -7477490 -4630376 -2304314 -36943 1792323 1862326 832487 1115968 2912699
35693 2912699 3566595 1874832 -77923 -713958 -1438212 -3375065 -4525267 -2884728 -299430
35684 -299430 -128958 -2216582 -3272609 -2028064 -1113471 -2982193 -6081073 -6689017 -3780462
35675 -3780462 -497783 -368542 -2913795 -4115365 -1353817 3324628 5825087 4951809
35667D951809j822935n25919M20692J71554j19809l09052j520856l264961l139677
35658e159154m44015K169022K099899K08504p45349J64552J468536J620623L44522
35649A727140j686510l035419k046267J032276K996462R83626l200728m595475
35641g824895j607074J692501J368732r50997j213430N79426R42076p85501j151445
35632h950607J471359L774996K585494k42039j047919n7873j65530j414255q01279
35623d847653K351104M573163L044503n45413k614542k210083j018452j07812
35615a375185J162545L040237L922392K008672k029847n039528m571437j596716
35607d478867P89099J036196K13042m70017j166756j680717n24640K518929M732383
$$ plain form
35667 4951809 3128874 2602955 3023647 3195201 3075392 2766340 1245484 -2019477 -5159154
35658 -5159154 -5603169 -3434147 -1334248 -1125744 -1871093 -1706541 -238005 1382618 1727140
35649 1727140 40630 -2994789 -5041056 -4008780 -1012318 -28692 -3229420 -7824895
35641 -7824895 -9431969 -7739468 -6370736 -7321733 -8535163 -7955737 -7013661 -7799162 -8950607
35632 -8950607 -7479248 -3704252 -1118758 -1360797 -2408716 -2466589 -2632119 -4046374 -4847653
35623 -4847653 -2496549 2076614 5121117 4575704 1961162 -248921 -1267373 -1375185
35615 -1375185 -212640 2827597 6749989 8758661 6728814 1689286 -2882151 -4478867
35607 -4478867 -3689768 -2653572 -2440530 -2910547 -4077303 -5758020 -6282660 -3763731 968652
35598I68652L698582Q67955o49927o98099j428715k781887k254990M95070K366979
35589E83620J368964m86728n08927Q01516J080623l73021k115953k490058r39350
35580c079314J424605J991020q03621m388948l950214J177479N578705M501078
35572B450790K52417j261598J154900K962575R54883k445522l195230j071118
35564a97903R23955R25878j73088q09505n42060L01639J251636J477558J79378
35555C337488j929453k543608n20431J983901J997876Q1972l21348J604540K316376
35546F007313m41428l392340k545436J78893j24113k960003k640866K445335O434284
35537B961639M331215r86511l580220k454825o96865L49312J329915J254998j326177
$$ plain form
35598 968652 4667234 5535189 4885262 4187163 2758448 -23439 -2278429 -1783359 583620
35589 583620 1952584 1465856 956929 1758445 2839068 2466047 350094 -2139964 -3079314
35580 -3079314 -1654709 336311 -467310 -4856258 -8806472 -7628993 -2050288 2450790
35572 2450790 2703207 1441609 2596509 5559084 6513967 4068445 873215 -197903
35564 -197903 726052 1651930 1478842 669337 127277 428916 1680552 3158110 3337488
35555 3337488 1408035 -1135573 -1656004 327897 2325773 2407745 2086397 3690937 6007313
35546 6007313 5565885 2173545 -371891 -192998 -317111 -3277114 -5917980 -3472645 2961639
35537 2961639 7292854 6306343 2726123 271298 -425567 -76255 1253660 2508658 1182481
35528A182481m160107l090761J548410M526639K756686q85102k289066j430396
35520a841216p60702p76565o6208J351296J559023j48433j752052j202633N10496
35511c126994O33241j136805j775463M63530K543504O09462l569078m194739L499
35502i549843L399563J876650q94165L89413L846423L356801j489801m518130
35494c583089k179440J932448L187135J820193N29772o1139q46086j665778j739171
35485b605155j119055j73569R56856J540493P07566o29222m51534J134159J792505
35476A153044Q40375M66644J899708L103289J895428r20047l001810l061530j102153
35467A272948J637138K430926l21658l753874l424106j19475Q67044j591275k254365
$$ plain form
35528 1182481 -2977626 -6068387 -4519977 6662 2763348 1878246 -410820 -1841216
35520 -1841216 -2601918 -3378483 -3444691 -2093395 -534372 -682805 -2434857 -3637490 -3126994
35511 -3126994 -2493753 -3630558 -5406021 -4942491 -2398987 -1789525 -5358603 -9553342 -9549843
35502 -9549843 -6150280 -4273630 -5167795 -4778382 -931959 2424842 935041 -3583089
35494 -3583089 -5762529 -3830081 -642946 1177247 1707019 1645880 799794 -865984 -2605155
35485 -2605155 -3724210 -3897779 -2940923 -1400430 -692864 -1322086 -1773620 -639461 1153044
35476 1153044 1993419 2460063 4359771 7463060 9358488 8438441 5436631 2375101 1272948
35467 1272948 2910086 5341012 5019354 1265480 -2158626 -2278101 -1411057 -3002332 -5256697
35458e256697J462649M497556K440460j078695r54496P48560m48137k583886j114641
35449b287327J852454R45224k203007j491483K044714J322522l756560m975614
35441h549077K34533L956245J057691k491568m51868L238731K224041j145422
35433a926694p67179K318164K486036m71037j963395j015415o66183j379198p82479
35424d167380Q76905J016677k14193m43513K41560J4016n88102p6340K59874r85648
35414d066144j386522R34572J974161k059464o234422l166360M179116N993280
35406c831783J344842p32989K862901M232724q59369m844432j304909M002919
35398H69904L101939j545154l057626j818860j840730j377608K759800O074595
$$ plain form
35458 -5256697 -3794048 703508 3143968 2065273 1110777 1859337 1411200 -1172686 -2287327
35449 -2287327 -434873 510351 -1692656 -3184139 -1139425 183097 -3573463 -8549077
35441 -8549077 -8314544 -4358299 -3300608 -5792176 -6244044 -3005313 -781272 -1926694
35433 -1926694 -2693873 -375709 2110327 1639290 -324105 -1339520 -2005703 -3384901 -4167380
35424 -4167380 -3290475 -2273798 -2487991 -2931504 -2689944 -2675928 -3264030 -3340370 -3080496 -4066144
35414 -4066144 -5452666 -4518094 -2543933 -4603397 -10837819 -14004179 -9825063 -3831783
35406 -3831783 -2486941 -3219930 -357029 3875695 3016326 -1828106 -3133015 869904
35398 869904 3971843 2426689 -630937 -2449797 -4290527 -5668135 -2908335 3166260
35390C166260K224360m938724n881490l89074K606809j64523k465013o73565Q88647
35381e626313l22722m12L825764N367070P09106m500065l666760L86708R08981
35372b918643j531185j162948K385440L644566Q42322j381760J02547K226986
35364B207325J160931j968616l482954k379515n51349N06196R56281J371712J885362
35355b94627K356497K364099J167564j497101m384361n109109k339706K180374
35347e556370M627529L039316k20861j216540O38106K196441J280571n42070j019220
35338C226902p89531j684493l005141k416209r0359J129587K88036N0493K187678
35329a103037L890693J575597l018527m343703r10488K255715Q81261k326266
$$ plain form
35390 3166260 5390620 451896 -5429594 -5818668 -3211859 -3376382 -5841395 -6514960 -5626313
35381 -5626313 -5949035 -5949447 -2123683 3243387 3952493 -547572 -4214332 -3827624 -2918643
35372 -2918643 -4449828 -5612776 -3227336 417230 1259552 -122208 -19661 2207325
35364 2207325 3368256 1399640 -2083314 -4462829 -5014178 -4507982 -3551701 -2179989 -294627
35355 -294627 2061870 4425969 5593533 4096432 -287929 -5397038 -7736744 -5556370
35347 -5556370 -928841 2110475 1889614 673074 1311180 3507621 4788192 4246122 3226902
35338 3226902 2437371 752878 -2252263 -4668472 -4758831 -3629244 -3341208 -3290715 -1103037
35329 -1103037 2787656 4363253 1344726 -2998977 -3909465 -1653750 -772489 -3098755
35321c098755k109595J203385K640262O39620j038790J9323J486675J287839R55291
35312A985255J266176m48207m623106n888339p64549M958508L464774l008630
35304c058118n209722j003259K152047r1994k519585l008M111069M431977K214203
35295A023610J535789J468656j162080m252806k777518K432534M831806J550073
35287D650064k793300k991412L33196L017292K889125J020600o00178r87373o63176
35278C874838j031586k685941m348719m182252j830647J427267L808400L826459
35270a142181J419230r13775q8983L103833L895455j0809m374366l881169L63391
35261a629374K612431N68489k333955k484828k57793J746783J717871l40498k316018
$$ plain form
35321 -3098755 -5208350 -4004965 -1364703 -725083 -1763873 -1744550 -257875 1029964 1985255
35312 1985255 3251431 2803224 -1819882 -7708221 -8472770 -3514262 -49488 -3058118
35304 -3058118 -8267840 -9271099 -7119052 -7211046 -9730631 -9733639 -5622570 -1190593 1023610
35295 1023610 2559399 4028055 2865975 -1386831 -4164349 -1731815 3099991 4650064
35287 4650064 1856764 -1134648 -801452 2215840 5104965 6125565 5525387 4538014 3874838
35278 3874838 2843252 157311 -4191408 -8373660 -10204307 -8777040 -4968640 -1142181
35270 -1142181 277049 -636726 -725709 2378124 6273579 6262770 1888404 -1992765 -1629374
35261 -1629374 983057 1551546 -782409 -3267237 -3525030 -1778247 -60376 -400874 -2716892
35252b716892j313149K262480L467356o80224n188610k937142M177331O558942
35244C630092N22386o311655o251318j651005R71172J263654K941589N258968
35236C73883M201974N91036n41612J221027P07947l378169n014573m65776M564453
35227B260190K787559l576978n872459j441729L440590L411050P95982K47921
35219B052126J461170J085261j111972k321757j595192o86113l83625L56859J408704
35210B65461J052463o84346j470619n24026J68832j39824P15734L199132L428256
35201F011063j152099o251629n603197M2262L709300J838460j609861j675645
35193d691346J174280L118896K411234M58388o83767j52526J232981J496165k76366
$$ plain form
35252 -2716892 -4030041 -1767561 1699795 1019571 -4169039 -7106181 -2928850 3630092
35244 3630092 4152478 -2159177 -8410495 -10061500 -9090328 -7826674 -4885085 373883
35236 373883 4575857 5166893 4625281 5846308 6554255 3176086 -1838487 -2304263 2260190
35227 2260190 5047749 1470771 -4401688 -5843417 -2402827 1008223 1804205 2052126
35219 2052126 3513296 4598557 3486585 1164828 -430364 -1116477 -1500102 -1143243 265461
35210 265461 1317924 633578 -837041 -1361067 -1192235 -1332059 -616325 2582807 6011063
35201 6011063 4858964 -1392665 -6995862 -6953600 -3244300 -1405840 -3015701 -4691346
35193 -4691346 -3517066 -398170 2013064 2471452 1787685 1635159 2868140 4364305 4087939
35184D087939k167338j696205L45063Q96003n39849j298873l15787J94853r02968
35175a397162j400033J07336J368930M58935o51192L13459J638991N95283j617527
35166e82980j850174k08587P40311O63794J195519J766490M9176l355488m658965
35157f240904k089547J771875L625330K899458J116785N1554O62833J928158J324569
35148E050111j414512k562393L41396L323903R11164m814827o159633j251416
35140f576207L050392J772328j189235n92698J418266k50324m395954n081898
35132a1845330q06140L549286L764396R07955j425520j298474N24270J633098
35124d996459K98241j986633j738785J361507L189898J298116j011359k38108
$$ plain form
35184 4087939 1920601 224396 569459 1465462 925613 -373260 -689047 -494194 -1397162
35175 -1397162 -2797195 -2689859 -1320929 -861994 -1513186 -1199727 439264 1034547 -582980
35166 -582980 -2433154 -2641741 -1901430 -1237636 -42117 1724373 1773549 -1581939 -6240904
35157 -6240904 -8330451 -6558576 -2933246 -33788 1082997 1134551 1797384 3725542 5050111
35148 5050111 3635599 1073206 1414602 4738505 5649669 834842 -5324791 -6576207
35140 -6576207 -3525815 -1753487 -2942722 -3535420 -2117154 -2367478 -6763432 -11845330
35132 -11845330 -12651470 -9102184 -5337788 -4429833 -5855353 -7153827 -6629557 -4996459
35124 -4996459 -4698218 -6684851 -8423636 -7062129 -3872231 -2574115 -3585474 -3823582
35116c823582J177246p20091l745783k701161J518187L012444P59557k1803K480006
35107b064980L155692r96799n038808l594838J041903L089603J639169R1144J41410
35098b536504P85787J262939J225799k05547k460947k743785j66003J928586R46700
35089a962975n76174O49918K876155K448827K24303k60621Q19644L99314j464847
35080C153544j870807p71645r72329k502743k316067j343J302199L64816o44971
35071d259346p80841j367833j666227R56702N115684N473354R50428k848922k272546
35062f99547q09512j797855j924716K310854O505071L925140l417230o569201
35054b476996j992212M277304N522180J997956j831473l320702k691045j030703
$$ plain form
35116 -3823582 -2646336 -3366427 -7112210 -9813371 -8295184 -5282740 -4523183 -4544986 -2064980
35107 -2064980 1090712 93913 -4944895 -8539733 -7497830 -4408227 -2769058 -2677914 -2536504
35098 -2536504 -1750717 -487778 738021 532474 -1928473 -4672258 -4838261 -2909675 -1962975
35089 -1962975 -2539149 -1889231 986924 3435751 3660054 3399433 4219077 4618391 3153544
35080 3153544 1282737 511092 -461237 -2963980 -5280047 -5281390 -3979191 -3614375 -4259346
35071 -4259346 -5040187 -6408020 -8074247 -7117545 -2001861 3471493 4421921 1572999 -699547
35062 -699547 -1509059 -3306914 -5231630 -2920776 3584295 7509435 4092205 -2476996
35054 -2476996 -4469208 -191904 5330276 7328232 5496759 2176057 -514988 -1545691
35046a545691M91367R24025M35278M0085L4216k32638r54250j432947j106396
35037c346951n8677J291890K231217K050505J078360N10160M78278k71191j787928
35028B175663j947027K88159K561413K153277m39977l065246m993546n909985
35020i177269m173585M30317M088638L125855m88059j802963J11457K147525K957402
35011b780682L615390L135779o08843m912605l667800L022761O767390K092201
35003F663591n362468o518513r57947L861874L236619j73840j826872j011571
34995b089127j74061j005396k319608j480063J825317L939321J575951k627596
34987b355262k769385J461579L597877K93738l174085j554016J567037m885m058201
$$ plain form
35046 -1545691 -1054324 -130299 304979 345064 379280 146642 -807608 -2240555 -3346951
35037 -3346951 -3405628 -2113738 117479 2167984 3246344 3756504 4234782 3963591 2175663
35028 2175663 228636 516795 3078208 5231485 4791508 1726262 -3267284 -9177269
35020 -9177269 -13350854 -12920537 -8831899 -5706044 -6194103 -7997066 -7885609 -5738084 -2780682
35011 -2780682 834708 3970487 3361644 -1550961 -5218761 -2196000 4571390 6663591
35003 6663591 1301123 -5217390 -6175337 -2313463 923156 749316 -1077556 -2089127
34995 -2089127 -2263188 -3268584 -5588192 -7068255 -5242938 -1303617 272334 -2355262
34987 -2355262 -5124647 -3663068 -65191 228547 -2945538 -4499554 -2932517 -2937402 -6995603
34978f995603l270060K357494N061713J729541j662969l46502K119683R56927
34970d9776j929445k174232l33269L13996n7885Q69579K420267K110464M05306
34961A575005k69252J9097l80951n88456J259692L133543J024818m024444o013162
34952d264110k388167K354456L424055J776691P65637O01018l20503j329269o26262
34943f454R93093J057611p06825k307588k620873j959687k85357K218308L300744
34934c17028P30804l499580m413318o42414L141777K215826k061737m363609k138913
34925a1348192K131346M641229L947157J144732j564527k151890k89977J820861
34917a669261J505241r30860k195376l05339K608494L221385J397700m61335j472399
$$ plain form
34978 -6995603 -10265663 -7908169 -2846456 -1116915 -2779884 -3126386 -1006703 -49776
34970 -49776 -1979221 -4153453 -4486722 -4172726 -4230611 -3361032 -940765 1169699 1575005
34961 1575005 1305753 1324850 943899 355443 1615135 4748678 5773496 1749052 -4264110
34952 -4264110 -6652277 -4297821 -873766 902925 1668562 2269580 1949077 619808 -6454
34943 -6454 986639 2044250 1337425 -970163 -3591036 -5550723 -5836080 -3617772 -317028
34934 -317028 413776 -3085804 -7499122 -8141536 -4999759 -2783933 -4845670 -9209279 -11348192
34925 -11348192 -9216846 -4575617 -628460 516272 -1048255 -3200145 -3490122 -1669261
34917 -1669261 -164020 -1094880 -3290256 -3595595 -987101 2234284 3631984 3170649 1698250
34908A698250k674994l462405j358640L141117N214057K237932j409437l89827
34900B996053L035945K183739l107651n450740j276010L516070K860325m82320
34892D275411o24566J434881L52361l707689n153451k271642M55877Q5196r27570
34883f081192k06749P02609K19446k70313K33904J40963j102143j082433J246956
34874f198952L024105K100104O74200J268649K470893K067672J248772J908776
34866H564219K495367N62643k704142m354057m065910l007985o15407L232308
34858A07036M969788J359686m456904o064082k470231J201857J579379N18674
34850c254797J88747k13400j246598j145658Q12477K258574J228608r58999k117843
$$ plain form
34908 1698250 -976744 -4439149 -5797789 -2656672 2557385 4795317 3385880 2996053
34900 2996053 6031998 8215737 5108086 -342654 -1618664 1897406 4757731 4275411
34892 4275411 3650845 5085726 5438087 1730398 -3423053 -5694695 -5238818 -5153622 -6081192
34883 -6081192 -6287941 -5585332 -5365886 -5636199 -5402295 -5261332 -6363475 -7445908 -6198952
34874 -6198952 -3174847 -1074743 -400543 868106 3338999 5406671 6655443 8564219
34866 8564219 11059586 11622229 8918087 4564030 498120 -2509865 -3125272 107036
34858 107036 5076824 6436510 1979606 -4084476 -6554707 -5352850 -3773471 -3254797
34850 -3254797 -3066050 -3279450 -4526048 -5671706 -4859229 -2600655 -1372047 -2331046 -4448889
34841d448889k002690j092185Q94289L374270M068665J980494m55362l77233J424450
34832C365809J496526j550291m942327m833985r17730K776865K378306q58151
34824c084978j864444J341289M566231L284487q10281k431874l85674J387837
34816B002593J48427k155927k433629m45459J671823J837907k98665k558390j905013
34807d136333J259014K381291q29308l889752j808502K741622L545750J192998
34799D56780J640832M948990M331549j822920n936437k999049J807324K236426
34791D663495K78064K64907M53674k221903m567754k343050J208422L16115l121972
34782e070002k809538R24835K256977O26018J162947M402917M702776L24193l405481
$$ plain form
34841 -4448889 -6451579 -7543764 -6649475 -3275205 793460 2773954 2318592 1941359 3365809
34832 3365809 4862335 3312044 -1630283 -6464268 -7381998 -4605133 -2226827 -3084978
34824 -3084978 -4949422 -3608133 958098 4242585 3432304 1000430 614756 2002593
34816 2002593 2151020 -4907 -2438536 -2883995 -1212172 625735 327070 -2231320 -4136333
34807 -4136333 -2877319 -496028 -1325336 -5215088 -7023590 -4281968 -736218 456780
34799 456780 2097612 7046602 11378151 9555231 3618794 619745 2427069 4663495
34791 4663495 4941559 5206466 5660140 3438237 -1129517 -3472567 -2264145 -1948030 -5070002
34782 -5070002 -7879540 -6954705 -4697728 -4071710 -2908763 1494154 6196930 6521123 3115642
34773C115642l296977k688259l633470k470112K557986O180050L896704o81489
34765B980075j802843j27828M45264K81900J802717K915618j42403m907743m859144
34756c414387M13759L975388J944464j045101K95548L706288L341692j282624
34748G935027n025531m489139j450442R29946J692713J195869k36809j416663
34740h65029n40840J912667K631885r7231l253276k976380n2384J716046J415542
34731a09000J189908R81822j728773n844313n866170j50090N105400M460006J341389
34722f19821J819793M013225J355464n231694p178636j460911M307733L419158
34714D24311m48171n20123K029794J239040k793622l821918L25467M260361L302773
$$ plain form
34773 3115642 -181335 -2869594 -6503064 -8973176 -6415190 -235140 3661564 2980075
34765 2980075 1177232 1049404 1494668 1776568 3579285 6494903 6352500 1444757 -3414387
34756 -3414387 -3000628 974760 2919224 1874123 2169671 5875959 9217651 7935027
34748 7935027 2909496 -1579643 -3030085 -2100139 -407426 788443 551634 -865029
34740 -865029 -1405869 506798 3138683 3041452 -211824 -3188204 -3240588 -1524542 -109000
34731 -109000 1080908 2062730 333957 -5510356 -11376526 -11526616 -6421216 -1961210 -619821
34722 -619821 1199972 5213197 6568661 1336967 -5841669 -7302580 -2994847 424311
34714 424311 -23860 -543983 1485811 2724851 -68771 -3890689 -3565222 695139 3997912
34705C997912j48260j252998J77519P89611m07548j192007o72781r37416k924776
34696b570744l607822j28003M675411M690355q68639n122659k453303L260081
34688b125323L714758j925215n670153k066567M382569O045938K276862j468683
34680C164186k020472j208496j039283p68528L91714J121425J57940j499464k006848
34671c707826j034232K86195Q28515K40652r16093j340885r9467K084988L336750
34662c21403K621996O05187j407484k481208k069689k00873J993327K855003J778483
34653C373339k97680k011370k513576j473237P15342K572186K541111P99437q46981
34644B858571j177364o64351j03420N65572J426061J813737J284120L43314o07442
$$ plain form
34705 3997912 3849652 2596654 2774173 3563784 3156236 1964229 1291448 354032 -2570744
34696 -2570744 -6178566 -6306569 -1631158 3059197 2190558 -2932101 -5385404 -2125323
34688 -2125323 1589435 -335780 -6005933 -8072500 -3689931 2356007 4632869 3164186
34680 3164186 1143714 -64782 -1104065 -1872593 -1480879 -359454 -201514 -1700978 -3707826
34671 -3707826 -4742058 -4455863 -3627348 -3386696 -4302789 -5643674 -5743141 -3658153 -321403
34662 -321403 2300593 2905780 1498296 -982912 -3052601 -3253474 -1260147 1594856 3373339
34653 3373339 3075659 1064289 -1449287 -2922524 -2207182 365004 2906115 3705552 2858571
34644 2858571 1681207 1016856 913436 1479008 2905069 4718806 6002926 6346240 5738798
34635E738798j890472l161569k875848p02846Q91234l64348k905049l172402n64848
34626i007350K180385L309236L565004L124427Q05801k353291k680949M40693
34618f16044K103148j335775o068713n968115j571148J399020J060402P78187
34610a0219038J750030R83353j768436j788762K611282N891046L504089r40192
34602B3372k047312j309729k724162l800337N35554P042182O699000j154781o469524
34593c205737l188604K248463K000668j184538k03768L794306L838190n24028
34585C574952k430757O40997K886565K49306k823576j148511K230481R08411m151785
34576f3917n530721o95267L862826K045519l095813m000196O96005M838930L705383
$$ plain form
34635 5738798 3848326 686757 -2189091 -2891937 -2000703 -2365051 -5270100 -8442502 -9007350
34626 -9007350 -6826965 -3517729 47275 3171702 3977503 1624212 -1056737 -616044
34618 -616044 1487104 151329 -5917384 -11885499 -13456647 -12057627 -10997225 -10219038
34610 -10219038 -8469008 -7485655 -9254091 -11042853 -8431571 -2540525 963564 23372
34602 23372 -2023940 -3333669 -6057831 -9858168 -9322614 -2280432 4418568 3263787 -3205737
34593 -3205737 -6394341 -4145878 -2145210 -3329748 -3533516 260790 4098980 3574952
34585 3574952 1144195 1785192 4671757 4921063 2097487 948976 3179457 4087868 -63917
34576 -63917 -5594638 -6289905 -2427079 -381560 -3477373 -7477569 -6781564 -1942634 1762749
34567A762749k44731k003312p77802O51032R84503J317593J883300J354803l29087
34558D599048j366992j048999o78415o02884Q38544L693147M499321Q73311l910795
34549F895286m466689o74764K203629J126901p93762K70460K720845K121425j633872
34540G769459l635605q95838L272038L664194n7621l467557l341994r20040R46800
34531C333836J428657J320691Q43014l23801j616943j923875j203807n69878p74821
34522E13073j462207j786157j146044L01701J345770P99252m22008K25649K914972
34513A284001L750525j34317n026467m214510K542037P397247M317817k972095
34505F944238o221878l366626J64424l1988k003089j792772M78659J614174O05198
$$ plain form
34567 1762749 1518018 -485294 -1263096 -612064 372439 1690032 3573332 4928135 4599048
34558 4599048 3232056 2183057 1504642 901758 1740302 5433449 9932770 10806081 6895286
34549 6895286 2428597 1753833 3957462 5084363 4290601 4561061 7281906 9403331 7769459
34540 7769459 4133854 3238016 6510054 10174248 10116627 6649070 3307076 2387036 3333836
34531 3333836 4762493 6083184 6926198 6602397 4985454 3061579 1857772 1287894 513073
34522 513073 -949134 -2735291 -3881335 -3579634 -2233864 -1434612 -1856620 -1630971 1284001
34513 1284001 5034526 4900209 -126258 -4340768 -1798731 5598516 9916333 6944238
34505 6944238 722360 -2644266 -2479842 -2511830 -4514919 -6307691 -5829032 -4214858 -3609660
34496c609660k55198N67531J482221O92508o36797l54096Q03368L02035j484120
34487b492208j309184J182137J801258j365755l448445K47384N763398N339031
34479E717616n06347l179191P58752M329850J448838l687283m050754q54979n7671
34470h1169j720648r54653K284453K627333j140288l572190j528335J025652J62847
34461b896998j752877q27646J790655K396063O61557r86568j639706j785376p83072
34452e823968J798098L646775K181543j159345k460192q25405P94817K82960j134252
34443b698969j595815j210683q81914m51342O44658J894975K039303O72095r62152
34434b549844r57266J169926L484587L581262J610860K2341o2475k73394j743712
$$ plain form
34496 -3609660 -3864858 -3297327 -1815106 -1122598 -1759395 -2113491 -1310123 -1008088 -2492208
34487 -2492208 -3801392 -2619255 -817997 -2183752 -5632197 -5384813 378585 5717616
34479 5717616 5211269 2032078 2790830 7120680 8569518 4882235 831481 -23498 -81169
34470 -81169 -1801817 -2756470 -472017 2155316 1015028 -2557162 -4085497 -3059845 -2896998
34461 -2896998 -4649875 -5477521 -3686866 -1290803 -629246 -1615814 -3255520 -5040896 -5823968
34452 -5823968 -4025870 -379095 1802448 643103 -1817089 -2642494 -1847677 -1564717 -2698969
34443 -2698969 -4294784 -5505467 -6387381 -6838723 -6194065 -4299090 -2259787 -1587692 -2549844
34434 -2549844 -3507110 -2337184 1147403 4728665 6339525 6361866 6299391 6025997 4282285
34425D282285k689963j351342N00989q4354k361586k574167M76801L504984L194560
34416B898207L23045j783007j510069m18477p80087k320187k109346J362027M721112
34407C83218L138659k232437m264674J90034M691114K284871l525171l802778
34399c137164J817696M575502N17655l789040k458533R59544R60980o28196N54848
34390f26708K659441J206109k086437j806320J735784L031506M97313j976665
34382B634023k518232l405335m903271l631385J008184M526403L829289J163386
34374a296938n32637j477359j998263m65542K796117L871653Q53224k621681k676135
34365c547561n44674O95169J212482K385365K840335R16702j341416j142761N090
$$ plain form
34425 4282285 1592322 240980 741969 657615 -1703971 -4278138 -3801337 -296353 2898207
34416 2898207 3221252 1438245 -71824 -490301 -1270388 -3590575 -5699921 -4337894 383218
34407 383218 3521877 1289440 -2975234 -2785200 1905914 4190785 665614 -3137164
34399 -3137164 -1319468 3256034 3773689 -15351 -2473884 -1514340 -553360 -1181556 -626708
34390 -626708 2032733 3238842 1152405 -653915 1081869 4113375 4610688 2634023
34382 2634023 115791 -3289544 -8192815 -11824200 -10816016 -6289613 -2460324 -1296938
34374 -1296938 -1829575 -3306934 -5305197 -5770739 -2974622 897031 1750255 -871426 -3547561
34365 -3547561 -4092235 -3397066 -2184584 200781 3041116 3957818 2616402 1473641 1478731
34356A478731j203415l758796l594602l47564J995249J468040N58347J216859
34348b187151J668068K13788j219038j60635J943375J503703j700908l679764
34340c618562j564567K292760L247925M66303k164899j575004N04215Q36002j94558
34331a770385J59584J822497J861329l36785j812829q66655O19699J048020J513938
34322B238413K471328J785090j298375l653899k690612k42819Q37915Q47977R05079
34313A200097r7667k440508k892052L94361L381945J703669j995910k120722O51968
34304b214819R10828j826444k297497J115076L257759O21599l102548k967087
34296f503133L15945K647148K344126O90232q74574j639860j381361p83144o57517
$$ plain form
34356 1478731 275316 -3483480 -7078082 -7425646 -5430397 -3962357 -3404010 -2187151
34348 -2187151 -519083 -305295 -1524333 -1684968 258407 1762110 61202 -3618562
34340 -3618562 -5183129 -2890369 357556 823859 -1341040 -2916044 -2411829 -1575827 -1770385
34331 -1770385 -1610801 211696 2073025 1736240 -76589 -943244 -323545 724475 2238413
34322 2238413 4709741 6494831 5196456 1542557 -1148055 -1390874 -552959 295018 1200097
34313 1200097 1102430 -1338078 -4230130 -3835769 -453824 1249845 -746065 -2866787 -2214819
34304 -2214819 -1303991 -3130435 -5427932 -4312856 -1055097 -433498 -3536046 -6503133
34296 -6503133 -6187188 -3540040 -1195914 -505682 -1380256 -3020116 -4401477 -5184621 -5842138
34287e842138k61188J561498L481895K772614k65154j994628m41137K146976K690079
34278C848817Q66885j408169k051374j75147K619384K846304o48927m248110m203456
34269b553793j869973m63727R15353M360110O404392J848188o101934q002116
34261e463500j853384L817188L111097M10299Q92849J931625j79319k396240r39837
34252f69222R54946j064466l834794j966102K271933K764996K71736N84580L693136
34243C006743L637730r61055m479579l467598j037414m38249n79108N6231N60376
34234c701923P19575K057801L823506K639598j699553m504322k722217P11927
34226b675608J640667L17157m89491o1754N19008R91646J570797J569124O02392
$$ plain form
34287 -5842138 -6103326 -4541828 -1059933 1712681 1447527 -547101 -988238 1158738 3848817
34278 3848817 4715702 3307533 1256159 1081012 3700396 6546700 5897773 1649663 -2553793
34269 -2553793 -4423766 -4887493 -3972140 387970 6792362 8640550 2538616 -5463500
34261 -5463500 -7316884 -3499696 -388599 21700 914549 2846174 2666855 270615 -669222
34252 -669222 285724 -778742 -4613536 -6579638 -4307705 -1542709 -1270973 -686393 3006743
34243 3006743 6644473 5683418 1203839 -2263759 -3301173 -3739422 -4318530 -4262299 -3701923
34234 -3701923 -2982348 -924547 2898959 5538557 3839004 -665318 -3387535 -2675608
34226 -2675608 -1034941 -717784 -1207275 -1269029 -750021 241625 1812422 3381546 3983938
34217C983938j71289J33737M44899l71964j298677q13533L21594R8005j407862
34208I18848j931327n06322Q89767K58326j220634p57700J693587K997604J523366
34199C865515k13197L61524J475828J54553j927866n99233L153844L413144j413460
34190H270652n366289l848716l27643m0921j947760k161791j247815j931936k598128
34181a1200347J97471M475130M759717N69973l107306l448080k048497R3338L614049
34172f094552O501051N078124L96857k156200r17784J06096j215412j739909M65466
34163D23737K125674N40334j658127j193192N76265P13046m24070p55776l4291
34154C13600R88444K161080K519174M74239k656459l122086p47551O3203k202105
$$ plain form
34217 3983938 3812649 3946386 4391285 4019321 2720644 1907111 2228705 2326710 918848
34208 918848 -1012479 -1518801 -629034 -370708 -1591342 -2349042 -655455 2342149 3865515
34199 3865515 3652318 4013842 5489670 5644223 3716357 3117124 6270968 9684112 8270652
34190 8270652 2904363 -944353 -1271996 -1312917 -3260677 -5422468 -6670283 -8602219 -11200347
34181 -11200347 -11002876 -6527746 -1768029 -1198056 -4305362 -7753442 -9801939 -9708601 -6094552
34172 -6094552 406499 5484623 5881480 3725280 2807496 2913592 1698180 -41729 423737
34163 423737 2549411 3089745 1431618 238426 814691 1527737 1103667 347891 313600
34154 313600 1302044 3463124 5982298 6456537 3800078 677992 -69559 -6356 -2208461
34145b208461l042075Q8473K407347l44137l933198k270577K167130K468484q66461
34136e533475r66456L269946M966959O18260m382685m503682j552798M28887J878676
34127e776368M484944N831248K923115j662339k685326p673J592642j9832j776908
34118B903503j085016L20165K8314j023857p91959O4876l70102j489272j048201
34109b491549P34676J270744Q0687j62429J685870K740822O16954k240775k074193
34100A60807J89871M93188j608852k279641M574J742355K34384j840047q16921
34091c720282J857693J834148j232501k926406l54203L901310N124799J958892
34083F443450k427936l826882j202668K211333K285955j153761l734238j720783
$$ plain form
34145 -2208461 -5250536 -5162063 -2754716 -3098853 -7032051 -9302628 -7135498 -4667014 -5533475
34136 -5533475 -6499931 -3229985 1736974 2355234 -2027451 -6531133 -8083931 -7655044 -5776368
34127 -5776368 -1291424 4539824 7462939 5800600 3115274 3107601 4700243 4680411 2903503
34118 2903503 1818487 2138652 2166966 1143109 351150 416026 45924 -1443348 -2491549
34109 -2491549 -1756873 -486129 -405442 -567871 1117999 3858821 4475775 2235000 160807
34100 160807 350678 843866 -764986 -3044627 -3040053 -1297698 -1063314 -2903361 -3720282
34091 -3720282 -1862589 -28441 -1260942 -4187348 -4541551 -640241 4484558 6443450
34083 6443450 4015514 188632 -1014036 1197297 3483252 2329491 -1404747 -3125530
34075c125530L157079N565825K768346k581311n735057m554921p78427K231430
34067c052566K517033Q53333o02656q10155m69856l06691q2393K15795j20752
34058a858908p76823m9812K013498K116513j751025n697103l806633L382492Q390229
34049A962428O071988k73173m170573l983455k539138j453944o3118J190965P03709
34040b554311q27742q00682P20385O53014j539853j967255J383562M130056J420602
34031F17776m008298m808525M90803N124600L444982j798754m082392j757114
34023f776922J262852J676000K20080p26803k10642J126886K131780J754344k31142
34014B26433k499502k949199q86980J868500K692020J088587o22139j78764J506818
$$ plain form
34075 -3125530 31549 5597374 8365720 5784409 49352 -4505569 -5283996 -3052566
34067 -3052566 -535533 317800 -284856 -1095011 -1564867 -1871558 -1953951 -1738156 -1858908
34058 -1858908 -2635731 -2685543 -672045 1444468 -306557 -6003660 -9810293 -6427801 1962428
34049 1962428 8034416 7761243 3590670 -392785 -2931923 -4385867 -4448985 -3258020 -2554311
34040 -2554311 -3382053 -4182735 -3462350 -2809336 -4349189 -6316444 -4932882 -802826 617776
34031 617776 -3390522 -8199047 -7708244 -2583644 861338 -937416 -5019808 -6776922
34023 -6776922 -5514070 -3838070 -3617990 -4344793 -4555435 -3428549 -1296769 457575 226433
34014 226433 -2273069 -5222268 -6109248 -4240748 -1548728 -460141 -1082280 -1261044 245774
34005B45774J485419q81717k756165k046567m54104j66906J35366K573870N189560
33996C324530M268260O85967j216199j095259l005800p037271p147721q05467
33988a2028960N212516L911848j633108l282222J00213K471591R92050n00568
33980d756640J056561L144356K332441o62895k921689l267792k160040J64490
33972g071208L337404N678962N046381J193059k985887l429752N06503M005165
33964F280627J945455l823357o053029j943846L059137L526845J167368N1179
33956D210379l51898k151634l194235n45721L052637K690497p64854k518158j851489
33947a424476j790728k296214o83899K038699K154494Q9988m31288M39688o15391
$$ plain form
34005 245774 1731193 849476 -1906689 -3953256 -4407360 -4574266 -4438900 -1865030 3324530
33996 3324530 7592790 8278757 7062558 5967299 2961499 -4075772 -11223493 -12028960
33988 -12028960 -6816444 -2904596 -4537704 -7819926 -7719713 -5248122 -4256072 -4756640
33980 -4756640 -3700079 -555723 1776718 1113823 -1807866 -5075658 -7235698 -7071208
33972 -7071208 -3733804 1945158 6991539 8184598 5198711 1768959 2275462 6280627
33964 6280627 8226082 4402725 -1650304 -3594150 -535013 2991832 4159200 4210379
33956 4210379 3858481 1706847 -1487388 -2033109 1019528 3710025 2945171 427013 -1424476
33947 -1424476 -3215204 -5511418 -6195317 -4156618 -2002124 -1912136 -2343424 -1903736 -2519127
33938b519127k643626j321740K584903L598174J026663m6244J622768J388530
33930C690301j819083k754918M87067K556886K55553k185080j316960j68729j186031
33921b440994j070090K196423M245269J702148j798126k239348j462756j633647
$$ plain form
33938 -2519127 -5162753 -6484493 -3899590 -301416 725247 679003 2301771 3690301
33930 3690301 1871218 -883700 -396633 2160253 2415806 230726 -1086234 -1254963 -2440994
33921 -2440994 -3511084 -1314661 2930608 4632756 2834630 595282 -867474 -2501121
$$ [...]
##END NTUPLES=NMR SPECTRUM
##END=
