##TITLE=31Pdec_3MBPA2001
 aceton-d6, 64 sc
 20.1.2023
##JCAMPDX= 6.0         $$ Bruker NMR JCAMP-DX V2.0
##DATA TYPE= NMR SPECTRUM
##DATA CLASS= NTUPLES
##ORIGIN= UXNMR, Bruker Analytische Messtechnik GmbH
##OWNER= root
$$ XWIN-NMR		Version 3.5
$$ Fri Jan 20 16:03:56 2023 Russian Standard Time (UT+4h)  she@DPX200
##.OBSERVE FREQUENCY= 81.013821
##.OBSERVE NUCLEUS= ^31P
##.ACQUISITION MODE= SIMULTANEOUS
##.ACQUISITION SCHEME= undefined
##.AVERAGES= 64
##.DIGITISER RES= 16
##SPECTROMETER/DATA SYSTEM= spect
##.PULSE SEQUENCE= zgpg30
##.SOLVENT NAME= Acetone
##.SHIFT REFERENCE= (INTERNAL, Acetone, 0, 248.564)
##AUDIT TRAIL= $$ (NUMBER, WHEN, WHO, WHERE, WHAT)
$$ ##TITLE= Audit trail, XWIN-NMR		Version 3.5
$$ ##JCAMPDX= 5.01
$$ ##ORIGIN= Bruker BioSpin GmbH
$$ ##OWNER= she
$$ F:/spectra/data/she/nmr/P31/1/pdata/1/auditp.txt
$$ ##AUDIT TRAIL=  $$ (NUMBER, WHEN, WHO, WHERE, WHAT)
(   1,<2023-01-20 16:03:03.40 +0400>,<she>,<DPX200>,
      <continue with go, POWCHK disabled, PULCHK disabled
       configuration hash MD5:
       00 E9 B6 7A A2 85 ED C7 34 08 36 98 17 FE 4E 26
       data hash MD5: 32K
       11 27 C3 73 4F 90 30 AF 88 09 63 7A 8A 3B C1 F8>)
(   2,<2023-01-20 16:03:06.06 +0400>,<she>,<DPX200>,
      <Start of raw data processing
       efp BC_mod = 2 LB = 1 FT_mod = 6 PKNL = 1 PHC0 = -11039.73 PHC1 = 265.4578 SI = 64K 
       data hash MD5: 64K
       CE 41 0E 47 5A B5 EE 17 15 EE 6C C6 F4 F2 CD 0E>)
(   3,<2023-01-20 16:03:23.20 +0400>,<she>,<DPX200>,
      <pk PHC0 = -3.070572 PHC1 = -45.8 
       data hash MD5: 64K
       CD 16 5A E0 25 04 6B 08 C2 5C 67 46 50 5D F8 73>)
(   4,<2023-01-20 16:03:29.35 +0400>,<she>,<DPX200>,
      <abs ABSG = 5 
       data hash MD5: 64K
       3A AA F7 B2 35 F1 AF 3A 0A 7C A3 FB DA F5 B0 05>)
$$ ##END=
$$ 
$$ hash MD5
$$ 29 60 40 75 50 EA 1E 00 B4 3F E4 A0 73 75 DB A6
##$RELAX= 
##$RELAX= 
##$RELAX= 
##$RELAX= 
##$RELAX= 
##$RELAX= 
##$RELAX= 
##$RELAX= 
##$RELAX= 
$$ Bruker specific parameters
$$ --------------------------
##$DU= <F:/spectra>
##$EXPNO= 1
##$NAME= <P31>
##$PROCNO= 1
##$TYPE= <nmr>
##$USER= <she>
##$AMP= (0..31)
100 100 100 100 100 100 100 100 100 100 100 100 100 100 100 100 100 100 
100 100 100 100 100 100 100 100 100 100 100 100 100 100 
##$AQSEQ= 0
##$AQ_mod= 1
##$AUNM= <au_zg>
##$AUTOPOS= <>
##$BF1= 81.014009
##$BF2= 200.13
##$BF3= 200.13
##$BF4= 200.13
##$BF5= 200.13
##$BF6= 200.13
##$BF7= 200.13
##$BF8= 200.13
##$BYTORDA= 1
##$CFDGTYP= 0
##$CFRGTYP= 5
##$CHEMSTR= <none>
##$CNST= (0..31)
1 1 145 1 1 1 1 1 1 1 1 1 1 1 1 1 1 1 1 1 1 1 1 1 1 1 1 1 1 1 1 1 
##$CPDPRG= <waltz16>
##$CPDPRG1= <>
##$CPDPRG2= <waltz16>
##$CPDPRG3= <>
##$CPDPRG4= <mlev>
##$CPDPRG5= <mlev>
##$CPDPRG6= <mlev>
##$CPDPRG7= <mlev>
##$CPDPRG8= <mlev>
##$CPDPRGB= <>
##$CPDPRGT= <>
##$D= (0..31)
0 1 0 0 0 0 0 0 0 0 0 0.03 2e-05 3e-06 0 0 0 0 0 0 0 0 0 0 0 0 0 0 0 0 
0 0 
##$DATE= 1674216105
##$DBL= (0..7)
120 120 120 11 120 120 24 19 
##$DBP= (0..7)
150 150 150 150 150 150 150 150 
##$DBP07= 0
##$DBPNAM0= <>
$$ [...]
##$SUBNAM3= <"">
##$SUBNAM4= <"">
##$SUBNAM5= <"">
##$SUBNAM6= <"">
##$SUBNAM7= <"">
##$SUBNAM8= <"">
##$SUBNAM9= <"">
##$SW= 501.771253377433
##$SWIBOX= (0..15)
0 1 3 0 0 0 0 0 0 0 0 0 0 0 0 0 
##$SW_h= 40650.406504065
##$TD= 32768
##$TD0= 1
##$TE= 0
##$TE2= 300
##$TE3= 300
##$TEG= 300
##$TL= (0..7)
0 120 53 12 22 120 120 120 
##$TP= (0..7)
150 150 150 150 150 150 150 150 
##$TP07= 0
##$TPNAME0= <>
##$TPNAME1= <>
##$TPNAME2= <>
##$TPNAME3= <>
##$TPNAME4= <>
##$TPNAME5= <>
##$TPNAME6= <>
##$TPNAME7= <>
##$TPOAL= (0..7)
0.5 0.5 0.5 0.5 0.5 0.5 0.5 0.5 
##$TPOFFS= (0..7)
0 0 0 0 0 0 0 0 
##$TUNHIN= 0
##$TUNHOUT= 0
##$TUNXOUT= 0
##$USERA1= <user>
##$USERA2= <user>
##$USERA3= <user>
##$USERA4= <user>
##$USERA5= <user>
##$V9= 5
##$VALIST= <valist>
##$VCLIST= <CCCCCCCCCCCCCCC>
##$VD= 0
##$VDLIST= <DDDDDDDDDDDDDDD>
##$VPLIST= <PPPPPPPPPPPPPPP>
##$VTLIST= <TTTTTTTTTTTTTTT>
##$WBST= 1024
##$WBSW= 4
##$XGAIN= (0..3)
0 0 0 0 
##$XL= 0
##$YL= 0
##$YMAX_a= 1750
##$YMIN_a= -7939
##$ZGOPTNS= <>
##$ZL1= 120
##$ZL2= 120
##$ZL3= 120
##$ZL4= 120
##$ABSF1= 248.5645
##$ABSF2= -253.2056
##$ABSG= 5
##$ABSL= 3
##$ALPHA= 0
##$AQORDER= 0
##$ASSFAC= 0
##$ASSFACI= 0
##$ASSFACX= 0
##$ASSWID= 0
##$AUNMP= <proc_1d>
##$AZFE= 0.1
##$AZFW= 0.5
##$BCFW= 0
##$BC_mod= 2
##$BYTORDP= 0
##$COROFFS= 0
##$CY= -3
##$DATMOD= 1
##$DC= 0
##$DFILT= <>
##$DTYPP= 0
##$F1P= 0
##$F2P= 0
##$FCOR= 1
##$FTSIZE= 65536
##$FT_mod= 6
##$GAMMA= 0
##$GB= 0
##$INTBC= 1
##$INTSCL= 6.047779e-11
##$ISEN= 30
##$LB= 1
##$LEV0= 0
##$LPBIN= 0
##$MAXI= 10000
##$MC2= 0
##$MEAN= 0
##$ME_mod= 0
##$MI= 50
##$NCOEF= 0
##$NC_proc= -10
##$NLEV= 6
##$NOISF1= 182.463
##$NOISF2= 159.3651
##$NSP= 0
##$NTH_PI= 0
##$NZP= 0
##$OFFSET= 248.5645
##$PC= 4
##$PHC0= -11042.8
##$PHC1= 219.6578
##$PH_mod= 1
##$PKNL= yes
##$PPARMOD= 0
##$PSCAL= 0
##$PSIGN= 0
##$REVERSE= no
##$SF= 81.0140089999694
##$SI= 65536
##$SIGF1= 159.3651
##$SIGF2= -187.1042
##$SINO= 113.3802
##$SIOLD= 16384
##$SREGLST= <1H.CDCl3>
##$SSB= 0
##$STSI= 65536
##$STSR= 0
##$SW_p= 40650.406504065
##$SYMM= 0
##$S_DEV= 0
##$TDeff= 32768
##$TDoff= 0
##$TI= <>
##$TILT= no
##$TM1= 0
##$TM2= 0
##$TOPLEV= 0
##$USERP1= <user>
##$USERP2= <user>
##$USERP3= <user>
##$USERP4= <user>
##$USERP5= <user>
##$WDW= 1
##$XDIM= 65536
##$YMAX_p= 372551929
##$YMIN_p= -146048585
$$ End of Bruker specific parameters
$$ ---------------------------------
##NTUPLES= NMR SPECTRUM
##VAR_NAME=  FREQUENCY,     SPECTRUM/REAL,   SPECTRUM/IMAG
##SYMBOL=    X,             R,               I
##VAR_TYPE=  INDEPENDENT,   DEPENDENT,       DEPENDENT
##VAR_FORM=  AFFN,          ASDF,            ASDF
##VAR_DIM=   65536,         65536,           65536
##UNITS=     HZ,            ARBITRARY UNITS, ARBITRARY UNITS
##FACTOR=    0.620285442955139, 1,           1
##FIRST=     20137.2065510682, 0,            0
##LAST=      -20513.1999529968, 0,           0
##MIN=       -20513.1999529968, -146048585,  0
##MAX=       20137.2065510682, 372551929,    0
$$ Real data points
##PAGE= N=1
##DATA TABLE= (X++(R..R)), XYDATA
$$ [...]
##PAGE= N=2
##DATA TABLE= (X++(I..I)), XYDATA
12128c632673l0768742q272012J6136348K2666344K2198845K6141943J9516032
12121F3986085q736698l4570632k9505466l775506J1382314Q911866L813656M61127
12113A1966746n986556o552420R504784K5576140J4003565j9463602l8565964
12106i517307k6134190k171869J1453656J6018740J8017686J3037534M01938p222615
12098A3883573l225894J2528q413457j7528276j0023801R221210J5791239k508293
12090b791171k7411866l0398442q051978J2211637P333085r964368r838259J0553406
12082e8357956K4832693J9938443J1812566J0185445J092690j7750620j9771920
12075b8018659M144592J7480723m985257k5338112J049302M3898719L6604117
$$ y = [-3632673, -34401415, -42673427, -26537079, -3870735, 18328110, 44470053, 63986085, 55249387, 20678755, -8826711, -12602217, -1219903, 7691963, 11505619, 11966746, 5980190, -572230, 8932554, 34508694, 48512259, 29048657, -9517307, -35651497, -37823366, -26369710, -10350970, 7666716, 20704250, 21106188, 13883573, 10657679, 10670207, 2256750, -15271526, -25295327, -16074117, -282878, -2791171, -30203037, -60601479, -68653457, -56441820, -49108735, -59073103, -68911362, -58357956, -33525263, -13586820, -1774254, 8411191, 9503881, -8246739, -28018659, -23874067, -6393344, -11378601, -36716713, -35667411, 8231308, 44835425]
12068D4835425j6973249m4764624j7558074J3369411O087285j2118048m210197
12061c1332071J5722283J7818130N109509q900750k7883520m3430400k3436509
12054i6333328L0502051N8441994K2021583l0148474k9198072J5462846M0860954
12047A1609554K6642309N734241l425550j3161765k1699722j0049921J4106477
12040I755623J8727291k039305k1282152k4708385k3191649k0658063r148756
12033g2545396M255277L944851k105562N599971J8354454J2484975l134497J195388
12025c1950539J9873089J7923410n624423j3503627L656388J1343479n463451
12018c745674j6522782l154704R972827L566984l118863N554544J0627469r95597
$$ y = [44835425, 27862176, -16902448, -34460522, -21091111, -15003826, -27121874, -31332071, -15609788, 2208342, 7317851, -1582899, -29466419, -72896819, -96333328, -65831277, -7389283, 14632300, -15516174, -44714246, -29251400, 11609554, 38251863, 43986104, 40560554, 27398789, 5699067, -4350854, 9755623, 28482914, 26443609, 5161457, -19546928, -42738577, -63396640, -72545396, -68290119, -64345268, -66450830, -60850859, -42496405, -30011430, -33145927, -31950539, -12077450, 5845960, 221537, -13282090, -9625702, 1717777, -3745674, -20268456, -23423160, -13450333, -9883349, -13002212, -7447668, 3179801, 2184204]
12010B184204o246868J2104773K9837936K0090810m464954j8310999k0484458
12003A4710444j6859546J172777K8899731L2808612j601539l6733506l4107551
11996a1710578j0133405k534080q745010j055648J8684116K4991695J5438330
11989B4935420R066325P586924k995978j8612728k0529029q459955J85897m02674
11981i225798k442975m699677r178663o543779R683096K3504910J5895545n407593
11973A1585066j8725087j9864038j7681476j1280996L409368J5805411J3448691
11966b3303061K824293j806067J947852J0449684K0295492J6558931j5856188
11959A1110936n3806932m8129572K387574L5234285J5282803r971178P986605
$$ y = [2184204, -4062664, 8042109, 37880045, 57970855, 53505901, 35194902, 14710444, -2149102, -976325, 27923406, 60732018, 59130479, 22396973, -11710578, -21843983, -24378063, -33123073, -34178721, -15494605, 9497090, 24935420, 34001745, 41588669, 38592691, 19979963, -549066, -9009021, -8823124, -9225798, -11668773, -16368450, -25547113, -32090892, -22407796, 1097114, 16992659, 11585066, -7140021, -27004059, -44685535, -55966531, -52557163, -36751752, -23303061, -20478768, -22284835, -20336983, -9887299, 10408193, 26967124, 11110936, -42695996, -90825568, -88437994, -53203709, -37920906, -47892084, -39905479]
11952c9905479L6471184K3776349o537896j763776J9623854L068584l4871629
11945a38809l1624346M742418O718254k7429327k6782263K1428644M2812925O755743
11937c516761j9354457P872036L0689807l949441m8292996l5996875R986055K7482301
11929c5080331J6060137J2460161J2490607o543672k2510080j853228L1054852
11922F078446K7085480o595971k2384244j0298457J50871p21807N54559j89357
11914f320480j3772449k1308876k661886J6397939K201874k0102728j667865M1550273
11906e684198M5604315J461266k9911455j4826291P757881j251400k1567103j6277650
11898c4694635R397081K3023225J0954107j2729850k4250296p416855K7817838
$$ y = [-39905479, -3434295, 20342054, 13804158, 12040382, 31664236, 34732820, -138809, -31763155, -27020737, -20302483, -47731810, -74514073, -53085429, -10272504, -3516761, -22871218, -14999182, 15690625, 11741184, -36551812, -72548687, -62562632, -35080331, -19020194, -6560033, 5930574, -613098, -23123178, -24976406, 6078446, 33163926, 26567955, 4183711, -6114746, -5963875, -6685682, -6131123, -6320480, -20092929, -41401805, -44063691, -27665752, -25463878, -45566606, -47234471, -5684198, 39920117, 41381383, 11469928, -3356363, 4401518, 3150118, -18416985, -34694635, -25297554, -2274329, 8679778, -4050072, -28300368, -35717223, -7899385]
11891g899385M3823359J6741550k4755531l2556008n647245J2755424J487229
11884C949393j5964715j7128222p676472L192238J5512414J9372148N91013k6688794
11876b4840997k9635133o043884J2449033J1817491J0615047J6893398J3033912
11869D288867n233865j6364491j2282967r699088j0985727K401490K4799780K2841881
11861b34120n384861j7901084J756307J4694837m286761k0541546j331720K5351652
11853g877296K0859917K190157N088050J6002735m86898l0565012k7640015J1737210
11845a0691152M2661356L8070601J3360851j1887812l2774902m0058667k3339696
11838b4659421K748649R399575o079639j9023625j5400451l761077P151467J5002829
$$ y = [-7899385, 35923974, 52665524, 27909993, -4646015, -10293260, 2462164, 3949393, -12015322, -29143544, -36820016, -33627778, -18115364, 1256784, 1847797, -24840997, -54476130, -60520014, -48070981, -36253490, -25638443, -8745045, 4288867, -944998, -17309489, -29592456, -39291544, -50277271, -47875781, -23076001, -234120, -5618981, -23520065, -21763758, -7068921, -11355682, -31897228, -33228948, -7877296, 12982621, 15172778, 20260828, 36263563, 35776665, 5211653, -22428362, -10691152, 31970204, 70040805, 83401656, 71513844, 38738942, -1319725, -24659421, -21910772, -12511197, -18590836, -37614461, -53014912, -56775989, -49624522, -34621693]
11830c4621693J2872203n13104n970473J1731988L2498442K5361981l672105k2254742
11822A5432497k2410310k2900987k6590782j7062943K907604J1610155R537350
11815d9477416J7676903L0492122J7043091k0295638l5849764q440662K4467654
11808b4383710K4290353L292461p891669p641359p442821k084778J0181654P483802
11800d196067j8684876l3023475m637888L5732973L3334190q456946l2496715
11793c2428804j2077482J7051171J7367690n44863p109594M36048M899621M04315
11785a2001898n372654p595743o025425M4115N866039M90580j5506424k1949903
11777f2051313l966802K2343418K6320221K852161k0323229j8340971J895525
$$ y = [-34621693, -21749490, -22262594, -28233067, -16501079, 15997363, 41359344, 37687239, 15432497, -6977813, -29878800, -56469582, -73532525, -70624921, -59014766, -49477416, -31800513, -1308391, 15734700, -4560938, -40410702, -48851364, -24383710, -93357, 3199104, -4692565, -12333924, -19776745, -21861523, -11679869, -4196067, -22880943, -55904418, -60542306, -24809333, 8524857, 67911, -32428804, -44506286, -27455115, -10087425, -10632288, -17741882, -17305834, -12406213, -12001898, -17374552, -24970295, -30995720, -30951605, -25085566, -24594986, -40101410, -62051313, -66018115, -43674697, -17354476, -14502315, -34825544, -53166515, -51270990]
11770e1270990J5608626J2043682J644020k790495N41265P788980J6193624K0779014
11762B0537726J3806935m565875k1169625k3693208j5127227o117459J191139
11755c5137594R599699J2211301o19990j8379831j4818560J4728243L7653852
11748E237120K2210129j9249504m3703755k9727858J584876J7941043J0989215
11741c4718734m583020j2609108p209183P764082K1617509K3795356J4713738
11734H770640N608575K533170k810912j7562856k9222199j7466558J4479171L5836247
11726A65278K4696539k846773j3554873l40479J2398391N977812r391626j5899778
11718A204491j4785285j6750213j8274734p370115J2112303K2213029J7388118
$$ y = [-51270990, -35662364, -23618682, -21974662, -24765157, -24223892, -16434912, -241288, 20537726, 34344661, 29778786, 8609161, -15084047, -30211274, -36328733, -35137594, -25537895, -13326594, -13946584, -32326415, -47144975, -32416732, 5237120, 27447249, 8197745, -35506010, -65233868, -63648992, -45707949, -34718734, -39301754, -51910862, -59120045, -51355963, -29738454, -5943098, 8770640, 14379215, 16912385, 14101473, -3461383, -32683582, -50150140, -35670969, 165278, 24861817, 22015044, 8460171, 8119692, 20518083, 26495895, 17104269, 1204491, -13580794, -30331007, -48605741, -55975856, -43863553, -21650524, -4262406]
11711d262406J0523017R388832O624358P7206K257809J5822997J8826024m484794
11703E4773043l1948219k9005716M59794J8010777O664457p936811k882158O204571
11695A4339738l127525j7729991j0517660J0109082J0669246j0435684j6818854
11688b3511648N377380K0394522n21205k8838663k0205007J6033976L0995388
11681b75257J0818115p687845m44476P885532r991795l6096635l3901987l047069
11673g2741417K1408353J6332586n387846j5571573l85662K8708611M4460904
11666A6823956K9310740k627902j8558397p396151P581258M512290p954478j1607381
11658A0083935q641899r867443j0191159r61856O695904j541886j3270337n405816
$$ y = [-4262406, 6260611, 15649443, 22273801, 22351007, 24608816, 40431813, 59257837, 54773043, 22824824, -6180892, -5721098, 12289679, 18954136, 11017325, 8135167, 14339738, 11212213, -6517778, -17035438, -6926356, 3742890, -6692794, -23511648, -18134268, 2260254, 1739049, -27099614, -47304621, -31270645, -275257, 10542858, 2855013, 2410537, 10296069, 304274, -35792361, -69694348, -72741417, -51333064, -35000478, -40388324, -55959897, -56345559, -27636948, 16823956, 46134696, 43506794, 24948397, 17552246, 25133504, 29645794, 21691316, 10083935, 1442036, -8425407, -18616566, -19578422, -12882518, -14424404, -27694741, -33100557]
11650c3100557J5994412K2367523P022102p296678o714225k693236n156091o783656
11642a6360406k619682j447870p766098j1808714n965092M571480J1835425J1159410
11634a8401547j329073j9607319k1861695K674236K7971277K2472149n03457j923631
11626a0509060J6386881J1915519k4488884m6186678k2295095J6011730K7874144
11619c1291443J7793679P270728n926018k2765060j7620780J7289302L7334702
11612B085110N905153l9599804l7440448M975042K6664786Q502551q965248j50054
11604c8022912J3767606J4720624J4383391J7896391J0018266p073819p539736
11597A8149811R739738J1033650j3640006k6037721j234067K6887037J6804928
$$ y = [-33100557, -17106145, 5261378, 12283480, 4986802, -1727423, -4420659, -9576750, -16360406, -18980088, -20427958, -28194056, -40002770, -45967862, -41396382, -29560957, -18401547, -19730620, -39337939, -61199634, -58525398, -30554121, -8081972, -8585429, -10509060, 5877821, 17793340, -6695544, -52882222, -75177317, -59165587, -31291443, -13497764, -6227036, -12153054, -34918114, -52538894, -35249592, 2085110, 7990263, -31609541, -69049989, -64074947, -37410161, -28907610, -37872858, -38022912, -24255306, -9534682, 4848709, 22745100, 32763366, 25689547, 18149811, 27889549, 38923199, 25283193, -754528, -1988595, 24898442, 41703370]
11590D1703370j6294471k7097838q732535O593254L904995K296001J5023939K5988742
11582D3385457J6010145q526170k5267706k3565494j2962207p831029j0825291
11575b9582295j4095207j3111047j0844684o230105R143305L3097674M4203094
11568A2580735K7941949K095498n224718L292301j25056k2954386l9648307k9691352
11560e1733336m686486J1774970J2951116Q559718Q591147J3061244R817598j3004000
11552d668029m1443239l7344249J1437803N8439069N1166671N023868j8623293
11545B3988601k738401Q942428r326549k6990758j6792402Q89468K411677K228474
11537a7387462J5529855K1733386L136144j7451581j6426259j0499333j7472163
$$ y = [41703370, 25408899, -1688939, -10421474, -3828220, 76775, 2372776, 17396715, 43385457, 59395602, 50869432, 25601726, 2036232, -10925975, -18757004, -29582295, -43677502, -56788549, -67633233, -73863338, -64720033, -31622359, 12580735, 40522684, 42618182, 37393464, 40685765, 40560709, 17606323, -22041984, -51733336, -56419822, -44644852, -31693736, -23134018, -14542871, -1481627, 8335971, -4668029, -46111268, -83455517, -72017714, -13578645, 37588026, 42611894, 23988601, 21250200, 30192628, 20866079, -6124679, -22917081, -22027613, -19615936, -17387462, -1857607, 19875779, 23011923, 5560342, -10865917, -21365250, -38837413]
11530c8837413j4050677J8662281M3514755J9176418k4563553k7326956N522687
11523a7902458J5281395j0966239k4700716k684475J9097589J2652760k191492
11516a1413636n439431r086129j7933846r493241J9711482L4897646J9443918
11509B0686763N259391J4340159J6194793j4679842m1419828j8486788K7978413
11502I873061L3953822l855334k4890854j95477K7416111J4643016j8781876k5715754
11494A2446715Q46961K6265554K3684835q01778k4969702l2820168k2433869m703901
11486b2485353O085560O810610O806570J0347598P114901j0465795k9270121k9354959
11478e4410989j1517247M841371J0320023J4161277K1163866K0124013N722564
$$ y = [-38837413, -52888090, -34225809, 9288946, 28465364, 3901811, -23425145, -17902458, -2621063, -13587302, -38288018, -40972493, -21874904, -9222144, -11413636, -16853067, -25939196, -43873042, -53366283, -33654801, 1242845, 20686763, 25946154, 40286313, 56481106, 41801264, 381436, -18105352, 9873061, 43826883, 39971549, 15080695, 14885218, 42301329, 56944345, 38162469, 12446715, 13293676, 39559230, 63244065, 62442287, 37472585, 4652417, -17781452, -22485353, -16399793, -9589183, -2782613, 7564985, 14679886, 4214091, -25056030, -54410989, -65928236, -61086865, -50766842, -36605565, -15441699, 4682314, 10404878]
11471A0404878o948274o133834m744544j5749318k1547868Q26922L2522046L0057954
11463A8687962p160831k8098468l981545K9108805K7685881M780943q68674Q389637
11455D8543710j53390k6350235l3851058r786746J6178435K0194876J3104334
11448B7879926Q733481j375489k2687187l5438326k0705208R214153K6117292
11441h261358J9228585j155402k0880064k9280030k0365839L30763J7673661K3866864
11433a8842820K4461771K2466703J0917974r851684k2709327j5015071J857544
11426f714910Q495778M214072K828180P468147O218752o420322j7897615j4415712
11418a6223630j701490J190491j0996727j9419294o684316J5304250K0130640
$$ y = [10404878, 3456604, -2677230, -7421774, -23171092, -44718960, -43892038, -11369992, 18687962, 11527131, -16571337, -20552882, 8555923, 36241804, 41022747, 40154073, 48543710, 48390320, 22040085, -11810973, -21597719, -5419284, 14775592, 27879926, 36613407, 35237918, 12550731, -22887595, -43592803, -34378650, -8261358, 10967227, 9811825, -11068239, -40348269, -60714108, -60383345, -42709684, -18842820, 5618951, 28085654, 39003628, 29151944, 6442617, -8572454, -6714910, 1780868, 5994940, 8823120, 16291267, 22510019, 16089697, -1807918, -16223630, -17925120, -16734629, -27731356, -47150650, -53834966, -38530716, -18400076]
11411a8400076P244060L238448J6189514J8596711m294049j9391361N767688M1770706
11403E0721641L1769104k1202356n3140289l1359568K976353L750995j4673560
11396c1157680j2287795J1525239K6093030K1217709J3475064J1396503O949634
11389D7211704j702523n129810q12457K145696l416100j6565571l1299917l5428416
11381d4997394j5906606K0984564M4794081L3479593L674434r622509J420910
11374C3827073J1678969J788843j7401475k5146127j9589048j4024287j2188910
11367d1054962k746066J7814446K9665927J2564712j8788635k4013897Q967390
11360a7591085M0550548K9807076r227831k9024748j4121939P784873J4141216
$$ y = [-18400076, -11156016, -7917568, 8271946, 26868657, 22574608, 3183247, 8950935, 50721641, 82490745, 61288389, 8148100, -23211468, -20235115, -16484120, -31157680, -43445475, -31920236, -5827206, 15390503, 28865567, 40262070, 47211704, 45509181, 40379371, 39566914, 41712610, 38296510, 21730939, -9568978, -44997394, -60904000, -39919436, 4874645, 38354238, 42028672, 32406163, 33827073, 45506042, 47294885, 29893410, 4747283, -14841765, -28866052, -41054962, -43801028, -25986582, 3679345, 16244057, -2544578, -26558475, -17591085, 22959463, 52766539, 43538708, 14513960, 392021, 8176894, 22318110]
11353B2318110R855797N11648j7879360l4535768k7383867l265550L094001j3841815
11345f1126804j4774063J9353343M7289498K7509277j5339045k6934311l291365
11338b7313470J1582904l437601k2490255j9339026q00113J3368767J6362362
11331c2066432J1363960J816072p342055r904544m307828N493762J3371595J3446546
11323h128924O529731M116960J2906546J7058349k795169l2521567l5655666p609228
11315d6098968J5182616J2327832P948578K2163550L3014709J6161152j1645006
11308D9054463k2332141k0129445k1471184j9845252o097021M011459r38688L83897
11300c7363912K3201537M0115423K5471875L581432M974208Q927615j4062859
$$ y = [22318110, 32173907, 32685555, 14806195, -19729573, -47113440, -50378990, -47284989, -61126804, -75900867, -56547524, -9258026, 18251251, 2912206, -24022105, -27313470, -15730566, -19168167, -41658422, -60997448, -61797561, -48428794, -32066432, -20702472, -18886400, -26228455, -36132999, -40440827, -34947065, -21575470, -8128924, -1599193, 2517767, 15424313, 32482662, 29687493, -2834074, -38489740, -46098968, -30916352, -18588520, -10639942, 11523608, 44538317, 60699469, 49054463, 26722322, 6592877, -14878307, -34723559, -40820580, -36809121, -37747809, -37363912, -14162375, 25953048, 51424923, 55006355, 59980563, 68908178, 54845319]
11293E4845319l6399010j7491474J4623385L360895l3901976k9121543J7448331
11286b6636073L2696024o011083l3597390q147234K5394488J9935896M7496M143769
11278G825893J4885899o41816k8112398l2481166j2726623R167500K2620724K1703342
11270B241355r85155k7235761k0288551J4461779K2172075j6601309m4947712
11263g1183279j5492875L2065836L2200238q158924l1253393j8882107j557602
11256h2262106L837326Q934249J5674924J2173367K831299L706673J2938111J7121384
11248e044773J6751800J6783731Q156381j1352649j8098056K463076K3693476
11241C3352986J6831691j500369j695184L547107j4587958l9368468k8711244
$$ y = [54845319, 18446309, 954835, 15578220, 18939115, -14962861, -44084404, -26636073, 6059951, 48868, -33548522, -41695756, -16301268, 3634628, 3682124, 7825893, 22711792, 22069976, -6042422, -38523588, -51250211, -42082711, -19461987, 2241355, 1256200, -25979561, -46268112, -31806333, -9634258, -26235567, -71183279, -86676154, -54610318, -22410080, -30569004, -61822397, -80704504, -82262106, -78424780, -69490531, -53815607, -41642240, -38810941, -35104268, -22166157, -5044773, 11707027, 28490758, 36647139, 25294490, 7196434, 9659510, 33352986, 50184677, 48684308, 46989124, 50536231, 35948273, -3420195, -32131439]
11234c2131439J2807643L6947063K3885847K39068j3655445k2902047k2696458
11227a7505768K586869L5756077L3577626p357571l8196028k9489721j0548072
11220c1176588j4029224k3818137j0185461J6668535K5343375J4297707Q383952
11213a4515841J5333231J7661047N609640q067871j0657398p841848j0283649
11206a2762689j2841713k97304K6275185M1092757K2064893j7898606m2464054
11199C168469l4144245r127718J0488643J8429643J4172385l437658k1870542
11192b2321023j9555701J222682J1572760O38445p028640K975909P524867q964414
11184c3935115j9228360N33180K3861720J7803741K167874J3795766L7846152
$$ y = [-32131439, -19323796, 17623267, 41509114, 41748182, 28092737, 5190690, -17505768, -14918899, 20837178, 54414804, 47057233, 8861205, -20628516, -31176588, -45205812, -69023949, -79209410, -62540875, -37197500, -22899793, -14515841, 817390, 18478437, 24088077, 16020206, 5362808, -2479040, -12762689, -25604402, -25901706, 373479, 41466236, 63531129, 45632523, 3168469, -30975776, -40103494, -29614851, -11185208, 2987177, -450481, -22321023, -41876724, -40654042, -29081282, -28442837, -35471477, -32495568, -24970701, -33935115, -53163475, -52630295, -28768575, -10964834, -8796960, 4998806, 42844958]
11177D2844958L2043608P95348j4175947m266543L965608N871480J5985875J7767336
11169A00831723j6379449n9077172n4030729j0186275N934058j9632153k7615588
11162h0155585N445527K3119953r566306m1001360j9387739K4663674L8094514
11155e8787322K8493787K8239906K8104305Q785610o239382P609413K0643564
11148E6849881j995844l2114242k4458786K236810j06615k1028326j3268641J6428977
11140a7456786J6483674j6524375l0480826o794569J4836651J1423944R021283
11133a9491004K2021297K2289311m826139k6012221j1791593J7721945K6430007
11126B6341603R015673j7685395l9339602m1305833j1891081L2033504N0162451
$$ y = [42844958, 74888566, 75683914, 61507967, 57241424, 61207032, 67078512, 83064387, 100831723, 84452274, 25375102, -28655627, -38841902, -32907844, -52539997, -80155585, -74710058, -51590105, -61156411, -102157771, -121545510, -96881836, -58787322, -30293535, -2053629, 26050676, 34836286, 28596904, 36206317, 56849881, 54854037, 22739795, -1718991, 517819, 411204, -20617122, -33885763, -17456786, -973112, -17497487, -47978313, -54772882, -39936231, -28512287, -19491004, 2530293, 24819604, 19993465, -6018756, -17810349, -88404, 26341603, 35357276, 17671881, -21667721, -62973554, -74864635, -42831131, 7331320]
11119G331320K7594483n914961j9114857j4829784r027937l499882L259447L823702
11111a0378469j824649j1776J2223122J8823652J2507598O134769N434827j527520
11103D1381554j5302176j6538144k033560L482771r267569j3406954P058590K4468757
11095A9843269J3106738n187322P89223J6212550P964517j3652247j1534452J0967530
11087C8509806J2294200j6831533l5644303j8290999P678454Q879544l471136
11080f875967J223607K1006573K5565105L051991k3218545k6240163p128272J0123122
11072b492549Q102207o479999j5036498j1214282m531974j161630M719990J4230166
11064a3864569J4497261l79051j3450841q494845L008265J321575o021408K420654
$$ y = [7331320, 34925803, 29010842, 9895985, -4933799, -13961736, -17461618, -14202171, -10378469, -12203118, -12214894, 8228, 18831880, 31339478, 37474247, 42909074, 41381554, 26079378, 9541234, 7507674, 10990445, 1722876, -11684078, -4625488, 19843269, 32950007, 27762685, 28551908, 44764458, 52728975, 39076728, 27542276, 38509806, 50804006, 33972473, -1671830, -19962829, -12284375, -3404831, -6875967, -5652360, 15354213, 40919318, 43971309, 20752764, -5487399, -12615671, -2492549, 5609658, -870341, -15906839, -27121121, -31653095, -32814725, -28094735, -13864569, 632692, 253641, -13197200, -21692045, -18683780, -17362205, -23383613, -20962959]
11056b0962959J8711270J1216535k1282569l6685586p057620L9379852N4994634
11049C8313557L0604644m895673k5617063k6118882j0106784J3495041K7310856
11042D2985696J8372458n267900k2190682j9164057J534341K6465104L4385312
11035G7120272J0470566k9068145m3219813j5767642J8362063J9999759M60762
11028C8357822l722151N318672n777328l4335213l5699529J429911K5575031j185488
11020a0038273m0297212l2284401J4713232M0105328J8772937j4111707k2168092
11013d5308188p813475J0800934K4173063K3977086M847790j5640206r355488
11006a4318484J8443389K7766143Q79006k9256800k6363361J082858K1827988
$$ y = [-20962959, -2251689, 8964846, -12317723, -49003309, -56060929, -16681077, 38313557, 68918201, 64022528, 38405465, 12286583, 2179799, 15674840, 42985696, 61358154, 56090254, 33899572, 14735515, 16269856, 42734960, 77120272, 87590838, 58522693, 15302880, -464762, 17897301, 37897060, 38357822, 34635671, 39954343, 34177015, -158198, -35857727, -34427816, -8852785, -10038273, -50335485, -82619886, -67906654, -27801326, -9028389, -23140096, -45308188, -53121663, -42320729, -18147666, 5829420, 10677210, -4962996, -14318484, 4124905, 31891048, 32770054, 3513254, -22850107, -21767249, 60739]
10999F0739K6584150K3862693J2610742r670615k5928085j7958451K805778J0375425
10991B2742376J536169q336766j5668428k3679176j7250311J8673147N8464207
10984C6481218N5232251P183978l4327177l3797325j0887358L076261P793799
10977C0755647J1001619J526706k2697108l1258584l244799L1071636K9436421
10970D6591538L99543j3680531l343236J603459j2639955k4832339j7953848o53624
10962b4508993J5638420K8345416K8961994R804610j1131364p361776J0087285
10955D9835592L465263k7954535m0312992j5914843P376767J909606m808674J2747240
10947a3656576K4753299O80898k3902306J75434M3793756L4242742k7498993o1171490
$$ y = [60739, 26644889, 50507582, 63118324, 53447709, 27519624, 9561173, 12366951, 22742376, 24278545, 15941779, 273351, -23405825, -40656136, -21982989, 36481218, 91713469, 98897447, 64570270, 30772945, 19885587, 22961848, 30755647, 41757266, 43283972, 20586864, -10671720, -13916519, 17155117, 46591538, 46991081, 33310550, 29967314, 31570773, 18930818, -5901521, -23855369, -24508993, -8870573, 19474843, 48436837, 58241447, 47110083, 39748307, 49835592, 53300855, 25346320, -14966672, -30881515, -23504748, -21595142, -26403816, -13656576, 11096723, 11777621, -12124685, -11949251, 31844505, 66087247, 38588254, -22583236]
10939b2583236k8336377J4809060J2285489j0619610l956708K2339050K4794397
10932H732065K609580q874453j855901Q8683o713840j416163J4127983J1259697
10924A7957651j2460629j9846362O590789K9130797Q269211l4420021m3045781
10917d7824345n702398L0538853K6035261j666813j0044981Q253497K1572101
10910B1161175P853900j7474238k6980193j5767164P84482J1016040J3976439
10903e429559R638767j399220r799391m461724R511775J2785161l039141k2558251
10895a4751583k5294050r632403Q320846J4304477Q305377M19476j044841K598222
10887a6774479L896087j5284m500091o499319p855702m922397J1931396L6748922
$$ y = [-22583236, -50919613, -36110553, -23825064, -34444674, -38401382, -16062332, 8732065, 11341645, 2467192, 611291, 699974, -6013866, -7430029, 6697954, 17957651, 5497022, -14349340, -7758551, 21372246, 29641457, -4778564, -47824345, -53526743, -22987890, 3047371, 1380558, -8664423, -410926, 21161175, 29015075, 11540837, -15439356, -31206520, -30422038, -19405998, -5429559, 4209208, 2809988, -6989403, -11451127, -1939352, 10845809, 7806668, -14751583, -40045633, -49678036, -41357190, -27052713, -18747336, -18327860, -19372701, -16774479, -12878392, -12893676, -17393767, -23893086, -31748788, -36671185, -24739789, 12009133]
10879A2009133M0760883P906823l2784599l7645351p182889J5827014Q636202
10872G527216m562467J881537J5840505J3561802j307704r188327o417770j933906
10864A5400886L474297J1483269J1058179p616138l0168446l0106680k859863
10857b9334496K6990121L2660741J1430478j3826879j6684282L731077J8971058
10850C3937818Q691108p356806K86939J7392432L699266l5292777m5832819j0672677
10842c5147516J9372123Q135236q589101P172715K4006275J049943k7753654o475964
10834a8229943L8625464L4683587j4482799l2465815J878354K3312946n244793
10827B8077001l5144175k1763373P171457J5374328J9378701L6191257L2690448
$$ y = [12009133, 52770016, 60676839, 27892240, -9753111, -16936000, -1108986, 7527216, 2964749, 4846286, 20686791, 34248593, 32940889, 23752562, 17334792, 15400886, 18875183, 30358452, 41416631, 33800493, 3632047, -26474633, -29334496, -2344375, 30316366, 41746844, 27919965, 11235683, 14966760, 33937818, 42628926, 35272120, 35559059, 52951491, 56650757, 21357980, -24474839, -35147516, -15775393, -7640157, -16229258, -9056543, 14949732, 15999675, -11753979, -18229943, 20395521, 55079108, 40596309, 8130494, 10008848, 33321794, 28077001, -7067174, -28830547, -21659090, -6284762, 13093939, 49285196, 81975644]
10820H1975644j4245343n8513382m7829246o090290Q216852p443197j2461488
10813e6390450M95386N490421K080516J2407146K9436558K5285616N218162n95645
10805B3427710N437047o372535l1328629l0124273L413231K8179542K1822433
10798A4454526J0684220J6559828K0475044K613580k2018722l2875357l3995336
10791b4102217l0820455j1307993K2085070L4015776L926812l3208347l0482307
10784f9893661M928848K7039870K0005705J1572717K0161402K7839351J5426346
10777E7080578o497540j6972063j3600316p053838k939810l771404j4952524l1899089
10769d0606006l2113283q17174L9749856M8474881J6230344k0559218k5339418
$$ y = [81975644, 67730301, 9216919, -38612327, -44702617, -36485765, -43928962, -56390450, -55895064, -50404643, -48324127, -35916981, -6480423, 18805193, 24023355, 23427710, 28864757, 22492222, -8836407, -38960680, -35547449, -7367907, 14454526, 25138746, 41698574, 62173618, 64787198, 42768476, 9893119, -24102217, -54922672, -66230665, -44145595, -10129819, -6203007, -39411354, -69893661, -64964813, -37924943, -17919238, -6346521, 13814881, 41654232, 57080578, 50583038, 33610975, 20010659, 12956821, 10017011, 6245607, -8706917, -40606006, -72719289, -73536463, -33786607, 14688274, 30918618, 10359400, -14980018]
10762a4980018l314918J4766240J5393014R382922N374734Q7080m933397N88505
10754B2364162J5692980K2275566R169291j1729763k3638752k6384647k7370509
10747a9621672k2265849j523143K7709354M1802259K6136122p491941l1892428
10740A2852702l0017856r677407N161313j325090k0461450k8316429j0071675
10733h1855892K6637245N8097916N9797671K3424635l0337957o1728471m8724792
10726e4689645j1594119J1686078R078884k237571q475871j0771674o400974J2722089
10718f0682803L6525505L8366222J1529335j7398327k2748085q477517N986061
10711a6899609Q973716j652852j8680183k1554631L177981L2356201K7828957
$$ y = [-14980018, -18294936, -3528696, 11864318, 21247240, 26621974, 26709054, 21775657, 22364162, 38057142, 60332708, 69501999, 57772236, 34133484, 7748837, -19621672, -41887521, -43410664, -15701310, 26100949, 52237071, 44745130, 12852702, -17165154, -26842561, -21681248, -23006338, -43467788, -71784217, -81855892, -55218647, 2879269, 62676940, 86101575, 55763618, -5964853, -54689645, -66283764, -54597686, -45518802, -47756373, -56232244, -67003918, -73404892, -60682803, -24157298, 14208924, 25738259, 8339932, -14408153, -22885670, -16899609, -7925893, -9578745, -28258928, -49813559, -46635578, -14279377, 13549580]
10704A3549580m959756j7733867P219106K7835305J1554866j0974939l64825K2404536
10696D8530006J2270419k1213602k8215334k047J8808675O75379k8942671l4886751
10688c2975926j5090563J0235625K4543507K1598001O902632l251921L44471N821015
10680A8126841j092054j4038074j9438048j9235253j9045784j0324257R879489
10673e5167140J9684585L927064j2935317j047518K4352321K6611705P199949
10666A2625649k846018K70571o541462k1964785k0116546k189488J693048j2537202
10658e1606233j4322796O231535K0546565J0987881m125610p022279k658736N376296
10650c6593377K1396459L1758517J4348875j7642251k5264663n252480N719591
$$ y = [13549580, 8589824, -9144043, -1924937, 25910368, 37465234, 26490295, 26125470, 48530006, 60800425, 39586823, 11371489, 11369442, 30178117, 30853496, 1910825, -32975926, -48066489, -37830864, -13287357, 8310644, 15213276, 11961355, 12305826, 18126841, 17034787, 2996713, -16441335, -35676588, -54722372, -65046629, -55167140, -35482555, -31555491, -44490808, -45538326, -21186005, 5425700, 12625649, 9779631, 10050202, 3508740, -18456045, -38572591, -40762079, -39069031, -51606233, -65929029, -59697494, -39150929, -28163048, -32288658, -39310937, -41969673, -36593377, -15196918, 16561599, 30910474, 13268223, -11996440, -17248920, -11529329]
10643a1529329l116345j236893J8144644J8154196j1123078k2758698R133295
10636d332208L7037524J2214740l6496110m7371755j4870503J5948243J8341104
10629a9528965K093191j6298903k2550196l735599K7761228L2597845j460693
10622a122092l1280979j7478395J9056429L6576872L4519216L2228676J9325093
10615I1824820j9211106n4298600m6478468j1372340L512538o761314q637949
10608e1422419L274770K586107j0462955n781388J8206867K7200996R000044j0468792
10600a7866770j5803018j8466547j7628469M476725L6234719L6646975J608k6726164
10592a9130941j3488789J0038332Q014381n988710l72463J9269626K2495619K252659
$$ y = [-11529329, -14645674, -15882567, 2262077, 20416273, 9293195, -13465503, -4332208, 32705316, 44920056, 8423946, -38947809, -53818312, -37870069, -19528965, -17435774, -33734677, -56284873, -60020472, -32259244, 338601, -1122092, -32403071, -49881466, -30825037, 5751835, 40271051, 72499727, 91824820, 72613714, 18315114, -28163354, -39535694, -36023156, -42784470, -51422419, -48147649, -45561542, -56024497, -61805885, -43599018, -16398022, -7397978, -17866770, -33669788, -52136335, -69764804, -65288079, -29053360, 7593615, 7595223, -19130941, -32619730, -22581398, -14567017, -20555727, -20928190, -1658564, 20837055, 23089714]
10584B3089714j9494920k2408366l648195K4120553L6607387J6733858j8641221
10577C6358810l1973037j6207143n456393j9271220k9085224o350828K6301250
10570d5683785K7837462J066176j6908927j2281429k457535N217847K0034639
10563b3175552L3085059J8678196j8977926l8380694j7180070J5876973K5515145
10556d558869J6828380J2165735Q196527r485738k7079755j7574372J1732020
10549i776072K5134981J2248384j125619k50245q39812j0237227r046223R151884
10541A5260051J7686486J951566j1797824l714209J024499j9357656l3373132
10534c2320219p041700K7276657J6805612j9271907j6673393K5361233M2378606
$$ y = [23089714, 3594794, -18813572, -22461767, 1658786, 38266173, 55000031, 36358810, 4385773, -11821370, -17277763, -36548983, -65634207, -71985035, -45683785, -17846323, -16780147, -33689074, -45970503, -48428038, -43210191, -23175552, 9909507, 28587703, 9609777, -28770917, -45950987, -30074014, -4558869, 12269511, 24435246, 32631773, 23146035, -3933720, -21508092, -9776072, 15358909, 27607293, 26481674, 26231429, 25391617, 15154390, 6108167, 15260051, 32946537, 34898103, 23100279, 19386070, 20410569, 1052913, -32320219, -39361919, -12085262, 4720350, -14551557, -31224950, -5863717, 36514889]
10527C6514889J4573481n368170Q443503J2097918k0001528m4165492k7888205
10520b5793604p005618j2233163j0829065J9859945L2528932n350520l5484587
10513d4307680k568324L8169258Q486874m8829596l2295045M2054096N7673255
10506A8382838j0855230n4913838q672599N1819988L9175291j6089645l4862912
10499a6016107j1658806N435090L585960M374047Q406220L93435j1907552r919808
10491b7307521J167214L591810m381784j4635405k2577413j8118546P709933L3707959
10483d0843753K3859027j2906816k3391524R412195L7974513K9815921J8294178
10476D2213741L3277212L8427394m743157n6522034n0947551J256036K9945137
$$ y = [36514889, 51088370, 45720200, 54163703, 66261621, 46260093, 2094601, -25793604, -32799222, -45032385, -55861450, -36001505, -3472573, -8823093, -44307680, -46876004, -8706746, -219872, -49049468, -81344513, -39290417, 18382838, 7527608, -47386230, -56058829, -4238841, 34936450, 18846805, -16016107, -27674913, -22239823, -18653863, -14279816, -5873596, -5480161, -17387713, -27307521, -26140307, -22548497, -26930281, -41565686, -64143099, -82261645, -74551712, -40843753, -16984726, -29891542, -53283066, -43870871, -5896358, 23919563, 42213741, 75490953, 113918347, 109175190, 52653156, 1705605, 2961641, 32906778]
10469C2906778R567522j8276921j9622250o515909J098365J742059m419885j7618343
10461b1138584k0872667K613572L3950661L6418805Q746851j4806579j7304828
10454G607231j5566236k1297131k1934219p964440J0691919K3119244K7398598
10447B054966J9144941m202510k5311288k0101721O478749K2791351J3711914
10440A4566402j829626k217424R371922J5893378Q182643r115629k1005027j2475440
10432A371199J2066724K5556500R680026j9022822l2236752k7551715k0596245
10425e0733085j2356023N988407K4272391K2843883P967366M897818J5628890
10418A8509647J6477593N60102j0571245m517151L891086J384915n288599r717165
$$ y = [32906778, 42474300, 24197379, 4575129, -1940780, -842415, 899644, -3520241, -21138584, -42011251, -39397679, -5447018, 30971787, 39718638, 24912059, 7607231, -7959005, -29256136, -51190355, -59154795, -48462876, -25343632, 2054966, 21199907, 16997397, -8313891, -28415612, -21936863, 854488, 14566402, 12736776, 10519352, 19891274, 35784652, 43967295, 34851666, 13846639, 1371199, 13437923, 38994423, 48674449, 29651627, -2585125, -30136840, -50733085, -63089108, -57100701, -32828310, -9984427, -2017061, 2880757, 18509647, 34987240, 35547342, 24976097, 20458946, 24350032, 25734947, 20446348, 10729183]
10410A0729183j7754055k8022764k5407975n799357J4533909K3629893K5878037
10403b213129K2384899N413017j7445354k0946942J018033K0606957J4079797
10396B2897278p409998k0765833k2059525j6952800k715005J7948871K4156620
10389d900392L221080k3135691k3370983J107625J9494711J2888179o773255j6408893
10381c7877619n806543J5664903K6259013J1179025j7188128k8088686j0854109
10374d6712144Q920244N495145r548359o977595J3644676K3678490R657460q529195
10366a0371278j0152857j993847j355940p049528m964569N271342Q613498J134111
10358b0869068L35774J7558788L2416023J5004476k7669212n0592853k6699225
$$ y = [10729183, -7024872, -35047636, -60455611, -66254968, -51721059, -28091166, -2213129, 20171770, 25584787, 8139433, -12807509, -11789476, 8817481, 22897278, 15487280, -5278553, -27338078, -44290878, -47005883, -29057012, -4900392, -1679312, -24815003, -48185986, -47078361, -27583650, -14695471, -21468726, -37877619, -43684162, -28019259, -1760246, 9418779, -7769349, -35858035, -46712144, -37791900, -32296755, -41845114, -48822709, -35178033, -11499543, -1842083, -10371278, -20524135, -22517982, -23873922, -30923450, -35888019, -30616677, -22003179, -20869068, -20533294, -2974506, 29441517, 44445993, 16776781, -33816072, -60515297]
10351f0515297J5891017L1211503J4406187k134101j276352K803236O01675L988658
10343D976526J5797611J4700938r653557l1763955k4810813j066063Q332726j60302
10335b3646889m268256M615435J2747705J2520863J1935177J2666261M307825
10328C0878121j1641094j4948163L003564J9742456R751568j8325676l0563197
10321a2102421j1311984J7609043K4931443O423294j3986571j4334334L021752
10314B50222J9620268K3180841J5682598L824935r251439k1129444k6013431j8480625
10306a2316075j90736J8597675K4524749J1642877j0358532k2650410j7144404
10299g894856n119808L4522O97958M890880P497369o14550j0629388n601141Q869535
$$ y = [-60515297, -44624280, -13412777, 993410, -1140691, -2417043, 386193, 987868, 4976526, 20774137, 35475075, 25821518, -5942437, -30753250, -31819313, -23486587, -23646889, -27915145, -23299710, -10552005, 1968858, 13904035, 26570296, 30878121, 19237027, 4288864, 7292428, 27034884, 36786452, 18460776, -12102421, -23414405, -5805362, 19126081, 25549375, 11562804, -2771530, 250222, 19870490, 43051331, 58733929, 62558864, 53307425, 32177981, 6164550, -12316075, -12506811, 6090864, 30615613, 42258490, 31899958, 9249548, -7894856, -13014664, -12980142, -12282184, -7391304, 106065, -508485, -11137873, -16739014, -7869479]
10290g869479R344387o256407j2135980K696049J4003488J794217j6522749j5760457
10282c0706931k727433J402143n10674P325556J7824067J1127900o311647p517619
10274a0094638J0793474K2008727J1034288o822469j3291117p750154L612134
10267I490245J4260466J0507717j4514911l7429708k5873769J1618548L0704747
10260a236665J4820896l760716r67556K264720j4214783k6845609r026178J6258169
10252b2707722R849060j7175295j8567219J3757818L7954633K5766522l345769
10245B5532028j9854997k0551237j4752935l418480J2368438K2762747K2135600
10238B4221164J5980230Q250852k674206j2024199j0634396j992684J520051P87063
$$ y = [-7869479, 1474908, -4781499, -16917479, -14221430, -217942, 1576275, -14946474, -30706931, -33434364, -32032221, -32542895, -25217339, -7393272, 3734628, -2577019, -10094638, 698836, 22707563, 33741851, 26919382, 13628265, 5878111, 9490245, 23750711, 34258428, 19743517, -17686191, -43559960, -31941412, -1236665, 13584231, 9823515, 8855959, 11120679, -3094104, -29939713, -38965891, -22707722, -12858662, -30033957, -48601176, -34843358, 3111275, 28877797, 25532028, 5677031, -14874206, -29627141, -33045621, -20677183, 2085564, 24221164, 40201394, 48452246, 45778040, 33753841, 23119445, 21126761, 22646812, 23433875]
10230B3433875O308866J1598820j573394k5700433k7206123K858492K8462673
10223A8182776J8792521q623820j9297158j2139343r305441j4304877j2814929
10216c9510271m605137l011410p014100k094378J2329202K1356224K0193695J7979653
10208A5623478J5941498N191154j1641365j9619483j6351731j5207639j8263718
10201d4327806r810076J3011846K6227380J2292295j0738415j3783015J629841
10194b5497950R304745P83792l030809J2242058K8471880J9912979q195544k5219764
10186H771387j6787594j532259q56553j0049045j2482773p633321n066144k73029
10178d5909331J7909249L7951984L2048591j552215k9193183k7085921j1499077
$$ y = [23433875, 29742741, 41341561, 39768167, 14067734, -13138389, -10279897, 18182776, 36975297, 28351477, 9054319, -3085024, -12390465, -26695342, -39510271, -44115408, -47126818, -54140918, -56235296, -43906094, -22549870, -2356175, 15623478, 31564976, 36756130, 25114765, 5495282, -10856449, -26064088, -44327806, -54137882, -41126036, -14898656, -2606361, -13344776, -27127791, -25497950, -16193205, -15409413, -18440222, -6198164, 22273716, 42186695, 33991151, 8771387, -8016207, -9548466, -10405019, -20454064, -32936837, -40570158, -45636302, -45909331, -28000082, 9951902, 42000493, 40448278, 11255095, -15830826, -27329903]
10171b7329903p090689q582591K207621J8929863J8975359J202221j0758972j887698
10163a4334789J6872795K4797216J2024599j2885816k6874527j2630148J5726608
10156B695938K1434597p790110l9201899l8684789j5032322J841985O110253J0204890
10148e8421457J2156225L468040l682400O688757K0611180J3886098m469249p808069
10140a7570875q94411q621242k3212373j3967913J1530207J1878265j5585380
10133e6443722k4566588K472589K4581010J4449428L218006J9005134L3229786
10126A5945643J2403029j9647657k0654756J694792J0119493J815105K251444
10119C927093J1434999N099027j7072643k6625540r891005J5353409K7103861
$$ y = [-27329903, -34420592, -43003183, -40795562, -21865699, -2890340, -1688119, -12447091, -14334789, 2538006, 27335222, 39359821, 26474005, -400522, -13030670, 2695938, 24130535, 16340425, -22861474, -61546263, -76578585, -74736600, -68626347, -58421457, -46265232, -42797192, -46479592, -39790835, -19179655, -5293557, -9762806, -17570875, -18465286, -27086528, -50298901, -64266814, -52736607, -40858342, -56443722, -81010310, -78537721, -53956711, -39507283, -36289277, -17284143, 15945643, 28348672, 8701015, -11953741, -10258949, -139456, 1675649, 3927093, 15362092, 20461119, 3388476, -23237064, -33128069, -17774660, 9329201]
10112I329201K0228536L920211n235588L104935J4170938J301169k9527186l7346645
10104b0054429p971919J7287650M909296j5637910j903279K8795082K8478941
10097C3903432k438074k0874952j2717617l868681n913796l513617M690199J685218
10089i047888r352211p270855M794807L515425p841869k901532J5737335J6458324
10081D091536m058099j2844569J207586J0487746J555557m777785o52133p322687
10073a2312848k5408459k1577096R845156K4411887n00600k1765340O1913L3200444
10065a4044943K7091725m550440j0719696J1411292J8509936j881683j4552424
10058A1263767K00738J7188173J2414962j866487m973659R6526L95661l457824
$$ y = [9329201, 29557737, 33477948, 28242360, 31347295, 45518233, 46819402, 17292216, -20054429, -28026348, -10738698, -5829402, -21467312, -23370591, 5424491, 33903432, 31465358, 10590406, -2127211, -5995892, -11909688, -15423305, -10733106, -9047888, -18400099, -25670954, -20876147, -17360722, -25202591, -28104123, -12366788, 4091536, 33437, -12811132, -11603546, -1115800, 439757, -4338028, -4990161, -12312848, -37721307, -59298403, -49453247, -25041360, -25541960, -47307300, -47245387, -14044943, 13046782, 8496342, -2223354, 9187938, 27697874, 25816191, 11263767, 11464505, 28652678, 41067640, 39201153, 34227494, 34324020, 34719681, 31261857]
10050C1261857m245575k862193k525576r00721J164374m448117j7160449k0165580
10042a9881980l963063J2402538M020297j8970988j7810588J8988925N0100975
10035B4886116L3448249j2744598l2672784j1084956R535871k256228k1607611
10028a2495941j4663449M595684K247834j5119283j2025116J5281863L3675786
10021A497378K6414667J0913907O12665j1874615k5693246k2488623L06480J7139206
10013c172181R776167r043045j8431113j3563412N04829J6066254J8423853m74235
10005H7117k0183660j2332768J3159512J6541084r867376k7035068j0862756J1502043
9997c8991872R636223l131115p47449Q836855L610041q204389j191508K1791293
$$ y = [31261857, 27016282, 24154089, 21628513, 20727792, 21892166, 17444049, 283600, -19881980, -23845043, -11442505, -7422208, -26393196, -44203784, -25214859, 24886116, 58334365, 45589767, 12916983, 1832027, 11367898, 9111670, -12495941, -27159390, -22563706, -20315872, -35435155, -47460271, -32178408, 1497378, 27912045, 38825952, 39438617, 27564002, 1870756, -20617867, -20311387, -3172181, 6603986, -2439059, -20870172, -34433584, -33928755, -17862501, 561352, 87117, -20096543, -32429311, -19269799, -2728715, -12596091, -39631159, -50493915, -38991872, -29355649, -32486764, -33234213, -24397358, -20787317, -28991706, -30183214, -8391921]
9989h391921L0737439J1336110j8813539l5459463l0268704r761010J3177339
9982d7443749K6403706K5742294J5319994R25060j0865239j1138878R25897J0411336
9974A0280421N530805k326599J974857O952189p987552l2204630l5738223j7435678
9966g0954410l051403J578221J1965462K1428706P636407j3912669j709773L4992994
9958a2026465L5755705j2258944m2417970j1399215L0938799K2735826j6316280
9951d988544k9632894j3884621k602578J996778J7259636K9063912J3989924r052063
9943B149550n579760J5219740J9793208Q361514L130639P59390j0983791j2472246
9935B0378244J5392227L9776230J7429024k9817871m3112887j6354753N126508
$$ y = [-8391921, 22345518, 33681628, 14868089, -20591374, -50860078, -60621088, -47443749, -21040043, 4702251, 20022245, 20947305, 10082066, -1056812, -130915, 10280421, 15811226, 13484627, 15459484, 22411673, 14424121, -17780509, -53518732, -70954410, -74005813, -72427592, -60462130, -39033424, -31397017, -45309686, -47019459, -12026465, 23729240, 11470296, -30947674, -42346889, -11408090, 11327736, -4988544, -34621438, -48506059, -51108637, -49111859, -31852223, -2788311, 11201613, 2149550, -3430210, 11789530, 31582738, 39944252, 43074891, 43834281, 32850490, 20378244, 35770471, 75546701, 92975725, 63157854, 20044967, 3690214, 8816722]
9928H816722M605591O780941J5667337O345707j8180738k3717084n553440L362061
9920a872903q261716j4947591m634144O092070J1527984K2863324L2009283J8361757
9912F1138064o952927j2936385l924178j0971283l0046716k5640659K640026J5887547
9904a0806511L536014k535280J0983418J9246676Q930436l817897r383234j0345411
9896E808211L196810L1611881L5714998o882443l9838090m909213M7117806K9514514
9888A01334474k0354196M942634P0595312J6359685j65853812k54651663j07063442
9881c54691008J14193244J68023727O5071023k881852K4779321L4450028k4764915
9874B4179568n9173415j1996955L7839379J7215632k6180185k0066731J4991771
$$ y = [8816722, 13422313, 20203254, 35870591, 42216298, 24035560, 318476, -5234964, -1872903, -10134619, -25082210, -29716354, -23624284, -12096300, 10767024, 42776307, 61138064, 54185137, 41248752, 37324574, 26353291, -3693425, -29334084, -26694058, -10806511, -7270497, -9805777, 1177641, 20424317, 29354753, 25536856, 16153622, 5808211, 9005021, 40616902, 76331900, 69449457, 29611367, 24702154, 71819960, 101334474, 80980278, 85922912, 156518224, 172877909, 7024097, -247627566, -354691008, -240497764, -72474037, -7403014, -10284866, 14494455, 48944483, 24179568, -34993847, -46990802, -9151423, 8064209, -18115976, -38182707, -23190936]
9867b3190936J7656700r921068j9901895j101234J5642345J3534221O198816O076186
9859D993135O460113l713530j9361353j8245104J1917301M4223488L3683624j8790510
9851D1167164n3653977k9747876J7613197L0548804Q482416j0234599j6325604
9844a2150475k5076553k6977524k263664K9373199L1299100J1395535N301951
9837A0901569J0905453l22181j8113434o453616K2994787K0322264j6871703l6008069
9829a2644930j6047028N680562M625218M02578K765305o546080k0139458j745304
9821d3649137M0572225M7436763L277448l0985297j5788954O188937q148235k6988012
9813b8084262p327392K3642685J6301377j6116678k5812016j0385115p87219L255628
$$ y = [-23190936, -5534236, -15455304, -35357199, -36458433, -20816088, -7281867, -1083051, 4993135, 11453248, 7739718, -11621635, -29866739, -17949438, 26274050, 59957674, 41167164, -12486813, -42234689, -24621492, 5927312, 14409728, 4175129, -12150475, -37227028, -64204552, -66468216, -37095017, -5795917, 5599618, 10901569, 21807022, 21484841, 3371407, -3082209, 19912578, 40234842, 23363139, -12644930, -28691958, -23011396, -18386178, -17983600, -15218295, -21764375, -41903833, -43649137, -3076912, 44359851, 47637299, 16652002, 863048, 7051985, -1096250, -28084262, -35411654, -11768969, 4532408, -11584270, -37396286, -47781401, -48568620, -45312992]
9805d5312992K1551709L6911988J4890921k8735782l9871242n637729K8733061
9798a7470066K6267582j508494k5326059l1966198k1721779k473126R495642N959346
9790e8743152J633412J1242741K1573996J2622891n207614o825492M164318L062719
9782a6476181j0440655j1560590M928202J6106053J2313698J2402157K6422592
9775C3695276L3299815J2821804k0717564l4332990j5672819J4497583K4298634
9768D7889739J980192l0898489m0628575k0233690K298590K312546j0296859j2622362
9760f0198908m294150O91997L175304J2665652K2163826J8154568Q500437J0104198
9752A0962924J4666250O67579k2860062k2469477N075523K2699951R378295r972086
$$ y = [-45312992, -23761283, 13150705, 28041626, -694156, -40565398, -46203127, -17470066, 8797516, 7289022, -18037037, -50003235, -71725014, -74198140, -64702498, -58743152, -57109740, -45866999, -24293003, -11670112, -16877726, -23703218, -19538900, -16476181, -26916836, -38477426, -33549224, -17443171, -5129473, 7272684, 33695276, 66995091, 79816895, 59099331, 24766341, 9093522, 23591105, 47889739, 49869931, 18971442, -21657133, -41890823, -39592233, -37279687, -47576546, -60198908, -64493058, -63801061, -60625757, -47960105, -25796279, -7641711, 858726, 10962924, 25629174, 26296753, 3436691, -19032786, -13957263, 8742688, 18120983, 8148897]
9744H148897q830280J032672j160430n756562N664859K0586677J3149567j0004161
9736B2831239j7059258j733742O836565q948364k7339055k0398451N967216K3122269
9728a6721581J8621444N823763k54261K24345M64937j053345k958200o759360
9720b612258j3091118j6294501r121765P968902K5337448L0809984J7532565r319403
9712C1209854l1177267k9223350n604659J4985530J3078225k837091j1351698
9705b0920456p870699l832246j878266P216342K1286474K1834951J358238k0342182
9697c147844j8516603P281229L3803287L6370491Q046861l2567682n1454134l1031769
9689e1216164O585876K3853173J4668579N218073P687966M062396j4493096k6346947
$$ y = [8148897, -681383, 351289, -809141, -6565703, -900844, 19685833, 32835400, 22831239, 5771981, 4038239, 10874804, 1926440, -25412615, -45811066, -39843850, -16721581, 1899863, 7723626, 7469365, 7693710, 8158647, 7105302, 4147102, -2612258, -15703376, -31997877, -41119642, -33150740, -7813292, 22996692, 40529257, 31209854, 32587, -29190763, -34795422, -19809892, -6731667, -9568758, -20920456, -28791155, -32623401, -34501667, -27285325, -5998851, 15836100, 17194338, -3147844, -21664447, -14383218, 19420069, 55790560, 63837421, 31269739, -20184395, -51216164, -44630288, -20777115, -6108536, -890463, 6797503, 10859899, -3633197, -29980144]
9681b9980144j7691791j0311750k2556861l0151950k508057M1229870N3305318
9674a8665365K5203832n124339j1151387n001837l744167m212307j056465J31582
9666b3620453q1629J0000766K8199508L1364642R085812j4272368j0230451J3003362
9658D3449189K0572054j328955k6274769k3412366p48356M455174j9762079l6968729
9650d0018837j3610594K4142660K1922981j8933724l7673922p708181J9622017
9643e2257600j156420l2313345j3792831L5641048M6194965P553201k0130722
9636c0261704m275437J9811647J7832974L222463m314987j1602322k0230149j1713693
9628d1531208J1382083J6044172n194044j5412193L893016J9848682Q390428k727681
$$ y = [-29980144, -47671935, -57983685, -80540546, -110692496, -113200553, -71970683, -18665365, 6538467, 1414128, -9737259, -14739096, -18483263, -22695570, -23752035, -23620453, -23702082, -13701316, 14498192, 45862834, 54948646, 40676278, 30445827, 43449189, 64021243, 62692288, 36417519, 13005153, 12256797, 16711971, -3050108, -40018837, -53629431, -29486771, -7563790, -26497514, -64171436, -71879617, -52257600, -53414020, -85727365, -99520196, -63879148, -17684183, -10130982, -30261704, -34537141, -14725494, 3107480, 6329943, 2014956, -9587366, -29817515, -41531208, -30149125, -14104953, -19298997, -34711190, -30818174, -10969492, -2579064, -5306745]
9620e306745J1104555K2211082K483300j9847472p867268J7865218J7988005N948441
9612D4579116J8068352L8419083K2659365j8692624l2272002j2542169q977090
9605E1242031l6087371m6417068j3372903K2146743J9019587k097171j362486
9598f928638J5718257J6971223l62774j1799647q993781o707104j1987007j3423336
9590b7512807l079187Q016837K510214j9690476l4803994j9072576J7511678L4882043
9582d1238268J3011433j6855829j2440598K1758426M4889378L7179852J3861093
9575F0165487j0409594l2533590l9480324j8404188Q884147N847370j7788517
9568d3719209j3818568K2546470L3658545r865732n2693453l2761189K6016955
$$ y = [-5306745, 5797810, 28008892, 30492192, 10644720, 2777452, 20642670, 38630675, 44579116, 62647468, 101066551, 123725916, 105033292, 72761290, 60219121, 51242031, 15154660, -31262408, -44635311, -22488568, -3468981, -5566152, -6928638, 8789619, 25760842, 25398068, 13598421, 4604640, -2102464, -14089471, -27512807, -30591994, -22575157, -20064943, -39755419, -74559413, -93631989, -76120311, -41238268, -28226835, -45082664, -57523262, -35764836, 9124542, 46304394, 60165487, 49755893, 17222303, -22258021, -40662209, -31778062, -25930692, -43719209, -57537777, -34991307, -1332762, -11198494, -63891947, -96653136, -70636181]
9561g0636181N1378747K5187705o227745q844842M956215J5192791J9922118J7731730
9553D8660538K981968j4786275j7494687q660587q339852j6274253j1179094Q898586
9545a6193656J8226637N383178p155240o55429R629441J769997j6600576k2566636
9537b8162284j4390108r509132j2512592q431141R764855K5454280J9417267k938207
9529b1307062j6139070n117480J6899642K4465522R412374j1673754j8673292
9522b2133120j0272426k349096p574987j9840623j9783147K185147K9119622L2679681
9514a7968949R919526q046350K555718K2033158J6201678q667797j4137814P299051
9506I188221J7861014l395726k4159418j0843028J7043095J9816334n04457j1421621
$$ y = [-70636181, -19257434, 5930271, -297474, -9142316, -4186101, 11006690, 30928808, 48660538, 51642506, 36856231, 19361544, 10700957, 2361105, -13913148, -25092242, -16193656, 2032981, 7416159, 260919, -394510, 9234931, 11004928, -5595648, -28162284, -42552392, -52061524, -64574116, -73005257, -63240402, -37786122, -18368855, -21307062, -37446132, -42563612, -25663970, -1198448, 8213926, -3459828, -22133120, -32405546, -34754642, -42329629, -62170252, -81953399, -79768252, -50648630, -17968949, -8049423, -16095773, -13540055, 8493103, 24694781, 16026984, 1889170, 9188221, 27049235, 23653509, -505909, -11348937, 5694158, 25510492, 25006035, 13584414]
9498A3584414o204363o340887j5659069j3838821L764736J6718005J4040379O222964
9490A2287358n71725j1086363j8594447q796892Q664688O756887j2858937j6322561
9482d0521992P107835K3500248P893973j5836084j5620338p31384K147633k507850
9474c4567959P373178K4915664K1462583m275484k0575737r615035R759107J3262053
9466G738370J320683j0543718j2739228m671160Q590329J6051773R436242l788439
9458A1394852q366459m318911o392191j6445125j5205672P724469L2012783L0594128
9450C0997874N144173j8573076k3834326j5148248k338843R135133J2562941L390434
9442A336062p974523m018883J3149040K0147520N947325j1285550j3744341j0587925
$$ y = [13584414, 7380051, 1039164, -14619905, -28458726, -24693990, -7975985, 6064394, 12287358, 11715633, 629270, -17965177, -26762069, -18097381, -11340494, -24199431, -40521992, -33414157, -9913909, -2019936, -17856020, -33476358, -34207742, -32060109, -34567959, -27194781, -2279117, 19183466, 14907982, -5667755, -15282790, -5523683, 7738370, 9059053, -1484665, -14223893, -18895053, -10304724, 5747049, 15183291, 11394852, 3028393, -1290518, -7682709, -24127834, -39333506, -31609037, 403746, 30997874, 36142047, 17568971, -6265355, -21413603, -23752446, -14617313, -2054372, 1336062, -6638461, -10657344, 2491696, 22639216, 28586541, 17300991, 3556650, -7031275]
9434g031275j5313174j5749344M288694K7116924K1708964l196015q315614R844936
9426A3354096Q467433k8084757n1211881j9382897L1379921L6171794k433772
9419a1740063k0637697R285523M0627221K3872161k4498598m8591302k4907545
9412e6590300J5723102K9450421P441492j8473827j5579045Q501283J6635060
9405a2891814m133152k3342500j5160704K180282J309466o490469M107289K1510573
9397c2911029J6580115j673958p07616J4065587Q526661j2106570o936203K2345728
9389G182715K4239904j2634066l1317387p28799K8524457Q873654k3882870j4063726
9381a3806118J9379325K0428730o800582j1264416J3953815K4489415K144105
$$ y = [-7031275, -22344449, -38093793, -33805099, -6688175, 15020789, 11824774, 3509160, 13354096, 21821529, -6263228, -57475109, -76858006, -45478085, -9306291, -11740063, -32377760, -23092237, 17534984, 41407145, 16908547, -31682755, -56590300, -40867198, -11416777, -3975285, -22449112, -38028157, -29526874, -12891814, -17024966, -40367466, -55528170, -53347888, -52038422, -58528891, -54421602, -32911029, -16330914, -18004872, -18712488, -4646901, 3879760, -8226810, -15163013, 7182715, 31422619, 18788553, -12528834, -13257633, 15266824, 24140478, 257608, -13806118, 5573207, 26001937, 19201355, 7936939, 21890754, 46380169, 48524274]
9374D8524274k4176526l4948842l9609822l6739980j0237169K7083632L7900221
9367c2204212J8917481O459203J2889573Q564174j6040411k2990213R404899M1267780
9359B6268274K7621040j3570713l0982917j4830142N6878m904860r328573M331184
9351a5339829J9312899J0997780j3207797k1542393l692573J1131754l815146
9344a6155305k6208997r758076M2580627O9140037L4726377j2567151r934817
9337G1822695K4499124K1259081k8810089n8570751k8784009J4747899J5163379
9330C1327329j5590036k8214865j0717691Q514479R773947j328853j3285834j7983086
9322c7504610j0459811K687208O823584K372966N350840J5531994J1630793q384831
$$ y = [48524274, 24347748, -10601094, -50210916, -86950896, -97188065, -70104433, -32204212, -13286731, -6827528, 6062045, 14626219, -1414192, -24404405, -14999506, 26268274, 53889314, 40318601, 9335684, -5494458, -5437580, -10342440, -19671013, -15339829, 3973070, 14970850, 1763053, -19779340, -23471913, -12340159, -16155305, -42364302, -52122378, -9541751, 59598286, 94324663, 81757512, 71822695, 96321819, 117580900, 88770811, 30200060, 1416051, 16163950, 31327329, 15737293, -12477572, -23195263, -14680784, -4906837, -6235690, -19521524, -37504610, -47964421, -45277213, -38453629, -36080663, -30729823, -15197829, -3567036, -11951867]
9314a1951867j5497833J741591J2863364k647960j6140103J064928K4405185J7522806
9306A1360111l173835Q83573J8133908O351751k7578258l2577903P39325K2871334
9298b989994O401489j5446451j1994726j673805o597914r741068O632214K0560930
9290a4849325P988072j1852630q899700O770067P194659k970777p79734Q038927
9282i360441R35640j4543929j0865779Q480141J2880477j447128o045024P000075
9274a2965968J1297842m605718j7011424j1232323m635834o064741N800029L6187747
9266c230390M6734495J1607114l2239572l4701717o431185N329816m752378r79251
9258a8663068K2582524L0990556J2931022l87270M201324l009896l3336233m5125693
$$ y = [-11951867, -27449700, -25708109, -12844745, -15492705, -31632808, -30567880, -6162695, 11360111, 8186276, 9069849, 27203757, 33555508, 5977250, -26600653, -25861328, -2989994, 3411495, -12034956, -24029682, -25703487, -32301401, -42042469, -35410255, -14849325, -6861253, -18713883, -27613583, -20843516, -13648857, -16619634, -17399368, -9360441, -8424801, -22968730, -33834509, -25354368, -12473891, -13921019, -19966043, -12965968, -1668126, -6273844, -23285268, -34517591, -39153425, -45218166, -39418137, -3230390, 43504105, 55111219, 22871647, -11830070, -18261255, -12931439, -17683817, -18663068, 3919456, 34910012, 47841034, 47453764, 51655088, 48645192, 15308959, -29816734]
9250b9816734r224472L2939855K5495004j6098709k8854029K345352K7284303
9243D070570R787811k3277575k6732232L429384L3078307L1509013k415122m0625941
9235a1175785m6810344j2171962K8444648L3516592O046191j4856483j1378075
9228b8385218m535096q841889o195695J5622333L0960441J3846581j4412972j2150349
9220a4091864J7611816K7327577n846126m5031274m3769065o827069K1789954
9213d8836051J8295733J446430k222190Q310980J7425815J6559430O445704j0538107
9205F887744k5071591j9818340P014675K6752139J3341490j5111492j7960800
9198b3966175P074494K1635894J0363600K671349J3811786J2170240k1447746
$$ y = [-29816734, -39041206, -6101351, 19393653, 3294944, -25559085, -23213733, 4070570, 13858381, -9419194, -36151426, -32722042, 356265, 31865278, 29450156, -11175785, -57986129, -70158091, -41713443, -8196851, -2150660, -17007143, -28385218, -32920314, -41762203, -47957898, -32335565, -1375124, 12471457, -1941515, -14091864, 3519952, 30847529, 25001403, -20029871, -63798936, -70626005, -48836051, -30540318, -29093888, -31316078, -23005098, -5579283, 10980147, 17425851, 6887744, -18183847, -38002187, -30987512, -4235373, 9106117, -6005375, -23966175, -16891681, 4744213, 15107813, 17779162, 31590948, 43761188, 22313442]
9191B2313442m6678506k3453239J7440420K1407972m45247L617880K9304524K2676718
9183D6183964j8188106l0753073N064634K8077426j350517l3907075j6857997
9176b1730744J6930036Q527546k7426581l2934700m068085J3079556N886060O085104
9168c5651808K2830525K7522396R068076r657556j7002997k5618380l3019180
9161f1528924j6611675J9590885L7120960J8762648n306830m277025J3878713
9154A628752K6653194K8780271K1298120j112026l0382180l8526560j4034884
9147e695313J5508019J8697485P03508j1705019q887046n32698P503234J6067782
9139C1659952K0153422J3270594O11062p088177r052893j1401450j3174354q471447
$$ y = [22313442, -24365064, -47818303, -30377883, -8969911, -9415158, -5797278, 23507246, 46183964, 27995858, -2757215, 2307419, 30384845, 29034328, -4872747, -21730744, -4800708, 3726838, -23699743, -56634443, -60702528, -47622972, -41736912, -35651808, -12821283, 14701113, 23769189, 14111633, -2891364, -28509744, -61528924, -78140599, -58549714, -21428754, -2666106, -7972936, -12249961, 1628752, 28281946, 57062217, 78360337, 77248311, 46866131, 8339571, -5695313, 9812706, 28510191, 29213699, 17508680, 8621634, 8088936, 15592170, 31659952, 51813374, 65083968, 65695030, 58606853, 49553960, 38152510, 24978156, 16506709]
9131A6506709o33127k379915j9156316l8397695l9132269j3452895K1574511L8432672
9123c6638325K9446453J4944165J3812803J7691163R582072m197271m873700L919156
9115D3686516K483332o273665j19393J6254030Q897081k6503416m5074123j9066445
9107b5716083J4211029Q057103k1687331k6857078o272258p9858j4557183j1613350
9099h4515009K0168881M0371563K3274859P46410P569974K3533863R675010k4847961
9091A5977590l5641879r761237K0730512K8419359J8838616O841538m831202j5447684
9083B5125613j7967178j0687524k456066q19956o067340j6028834k3608566j4791763
9075f7301614J2477021L3442852K4443696Q43112k720488J1966056Q377840k0784801
$$ y = [16506709, 15873582, 13493667, -5662649, -44060344, -83192613, -96645508, -75070997, -36638325, -7191872, 7752293, 21565096, 39256259, 48838331, 44641060, 39767360, 43686516, 46169848, 39896183, 39776790, 56030820, 64927901, 38424485, -6649638, -25716083, -11505054, -3447951, -25135282, -51992360, -58264618, -58344476, -72901659, -84515009, -64346128, -23974565, -699706, 46704, 7616678, 31150541, 40825551, 15977590, -19664289, -29425526, -8695014, 19724345, 38562961, 45404499, 40573297, 25125613, 7158435, -3529089, -5985155, -6805111, -12872451, -28901285, -52509851, -67301614, -54824593, -21381741, 3061955, 3905067, 1184579, 13150635, 21528475, 743674]
9067G43674l3896477m566339L3694212L6607284J0511620r786307j6857149k4703581
9059h253063k8173802j1781732J2926158J9643435R071059J298951l504236j6794975
9051b5568205k4356619l501634K7879945K9173407L620572n275898J1624554J4696115
9043B8292237j1295525k8102313j1741700O094747l273533j5715719k246023J6983966
9035b1003863J0416145r048417j0603238J557124N258302M220023J2304618J7491554
9027A0592248L775396j2318461p938012M747359L761354K18630J2170847J9845361
9019C4854722l141210l4368911l1933493l469756Q729042j263853l572783N620765
9011b8545477K526838q372262K037121K6672087K5577779l958775j9884887p264768
$$ y = [743674, -33152803, -37719142, -4024930, 32582354, 43093974, 33307667, 16450518, -8253063, -36426865, -48208597, -35282439, -15639004, -6567945, -5268994, -8773230, -25568205, -49924824, -53426458, -25546513, 3626894, 7247466, 1971568, 13596122, 28292237, 16996712, -11105601, -22847301, -16752554, -20026087, -35741806, -37987829, -21003863, -10587718, -19636135, -30239373, -28682249, -23423947, -19203924, -6899306, 10592248, 14367644, 2049183, -5888829, -1141470, 2619884, 2838514, 15009361, 34854722, 31713512, -2655399, -34588892, -38058648, -29329606, -30593459, -34166242, -28545477, -26018639, -34390901, -32353780, -5681693, 19896086, 15937311, -3947576, -11212344]
9003a1212344J085590j1350766j8453200o037530L874883K599599J2254452L1753329
8995D514013K2981651k0997354m9541047k9474837N186442J4186217J1375627
8988d1769288K3597555L5800513K2976156r51114r940889q712150j0314215n513529
8980E173039Q245168N674797j9044690k5703912O360119L0715195N566481l0998750
8972a4012553k2057216J1087148Q718841j9754707j3525328K8012193M0197814
8965A8666192L519297k5713044j3105345L080744j1546902k8572590j3454413
8958f7126061J4075395J9184454R050805R150494J5717273J1190494J245810O25021
8950A3113685K655212n382030j4289941q879595M220473J0186088J1232790J4122665
$$ y = [-11212344, -10126754, -21477520, -39930720, -45968250, -42093367, -39493768, -27239316, 4514013, 27495664, 6498310, -43042737, -72517574, -67331132, -53144915, -41769288, -18171733, 17628780, 40604936, 39653822, 29712933, 21000783, 10686568, 5173039, 13418207, 19093004, 48314, -25655598, -19295479, 11419716, 16986197, -14012553, -36069769, -24982621, -16263780, -36018487, -49543815, -21531622, 18666192, 22185489, -3527555, -16632900, -13552156, -25099058, -53671648, -67126061, -53050666, -33866212, -24815407, -15664913, 52360, 11242854, 12488664, 13113685, 15768897, 10386867, -3903074, -12782669, -8562196, 1623892, 12856682, 26979347]
8942B6979347J0144639o303815j6510976m321889J0685795j04206k5157745k6960037
8934c1548887j668949J4223487K508025r644080K314274J8748624R800703j2582757
8926g849560j1651108J4825430K8862736R762756j5785400j5808532J634429P996722
8918A1987473q7947k925055M666283P865099J706310k273619j782037q035874
8910A1120633j7951919j0942943J4433591K8193635J0991322j5172448j8909075
8903A762796k240184J0356794Q684735K07122q827080j3616984n056941J5283874
8895F554132K7246791J9069966P287990Q572133R793833p315027k8803648k7480306
8887A4925864o769016O762247N009126N52561l286842j1309256j4117618j882929
$$ y = [26979347, 37123986, 30820171, 14309195, 9987306, 20673101, 20568895, -4588850, -31548887, -33217836, -18994349, -16486324, -26130404, -23816130, -5067506, 4733197, -7849560, -19500668, -4675238, 24187498, 33950254, 18164854, 2356322, 3990751, 11987473, 11899526, 8974471, 13640754, 21505853, 23212163, 20938544, 19156507, 11120633, -6831286, -17774229, -3340638, 24852997, 35844319, 20671871, 1762796, -477388, 9879406, 18564141, 18771263, 9944183, -3672801, -8729742, 6554132, 33800923, 52870889, 60158879, 68731012, 78524845, 71209818, 42406170, 14925864, 8156848, 14919095, 19928221, 20480782, 17193940, 5884684, -8232934, -10115863]
8879a0115863Q153605m310003j9702975l077363L3596035M2345877J3697675j1010119
8871D9576869r113246m485717j0894853l661220K5106080L5339303J052410l9178100
8863D3741526l6503138k978827J5143441P629797j706249o001857j7020266k7832715
8855b5528288j8604081M758178J6339172J2093946J0928500J6144557J1145945
8848B7277929m870172j1128201j503094L754308p753887j9794639j2672955R110166
8840a7580545K4167282J6885843j0477406l6152917l1792746N892168L9702561
8833i355760L0046472j2160174l5465521j3980520K2822970L4421699J6855082
8826C3184248p629208k3813711k6502429j0006661K0792741M0521561K8634291
$$ y = [-10115863, -1962258, -6272261, -25975236, -29052599, 4543436, 46889313, 60586988, 49576869, 40463623, 35977906, 25083053, 21421833, 46527913, 81867216, 82919626, 43741526, 7238388, 4259561, 19403002, 27032799, 25326550, 19324693, 2304427, -25528288, -44132369, -39374191, -23035019, -10941073, -12573, 16131984, 27277929, 22407757, 11279556, 9776462, 13530770, 5776883, -14017756, -26690711, -17580545, 6586737, 23472580, 12995174, -23157743, -54950489, -49058321, -9355760, 20690712, 8530538, -26934983, -40915503, -18092533, 16329166, 33184248, 25555040, 1741329, -24761100, -34767761, -13975020, 26546541, 55180832]
8819E5180832r76856j7037780j3292419j1083360k0067201k1797689j484286K4878469
8811e680290L0577276J2352395j1035434k5236464k8982294k2601916o665091
8804e7271818Q388647R197659l00861j727155R177007J3604180j033125j8732005
8796c8697471j6407012M067685K1675859K5335992J9965708J0276864k652546
8789B3565079j1911635r951030j937093J889187L392674Q248650O775007j1994012
8781H076827l0316286j7706005J8066396L0547301J36112l3078541k6503453L269867
8773d7507782R375813j3654008k5963311m501418K7236751L6635065K0857452
8766B478562m70740j0352981l809727J0928850J4389150m761606k7615634k1530169
$$ y = [55180832, 54203976, 37166196, 23873777, 12790417, -7276784, -29074473, -30558759, -5680290, 24896986, 37249381, 26213947, 977483, -28004811, -50606727, -57271818, -48883171, -39685512, -39986373, -41713528, -32536521, -18932341, -19965466, -38697471, -55104483, -51036798, -29360939, -4024947, 15940761, 26217625, 23565079, 11653444, 1702414, -234679, 1654508, 5047182, 13295832, 20070839, 8076827, -22239459, -39945464, -21879068, 8668233, 8804345, -24274196, -50777649, -47507782, -38131969, -51785977, -77749288, -82250706, -55013955, -18378890, 2478562, 2007822, -8345159, -12154886, -1226036, 13163114, 8401508, -19214126, -40744295]
8758d0744295J3670518L7704584K2614737p082210j0426908Q600787Q306844k3421425
8750I222632m4532149j8074979L0763098M5324736J2404205k5183892l0054428
8743b0130777j2390687k47177L134230J0457260J9163485J6706699O856245L942869
8735B7492147N722185j874640j4662327j2426161N409872J3454239j709697k1488212
8727h2594k4530610j4407289n390691n80525J906232n21849l774245N419124K5758087
8718a6204360L3867982J7673017j849699k348129N670165P47058j0990300q971260
8710A7594474K843279K960080q292909r677732K003648O387024l682749j0837413
8702g02298n971565l139316j0296485j1807929M050235K1763285K0602765M221607
$$ y = [-40744295, -27073777, 10630807, 33245544, 26163334, 15736426, 24337213, 32644057, 9222632, -35309517, -53384496, -22621398, 22703338, 35107543, 9923651, -20130777, -32521464, -32768641, -29634411, -19177151, -13666, 16693033, 23549278, 27492147, 33214332, 31339692, 16677365, 4251204, 9661076, 23115315, 21405618, -82594, -24613204, -39020493, -44411184, -44991709, -43085477, -43607326, -47381571, -41962447, -16204360, 17663622, 35336639, 33486940, 31138811, 36808976, 37556034, 26565734, 17594474, 20437753, 23397833, 15104924, 5427192, 7430840, 13817864, 10135115, -702298, -6673863, -9813179, -20109664, -31917593, -27867358, -6104073, 14498692, 18720299]
8694A8720299q285117q647573k080660N736760J0480392O479256n532855j4896157
8686A974345j4580695r985994o135535K386872J7478569K5090722J2017008j2252732
8678A5992560k5360336j9004057l204343J0628145J6764408J0622238o128391
8671C10224j7884601r322872J1832333K1846194J2595445K27927r81474L997091
8663B2620267O426943Q867374J3346848J0413533m596636j7132430j2996436k016813
8655B4932650k246257r351344n901057M628661K741099q068433j918661K0261186
8647B5077844K0111630j6555659m3498451j7330603K9893649L1521749j3068784
8640A6151375l6661176q293923K0834421J886037l4140721k9063140R223939K3735579
$$ y = [18720299, 10435182, 1787609, -293051, 5443709, 15924101, 22403357, 16870502, 1974345, -12606350, -22592344, -28727879, -26341007, -8862438, 16228284, 28245292, 15992560, -9367776, -28371833, -31576176, -20948031, -4183623, 6438615, 310224, -17574377, -26897249, -15064916, 6781278, 19376723, 19604650, 18623176, 22620267, 29047210, 37914584, 51261432, 61674965, 57078329, 39945899, 26949463, 24932650, 22686393, 13335049, 7433992, 12062653, 14803752, 6735319, 4816658, 25077844, 45189474, 28633815, -14864636, -32195239, -2301590, 29220159, 16151375, -20509801, -28803724, -7969303, -6083266, -40223987, -69287127, -60063188, -36327609]
8632c6327609K152987p990226J7040066L5922388J0358826l0013287l0614103
8625c9470958O040134K6135745M635942k3879117k2926061n705482o478062k4746723
8617h6394582k8143299k197970L1001474M5277554L8433176K2000252L058479
8610B3035084j3425741j9747203j4927123q191551m379002J954978J0531896J0279775
8602a4868887J236187J918273J8342329K6152634O544026j9185296k0010043l694788
8594c565565j75561q828882l222121J6351653J8988017l975614k3485343j9207929
8586b7121345l696725R081925K0884685K4644140M377690k6083304k7397910L913008
8578b1397836K2801816O338722j0663777Q02686J5199484N888631k146903J7202561
$$ y = [-36327609, -34174622, -42164848, -25124782, 10797606, 21156432, -8856855, -39470958, -33430824, -7295079, -2659137, -26538254, -49464315, -55169797, -61647859, -86394582, -114537881, -116735851, -85734377, -40456823, -2023647, 19976605, 23035084, 9609343, -10137860, -25064983, -33256534, -37635536, -35680558, -25148662, -14868887, -13632700, -11714427, 6627902, 32780536, 39324562, 20139266, 129223, -3565565, -3741126, -12570008, -15792129, 559524, 19547541, 15571927, -7913416, -27121345, -30818070, -21736145, -851460, 23792680, 28170370, 2087066, -25310844, -21397836, 1403980, 7742702, -2921075, -2118389, 13081095, 18969726, 16822823, 34025384]
8570C4025384L2253050M895273l4284544k8639424J0930652K3709032l445959
8563C9443464k4802144j6839744m333705k480906M561549J8043553J4476113o056424
8555B2011756j2382861L904240J3973555K915512r589034j0100744q566150o213382
8547d047108P928832K1510932R261703j4082171o152521K7394652L0318527j2784249
8539E9348597m5088826k5254007J2982416K3039617J2213968P638417N329855
8532E0210037o030089j3656033j0214617j3380942k4367027j4304626J6837884
8525a4905413K3459602p194804k2600984L978294J9500340j2613164l4528742
8518d4904871R445765O4504356M8769054q883945k1497915O553410Q26579l7361255
$$ y = [34025384, 66278434, 71173707, 36889163, 8249739, 19180391, 42889423, 39443464, 14641320, -2198424, -6532129, -9013035, -4451486, 13592067, 28068180, 22011756, 9628895, 13533135, 27506690, 30422202, 20833168, 10732424, 2166274, -4047108, 3881724, 25392656, 34654359, 20572188, 14419667, 41814319, 72132846, 59348597, 14259771, -10994236, 1988180, 25027797, 37241765, 44880182, 50210037, 44179948, 30523915, 20309298, 6928356, -17438671, -31743297, -14905413, 8554189, 1359385, -21241599, -17263305, 2237035, -10376129, -44904871, -35459106, 29045250, 77814304, 68930359, 47432444, 53985854, 54812433, 17451178]
8510A7451178l3105031J7393041L1849243j1040009l1843552Q120261M0268741
8503C9093872J2569519k4459110j5452954Q702222L913060n887914Q094321J0364576
8495C6937592k7866092n5849508k3733567K3569524J9938398p748225N735285
8488b9016593L9208335K1463863l3951256m2038678J0226473M1668690J1891381
8481A9452215k1266321q097910J8407525J5911312M661865J5273247K5038812
8474F9380745J985319l1429581l3041977r318489L04861j2724007k1160044q647582
8466d4650755J3924290L0589631L2173964J5134375r784072j8939820n039902
8459A3407711Q445215O05626j5236250j4339741N84340P561848P89839o076983
$$ y = [17451178, -15653853, 1739188, 33588431, 22548422, -9295130, -1174869, 39093872, 51663391, 27204281, 11751327, 20453549, 24366609, 18478695, 26573016, 36937592, 9071500, -46778008, -70511575, -46942051, -27003653, -34751878, -29016593, 10191742, 31655605, -2295651, -44334329, -34107856, 7560834, 19452215, -1814106, -9912016, 8495509, 24406821, 29068686, 44341933, 69380745, 71366064, 39936483, 6894506, -2423983, -2119122, -14843129, -36003173, -44650755, -30726465, -136834, 32037130, 47171505, 37387433, 18447613, 13407711, 21852926, 22458552, 7222302, -7117439, -6533099, 1028749, 1818588, -4258395]
8451d258395m227660L495241J3034113J8838168J2373413k593257o162063P231060
8443C7730620J0677637j6831342m8488361m0364915K308954K7280813Q003383
8436a9683211k1599495j9425186P266022J9263609K498966j7250410j2511984
8429f1441689J1961581K8322217K0036210o51566j1242540q346911p159220j2682822
8421d1204740j0705357L662844J0527476k041867j0281336J0487986L8674059
8414h80935L2438575l719293k2107771m895723J2188146L086903q339025K410451
8406A0181328J3479379k850170k5601966j6777449J3451610K1326930p50992j6321970
8398c863300o236731O546521J877865o838113k167092P500947N588200o542224
$$ y = [-4258395, -8486055, -4990814, 8043299, 26881467, 39254880, 36661623, 30499560, 37730620, 48408257, 31576915, -16911446, -57276361, -54967407, -27686594, -19683211, -41282706, -60707892, -53441870, -34178261, -31679295, -48929705, -61441689, -49480108, -21157891, -1121681, -1773247, -13015787, -21362698, -28521918, -41204740, -51910097, -48247253, -37719777, -39761644, -50042980, -39554994, -880935, 31557640, 27838347, 5730576, 834853, 13022999, 16109902, 7770877, 10181328, 23660707, 20810537, -4791429, -21568878, -8117268, 13209662, 12458670, -3863300, -10100031, -3553510, -1675645, -8513758, -10680850, -3179903, 2408297, -4133927]
8390d133927j6387550j7327866q244825Q917214K3259114K1631017P859589N56639
8382A6129405O806895J3257514P044972j0010903k9330226m0290122k9071560
8375f5464025M358480L0452738K0419203p831907r657519J6656305K4071455n643361
8367G361369k7654561o373551K4146449J5287832j7197641k1727320N423515K0817485
8359H3577P227032p874693o480145l187071p542471o251219O448560J6148930
8351a427500J5168305J0912733K796007j5976303l0678484j7250462J2031097
8344b4424607J6678549q013300j9654464K024452K1232578P243547j5050115j0696143
8336c0659503P695032Q947223j622698p53589M566895n132409j5656755j327720
$$ y = [-4133927, -20521477, -37849343, -46094168, -37176954, -13917840, 7713177, 15572766, 16129405, 22936300, 36193814, 43238786, 33227883, 3897657, -36392465, -65464025, -61105545, -30652807, -10233604, -18065511, -27723030, -11066725, 13004730, 7361369, -20293192, -26666743, -2520294, 12767538, -4430103, -26157423, -20733908, 83577, 7310609, -564084, -7044229, -10231300, -17773771, -24024990, -17576430, -1427500, 13740805, 24653538, 27449545, 11473242, -19205242, -36455704, -24424607, -7746058, -15759358, -35413822, -33389370, -12156792, -4913245, -19963360, -30659503, -22964471, -14017248, -15639946, -16393535, -11826640, -16959049, -32615804, -33943524]
8328c3943524K0358245J0628737j9434534j7511111K3797181M7253618J7879676
8321D9028288k2480551k0547234R876048J7168482p293495k4194886j1844074
8314a0287422O898290P489708j392172K269Q651845O030145j0939126k3456180
8306a7002643j5705613M953733J8431317J7631968J4783888J9964861K2897391
8299F5954902O719530k4023849m3292697l4937144j2467240m00809m663293j0755080
8291e7865680o148154N507638J2069015P733178j484693m135613N168916J9353870
8283a9801523K5088920J6418150L90174j1556516j4716222j1789879n794414L014246
8275a8747064J2290307J3477318j172388k4226797l2117445r757653K4568535
$$ y = [-33943524, -13585279, -2956542, -22391076, -39902187, -16105006, 31148612, 49028288, 26547737, 6000503, 15876551, 33045033, 25751538, 1556652, -10287422, -3389132, 4100576, 2708404, 2710673, 11362518, 17392663, 6453537, -17002643, -32708256, -27754523, -9323206, 8308762, 23092650, 43057511, 65954902, 72674432, 48650583, 5357886, -29579258, -42046498, -42447307, -47110600, -57865680, -64013834, -58506196, -46437181, -38704003, -40188696, -44324309, -39155393, -19801523, 5287397, 21705547, 22095721, 10539205, -4177017, -15966896, -21761310, -18747064, -6456757, 7020561, 5848173, -18378624, -50496069, -60253722, -35685187]
8268c5685187L4067510R356122j6741684j3162903P189093J0935580l091153n744997
8260a2877619J1317640K2042183J1460476r7653M198912O966979q496106k0013850
8252A4500962K79119L1726631K6117821k0666786n7437781m4612492M25118L4851962
8244a4815446L8369057J7110396j3585051l3198702k4165228N690212K4493142
8237a01620J4849921m684861r717901k494642K282455M335132R098292R220058
8229B2786834j419988j0008196n961854m507658k0132834l1599303j0355309K5635008
8221c5563300K9825602j033516j8690168K037225K4872822J0431599k4576569
8214a2696305l6436942j5944384R639261J7691886O686639j3251205k3540926
$$ y = [-35685187, -1617677, 7738445, -9003239, -22166142, -14977049, -4041469, -7132622, -12877619, -1559979, 20482204, 31942680, 31845027, 36043939, 43010918, 34514812, 14500962, 14780081, 46506712, 72624533, 51957747, -5480034, -50092526, -49667408, -14815446, 23553611, 40664007, 27078956, -6119746, -30284974, -24594762, -101620, 14748301, 10063440, 345539, -2149103, 133352, 4468484, 13566776, 22786834, 21366846, 11358650, 5396796, 889138, -19243696, -50842999, -61198308, -35563300, -5737698, -6771214, -25461382, -23424157, 1448665, 11880264, -12696305, -49133247, -65077631, -55438370, -37746484, -31059845, -44311050, -67851976]
8207f7851976o713197K6545703L8712345J5112586j0936264q347682M412575j697260
8199a0763170q536452J6608781M9356185L2421727k8952862o0382364k4484750
8192c4732905K4288579K1394057j8833897l5622148r746215K3124834K8834935
8185a292760Q913519j2561819j2299831J2261505L1809678J2572554l1696416
8178G706430m4506016n227857L2062748J3964920l0341332l2117143J3202637
8171d5255613M3332528K4810747o876676j2164681k44555L055882k007151l541429
8163A109052l277855l560372M610840J8991465J6604203j0791409l5016870k9077444
8155d0408390n382427Q226340R731230J1689432Q102930j2014012l0125951j6811532
$$ y = [-67851976, -74565173, -48019470, -9307125, 5805461, -5130803, -13478485, -9065910, -10763170, -19299622, -2690841, 46665344, 79087071, 50134209, -10248155, -34732905, -10444326, 10949731, -7884166, -43506314, -53252529, -30127695, -1292760, 7620759, -4941060, -17240891, -4979386, 26830292, 39402846, 7706430, -36799586, -42027443, -9964695, 4000225, -26341107, -58458250, -45255613, -1923085, 22887662, 16010986, 3846305, 3601750, 6657632, 4650481, 1109052, -2168803, -5729175, -1118335, 17873130, 34477333, 23685924, -11330946, -40408390, -45790817, -37564477, -27833247, -16143815, -8040885, -20054897, -50180848, -66992380]
8147f6992380J7286987K8275850L343773j8825147p076698J6667991J5851186
8140a1468438l499185p929492O119267R151134p968479j6246503J921678J8745781
8132a1174237L231997k5548889k2964998J2839279L6218285K1957757m18814K242966
8124A6383346J5268097O287514j6590670j5942066J3609440L3875427J7934089
8117G0825177j5281527l2305361k5795040j0142312L195844R962222O890915l512845
8109C837073j0587876q556751m275216n035811q219645q997770p061201j80418
8101d9077615J5084745K9442827K4333995M77127j3710211J683343K6856931K6555349
8093F1646491k884715l0596820l1997833j4293062L7481M50160n916422p240776
$$ y = [-66992380, -49705393, -21429543, -18085770, -36910917, -43987615, -27319624, -11468438, -14967623, -22897115, -16777848, -7626714, -15595193, -31841696, -29920018, -11174237, -7942240, -33491129, -56456127, -43616848, -7398563, 14559194, 14140380, 16383346, 31651443, 37938957, 21348287, 5406221, 19015661, 52891088, 70825177, 55543650, 23238289, -2556751, -12699063, -9503219, 459003, 7349918, 3837073, -6750803, -15307554, -19582770, -24618581, -32838226, -41835996, -48897197, -49077615, -33992870, -4550043, 19783952, 20261079, 6550868, 8234211, 35091142, 61646491, 58761776, 28164956, -3832877, -18125939, -18088458, -17638298, -23554720, -30795496]
8085c0795496p34673N072604J700470o543757o525192O232216K0950709K4109642
8077A3466523J1960431q674762k3450455j7820394N535567K1162270J0880565
8070A3059745o206953L14793K0564802J5665636j5455684k6055360L675298K8833284
8062C4395561R123739k6466003k8105387l750279K434390j4305693k0619005o828158
8054e4120835P182039J7799966L5059765M2026390J4448134k2910270k1295751
8047A8189438R392506R717845k8492463m2491071j719961M1342044L8297829J5117746
8039E9353913J0006980M073397k8515154n4308877l0934269J5190043K8074405
8032B940438R271139M16151M614932n322118j8708161n76087L3926105L1732170
$$ y = [-30795496, -31530169, -26457565, -24757095, -31300852, -37826044, -31593828, -10643119, 13466523, 25426954, 16752192, -6698263, -24518657, -18983090, 2179180, 13059745, 6852792, 7167585, 27732387, 43398023, 27942339, 1886979, 5562277, 34395561, 43519300, 17053297, -11052090, -14802369, -12367979, -26673672, -47292677, -54120835, -46938796, -29138830, 5920935, 47947325, 62395459, 39485189, 18189438, 27581944, 37299789, 8807326, -33683745, -35403706, 5938338, 44236167, 59353913, 69360893, 73434290, 44919136, -9389741, -40324010, -25133967, 2940438, 12211577, 12627728, 17242660, 11920542, -6787619, -7363706, 26562399, 58294569]
8024E8294569q602551k9450058p373201J3017408j579650k1961484j3714557P176215
8016d193309J0635603K438365K575359O285113j51139r536233q128869O6119N507389
8007E498398J0209238J4926096J0124172m268858j1465124m278134L086116J219135
7999B5051039j255840p42487o491773j5237047j0499723J934446m162547k4523242
7991c5927174k0018603J5773087L3849933O123074k4781166j3650008J6149848
7984b2481009K0781592J2347540K5274618M0931547J6994894k9450966m2040536
7977B2357680j7761946n531887j5281478o313022K4600461K3789866k3864653
7970A995021n3506418j6431444M1950218N0254494J2007445j4330747m457967
$$ y = [58294569, 49692018, 20241960, 12868759, 25886167, 24306517, 2345033, -11369524, -4193309, 6442294, 8880659, 11456018, 17741131, 17589992, 8053759, -75110, -8991, 5498398, 15707636, 30633732, 40757904, 36489046, 25023922, 20745788, 23831904, 25051039, 23795199, 23052712, 16560939, 1323892, -9175831, -7241385, -11403932, -35927174, -55945777, -40172690, -6322757, -199683, -24980849, -38630857, -22481009, -1699417, 10648123, 35922741, 76854288, 93849182, 64398216, 22357680, 4595734, -936153, -16217631, -22530653, 2069808, 25859674, 1995021, -51511397, -67942841, -25992623, 24261871, 36269316, 21938569, 17480602]
7963A7480602J4424734J6313852Q62058k3756315m4909604m1548460q755730K2465221
7955d7423642J9817740m766585j3604794J306217J3028834O032169m020238m27512
7947c0057811J0850076J5434580J0327691K562891l62896M027360R198762M115687
7939B6096340r565970j2792400M891060K3234178J4542777j4652730k6960171
7932D793084l337780K9290532L0213489m973391l8223922l2874079M041161L0695852
7924A9624946K1376827m174502j2730502m958922o516243j8671804j3391981J4537138
7916d905043K8167431L491071k8040011k3838941O711709K0297224N328460r753967
7908b542067o989238R68328K311131L065129O653734N492589m26678j748518o87150
$$ y = [17480602, 31905336, 48219188, 49081246, 25324931, -19584673, -61133133, -69888863, -47423642, -27605902, -32372487, -45977281, -44671064, -31642230, -25610061, -29630299, -30057811, -19207735, -3773155, 6554536, 9117427, 8754531, 12781891, 21980653, 26096340, 16530370, 3737970, 8629030, 31863208, 46405985, 31753255, 4793084, 1455304, 30745836, 60959325, 55985934, 17762012, -15112067, -11070906, 19624946, 41001773, 36827271, 24096769, 19137847, 12621604, -6050200, -19442181, -4905043, 23262388, 26753459, -1286552, -25125493, -18413784, 1883440, 7211900, -2542067, -9531305, -8562977, -6251846, -3186717, 3467017, 8959606, 8532928, 6784410, 6097260]
7899F097260p537793j2885236N587384L9256532M4343819P58827n1217119n7684551
7891c3280877j7143916K4747228L5008666K2625239J1103890N535801m062687
7884D4533344j8848610k4269185j0032760J0447910J2112341q691943k7089611
7877b1838514k3519689r184982l577246l345217M303780J2005122N470231m149510
7869d3836025M316631K0120809J3245470j1469686j6370987O333875K0568099
7862g091814R307054K171933J5892766J7700588j4125542l9307517j6090984K3225183
7854h318333J7690836k3813790l4981819M025825L9908684L0978100l75414j7921369
7846G192720k2344584k5388917j6887353Q904102K6055761J1277799j5716346
$$ y = [6097260, -1440533, -14325769, -8738385, 30518147, 74861966, 75620793, 24403674, -33280877, -50424793, -25677565, 9331101, 31956340, 43060230, 48596031, 44533344, 25684734, 1415549, -8617211, 1830699, 13943040, 5251097, -21838514, -45358203, -54543185, -58120431, -61465648, -57161868, -45156746, -39686515, -43836025, -39519394, -19398585, -6153115, -17622801, -33993788, -27659913, -7091814, 2215240, 4387173, 20279939, 37980527, 23854985, -15452532, -31543516, -8318333, 9372503, -14441287, -49423106, -45397281, -5488597, 25489503, 25114089, 7192720, -15151864, -40540781, -57428134, -48524032, -22468271, -11190472, -26906818]
7839b6906818j8526677L959583K1603217J8696849P098879j110406p077046j0159527
7831a2421946k675684J3156161J9191833K622665k4191376l4214346j5724190
7824e4256883J3258570K4432475J1838427k873887j819865M015104n356850k3068079
7816c3830988k1883635L613582K5397275K0181816k025112j8466273k2562448
7809d9575783j7804394k030997K1980576L4591476K1170858k183607p153759O933559
7801E927929J3762010Q4309j6391993j4507896K017674J2666353O395358q191132
7793A762612j4714946p111837L509658K530067o902695o011917R761593J6884213
7785b93252m199749l3820541l3484595J144927L2934855L3413109J5595143N666988
$$ y = [-26906818, -45433495, -41473912, -19870695, -1173846, 5925033, 4814627, -2262419, -12421946, -15097630, -1941469, 17250364, 19873029, -4318347, -38532693, -54256883, -40998313, -16565838, -4727411, -7601298, -9421163, -5406059, -10762909, -33830988, -55714623, -52101041, -26703766, -6521950, -8547062, -27013335, -49575783, -67380177, -69411174, -47430598, -12839122, 8331736, 6148129, -1005630, 5927929, 19689939, 19774248, 3382255, -11125641, -9107967, 3558386, 9953744, 1762612, -12952334, -20064171, -16554513, -14024446, -20927141, -26939058, -17177465, -293252, -4493001, -38313542, -71798137, -70653210, -37718355, -4305246, 11289897, 16956885]
7777A6956885M732151j553408j0437245m253919J7500474L0007078J4289016j5770627
7769E1470405k7573343p675297K2500411L1651030J4084062q388730j9204103
7762E6864435k6077874l7343384l6860015p572139K8881728L0985795L56658j1916942
7754b681738J9399773M8355677K1776605l8778128o4602800l6322490k327997
7747e5181098P04046n888843O245021K1115766J0765105j3011987j7670984k205261
7739e5128235O677081P83564k553591L251985L781201p116688j6227405j4991549
7731h1523637r507058n92056J9903450M3395156M2596058J2151375j2639847r10979
7723A2872462K7469660K7624167q296787m3025860m5880194k5439499n744618
$$ y = [16956885, 21689036, 20135628, 9698383, 5444464, 22944938, 52952016, 67241032, 51470405, 23897062, 16221765, 38722176, 70373206, 84457268, 76068538, 56864435, 30786561, -6556823, -43416838, -50988977, -22107249, 8878546, 9235204, -2681738, 16718035, 65073712, 86850317, 48072189, -16530611, -52853101, -55181098, -54477052, -60365895, -54120874, -33005108, -22240003, -35251990, -52922974, -55128235, -48451154, -47667590, -50221181, -46969196, -43187995, -50304683, -66532088, -81523637, -91030695, -91622751, -71719301, -28324145, 14271913, 26423288, 13783441, 12872462, 40342122, 67966289, 59669502, 16643642, -29236552, -54676051, -60420669]
7716f0420669N586086J3194241J6082002J0417262Q33571n458190j0121042j6668384
7708d6555123j7339080k150270K0350712K7862480J3866960k725959n134347j119954
7700a2944581m944934j0247887j198193J6292785J9233773M640612l544319O637448
7692A3924704J4034398j304138k3890083k6011906r848680P37290J140338Q441705
7684b2776372K4380590K6498899M067694k1781138k5622606p993946J1784864
7677a1442015J8509793R214345p685464j5347947m396588J0799853Q177813p935379
7669a05589j0740247O632286J9103633J0104836l773873m377671r99825o907765
7661H935785j2329672o171573j591977j0728681j4589754Q018751L7744315L8212418
$$ y = [-60420669, -54834583, -41640342, -25558340, -15141078, -14307507, -19765697, -29886739, -46555123, -63894203, -66044473, -45693761, -17831281, -3964321, -6690280, -11824627, -12944581, -17889515, -28137402, -29335595, -13042810, 6190963, 10831575, 7287256, 13924704, 27959102, 26654964, 2764881, -23247025, -33095705, -32358415, -31218077, -22776372, 1604218, 28103117, 32170811, 10389673, -15232933, -23226879, -11442015, 7067778, 16282123, 8596659, -6751288, -11147876, -348023, 7829790, -105589, -10845836, -4213550, 14890083, 24994919, 21221046, 16843375, 15843550, 8935785, -3393887, -9565460, -11157437, -21886118, -36475872, -28457121, 9287194, 47499612]
7653D7499612J2158669m163777K175274P741986l224521j8660778k7234784l2806124
7645a6514443l3623862k0113238k063499m641705k4569102k3143756J7882239
7638a06787366O1608963O1269416K0793874j3572035j0644107J6189565L0791421
7631E9649731J2901078k1503808l5080227j1827109J8681492J6299133j4692809
7624B4427481l1373240j4010133R326874R422910m436508q375332Q2327R983566
7616d952055J7040263J5378194p271109m2952050n4401584k0348529K7210331
7609g0296539L9956732J5176986p968662n962910M555548k30025j7776351k5710189
7601f8255410j0836793J3135526J7886542l480676j9037111L211208M2792190
$$ y = [47499612, 59658281, 55494504, 57669778, 65411764, 62187243, 43526465, 16291681, -16514443, -50138305, -70251543, -72315042, -76956747, -101525849, -124669605, -106787366, -45178403, 16091013, 36884887, 23312852, 12668745, 28858310, 59649731, 72550809, 51047001, 15966774, 4139665, 22821157, 39120290, 24427481, -6945759, -20955892, -11629018, -2206108, -6642616, -15017948, -14935621, -4952055, 12088208, 27466402, 20195293, -22756757, -77158341, -97506870, -70296539, -30339807, -15162821, -23131483, -29094393, -24538845, -24768870, -42545221, -68255410, -79092203, -65956677, -48070135, -51550811, -70587922, -67376714, -24584524]
7594b4584524M5809658K362973l5034976k7668911k240193L059425R83877J9589684
7586a7722987L9492761K2518645j7530919l0142382n805073J4611630O310049
7579A1731724j2470875k1591485k1623315j1496831J3894722L8500714L6348566
7572C3293220J1687146q144414j7618899l0381010l7529408j8036990J1341716
7565e5388639J2081020p991693l452206K5165830K5762529j0513183k4128151
7558c8464493J1464832L9084534J5300304j3841321K999787K7727600R87460m5545941
$$ y = [-24584524, 21225134, 23588107, -11446869, -39115780, -41355973, -38296548, -37312671, -17722987, 21769774, 44288419, 26757500, -3384882, -9189955, 5421675, 11731724, -739151, -22330636, -43953951, -55450782, -41556060, -3055346, 33293220, 44980366, 36835952, 19217053, -11163957, -48693365, -66730355, -55388639, -43307619, -51299312, -54751518, -29585688, -3823159, -14336342, -38464493, -26999661, 12084873, 27385177, 13543856, 16543643, 44271243, 45258703, -287238]
$$ [...]
##END NTUPLES=NMR SPECTRUM
##END=
