##TITLE=31Pdec_3MBDP1901
 CDCl3, 24 sc
 19.1.2023
##JCAMPDX= 6.0         $$ Bruker NMR JCAMP-DX V2.0
##DATA TYPE= NMR SPECTRUM
##DATA CLASS= NTUPLES
##ORIGIN= UXNMR, Bruker Analytische Messtechnik GmbH
##OWNER= root
$$ XWIN-NMR		Version 3.5
$$ Thu Jan 19 16:40:54 2023 Russian Standard Time (UT+4h)  she@DPX200
##.OBSERVE FREQUENCY= 81.013821
##.OBSERVE NUCLEUS= ^31P
##.ACQUISITION MODE= SIMULTANEOUS
##.ACQUISITION SCHEME= undefined
##.AVERAGES= 24
##.DIGITISER RES= 16
##SPECTROMETER/DATA SYSTEM= spect
##.PULSE SEQUENCE= zgpg30
##.SOLVENT NAME= CDCl3
##.SHIFT REFERENCE= (INTERNAL, CDCl3, 0, 248.564)
##AUDIT TRAIL= $$ (NUMBER, WHEN, WHO, WHERE, WHAT)
$$ ##TITLE= Audit trail, XWIN-NMR		Version 3.5
$$ ##JCAMPDX= 5.01
$$ ##ORIGIN= Bruker BioSpin GmbH
$$ ##OWNER= she
$$ F:/spectra/data/she/nmr/P31/1/pdata/1/auditp.txt
$$ ##AUDIT TRAIL=  $$ (NUMBER, WHEN, WHO, WHERE, WHAT)
(   1,<2023-01-19 16:40:06.00 +0400>,<she>,<DPX200>,
      <created by zg, POWCHK disabled, PULCHK disabled
       configuration hash MD5:
       00 E9 B6 7A A2 85 ED C7 34 08 36 98 17 FE 4E 26
       data hash MD5: 32K
       2C C0 80 9A 0A 1D C2 D9 E3 54 83 B5 AF 00 84 E5>)
(   2,<2023-01-19 16:40:08.40 +0400>,<she>,<DPX200>,
      <Start of raw data processing
       efp BC_mod = 2 LB = 1 FT_mod = 6 PKNL = 1 PHC0 = -10971.51 PHC1 = 67.05779 SI = 64K 
       data hash MD5: 64K
       75 31 D8 FF 76 F2 D7 F7 1D 5D 68 F8 55 15 16 F3>)
(   3,<2023-01-19 16:40:20.50 +0400>,<she>,<DPX200>,
      <pk PHC0 = 13.56139 PHC1 = 0 
       data hash MD5: 64K
       91 7E 73 50 99 BC B2 31 A5 BC 6C 21 FE F0 5F BA>)
(   4,<2023-01-19 16:40:26.70 +0400>,<she>,<DPX200>,
      <abs ABSG = 5 
       data hash MD5: 64K
       19 7C FF 87 40 61 21 EE 73 E6 25 D7 AF 1B B1 95>)
$$ ##END=
$$ 
$$ hash MD5
$$ FA AF DA C3 8B 56 7E 01 EA FC 94 80 C6 BA F9 D9
##$RELAX= 
##$RELAX= 
##$RELAX= 
##$RELAX= 
##$RELAX= 
##$RELAX= 
##$RELAX= 
##$RELAX= 
##$RELAX= 
$$ Bruker specific parameters
$$ --------------------------
##$DU= <F:/spectra>
##$EXPNO= 1
##$NAME= <P31>
##$PROCNO= 1
##$TYPE= <nmr>
##$USER= <she>
##$AMP= (0..31)
100 100 100 100 100 100 100 100 100 100 100 100 100 100 100 100 100 100 
100 100 100 100 100 100 100 100 100 100 100 100 100 100 
##$AQSEQ= 0
##$AQ_mod= 1
##$AUNM= <au_zg>
##$AUTOPOS= <>
##$BF1= 81.014009
##$BF2= 200.13
##$BF3= 200.13
##$BF4= 200.13
##$BF5= 200.13
##$BF6= 200.13
##$BF7= 200.13
##$BF8= 200.13
##$BYTORDA= 1
##$CFDGTYP= 0
##$CFRGTYP= 5
##$CHEMSTR= <none>
##$CNST= (0..31)
1 1 145 1 1 1 1 1 1 1 1 1 1 1 1 1 1 1 1 1 1 1 1 1 1 1 1 1 1 1 1 1 
##$CPDPRG= <waltz16>
##$CPDPRG1= <>
##$CPDPRG2= <waltz16>
##$CPDPRG3= <>
##$CPDPRG4= <mlev>
##$CPDPRG5= <mlev>
##$CPDPRG6= <mlev>
##$CPDPRG7= <mlev>
##$CPDPRG8= <mlev>
##$CPDPRGB= <>
##$CPDPRGT= <>
##$D= (0..31)
0 1 0 0 0 0 0 0 0 0 0 0.03 2e-05 3e-06 0 0 0 0 0 0 0 0 0 0 0 0 0 0 0 0 
0 0 
##$DATE= 1674132005
##$DBL= (0..7)
120 120 120 11 120 120 24 19 
##$DBP= (0..7)
150 150 150 150 150 150 150 150 
##$DBP07= 0
##$DBPNAM0= <>
##$DBPNAM1= <>
$$ [...]
##$SUBNAM3= <"">
##$SUBNAM4= <"">
##$SUBNAM5= <"">
##$SUBNAM6= <"">
##$SUBNAM7= <"">
##$SUBNAM8= <"">
##$SUBNAM9= <"">
##$SW= 501.771253377433
##$SWIBOX= (0..15)
0 1 3 0 0 0 0 0 0 0 0 0 0 0 0 0 
##$SW_h= 40650.406504065
##$TD= 32768
##$TD0= 1
##$TE= 0
##$TE2= 300
##$TE3= 300
##$TEG= 300
##$TL= (0..7)
0 120 53 12 22 120 120 120 
##$TP= (0..7)
150 150 150 150 150 150 150 150 
##$TP07= 0
##$TPNAME0= <>
##$TPNAME1= <>
##$TPNAME2= <>
##$TPNAME3= <>
##$TPNAME4= <>
##$TPNAME5= <>
##$TPNAME6= <>
##$TPNAME7= <>
##$TPOAL= (0..7)
0.5 0.5 0.5 0.5 0.5 0.5 0.5 0.5 
##$TPOFFS= (0..7)
0 0 0 0 0 0 0 0 
##$TUNHIN= 0
##$TUNHOUT= 0
##$TUNXOUT= 0
##$USERA1= <user>
##$USERA2= <user>
##$USERA3= <user>
##$USERA4= <user>
##$USERA5= <user>
##$V9= 5
##$VALIST= <valist>
##$VCLIST= <CCCCCCCCCCCCCCC>
##$VD= 0
##$VDLIST= <DDDDDDDDDDDDDDD>
##$VPLIST= <PPPPPPPPPPPPPPP>
##$VTLIST= <TTTTTTTTTTTTTTT>
##$WBST= 1024
##$WBSW= 4
##$XGAIN= (0..3)
0 0 0 0 
##$XL= 0
##$YL= 0
##$YMAX_a= 10160
##$YMIN_a= -10570
##$ZGOPTNS= <>
##$ZL1= 120
##$ZL2= 120
##$ZL3= 120
##$ZL4= 120
##$ABSF1= 248.5645
##$ABSF2= -253.2056
##$ABSG= 5
##$ABSL= 3
##$ALPHA= 0
##$AQORDER= 0
##$ASSFAC= 0
##$ASSFACI= 0
##$ASSFACX= 0
##$ASSWID= 0
##$AUNMP= <proc_1d>
##$AZFE= 0.1
##$AZFW= 0.5
##$BCFW= 0
##$BC_mod= 2
##$BYTORDP= 0
##$COROFFS= 0
##$CY= -3
##$DATMOD= 1
##$DC= 0
##$DFILT= <>
##$DTYPP= 0
##$F1P= 0
##$F2P= 0
##$FCOR= 1
##$FTSIZE= 65536
##$FT_mod= 6
##$GAMMA= 0
##$GB= 0
##$INTBC= 1
##$INTSCL= 6.047779e-11
##$ISEN= 30
##$LB= 1
##$LEV0= 0
##$LPBIN= 0
##$MAXI= 10000
##$MC2= 0
##$MEAN= 0
##$ME_mod= 0
##$MI= 50
##$NCOEF= 0
##$NC_proc= -6
##$NLEV= 6
##$NOISF1= 182.463
##$NOISF2= 159.3651
##$NSP= 0
##$NTH_PI= 0
##$NZP= 0
##$OFFSET= 248.5645
##$PC= 4
##$PHC0= -10957.95
##$PHC1= 67.05779
##$PH_mod= 1
##$PKNL= yes
##$PPARMOD= 0
##$PSCAL= 0
##$PSIGN= 0
##$REVERSE= no
##$SF= 81.0140089999694
##$SI= 65536
##$SIGF1= 159.3651
##$SIGF2= -187.1042
##$SINO= 113.3802
##$SIOLD= 16384
##$SREGLST= <1H.CDCl3>
##$SSB= 0
##$STSI= 65536
##$STSR= 0
##$SW_p= 40650.406504065
##$SYMM= 0
##$S_DEV= 0
##$TDeff= 32768
##$TDoff= 0
##$TI= <>
##$TILT= no
##$TM1= 0
##$TM2= 0
##$TOPLEV= 0
##$USERP1= <user>
##$USERP2= <user>
##$USERP3= <user>
##$USERP4= <user>
##$USERP5= <user>
##$WDW= 1
##$XDIM= 65536
##$YMAX_p= 423772124
##$YMIN_p= -10876491
$$ End of Bruker specific parameters
$$ ---------------------------------
##NTUPLES= NMR SPECTRUM
##VAR_NAME=  FREQUENCY,     SPECTRUM/REAL,   SPECTRUM/IMAG
##SYMBOL=    X,             R,               I
##VAR_TYPE=  INDEPENDENT,   DEPENDENT,       DEPENDENT
##VAR_FORM=  AFFN,          ASDF,            ASDF
##VAR_DIM=   65536,         65536,           65536
##UNITS=     HZ,            ARBITRARY UNITS, ARBITRARY UNITS
##FACTOR=    0.620285442955139, 1,           1
##FIRST=     20137.2065510682, 0,            0
##LAST=      -20513.1999529968, 0,           0
##MIN=       -20513.1999529968, -10876491,   0
##MAX=       20137.2065510682, 423772124,    0
$$ Real data points
##PAGE= N=1
##DATA TABLE= (X++(R..R)), XYDATA
$$ [...]
40539a478045M5445Q39742J168328Q13640j34700r46723q15221m4515K21234k73055
40529f03870n05909M5618M23117k43311j190043j057556J82150J298129J388231
40520b63444O15737k88731o23510j66389M77971M26934k21308l89958K81630P43512
40510E92444K72243k32850J48725N38584l29788j648592j468238J75224J157417
40501g94831N07933l09526l5090M31091q9216q38933m21519P56563J104175L77265
40491F87912j10197K89721O86148K99350l12702k78501K36211L90973j38193r14832
40481H35890j388123j331152q12713q0065N74059R61182R66508M86701k95100
40472h2813o93732j46343Q56908J100309J93360q22775q71699k41591P2566r4408
$$ plain form
40539 -1478045 -1432600 -592858 575470 1389110 1254410 307687 -507534 -552049 -330815 -603870
40529 -603870 -1109779 -1064161 -641044 -884355 -2074398 -3131954 -2949804 -1651675 -263444
40520 -263444 352293 63562 -559948 -726337 -248366 178568 -42740 -432698 -151068 592444
40510 592444 864687 631837 780562 1319146 989358 -659234 -2127472 -1952248 -794831
40501 -794831 -286898 -596424 -631514 -200423 -289639 -1128572 -1550091 -793528 310647 687912
40491 687912 577715 867436 1553584 1852934 1540232 1261731 1497942 1888915 1750722 835890
40481 835890 -552233 -1883385 -2696098 -2776163 -2202104 -1240922 -274414 212287 -82813
40472 -82813 -776545 -922888 -65980 1034329 1227689 404914 -466785 -708376 -635810 -730218
40462g30218j06815J86087K33528j18996l15618j15798j4145k58290l20735J29677
40452a431323N35296L64442j6669r8394j18554l41316j88096P74949J562783Q69814
40442A912932q17891j647169r40316J00803M09684L17002L71960L35301N0920
40433I3226M0857L82377J80109q48650j406325m79259Q06579O86371n69525j121198
40423b235438l58238M71104M91501M13670R85628J554641J044929l81168j449347
40414E37282j272641k42527M76700J93541n09393m30632N74905J109215P7873
40405E14323j503826j648663j35093J177963R50014m67j91316M78972J002837
40396F44744Q40051L29874j07994m30538p12627q88891p73205k42703M62681P50199
$$ plain form
40462 -730218 -837033 -650946 -417418 -536414 -852032 -967830 -981975 -1240265 -1561000 -1431323
40452 -1431323 -896027 -531585 -548254 -646648 -765202 -1106518 -1294614 -519665 1043118 1912932
40442 1912932 1095041 -552128 -1492444 -1391641 -981957 -664955 -292995 42306 93226
40433 93226 134083 516460 696569 -152081 -1558406 -2037665 -1231086 -544715 -1114240 -2235438
40423 -2235438 -2593676 -2122572 -1631071 -1217401 -231773 1322868 2367797 1986629 537282
40414 537282 -735359 -977886 -501186 -307645 -817038 -1247670 -672765 436450 514323
40405 514323 -989503 -2638166 -2773259 -1595296 -645282 -645749 -837065 -358093 644744
40396 644744 1484795 1814669 1706675 1276137 563510 -325381 -1098586 -1341289 -878608 -128409
40386a28409L69412p9469Q0216N22353M39182k6956k154M35877J75375r28303
40376H57124j421733m26851Q77332J036539M45361L73126P74784N90049l00681
40367B805050r10090p47372l48904k79300n63074r35700q87760P1518J377531
40358d18101J446978j01611j256523k90409J318198Q73976j217528j852670j8885
40349a516575J721818J317487J8165k81626J5953k14914m09030L36114J087002
40340B074394N45052m91153l88226N22010O41228j28169n63371n01909p46115
40331I63741r90947k37156Q97564P23027o02680j149334m51361j06401o30450
40322a583997m27015J107938K090151J219808k7671l7479K99193l58241j065983
$$ plain form
40386 -128409 241003 161534 241750 764103 1203285 1176329 1174175 1610052 1785427 857124
40376 857124 -564609 -991460 -114128 922411 1367772 1740898 2515682 3105731 2805050
40367 2805050 1894960 1147588 798684 519384 -43690 -979390 -1867150 -1795632 -418101
40358 -418101 1028877 927266 -329257 -619666 698532 1572508 354980 -1497690 -1516575
40349 -1516575 205243 1522730 1540895 1259269 1275222 1060308 651278 987392 2074394
40340 2074394 2619446 2128293 1740067 2262077 2903305 2775136 2211765 1709856 963741
40331 963741 -27206 -264362 633202 1356229 753549 -395785 -847146 -953547 -1583997
40322 -1583997 -2011012 -903074 1187077 2406885 2379214 2341735 2640928 2282687 1216704
40313A216704l78217P05726L18829q38603n49870J012991J425895M9359r78508
40304A984306l35530N66937K78801m13933l26717q6381p84329j758424j527666
40295b402936j86403P69687O45276J74802P6627J91207J83197J54274K64939L53569
40285B24239K20417l6596j52594j7144J88884J57827j53070l60744j57439J19065
40275C2845r9070o35756o89826r6538L28057J08853p9018L64547P36557J15655
40265H6306q70464p48275M34447R35096r4534j239341r00384L82473R00541L07604
40255h06531k65814k67312k82896m35163J20583J440180J998054P59622j052846
40246A207877j569138q09903j66227j4651L88317R25498N04096q24011j478419
$$ plain form
40313 1216704 838487 1544213 1863042 1024439 474569 1487560 2913455 2962814 1984306
40304 1984306 1648776 2215713 2494514 2080581 1753864 1667483 883154 -875270 -2402936
40295 -2402936 -2589339 -1819652 -1174376 -999574 -922947 -731740 -548543 -394269 -129330 224239
40285 224239 444656 408060 255466 238322 427206 585033 431963 71219 -86220 32845
40275 32845 -66225 -701981 -1391807 -1488345 -1160288 -1051435 -1130453 -765906 -29349 86306
40265 86306 -784158 -1532433 -1097986 -162890 -257424 -1496765 -2397149 -2014676 -1114135 -806531
40255 -806531 -1072345 -1339657 -1622553 -2057716 -1937133 -496953 1501101 2260723 1207877
40246 1207877 -361261 -1171164 -1337391 -1352042 -963725 -38227 465869 -358142 -1836561
40237a836561p08736L04657M76113L39553N78318O42057J38220R2846J142931
40228A169398J762336L56119j757908j801192L35319J772352P36267j172779j574230
40219a74318m14203O31717O61107K38073J41213L55976K56191n25867j385143
40210b15254j182804J81723J176336N26056p81600p11907P96873J644207O71067
40201B104697o70730n34649P38305J351634N80664n38446p79993j68320K55357
40192B338519k16164j031415j030739l6159Q22833P22886K35636Q9285j32762
40183A761920q67432j179490j88282R34358M62597r21082r95091M12792J256618
40174F76908P57219L08155M71456j6579j344842j665854l68269N30008q3437l51698
$$ plain form
40237 -1836561 -2545297 -2240640 -1764527 -1424974 -846656 -204599 -66379 26467 1169398
40228 1169398 2931734 3287853 1529945 -271247 64072 1836424 2572691 1399912 -174318
40219 -174318 -588521 43196 704303 942376 1083589 1439565 1695756 1169889 -215254
40210 -215254 -1398058 -1216335 -39999 486057 -295543 -1007450 -210577 1433630 2104697
40201 2104697 1433967 899318 1637623 2989257 3569921 3031475 2251482 2083162 2338519
40192 2338519 2122355 1090940 60201 24042 846875 1569761 1805397 1894682 1761920
40183 1761920 894488 -285002 -473284 461074 923671 2589 -992502 -579710 676908
40174 676908 1434127 1742282 2213738 2197159 852317 -813537 -1181806 -651798 -735235 -1086933
40164a086933R58878J655389k40299k478256j681621J205247K285049O41419p90683
40155D68190j47533J026261R13051j4426n23644m92253k57983K15187O80391M43749
40145B310990m81395j102437p74359K9959M58304J12483p32605j166641m18945
40136a764646Q09880Q00325n52358j039026N23016J979042J014561r75785j054732
40127b59723M37053O55085p20572r93408P45515K014607J149335k01461k48975
40118B577456J61485k94238r49743p55077l48978o17787q44327j45244O27697
40109e88756K21241q49987j096083k35485P23071R34720L28839n21900n76951
40100a661291O37446J821300J164479p76226j340434L41940J840814J058892p19302
$$ plain form
40164 -1086933 -128055 1527334 1287035 -1191221 -2872842 -1667595 617454 1258873 468190
40155 468190 320657 1346918 2259969 2245543 1721899 1229646 971663 1186850 1867241 2310990
40145 2310990 1829595 727158 -47201 -17242 441062 553545 -179060 -1345701 -1764646
40136 -1764646 -954766 -154441 -706799 -1745825 -1222809 756233 1770794 795009 -259723
40127 -259723 177330 832415 111843 -881565 -136050 1878557 3027892 2826431 2577456
40118 2577456 2738941 2444703 1494960 739883 390905 -226882 -1071209 -1216453 -588756
40109 -588756 -367515 -1217502 -2313585 -2549070 -1825999 -891279 -562440 -1084340 -1661291
40100 -1661291 -1023845 797455 1961934 1185708 -154726 187214 2028028 3086920 2367618
40091B367618j138139k92097J52523n3845J05158O41181N65439k52512r34006
40082A161320j000854o38047N640O77867P89147K94416K2030K64785J65615n48375
40072A193544p00909J90610N83701n48361j508815m19340J467851J595878J70505
40063B024664m51182K01041L06536p01119j166388k74591N68201K60145l24731
40054D42576j76447J98906p016n30871p82741p36172m10321L49693J073046Q94223
40044C14876L7702k44419L22516N12612l27701j136265q82057j44275K9378k33906
40034a751539j56783L18830O23433M72886J1672m72771n71062q8409L90323P4818
40024a148602o62743n22381P36928J682597J196806k890o07746m88148k91680
$$ plain form
40091 2367618 1229479 937382 1089905 1036060 1141218 1782399 2347838 2095326 1161320
40082 1161320 160466 -477581 -471941 205926 995073 1289489 1311519 1576304 1741919 1193544
40072 1193544 492635 683245 1266946 718585 -790230 -1209570 258281 1854159 2024664
40063 2024664 1573482 1774523 2081059 1379940 213552 -61039 507162 767307 442576
40054 442576 266129 465035 458019 -72852 -855593 -1591765 -2002086 -1652393 -579347 314876
40044 314876 352578 108159 430675 943287 615586 -520679 -1402736 -1547011 -1517633 -1751539
40034 -1751539 -1908322 -1589492 -966059 -493173 -481501 -954272 -1525334 -1613743 -1223420 -1148602
40024 -1148602 -1811345 -2333726 -1596798 85799 1282605 1279715 671969 183821 -107859
40015a07859j19569L12462P32133N71086p5913n36902m41754K6288N04293O32211
40005A496476J96629m94013p46122l63223L3610q2636m17821m39771j59851J16368
39995h60354L08761L78697J45498k49504k46850K63820N74881K35757j46802O4211
39985D68115L11769l50736j568382j897403p42961Q40527J515131J108611L99140
39976H3811L6172R5433L49673N20691L55684j80462p08717o91620j03700L19145
39966G6110r7782q78955p20761P16255J918046J213937r25821k279222j619899
39957b598092p2345O40806L54701J41009M97157Q30886O06630J52180M3430J69224
39947G65586j13189r18152j383730p18375N00899Q39589M661o03871L4288R34656
$$ plain form
40015 -107859 -227428 85034 817167 1388253 1312340 775438 333684 359972 864265 1496476
40005 1496476 1693105 1199092 452970 89747 123357 40721 -377100 -816871 -976722 -860354
39995 -860354 -551593 -172896 -27398 -276902 -523752 -259932 314949 550706 403904 468115
39985 468115 779884 429148 -1139234 -3036637 -3779598 -2939071 -1423940 -315329 83811
39976 83811 119983 215416 565089 1085780 1441464 1261002 552285 -139335 -243035 76110
39966 76110 -21672 -900627 -1621388 -905133 1012913 2226850 1301029 -978193 -2598092
39957 -2598092 -2670437 -2029631 -1674930 -1533921 -1036764 -205878 400752 552932 596362 765586
39947 765586 652397 -265755 -1649485 -2367860 -1866961 -1027372 -1022711 -1626582 -1592294 -657638
39937f57638P00959j21393M2135J011478J038837j53173p38406J45102Q51078
39928B118979m4274j378589j391477n06336k28732m72357p2229Q18886R65188
39919a90941K84497j11239Q5784J49854o5666n3427k3967n10869p82726K68248
39909i50452J690181J302144p34117j732477n93459N75764J64495l55300N57303
39900g5918J437301L56743j411903j305218K53953O93687l06037n65450N29249
39891c93593J009237m3764q74265j71634P95800N63315k28055m36830l96821o80317
39881h56927o19445K31382P20889p167o92916J1876J025223N54121p55358q27951
39871a216273M05394J117082P44480M71019O15285J42191r18295j099913j79017
$$ plain form
39937 -657638 43321 -78072 -35937 975541 2014378 1861205 1122799 1267901 2118979
39928 2118979 2074705 696116 -695361 -1201697 -1430429 -1902786 -1975015 -1156129 -190941
39919 -190941 93556 -17683 68101 217955 152289 98862 74895 -435974 -1218700 -950452
39909 -950452 739729 2041873 1307756 -424721 -1018180 -442416 -277921 -633221 -75918
39900 -75918 1361383 1718126 306223 -998995 -745042 -51355 -357392 -922842 -393593
39891 -393593 615644 571880 -302385 -474019 321781 885096 657041 220211 -176610 -856927
39881 -856927 -1476372 -1244990 -524101 -531268 -1224184 -1212308 -187085 367036 -388322 -1216273
39871 -1216273 -810879 306203 1050683 1521702 2136987 2279178 1360883 260970 81953
39862H1953J68502p35587j303147m41783N66388L57004k79485o5690N51945O06993
39852d92907N46407J092406J433113N22103q16125j052837m01474j37584k32683
39843D60419K28558Q45808L82998p90382r83450M8491P58387M25324Q762K6777
39833A411692k74605r89947q89554L35497J060174J98715r29834o27743N93101
39824a12504R61517N5937r73307j177054n98813K31843O56380K53407m20330j90704
39814a313628R26751J323932J76314r82119m81266P83390P42192m94406q68628
39805a87468K22915J027295L41540p40989q32862k59664L9545J76815N79468P26823
39795A093418O3739o44592l71990L30147J47604o68117n62320O17148J036850
$$ plain form
39862 81953 250455 -485132 -1788279 -2230062 -1663674 -1306670 -1586155 -1651845 -1099900 -492907
39852 -492907 53500 1145906 2579019 3101122 2284997 1232160 830686 693102 460419
39843 460419 688977 1534785 1917783 1127401 143951 192442 950829 1376153 1384915 1411692
39833 1411692 1137087 147140 -742414 -406917 653257 851972 -77862 -705605 -112504
39824 -112504 849013 904950 -68357 -1245411 -1844224 -1612381 -956001 -702594 -1122924 -1313628
39814 -1313628 -386877 937055 1113369 131250 -350016 433374 1175566 681160 -187468
39805 -187468 35447 1062742 1404282 663293 -169569 -429233 -389688 -212873 366595 1093418
39795 1093418 1157157 512565 140575 470722 618326 -49791 -612111 5037 1041887
39786A041887k70666j620842j030007Q31650J668690Q89351R6606L22702O03668
39777B533039j03893j122819j225145n43954j13353j80514k08327j34543l46970
39768a446479n68937o2418R59823J361468Q17111L21858M72984M44328m90258
39759A809480j452818j155478O3604O85545J91784m57748m89081k29131j27449
39750a161292k524K61392K51947j02575p2132O72063J171511N33699m31680k52627
39740H67782P92083Q50659o40606j820853r88971R01726J584512N43490o69542
39731A420280q34297l38868J7810J85489L72456L76083J74m50054n39239j87237
39721B2597L82221P55533M53428m34530r10462k64798N67295J14428j171499j223963
$$ plain form
39786 1041887 771221 -849621 -1879628 -1047978 620712 1510063 1606669 1929371 2533039
39777 2533039 2429146 1306327 81182 -462772 -576125 -756639 -964966 -1099509 -1446479
39768 -1446479 -2015416 -2077834 -1118011 243457 1060568 1382426 1855410 2299738 1809480
39759 1809480 356662 -798816 -735212 -49667 142117 -315631 -804712 -1033843 -1161292
39750 -1161292 -1163816 -902424 -650477 -753052 -825184 -153121 1018390 1552089 1120409 867782
39740 867782 1659865 2510524 1869918 49065 -939906 -38180 1546332 2089822 1420280
39731 1420280 585983 247115 264925 450414 822870 1198953 1199127 749073 209834 22597
39721 22597 404818 1160351 1613779 1179249 268787 3989 571284 685712 -485787 -1709750
39711a709750M18800J549538N12613j206097j190851M05464J430646R40773p2184
39702A078952o63741q03391m93995K59216O93987Q7677p89176n92913L48796M58535
39692d16053m26980p52577Q3308P42838L38194o2191N94858J416936R66211m42679
39682B041865j167167m10458J009373J714878R96092o27178j732235j378267k80758
39673A66145R2854m45208p15484j45967M72702M72077J84924o7268m82950p92104
39663a260279k12366J001019J434217O15337k82041n00082p06966j119478o61882
39654a692521P40120J159491k80988j395815k07423J597702J213621p00516j137147
39645g03476L35025J117234L8760r62344l25866P46987N90885l88982q09441m00131
$$ plain form
39711 -1709750 -1290950 258588 771201 -434896 -1625747 -1220283 210363 1151136 1078952
39702 1078952 415211 -388180 -882175 -622959 71028 158705 -630471 -1223384 -874588 -416053
39692 -416053 -843033 -1595610 -1512302 -769464 -431270 -493461 101397 1518333 2484544 2041865
39682 2041865 874698 464240 1473613 3188491 4184583 3557405 1825170 446903 166145
39673 166145 258999 -186209 -901693 -1047660 -574958 -102881 82043 14775 -468175 -1260279
39663 -1260279 -1472645 -471626 962591 1577928 1295887 795805 88839 -1030639 -1692521
39654 -1692521 -952401 207090 -73898 -1469713 -1677136 -79434 1134187 433671 -703476
39645 -703476 -368451 748783 787543 -174801 -500667 246320 837205 448223 -361218 -761349
39635g61349J57823L58245Q864p68585j165035l83580R31033J187239J15471q08233
39625a128107o08257j3988J25585J17980L75906N20448L79318N29668R69797O42266
39615A910616o93725j514002p09647N64235O62191o4232j95414K65152J89638
39606D14812m33242m82526J96266M82852k7620l49211J23947N84414K36356l77068
39596C68980l19342K50549M17980r8373o84383p75913m27948N1567N22049Q82812
39586A87978Q42031J61831q38739j319826p64413L03349Q37501N55004K18226
39577A82942M24375O95998L11982m22089n60401k6881J98361l58402p97284j95572
39567e46971P85470O58664o10000j211822L5832J721052J516263m74900j557743
$$ plain form
39635 -761349 -603526 -245281 -236417 -1005002 -2170037 -2553617 -1622584 -435345 -319874 -1128107
39625 -1128107 -1736364 -1750352 -1624767 -1506787 -1130881 -610433 -231115 298553 1268350 1910616
39615 1910616 1216891 -297111 -1006758 -442523 219668 155436 -39978 225174 414812
39606 414812 -18430 -500956 -304690 178162 150542 -198669 -74722 509692 746048 368980
39596 368980 49638 300187 718167 619794 -64589 -840502 -1268450 -1216883 -694834 187978
39586 187978 1030009 1191840 353101 -966725 -1731138 -1427789 -590288 -35284 182942
39577 182942 607317 1303315 1615297 1193208 632807 605926 804287 445885 -351399 -546971
39567 -546971 238499 897163 287163 -924659 -888827 832225 2348488 1873588 315845
39558C15845j33806J892753J699125m37500j609965n67638O39786M2836j217269
39549F24167q73783P86499J403910K60417p37761j77995P57880L73351q59491
39540A557194j192057l23689L72469Q7835m46846m13257p5234k121q7956R655
39530e14007J53718J26599K02525O13880Q69657L77238n33246r99291q74954p57139
39520a335020q19512n49362J71926O42777M28926J04840L15474P04432M95997
39511A60478k36104o32630k49688M40160P64548N85803K38260O4063J06282J08809
39501A349981j68970n78439o90749l66066M7079K14235J94723J44005K9908r4432
39491H1275K8127L31110K18902n93718j390753j228533k14645N99085N52455N6567
$$ plain form
39558 315845 182039 2074792 3773917 3336417 1726452 1158814 1798600 1841436 624167
39549 624167 -249616 536883 1940793 2201210 1463449 1285454 2043334 2416685 1557194
39540 1557194 365137 41448 413917 501752 54906 -358351 -433585 -435706 -523662 -514007
39530 -514007 -360289 -233690 -31165 582715 1452372 1829610 1296364 297073 -577881 -1335020
39520 -1335020 -2154532 -2703894 -2531968 -1889191 -1460265 -1355425 -1039951 -335519 160478
39511 160478 -75626 -708256 -957944 -517784 246764 832567 1070827 1134890 1241172 1349981
39501 1349981 1181011 602572 -88177 -454243 -407164 -192929 1794 145799 175707 81275
39491 81275 109402 440512 659414 65696 -1325057 -2553590 -2768235 -2169150 -1616695 -1560128
39481a560128j26435J58125M06605J84369k38064j03914P96281J520158R73390
39472B010387n03415j337651p52848K75033N37939J34787k20801m95077r03720
39463a255366r42073r5584R53465J099950N03992K59112N83854O53159J77025
39454A937534j85869j27684j51445m66636n54902j59925K80387M48634M51958
39445A472052J75803n99811j291370r23682K72096R03756M24257j70784q2353
39436A79964K10145J93303K39008M81729J58371r16703j491051o57102O38034
39427i64302J081251Q64999P14003K13695j144960k180662j351838N81624J329946
39418h56244M32300k40117L81357J004924L57567o80398n81575M37683R33172
$$ plain form
39481 -1560128 -1686563 -1528438 -1121833 -937464 -1175528 -1279442 -483161 1036997 2010387
39472 2010387 1506972 169321 -583527 -308494 229445 364232 143431 -351646 -1255366
39463 -1255366 -2197439 -2293023 -1339558 -239608 264384 523496 1107350 1760509 1937534
39454 1937534 1751665 1623981 1472536 1005900 450998 291073 571460 1020094 1472052
39445 1472052 1647855 1048044 -243326 -1167008 -894912 8844 433101 262317 179964
39436 179964 390109 583412 822420 1304149 1462520 545817 -945234 -1602336 -964302
39427 -964302 116949 981948 1695951 1909646 764686 -1415976 -2767814 -2186190 -856244
39418 -856244 -423944 -664061 -282704 722220 1079787 399389 -182186 255497 1188669
39409A188669M26759k29765l83769l21308m10578l83250J55342R14339J050837
39400B007276J97556q42546q30409L02443J087445L43385j055589j212413J15942
39391A13090J110767M99209o96849q50377j03892J91332k55029m52777k5771J72027
39381b98270l31820o97860j38354P77177J021579N92882J99148J5386k52037m27893
39371D59938q4228M26267K46159n72662r66655m38974K42869L29368J17497J32844
39361a07577J73022q9377k93850k4794L34778K34764p9405j05673n8880l13119
39351c30111l62091M55357J464355J216497l93888j774743j648433m20906P06766
39342a087197J051019N77410l87295j175138j185681n65681N6965N09394J005880
$$ plain form
39409 1188669 1615428 1385663 1001894 680586 270008 -113242 42100 956439 2007276
39400 2007276 2204832 1362286 531877 834320 1921765 2265150 1209561 -2852 113090
39391 113090 1223857 1723066 1026217 175840 71948 263280 8251 -444526 -470297 -298270
39381 -298270 -630090 -1327950 -1466304 -689127 332452 925334 1124482 1139868 887831 459938
39371 459938 375710 801977 1048136 475474 -491181 -930155 -687286 -357918 -240421 -107577
39361 -107577 65445 -23932 -317782 -342576 -7798 226966 147561 41888 -16992 -330111
39351 -330111 -692202 -236845 1227510 2444007 2050119 275376 -1373057 -1793963 -1087197
39342 -1087197 -36178 541232 153937 -1021201 -2206882 -2772563 -2715598 -2206204 -1200324
39333a200324J257637P08014k53809m72867K77174Q92135O19849L2986j66673
39324A694122j84824l16689j46943N99954J233394R55674l1514q95128j101473
39315A806573n92434K82024P24375K21550m97080l08078L86585R5217j105975
39306A012757j292622J35225J134620K49669r43580n60209L52721j86006j383373
39297a480798r69055O99456J074580k51491r08830J25762Q83535l7053j028766
39288a892660k36283J390536J714916O09414l28908l10689O8499K23338J58620
39279A396783n1033l31782m01198j99718j60900m72667n86900o7844O25866Q37427
39269E88034O45752M65132K45698k44660p80812r61226p67815l56050K59532Q45996
$$ plain form
39333 -1200324 57313 765327 511518 38651 315825 1207960 1827809 1860795 1694122
39324 1694122 1509298 1192609 1045666 1645620 2879014 3834688 3803174 2908046 1806573
39315 1806573 1214139 1496163 2220538 2442088 1945008 1636930 2023515 2118732 1012757
39306 1012757 -279865 -144640 989980 1239649 296069 -264140 88581 -97425 -1480798
39297 -1480798 -2449853 -1750397 -675817 -927308 -1836138 -1710376 -826841 -863894 -1892660
39288 -1892660 -2128943 -738407 976509 1585923 1257015 946326 1014825 1238163 1396783
39279 1396783 1345750 1013968 612770 413052 252152 -220515 -807415 -875259 -249393 588034
39269 588034 1233786 1698918 1944616 1699956 919144 -42082 -809897 -1165947 -906415 -60419
39259f0419Q39897J51308m67578m39766j80531k69646m34536j59502K40203J04328
39249f76242l72348m11144M4994K34570k08197p52921p90370l06250L47624Q11712
39239b078572Q14037M08744J03930K61374M63522O8452o83316q33997n6263Q73594
39229f58495J139760P58367J48908m50185p46216k92561P39197J249544M72459
39220B360778q06735j166813m88478J4875k71945n45894j23339L19670o3867p08963
39210a480711m65093M51121P15026N6329k74610M12659J040171M31933q46305
39201D0520j341337p16769J40398N57330N85383L49800r1597l14874J29641Q78266
39191B16761J011096K53523o84275j024694o58807J5516M95499M73760J64058
$$ plain form
39259 -60419 779478 930786 463208 23442 -157089 -426735 -861271 -1020773 -780570 -676242
39249 -676242 -1048590 -1459734 -1414740 -1180170 -1388367 -2141288 -2931658 -3237908 -2890284 -2078572
39239 -2078572 -1264535 -855791 -751861 -490487 -26965 41487 -641829 -1475826 -1532089 -658495
39229 -658495 481265 1239632 1388540 938355 192139 -100422 638775 1888319 2360778
39220 2360778 1554043 387230 -101248 -86373 -358318 -904212 -1027551 -707881 -771748 -1480711
39210 -1480711 -1945804 -1494683 -779657 -723328 -997938 -585279 454892 886825 40520
39201 40520 -1300817 -2017586 -1877188 -1319858 -734475 -384675 -476272 -791146 -661505 216761
39191 216761 1227857 1481380 797105 -227589 -886396 -870880 -375381 98379 262437
39182B62437J36753M26991K57019p15741j433355p16723Q60345J540349O96474
39173A314549n63186j074972p58294m3960O42306O86515k29183j232743j027626
39164b286594K23357J000747O30303q56k34328n37211j008123o82994O72498J615692
39154f07509J090734P4063j65057j07298o99165j230401m24790J127253J619155
39145F76985P24528k00432l88720l51022l65300m9638M03785K04479n52521q62058
39135g59914n18819l54045m86430J8504J209750J632744N30464p76268p83840
39126b87854J02123N24400K47029L2383J53463K51637K49472L53030M39791K88535
39116B354009Q9640O630k97497r29013j147171m37443L56985J35330o55020o47711
$$ plain form
39182 262437 399190 826181 1083200 367459 -1065896 -1782619 -922274 618075 1314549
39173 1314549 751363 -323609 -1081903 -1125863 -483557 202958 -26225 -1258968 -2286594
39164 -2286594 -2063237 -1062490 -432187 -433043 -667371 -1204582 -2212705 -2895699 -2223201 -607509
39154 -607509 483225 557288 392231 284933 -414232 -1644633 -2069423 -942170 676985
39145 676985 1401513 1201081 812361 461339 96039 46401 450186 654665 102144 -759914
39135 -759914 -1278733 -1632778 -2119208 -2100704 -890954 741790 1272254 495986 -287854
39126 -287854 -185731 338669 585698 618081 771544 1023181 1272653 1625683 2065474 2354009
39116 2354009 2443649 2450279 2152782 1223769 76598 -360845 -3860 131470 -523550 -1171261
39106a171261K16490N72677j22061o94809j27408R17567J180197M82202m21362
39097H32232r22592p95493l3292Q30954Q51855j47036j067999r24563j38978L24543
39087a190369M38608O78447P14081r5251j164715j121677J03465R98218O22296
39078a6897k16018m22896p0657K58776M90878O25491K43241o63867j185036p38208
39068a695193q4588j26952m11815M4731J009797J340445O94434k05054p35864
39059a70059p38133p2279R83395J253475J3485j379974q46240J309194K365942
39050B718806Q17100j555461k137838p44402O88084P83631n2716o66981m75164
39041f24941J52445L68050j63015p12814l95978M83523Q32951M85659L51610O56793
$$ plain form
39106 -1171261 -954771 -382094 -504155 -1198964 -1326372 -408805 771392 1253594 832232
39097 832232 -90360 -885853 -919145 -88191 763664 616628 -451371 -1375934 -1514912 -1190369
39087 -1190369 -751761 -73314 640767 545516 -619199 -1740876 -1637411 -639193 -16897
39078 -16897 -232915 -655811 -726468 -467692 23186 648677 891918 228051 -956985 -1695193
39068 -1695193 -1779781 -1906733 -2318548 -2273817 -1264020 76425 770859 565805 -170059
39059 -170059 -908192 -980471 2924 1256399 1269884 -110090 -956330 352864 2718806
39050 2718806 3535906 1980445 -157393 -901795 -213711 569920 517204 -149777 -624941
39041 -624941 -472496 -104446 -267461 -980275 -1376253 -892730 -59779 425880 777490 1434283
39031A434283M34862o29828j267816n26876N91465O21674j77681m64316L1494
39022D7261L72006P2602l59726m23628j63646K03713M50492L15491o6653r1948
39012C55964L65423N17953j00186o75859l34980L87159M29722o1956j88310R770
39002G04700k50205q68470r14980k64827K07592J49586J29869L64751L42482O125
38992c93377P7039P50376J133466N24468n71931j179676r52324k12286N13514
38983c10731P56075M21499l9630k06765k66501m76078m61959J03593N68465J60034
38973B48002n76905n10097J75309L16686r0262J66316J235803J688571Q35515
38964C488938j58342k84443k04125p09400j120310n32611M17366M16602n57192
$$ plain form
39031 1434283 1869145 1239317 -28499 -555375 36090 657764 480083 15767 47261
39022 47261 419267 491869 132143 -291485 -455131 -251418 199074 514565 447912 355964
39012 355964 721387 1239340 1139154 463295 128315 515474 945196 883240 694930 704700
39002 704700 454495 -413975 -1328955 -1593782 -1386190 -1236604 -1106735 -741984 -399502 -393377
38992 -393377 -316338 434038 1567504 2091972 1520041 340365 -611959 -824245 -310731
38983 -310731 445344 866843 827213 620448 353947 -122131 -584090 -480497 87968 248002
38973 248002 -328903 -839000 -663691 -347005 -437267 -270951 964852 2653423 3488938
38964 3488938 3330596 3046153 2842028 2132628 1012318 479707 897073 1313675 756483
38955G56483j296137r62688J98809J293212J335466K6950j510289j597843j48318
38946a904355J019824O34120m11958p20432m17379l36856k94086L50738J174578
38937i05806J231493O16056J46639o5608m20370o20004n2630Q42716R35209P9161
38927A786856p25732q15052m54127k2990L65313M53977o139o80719r81909q25544
38917a906066l76931N21028J740432K187203R63803j031025j911763j134857J20075
38908h28101P74677Q33780N73236L2794m75008m39313L0828L29849L26927L41073
38898A500742K97893n8340l17373L3937M07201j39005j082426r74340J47531O30708
38888D46528j78392r61926o58592M2103K30008J93636L41855J88174m74585p07431
$$ plain form
38955 756483 -539654 -1502342 -1303533 -10321 1325145 1352095 -158194 -1756037 -1904355
38946 -1904355 -884531 -250411 -662369 -1382801 -1800180 -2137036 -2431122 -2080384 -905806
38937 -905806 325687 941743 1088382 1022774 602404 -17600 -70230 772486 1707695 1786856
38927 1786856 1061124 246072 -208055 -231045 134268 588245 582106 -98613 -1080522 -1906066
38917 -1906066 -2282997 -1761969 -21537 2165666 3129469 2098444 186681 -948176 -828101
38908 -828101 -53424 780356 1353592 1386386 911378 472065 502893 832742 1159669 1500742
38898 1500742 1798635 1740295 1422922 1456859 1864060 1725055 642629 -331711 -184180 446528
38888 446528 268136 -693790 -1352382 -1310279 -1080271 -886635 -544780 -356606 -831191 -1538622
38878a538622O6849Q48300N70735k27528m82334l53081n58295q27853m31832L77428
38868b556233P67979O62732N14466L06061r9527k22113K60291O26118K00089l40872
38858A18991n0346N87240M91526j19590k70471q5703l29515n61175K27455J350161
38848A358573J005099p29114j683979q66830K12007K21294j03836J56685L46375
38839h3726j87330m96939K38958Q37398o3612j400974j106326N05884J082845
38830f73822j13841j149829n08729P43220Q93474J64784j5461N57991O58896l33554
38820B23129j427796j386225l10843O90225J023044J111688J357004J295262L54396
38811B929884r17030j226775k67372P10773M87947n71713j161805p90807j55388
$$ plain form
38878 -1538622 -1471773 -623473 -52738 -280266 -762600 -1115681 -1673976 -2501829 -2933661 -2556233
38868 -2556233 -1788254 -1125522 -611056 -304995 -404522 -626635 -366344 259774 459863 118991
38858 118991 68645 655885 1147411 1027821 757350 671647 342132 -219043 8412 1358573
38848 1358573 2363672 1634558 -49421 -916251 -704244 -482950 -586786 -430101 -83726
38839 -83726 -271056 -767995 -529037 308361 244749 -1156225 -2262551 -1756667 -673822
38830 -673822 -787663 -1937492 -2446221 -1703001 -809527 -644743 -660204 -102213 556683 223129
38820 223129 -1204667 -2590892 -2901735 -2211510 -1188466 -76778 1280226 2575488 2929884
38811 2929884 2012854 786079 518707 1229480 1717427 1145714 -16091 -806898 -962286
38802i62286N2505n4464n0320J11807J73591K1258j86957k56252k18148l11096
38792a680362n91528o50034p4704P75870J010065M44613k9469K14885N08820l4253
38782a06097r53729j015693j25387M90848J29720m53213l41898K36476N05203
38773a633770L57383L01513N81729R36350J016661O45626j14306q35265r43385
38764C12536l90638J61719J48982j87913k41486Q9862L77026L25374O4352j43946
38754E15868j69332l5714J00051N8453j38672k89457l38530m32552n40873l65427
38744a636185J66315O65744P85972O07412K78039k71208q80762r37022j70086
38735a391781O99808P68126J36674l65776m16165l70257l18348J31420R51864
$$ plain form
38802 -962286 -909781 -964245 -1014565 -902758 -729167 -707909 -894866 -1151118 -1369266 -1680362
38792 -1680362 -2271890 -2921924 -2996628 -2220758 -1210693 -766080 -795549 -580664 -71844 -106097
38782 -106097 -1059826 -2075519 -2200906 -1710058 -1580338 -2033551 -2375449 -2138973 -1633770
38773 -1633770 -1276387 -974874 -393145 543205 1559866 2205492 2091186 1255921 312536
38764 312536 -78102 83617 232599 44686 -196800 -106938 270088 595462 659814 515868
38754 515868 346536 310822 410873 469326 330654 41197 -297333 -729885 -1270758 -1636185
38744 -1636185 -1469870 -804126 -18154 589258 867297 596089 -284673 -1221695 -1391781
38735 -1391781 -691973 76153 212827 -152949 -569114 -939371 -1257719 -1126299 -174435
38726a74435J379477Q94767j9652m89317k43697K98287O00057L73249l38790j126098
38716A153848j417647r74568j46724M43833M43867N3705j44269K05201O81996
38707B99242M64717n10802j218896q36607J05910N53787M44647M41324M95868
38698B39190n9477j004297j180282k91005N15764L99394k6333L8505L31870L98816
38688f37855N98691J186819J360389M40211p69280j065392o37513m69806n59501
38679e53237j85082M82914N82921J53932L2010K95628L02747J36623L84488N64167
38669B197111l33134j586996j196456Q17909J808641L44276j463809j149509M29992
38660a31975P83946j78016l74673P53629J384266L59637j127016j568545j097074
$$ plain form
38726 -174435 1205042 2099809 2080157 1590840 1347143 1645430 2245487 2618736 2279946 1153848
38716 1153848 -263799 -1238367 -1385091 -941258 -497391 -443686 -587955 -382754 299242
38707 299242 763959 253157 -965739 -1802346 -1696436 -1142649 -698002 -256678 239190
38698 239190 179713 -824584 -2004866 -2295871 -1780107 -1380713 -1407046 -1368541 -1036671 -637855
38688 -637855 -39164 1147655 2508044 2948255 2178975 1113583 476070 6264 -553237
38679 -553237 -738319 -255405 327516 481448 513458 809086 1111833 1248456 1632944 2197111
38669 2197111 1863977 276981 -919475 -101566 1707075 2051351 587542 -561967 -131975
38660 -131975 651971 473955 99282 852911 2237177 2596814 1469798 -98747 -1195821
38651a195821n22018J36627J044124J511113Q05327m86967j002291l84902L18624
38642B23816J50989n29077o70128l1660M88894J71029l85521o5876R64588J214772
38632A531826N00j310073j066433L03136R02387Q7360p66471m49812L73389L50144
38622d4047n21285r73847k76990Q61926J282890P50435P9525M2122M29336M01825
38612B031890l15806r99967q92324k05112K42066R6343k98071n12734l57295J99160
38602a011850Q41196Q35401j49163j240900j167009Q5197J171150J106735L17110
38593G87867l01575n82285q17652q78120l33094O90221J350023R81968n6981o87665
38583A52707l62723K16559P8187m87823k65518Q11087J143173j28596j405475
$$ plain form
38651 -1195821 -1717839 -1581212 -537088 974025 1779352 1292385 290094 -94808 223816
38642 223816 374805 -154272 -824400 -856060 -367166 -196137 -581658 -647534 317054 1531826
38632 1531826 1532326 222253 -844180 -541044 361343 448703 -317768 -767580 -394191 -44047
38622 -44047 -565332 -1539179 -1816169 -954243 328647 1079082 1158607 1200729 1630065 2031890
38612 2031890 1716084 716117 -176207 -381319 -139253 -42910 -340981 -853715 -1211010 -1011850
38602 -1011850 -170654 664747 515584 -725316 -1892325 -1807128 -635978 470757 787867
38593 787867 486292 -95993 -913645 -1791765 -2124859 -1434638 -84615 897353 840372 152707
38583 152707 -210016 6543 84730 -403093 -668611 142476 1285649 1157053 -248422
38574b48422p72409J025417J620895N75819k45746J28835M79886j48644q45298
38565A570333o82090k82752l33627k32716M16357N79352l59726j023117j53090
38556e01076J004379N37464r16353j113676K33504J218721Q72192K26100J03509
38547A664764O846l57980l94019k7711o7627n44830l84356N72801R17691m0997
38537A344582r40541m73084N63975O74232j0162k84441N1417J87075p7858j34721
38527I00474J41155J20649m38632q97846o00667L36718J204042J306512M92651
38518B565056n79780q98534j86673O77047O77659j49042q94057q55126r5644P59932
38508A020838R50277J71117q83498j008781L2971R98529P03486l94555r03703
$$ plain form
38574 -248422 -1020831 4586 1625481 2201300 1955554 2084389 2564275 2415631 1570333
38565 1570333 888243 605491 271864 39148 455505 1034857 675131 -347986 -501076
38556 -501076 503303 1040767 124414 -989262 -755758 462963 1335155 1561255 1664764
38547 1664764 1671610 1313630 919611 891900 824273 279443 -104913 467888 1385579 1344582
38537 1344582 404041 -69043 494932 1169164 1159002 874561 925978 1113053 1035195 900474
38527 900474 1041629 1162278 723646 -174200 -774867 -438149 765893 2072405 2565056
38518 2565056 1985276 1086742 900069 1577116 2254775 2105733 1211676 356550 260906 1020838
38508 1020838 1971115 2142232 1258734 249953 282924 1281453 1984939 1590384 686681
38499F86681m25824J46514J37936j00827r5749o8826l50994n99302k67252M30206
38489e07437O88392K53185j87153J4347N41249O20844J77952j40272n8676o1051
38479A341380m28392o29842k14876L21855L01394l5099m1477J83613J88799K79136
38469A266491R29743J368816L67436j479703k066479q65592J53224l75004j063353
38460a764421k30529J143808J008676l14085o85423L10369Q81016K54497n4159
38451E49749R39371J735114O85517j227808j734743n62867M23529J29113m41164
38442D95811j01839O85069P55699J11802k64704j11071k38957j008851j476085
38433a153126p20623O49142J220064O74882R710n9652J17900J00668O7705J32659
$$ plain form
38499 686681 260857 407371 545307 444480 348731 279905 -71089 -670391 -937643 -507437
38489 -507437 180955 434140 246987 261334 802583 1423427 1601379 1461107 1402431 1341380
38479 1341380 912988 283146 68270 390125 691519 656420 614943 798556 987355 1266491
38469 1266491 2196234 3565050 3932486 2452783 386304 -479288 -326064 -701068 -1764421
38460 -1764421 -1994950 -851142 157534 -156551 -841974 -531605 349411 603908 549749
38451 549749 1489120 3224234 3909751 2681943 947200 384333 807862 936975 495811
38442 495811 393972 1079041 1834740 1946542 1681838 1570767 1331810 322959 -1153126
38433 -1153126 -1873749 -1224607 -4543 670339 680049 620397 738297 838965 906670 1039329
38423A039329j04615p18384j009010n74413k6384J06685L07303R37574J106961
38414A065046K1159j249835j003092M55861J186847N98006J44580O51114Q87691
38405B757377j91444j442331j201152J60714Q94519M11755l22734n59741m95563
38396A1400l33076N3503L78257N4153o62636o99075K43642J082524Q86939J64595
38386A180226q0127J66161K44785Q0092J10067K54640m44n34870o17682j30164
38376F72684K00969M0336p7013R9514l2261o68936q35353J01225J047379O37363
38366A185907n54713p87181J74333Q14566L47169k56349j36539J47927p4502l63349
38356D97269j91760m0833m19986p44511k89471M90337O64833K40525j17400j97700
$$ plain form
38423 1039329 934714 216330 -792680 -1367093 -1393477 -1286792 -979489 -41915 1065046
38414 1065046 1086205 -163630 -1166722 -710861 475986 1073992 1218572 1869686 2757377
38405 2757377 2565933 1123602 -77550 83164 977683 1389438 1066704 506963 11400
38396 11400 -321676 -268173 110084 164237 -498399 -1197474 -953832 128692 1015631 1180226
38386 1180226 1100099 1266260 1511045 1591137 1701204 1955844 1955400 1420530 802848 672684
38376 672684 873653 913989 836976 936490 904229 235293 -600060 -498835 548544 1185907
38366 1185907 631194 -155987 18346 832912 1180081 923732 787193 935120 860618 497269
38356 497269 305509 264676 -155310 -899821 -1189292 -698955 -34122 206403 89003 -108697
38346a08697j39317J85191P16836P48027n5855p49432l14575P46360J146061O51152
38336B825751L3473l25458n42040l97322K67083O87367R1915q38876q53589j50992
38326G97312N4401k81217r4271N75386M29234o87953j186565k34397Q89871Q48032
38316A109833J08674k54364k66491m20494m71303m5768L98707K96875m2963r4590
38306C18116n4197k54662l28755J41692P25610P46988K95132j09770l48647n02489
38296F29018l59089J46406M67240J22569n47768q81256p27103k89154L56023J049832
38286c3282J343155J016473M07776j09908m60846m72865O8951O76636M13580o28711
38276B220959j098843k65916Q44250R61882K98455j21735k5875J63859K60070
$$ plain form
38346 -108697 -248014 -62823 654013 1402040 1346185 596753 282178 1028538 2174599 2825751
38336 2825751 2859224 2533766 1991726 1594404 1861487 2548854 2640769 1801893 948304 797312
38326 797312 851713 570496 476225 1051611 1480845 792892 -393673 -628070 261801 1109833
38316 1109833 1218507 964143 697652 277158 -194145 -239913 158794 455669 412706 318116
38306 318116 263919 9257 -319498 -177806 547804 1294792 1589924 1480154 1131507 629018
38296 629018 269929 416335 883575 1006144 458376 -422880 -1149983 -1439137 -1083114 -33282
38286 -33282 1309873 2326346 2734122 2624214 2163368 1690503 1759454 2436090 2849670 2220959
38276 2220959 1122116 856200 1700450 2662332 2960787 2839052 2813177 2977036 3237106
38267C237106K61079l1942n31990o24726j68028r280o91516j416705j215023m14463
38257a605488J8351p2478j87829j23910J21260O86346J260894J021353J5635m56617
38247F77517J35582M50195m49550j135994n0431J533247J205471o52864j329635
38238C83538j5278J151407P05334p4188K44967P95823J12222j230528j412683
38229F60614j00713J097463P99575n06845j189606m17160Q99058J215093K52873
38220B710352p64843q89756n63899m52679k34852M52928Q50214K00358p08125
38211E99698o08486K34469O16582M25236L90942L21403m97385j423627j011362
38202i52530N74033J621499J407192P68141J56484p72043j490420q19759P26878
$$ plain form
38267 3237106 3498185 3466243 2934253 2309527 2141499 2132219 1440703 23998 -1191025 -1605488
38257 -1605488 -1587137 -1659615 -1847444 -1971354 -1850094 -1163748 97146 1118499 1134134 677517
38247 677517 813099 1263294 813744 -322250 -372681 1160566 2366037 1713173 383538
38238 383538 368260 1519667 2225001 2150813 2395780 3191603 3303825 2073297 660614
38229 660614 559901 1657364 2456939 1950094 760488 343328 1242386 2457479 2710352
38220 2710352 1945509 1055753 491854 39175 -195677 257251 1107465 1307823 599698
38211 599698 -8788 225681 842263 1267499 1658441 1979844 1482459 58832 -952530
38202 -952530 -378497 1243002 2650194 3418335 3574819 2802776 1312356 492597 1219475
38193A219475J085811j97427j151579n40531L69828K53385k15336n6711J99083
38184I65998j23690l31429K82658R70062P92024Q8175m81393j008061j376047
38175b21703p73033O53879J263927L60796m70285R9201R50974N35592n26352p37470
38165A135526k20319K1896J11754O09848R05568K15779p57744r25709n63573l44719
38155A88307J13814R97200J074403k21524j060163N5243J388278N98401j164914
38146A969045j067506N81203R46741m07830j004407R0087R87532O67976M07963
38137C170804O84845O8451j588627k056534l70832J280633J001230o5246j96413
38128A928311J15881k13123n88707j51435L35166Q532k89091L33016Q70524J29225
$$ plain form
38193 1219475 2305286 2107859 956280 415749 785577 1038962 823626 766915 965998
38184 965998 842308 510879 793537 1763599 2555623 2643798 2162405 1154344 -221703
38175 -221703 -994736 -340857 923070 1283866 813581 912782 1863756 2399348 1872996 1135526
38165 1135526 915207 937103 1048857 1658705 2564273 2780052 2022308 1096599 533026 188307
38155 188307 302121 1299321 2373724 2152200 1092037 1147280 2535558 3133959 1969045
38146 1969045 901539 1482742 2429483 2021653 1017246 1107333 2094865 2762841 3170804
38137 3170804 3855649 3924100 2335473 278939 -91893 1188740 2189970 2124724 1928311
38128 1928311 2044192 1831069 1242362 1090927 1426093 1434625 1145534 1478550 2349074 2478299
38118B478299r72276q35197J98470O18750J99749j67952k42019k75198O3536Q92551
38108A958713J084446j87717j651989j541691l14023J92541k08296K0447J297813
38099F50244K059077J099080p69168j862986j385025J83077J570367J574070J97261
38090C315997j179072j357870o30555Q1615N66303Q71064M83042p07517j434959
38081H048n82541R43552J426276Q29709L94450L11910k42309j066501j015428
38072A007166j47976K18669j94039k35787M25814O52944J4278l06484L77500R78559
38062B790644N07870k79282k65275K43936K93611j35500m16462l78339j81962
38053B179241K14093O64445O05339o4186n69868l99988j10530l12679o34190m65427
$$ plain form
38118 2478299 1506023 670826 869296 1488046 1687795 1519843 1277824 1002626 1066162 1958713
38108 1958713 3043159 2855442 1203453 -338238 -652261 -459720 -668016 -647569 650244
38099 650244 2709321 3808401 3039233 1176247 -208778 -25701 1544666 3118736 3315997
38090 3315997 2136925 779055 148500 230115 796418 1667482 2150524 1443007 8048
38081 8048 -574493 369059 1795335 2625044 3019494 3331404 3089095 2022594 1007166
38072 1007166 859190 1077859 883820 648033 1073847 1726791 1741069 1434585 1812085 2790644
38062 2790644 3298514 3019232 2753957 2997893 3291504 3156004 2739542 2361203 2179241
38053 2179241 2393334 3057779 3663118 3598932 3029064 2629076 2518546 2205867 1571677 1106250
38043A106250m9235j1523l39337n42850l86562Q8498P67229J234697R47416O1292
38033B875875n49908m61031j38480O6036L91910P63827N59663j61038m18163J6149
38023B944840M4750p76122j151852j67630R35964O73585k55918k85394L21911
38014B284134J71733n99882o00185K52889O61534L47349L29287P04656L76266
38005C927781o39080q43566J42531P42092R0101n06386L3676O46049J33692o02868
37995C124022k02098O18872K24301j106565j594881p62925J57993M41509N77661
37986A477889O97567J70322q08049r58571K9738P16932J23404o26069j04690J052156
37976A770629J136099R1391m77756N4234M30515k39641q90263k58180Q97274Q63168
$$ plain form
38043 1106250 1057015 1045492 706155 163305 -223257 -134759 632470 1867167 2814583 2875875
38033 2875875 2325967 1864936 1726456 1792492 2184402 2948229 3507892 3346854 2928691 2944840
38023 2944840 2989590 2213468 1061616 893986 1829950 2503535 2247617 1962223 2284134
38014 2284134 2455867 1855985 1255800 1508689 2170223 2517572 2846859 3551515 3927781
38005 3927781 3288701 2445135 2587666 3329758 3419859 2913473 2947149 3593198 3726890 3124022
37995 3124022 2921924 3540796 3765097 2658532 1063651 300726 458719 900228 1477889
37986 1477889 2175456 2345778 1537729 579158 608896 1325828 1449232 823163 718473 1770629
37976 1770629 2906728 2998119 2520363 2574597 3005112 2765471 1875208 1617028 2514302 3377470
37966C377470k76193o86413L18060J145950M43450p57111p07049L03303N63867
37957C725334j79035l81467N90355J254461L35269j162030j418410m05743L12957
37948B671691q2260q15249r10819l53639L29502Q19164J027394R14844N83346
37939D183974K71843J26337J36317K26290K09787j35546o45336p12359j01393
37930C559914M76117K21518n14701o03762K74518J195797J301666Q03308L57588
37921G071963J03194k03728n65154p57885o87460l51500K45168Q02059P51599
37912F408256M3908m88027j71093M18214K22918n73320o17814N62323J609353
37903G414718J137842k87167r81458n12840l8556k98037n49665j032P81622P64335
$$ plain form
37966 3377470 3101277 2414864 2732924 3878874 4322324 3565213 2858164 3161467 3725334
37957 3725334 3546299 3164832 3755187 5009648 5344917 4182887 2764477 2358734 2671691
37948 2671691 2589431 1774182 863363 509724 839226 1658390 2685784 3600628 4183974
37939 4183974 4455817 4582154 4718471 4944761 5154548 5019002 4373666 3661307 3559914
37930 3559914 4036031 4257549 3742848 3139086 3413604 4609401 5911067 6714375 7071963
37921 7071963 7175157 6971429 6406275 5648390 4960930 4609430 4854598 5656657 6408256
37912 6408256 6452164 5964137 5793044 6211258 6434176 5860856 5243042 5805365 7414718
37903 7414718 8552560 8265393 7283935 6771095 6732539 6434502 5884837 5883805 6665427 7429762
37893G429762L3211m97513n32622n16828n23503j10070O59398J066162Q58375
37884G866372O05978N97687K95321n80733j248756q93988Q2243O26498M60219
37875G810841J78870J66164J71086m9362k81042j94637J92683N13549M30816P4557
37865I013525J5539N08423R21985N38273j67373J0131J088339J595718P19809
37856A4244369m32670n83354j43504j59345m28409j39004M06746L57034L3454
37847A3155317L59949R90892Q68986L52306O86008J416340P23983j250684j925767
37838A5377330j26364J920916J913047P28268N05639J183139J159831K54545k78006
37829B2638345o4551J31970J35855M59759Q79619O46942K1603k5935M51868N38917
$$ plain form
37893 7429762 7462973 6965460 6432838 5916010 5392507 5282437 5941835 7007997 7866372
37884 7866372 8472350 9070037 9365358 8784625 7535869 6641881 6724124 7350622 7810841
37875 7810841 7989711 8155875 8326961 8277599 7996557 7801920 7994603 8508152 8938968 9013525
37865 9013525 9029064 9537487 10459472 10997745 10830372 10840503 11928842 13524560 14244369
37856 14244369 13811699 13228345 13084841 12925496 12497087 12358083 12764829 13121863 13155317
37847 13155317 13515266 14506158 15375144 15727450 16413458 17829798 18553781 17303097 15377330
37838 15377330 15250966 17171882 19084929 19813197 20318836 21501975 22661806 22916351 22638345
37829 22638345 22573794 22705764 22841619 23301378 24180997 24827939 24849542 24823607 25275475 25814392
37819B5814392K42095M19703R30538O81715k55255m45729N15671J243385Q89430
37810C0035945M37640P10989Q40805Q3767l61679Q55301K619459K488057J67295
37801C7877579j863761j432281Q45495K568027K288994Q48993K34479J276997
37793D2644522K648123K564792J309260R59843K314904L531516K870666J475189
37785F0318815J696828L466226M420675L527002K477998K966320M394642N265510
37777H8534016N437916N787873O562889P294800P802021Q239848Q545651Q737498
37769A46942512R397560J0945871J2721512J3726276J4093389J4824844J6118767
37762B38770731J7045501J7139544J7277622J8341204J9698862J9814162J8115260
$$ plain form
37819 25814392 26056487 26476190 27406728 28088443 27833188 27387459 27903130 29146515 30035945
37810 30035945 30473585 31184574 32025379 32109146 31747467 32602768 35222227 37710284 37877579
37801 37877579 36013818 34581537 35427032 37995059 40284053 41133046 41367525 42644522
37793 42644522 45292645 47857437 49166697 50126540 52441444 55972960 58843626 60318815
37785 60318815 62015643 65481869 69902544 73429546 75907544 78873864 83268506 88534016
37777 88534016 93971932 99759805 106322694 113617494 121419515 129659363 138205014 146942512
37769 146942512 156340072 167285943 180007455 193733731 207827120 222651964 238770731
37762 238770731 255816232 272955776 290233398 308574602 328273464 348087626 366202886
37755C66202886J5604712J3567991J2067966R891399N924623N12547m702768q438763
37747D10630593j1028981j3641807j6489948j8565519j9226603j9159400j9282148
37740B93236187j9438630j8919608j7751326j6581575j5583441j4413452j3173630
37733A77374525j2447853j2215745j1610355j0130472q410990p361732p083046
37726A08114332p057472o935838o655405o128686n295481m328802l511083l051001
37718F5150564l071374l419717l481541k772472j830219j764702k646711l212287
37710D2951541k642764j689025j301451j134395m96494O7989m38026j625251k167394
37701C1524730j817119j452299j269426o28971J94212m8863j369835k034056j116072
$$ plain form
37755 366202886 381807598 395375589 407443555 417334954 423259577 423772124 419069356 410630593
37747 410630593 399601612 385959805 369469857 350904338 331677735 312518335 293236187
37740 293236187 273797557 254877949 237126623 220545048 204961607 190548155 177374525
37733 177374525 164926672 152710927 141100572 130970100 122559110 115197378 108114332
37726 108114332 101056860 94121022 87465617 81336931 76041450 71712648 68201565 65150564
37718 65150564 62079190 58659473 55177932 52405460 50575241 48810539 46163828 42951541
37710 42951541 40308777 38619752 37318301 36183906 35687412 35755401 35317375 33692124 31524730
37701 31524730 29707611 28255312 26985886 26356915 26551127 26502264 25132429 23098373 21982301
37692B1982301L0692n7139p58232o59461J72332O77519N91232K53860n01985j688484
37682B0042635k156267j020535M76956M32431p68172j025672N9414O15396l08511
37673A6347675j243565q48360O9284K60368K9416J37970J89823l53075p57278
37664A3832258k41089L82871l5730r10537q71084j45564q8217p10297o93648J64982
37654A0683945N24773j67334p85534n54738k63164o29980r85594o06760r2066
37645G123548k51208o37886m01997J60408J31266m52165o84109k15271L34196
37636E106782L00823k88201p75385l86442Q81412J734223Q24012j153272j837990
37627D405962l99311J080520O23221p07219p05239L55229M20421o58832r04900
$$ plain form
37692 21982301 22012993 21955854 21197622 20538161 20710493 21388012 21979244 22233104 21731119 20042635
37682 20042635 17886368 16865833 17342789 17775220 17007048 15981376 16040790 16656186 16347675
37673 16347675 15104110 14255750 14325034 14585402 14614818 14752788 14942611 14589536 13832258
37664 13832258 13591169 13974040 13938310 13027773 12156689 12011125 11922908 11212611 10518963 10683945
37654 10683945 11208718 11041384 10255850 9701112 9437948 8807968 7822374 7215614 7123548
37645 7123548 6872340 6234454 5832457 5992865 6124131 5671966 4987857 4772586 5106782
37636 5106782 5407605 5119404 4344019 3957577 4838989 6573212 7397224 6243952 4405962
37627 4405962 4006651 5087171 5710392 5003173 4297934 4653163 5073584 4414752 3509852
37618C509852K07741P05962n21591j762159j203843L69371J162704J035494R00278
37609D403809P56694J19265n11689l50581J30998n8542o85962p89743m12478k98660
37599B303111l19942J50958O28144N8210j114610j260869j24958P16282L64422
37590A400748j76678L9298L76358M6171l53164K5386O52220M66743l30249o04675
37580A542158l2150O15323P43673N13078J71708l28044q86669j048254n10263
37571G80560M21557J045122Q88226J62298m33308m89303l10413k81470j45489
37562A637780M39262R13585M21403o05805p15839L49010J003695J30470j171504
37553B402057j232382k20581M27765K94192K03152M97603N91890K68761P0489
$$ plain form
37618 3509852 3717593 4423555 3901964 2139805 935962 1305333 2468037 3503531 4403809
37609 4403809 5160503 5279768 4768079 4417498 4548496 4489954 3803992 3014249 2601771 2303111
37599 2303111 1983169 2134127 2762271 2820481 1705871 445002 320044 1036326 1400748
37590 1400748 1224070 1263368 1639726 1685897 1332733 1358119 2010339 2477082 2146833 1542158
37580 1542158 1510008 2125331 2869004 3382082 3553790 3225746 2339077 1290823 780560
37571 780560 1202117 2247239 3135465 3297763 2864455 2375152 2064739 1783269 1637780
37562 1637780 2077042 2990627 3412030 2806225 2090386 2439396 3443091 3573561 2402057
37553 2402057 1169675 949094 1376859 1671051 1874203 2371806 2963696 3232457 3302946
37544C302946J56740k9294n67672o22526K12707J003430O65364m68318j034152
37535B619225l91063O37933Q38293K3710q58125r38498m08279j3822J37531N64532
37525B211437J177139J037083j16827j052548o97430J53182J7661r07262j063090
37516G59345m8537P96722N78277M9043J3914l7629p38116j408196j012163J50532
37506h96808Q76542P96313O22525Q22701R90325O40720l4267m23168j96904L46273
37496C544252N74264K68739o058L23492Q09202M66367o17675j127395l87310O06549
37486D454427P08798K29908R0261K24731J8380l00442m0932N53958O52062L69531
37476F960682N72219J184622J155071K99876k71308J219K63839r8223k54046O55185
$$ plain form
37544 3302946 3459686 3430392 2862720 2240194 2452901 3456331 4121695 3653377 2619225
37535 2619225 2228162 2866095 3704388 3728098 2869973 1931475 1523196 1509374 1646905 2211437
37525 2211437 3388576 4425659 4308832 3256284 2558854 2712036 2729697 1822435 759345
37516 759345 710808 1507530 2085807 2134850 2148764 2111135 1373019 -35177 -1047340 -896808
37506 -896808 -20266 776047 1398572 2221273 3211598 3852318 3818051 3394883 3197979 3544252
37496 3544252 4118516 4387255 4381197 4704689 5513891 5980258 5362583 4235188 3847878 4454427
37486 4454427 5163225 5393133 5483394 5708125 5726505 5426063 5385131 5939089 6591151 6960682
37476 6960682 7532901 8717523 9872594 10172470 9901162 9902381 10166220 10067997 9813951 10469136
37466A0469136J919359K221490J541608J013617J271593J895923K301038K399236
37458B5033000K480410K936103L897052M824500M946061M474958M661907N988076
37450E9242067P076420O300771L809850R55498j559318l670259m785224m391883
37442F2977922l592129m119142n631296n903144m252476k806939l313260m511487
37434B8848049m248006k752983j877144k005885j867904j061941o74198j188461
37426A3171527j617389j247685p23081o88463o61852j29790K92141j79605j083372
37417G132431j288055o16080j3068k15593q92236j136381m92223M88340O95874
37408C663009k44894j249008r81361K38216P24529j20095q52327k08760R15548
$$ plain form
37466 10469136 12388495 14609985 16151593 17165210 18436803 20332726 22633764 25033000
37458 25033000 27513410 30449513 34346565 39171065 44117126 48592084 53253991 59242067
37450 59242067 66318487 72619258 76429108 77384606 75825288 72155029 67369805 62977922
37442 62977922 59385793 55266651 49635355 43732211 39479735 36672796 33359536 28848049
37434 28848049 24600043 21847060 19969916 17964031 16096127 15034186 14359988 13171527
37426 13171527 11554138 10306453 9583372 8894909 8233057 8103267 8395408 8215803 7132431
37417 7132431 5844376 5228296 5215228 4999635 4107399 2971018 2478795 2967135 3663009
37408 3663009 3418115 2169107 1187746 1425962 2150491 2030396 1178069 969309 1884857
37399A884857R25851M9987j74265N30884Q45659J10786p20000q10751o72607r30858
37389A039543j065857l69246O67720R62339L74941k63547l72553j00207K10737
37380A083870L31430O4095m91201o85742p838R91472J165454L30708l40886P1652
37370B513014Q02962L51608j277181k226831j175359O69621R98594m10255j308197
37361a062024k48619J192799P57240r89681j432279J33824J520328J088645K3136
37352I83369p869M16302j13647j033370o54601Q06499J346143L25626o23878l14590
37342A129984L03674L7136n74955l84847M04943P13025L25525j3524J10632L72404
37332B423997L80443O0719m17193o01054m5746Q67983R86003j00452j228927j193923
$$ plain form
37399 1884857 2810708 2860695 2686430 3217314 4062973 4173759 3453759 2643008 1970401 1039543
37389 1039543 -26314 -395560 272160 1234499 1609440 1345893 973340 873133 1083870
37380 1083870 1415300 1479395 988194 302452 294614 1286086 2451540 2782248 2441362 2513014
37370 2513014 3315976 3667584 2390403 163572 -1011787 -342166 656428 246173 -1062024
37361 -1062024 -1310643 -117844 639396 -350285 -1782564 -1648740 -128412 960233 983369
37352 983369 975500 1391802 1278155 244785 -409816 396683 1742826 2068452 1444574 1129984
37342 1129984 1433658 1470794 895839 510992 915935 1628960 1954485 1940961 2051593 2423997
37332 2423997 2804440 2865159 2447966 1846912 1801166 2669149 3655152 3554700 2325773 1131850
37322A131850m55498k37367m85080j54411O93929P46871l06289r51395r1129J150975
37312A042456J012099l47268j154578n51569M43666N93572Q741l91484k84103
37303C71532j51180l33518m98690k09571L51492N85380L01974o6332j76102k43493
37293f8508m77424n01340L4204N70074K45731o37949p64348K76496J197249P91920
37283F66105l35103p34879j94224K76343K30265L04683Q31009J084966M23975
37274B553140o66867j275543j218861q92749m47125J86094P07168O30083O7064
37265c57596k63421R528L81674J82093m48716o59684J439Q59821P89450l67063
37255A27525j397024j067253L04842J152879O12579m04811m69002M96140J226477
$$ plain form
37322 1131850 676352 438985 -46095 -200506 493423 1240294 934005 -17390 -108519 1042456
37312 1042456 2054555 1707287 552709 1140 444806 1038378 1047119 655635 371532
37303 371532 220352 -113166 -611856 -821427 -469935 115445 417419 351087 174985 -68508
37293 -68508 -545932 -1047272 -1013068 -442994 -197263 -835212 -1599560 -1323064 -125815 666105
37283 666105 331002 -403877 -598101 -321758 -91493 213190 1044199 2129165 2553140
37274 2553140 1886273 610730 -608131 -1500880 -1948005 -1761911 -1054743 -424660 -357596
37265 -357596 -621017 -611489 -229815 -47722 -496438 -1156122 -1154683 -294862 494588 127525
37255 127525 -1269499 -2336752 -2031910 -879031 -266452 -671263 -1140265 -644125 582352
37246E82352Q39249j50253o77439m25164P4766K67805P3678k87212n69698o12683
37236h84599m57835l66792m67742m09646K64829J297323J694632Q86709l88944
37227A167935q59701k58829M71363N54117K84696K38655K28952k46015q76227
37218G04946p64813J60844P92256K82690p58375j075320m15886K67125J85480
37209f21053l16904l84083J44628N36569J55730o38698q38535l9423R34913R46025
37199a20831m5515q99222p11002J23528N51976K37420j60707L1189O63493R86822
37189F57151M70973o48295j487677j242505k6336J063957J020909Q7978m77743
37180e81588P7472J061499J195674J93272r36518j165153o04807j37362j73910
$$ plain form
37246 582352 1421601 1271348 593909 168745 243511 511316 584994 297782 -271916 -884599
37236 -884599 -1342434 -1709226 -2176968 -2586614 -2321785 -1024462 670170 1556879 1167935
37227 1167935 308234 49405 520768 1074885 1359581 1598236 1827188 1581173 704946
37218 704946 -59867 100977 893233 1175923 417548 -657772 -1073658 -806533 -621053
37209 -621053 -937957 -1322040 -1177412 -640843 -485113 -1123811 -1962346 -2001769 -1066856 -120831
37199 -120831 -166346 -1065568 -1776570 -1653042 -1101066 -863646 -1024353 -993164 -329671 657151
37189 657151 1128124 479829 -1007848 -2250353 -2276689 -1212732 -191823 -103845 -581588
37180 -581588 -504116 557383 1753057 1946329 1009811 -155342 -760149 -897511 -1071421
37171a071421k72118k2240K08378j71728r41013j144759k88693R85228J621591
37162a096775J239692K94322n40665q49202n68588J5934M38465M82517L84441
37153a99859M15218M30398J42319l07476m70964k74645j34752k68507l09659R7095
37143h80832O12914N42665j96272q50095p36042p8710L75177M07917N04130Q91784
37133E92636J006361L82093l81999l27965L60916N04957k79268r30788n94128
37124C32815K0077j89657q62715o75634N43183J401830Q56347m24664j046788
37115d5206n88459J82852M18242O0864k95458j86412J71930K43332M6308J75184
37105A83177O93003P06297k65986j163151p17860N06882P85260j80574q72324
$$ plain form
37171 -1071421 -1343539 -1365779 -1157401 -1329129 -2270142 -3414901 -3703594 -2718366 -1096775
37162 -1096775 142917 437239 -103426 -952628 -1521216 -1505282 -1066817 -584300 -199859
37153 -199859 215359 645757 788076 480600 9636 -265009 -399761 -668268 -977927 -880832
37143 -880832 -267918 274747 78475 -771620 -1507662 -1586372 -1211195 -803278 -299148 592636
37133 592636 1598997 1981090 1599091 1271126 1632042 2136999 1857731 926943 332815
37124 332815 352892 163235 -699480 -1375114 -831931 569899 1426246 1001582 -45206
37115 -45206 -633665 -450813 -32571 28293 -267165 -453577 -281647 -38315 7993 183177
37105 183177 876180 1582477 1316491 153340 -564520 -57638 727622 547048 -325276
37096c25276m00828K71256K07321N2807O30425J252583Q12057l14565q65257o07192
37086G13331k99978j93185O3699K96361j5400n36125m07877J92613J94253m97488
37076d89796o75206J84000R38171N21371m32883o30601J2447N11287L26377j72096
37066I3071m93666n01182k04153K77632N54016K86603k60953l93877J39630O97024
37056A94145M22378o08580j195926l49967J231649J692545L84695j047892p83157
37047f0110O13682J039246J2397o52233K81084J508985J117781o52450j842436
37038A365946j376014n0194Q17221P48781J69741j92295J4530L28333J0p85430
37028A040629q95904K9024P31033J22124r07630p61637L77619R00427L61680q850
$$ plain form
37096 -325276 -726104 -454848 -247527 -194720 435705 1688288 2500345 2185780 1320523 713331
37086 713331 413353 220168 283867 580228 564828 28703 -379174 -186561 7692 -489796
37076 -489796 -1165002 -981002 -42831 478540 45657 -584944 -572497 -61210 265167 93071
37066 93071 -400595 -901777 -1105930 -828298 -274282 12321 -248632 -642509 -502879 194145
37056 194145 616523 7943 -1187983 -1537950 -306301 1386244 1770939 723047 -60110
37047 -60110 553572 1592818 1605215 952982 1234066 2743051 3860832 3208382 1365946
37038 1365946 -10068 -60262 756959 1505740 1675481 1483186 1497716 1826049 1826059 1040629
37028 1040629 144725 173749 904782 1026906 119276 -642361 -264742 635685 997365 988515
37018I88515M10348N65950l47524j352725j141387m9648N67057K93260j23164
37009a89318j54402o1131j37658k28164j33166N5078J68097J61670K9553k09609
36999f99050l72727j57721N42577J356113J526155N48507j081868k055374j607686
36990b001074m53416J97364K62516N56836J106443R39118j40154q51761k77256
36981f61384O80446O83163n5242l74055j39248k16828p09805o41123L90963J399625
36971C56512J319926L59715m15671l65875J77966L55527l38895j399625j706019
36962a656439q80537J52657M88567N40037J100328J652599J000827n64378j312084
36953E21577n85233K62766Q4668l54062J10994J027917J120352L02877m12628
$$ plain form
37018 988515 1398863 1964813 1617289 264564 -876823 -926471 -359414 -66154 -189318
37009 -189318 -343720 -404851 -542509 -770673 -903839 -848761 -680664 -518994 -489441 -699050
36999 -699050 -1071777 -1229498 -686921 669192 2195347 2743854 1661986 -393388 -2001074
36990 -2001074 -2454490 -2257126 -1994610 -1437774 -331331 607787 467633 -384128 -661384
36981 -661384 19062 702225 646983 272928 133680 -83148 -792953 -1434076 -1043113 356512
36971 356512 1676438 2036153 1620482 1254607 1432573 1788100 1449205 49580 -1656439
36962 -1656439 -2536976 -2384319 -1895752 -1355715 -255387 1397212 2398039 1833661 521577
36953 521577 -63656 199110 283778 -70284 40710 1068627 2188979 2491856 2079228
36944B079228n57974n36900n84620n19494m13657n23428o03373j71192N78006
36935a253404R34987P13317L49913M6449l64734p27086n90693j5962M16074M44316
36925d6823K47823j95802r59406j408883p17506O70722J263450O05813l1532L45908
36915b26236R47048N97222l72892q09021n69668m01249m23929m6950P47748J212908
36905F54981R58627K94152n15565j329718j527547n30751R07602J209889J79106
36896C00776n76288n9624O03899J25389p02577k87977J017044J351971L39615
36887B112228l41460K08856O18295l55412j524250j029719N71719R56690m65021
36878G51926j667280j078488J98988L00782n27384m62855J019180K298873J778819
$$ plain form
36944 2079228 1521254 984354 399734 -119760 -533417 -1056845 -1660218 -1831410 -1253404
36935 -1253404 -318417 394900 744813 791262 426528 -300558 -891251 -907213 -491139 -46823
36925 -46823 201000 5198 -954208 -2363091 -3080597 -2409875 -1146425 -540612 -572144 -226236
36915 -226236 720812 1318034 945142 136121 -433547 -834796 -1258725 -1305675 -557927 654981
36905 654981 1613608 1907760 1392195 62477 -1465070 -1995821 -1088219 121670 300776
36896 300776 -275512 -335136 268763 394152 -308425 -596402 420642 1772613 2112228
36887 2112228 1770768 1979624 2597919 2242507 718257 -311462 260257 1216947 751926
36878 751926 -915354 -1993842 -1794854 -1494072 -2021456 -2484311 -1465131 833742 2612561
36869B612561j77434j839612j939283n88566J038269J595099O20870r19121j500047
36860a097264p21075K87010M28517N4391K07882Q99427J048187J46694q95495
36851C58274r50811r7884O71179P54453L49447k00437p53442j024965o07820L20247
36841a181759Q58205M75038j37092L4747P77640Q49182j69781j119721q82925
36832d96466j9080R8199o20543q45609J16770J186889R97655k08177r78178o02114
36822a370654K08555N89916O15818P35374P89529L09035m78915p50078k82640
36813C65940J79489R3132n7180K97603O72607K87088m38491l99294K19809l4172
36803A186531j432123k167972r36256R33153J387832O45976M23013Q70660N54240
$$ plain form
36869 2612561 2435127 595515 -1343768 -1932334 -894065 701034 1321904 402783 -1097264
36860 -1097264 -1818339 -1531329 -1102812 -1048421 -840539 58888 1107075 1253769 358274
36851 358274 -592537 -690421 -19242 735211 1084658 884221 130779 -894186 -1502006 -1181759
36841 -1181759 -323554 151484 14392 49139 826779 1675961 1506180 386459 -496466
36832 -496466 -515546 -417347 -1037890 -1883499 -1766729 -579840 417815 209638 -768540 -1370654
36822 -1370654 -1162099 -572183 43635 779009 1568538 1877573 1398658 648580 365940
36813 365940 545429 638561 581381 878984 1551591 1838679 1400188 1000894 1220703 1186531
36803 1186531 -245592 -2413564 -3349820 -2416667 -1028835 -382859 40154 910814 1465054
36794A465054o08255q36986M41132J303135L32375j057291r42471Q0309J81451
36785C58453n80308o97918r5215j37967q69251o51951R21722J951241J072162
36776A270968m10664n87563K03888J90981r51741j676332q72923P11982J599461
36767e21943J249900L05025l09794k48437N1824p7446o92989j083827o29129L81842
36757a574974J047138Q47877J19854l91508k87862J29124K42107o7695j75465
36748a11404M00050J097873R36198j3398n76217j17001N77857M97517k45103q47172
36738A599200r78352q39657n60678k19736m8670m19L92347J066001R85033l94783
36728A000286j805686j552333J08549J325599J268081Q93197R25292O63807n12465
$$ plain form
36794 1465054 856799 19813 460945 1764080 2096455 1039164 96693 177002 358453
36785 358453 -221855 -919773 -1014988 -1152955 -2022206 -2674157 -1752435 198806 1270968
36776 1270968 860304 272741 476629 667610 -284131 -1960463 -2833386 -2121404 -521943
36767 -521943 727957 1032982 723188 474751 526575 449129 -243860 -1327687 -1956816 -1574974
36757 -1574974 -527836 320041 439895 48387 -239475 -110351 131756 64061 -111404
36748 -111404 288646 1386519 2322717 2309319 1733102 1616101 2193958 2691475 2446372 1599200
36738 1599200 620848 -218809 -779487 -999223 -1047893 -1048312 -655965 410036 1395069 1000286
36728 1000286 -805400 -2357733 -2249184 -923585 344496 1237693 2162985 2826792 2314327
36719B314327j774459j937024j028146Q6217Q75105J164110P76456R613k54143
36710B32056K19235M25659k94373r50360m17499N44906L78450o98974j020998
36701a581898j98807M22585K30384K64746J040866J378582M82576m92023l33817
36692A213194J83009k31099j016678p32480L74276P37393N6723m21876j62171
36683B91J6403k19242o5782O68155Q46164j19001j087395q84299j8129L33127
36673e29708J00449J7962K75674M89806M60537J43066n32511j113718p17140N20497
36663h85086J071320J76742o78765P4448J411824J121138o70671j599689o92655
36654f71394L64549J23214n72919m48131P4431l8187n45002n87130k64245j61118
$$ plain form
36719 2314327 539868 -1397156 -2425302 -2339085 -1463980 -299870 476586 486199 232056
36710 232056 451291 876950 582577 -367783 -785282 -240376 138074 -560900 -1581898
36701 -1581898 -1780705 -1358120 -1127736 -862990 177876 1556458 2039034 1547011 1213194
36692 1213194 1396203 1165104 148426 -584054 -209778 527615 584338 162462 291
36683 291 16694 -202548 -268330 399825 1245989 1126988 39593 -844706 -862835 -529708
36673 -529708 -429259 -411297 -135623 354183 814720 957786 425275 -688443 -1405583 -885086
36663 -885086 186234 362976 -315789 -241341 1170483 2291621 1620950 21261 -671394
36654 -671394 -306845 -183631 -756550 -1204681 -1130250 -1168437 -1713439 -2300569 -2564814 -2725932
36644b725932n7794N09288J005040O33363j05668n4690O09032N18434o27994j363664
36634a660585m92129J226288K033315J153055o37803j906973j711378k96851J081306
36625a211755J343505O28183j61905n72936p07215m37981M35419J296615J174605
36616A786535L04947k2880M31106L11476j025648k106986j478414k1382M57765
36607a363481J4684M3044N47280J62583j072583j252939L65186J857175J336549
36598F37498l77802j192752o64905J7643J59361J08355J17321O6239J39886O01437
36588c87719J024197P67956K7057n46316r21262j325362j238552r6586J276944
36579a419643J438876M49296k88935k82968l52587o66823l12837O88601R18961
$$ plain form
36644 -2725932 -2783726 -2274438 -1269398 -636035 -741703 -796393 -187361 331073 -296921 -1660585
36634 -1660585 -2152714 -926426 1106889 2259944 1622141 -284832 -1996210 -2293061 -1211755
36625 -1211755 131750 759933 598028 25092 -682123 -1120104 -684685 611930 1786535
36616 1786535 2091482 2068602 2499708 2811184 1785536 -321450 -1799864 -1821246 -1363481
36607 -1363481 -1348797 -1305753 -758473 -595890 -1668473 -2921412 -2556226 -699051 637498
36598 637498 259696 -933056 -1597961 -1580318 -1420957 -1312602 -1195281 -1129042 -989156 -387719
36588 -387719 636478 1404434 1431491 885175 -36087 -1361449 -2600001 -2696587 -1419643
36579 -1419643 19233 468529 179594 -103374 -455961 -1122784 -1435621 -747020 171941
36570A71941m4699o81036o6689N23677k1585n35596L17356J404252Q47964p46244
36560A169341j204642k37318M36245P5380l24613k11186j45602j40834M67789
36551a15440J157863M43233j418553k096654n32375J310521J259567j36754q86102
36542a014694m60278Q1077K8351l26450n70410o43768n98102m63601j72802M98443
36532c642234J426876J730574P80816n20813p17040L7433L07481j48574j60731
36523i06212L79230J43548q50096o45039J175158K008459K04398j840099j129039
36514a459692J251958J873659J31389j435643j336301n91570j60400K61484O50774
36505h14342L72415j67454J68127J006865P89354l79845o20813M48863Q46900
$$ plain form
36570 171941 127242 -553794 -620483 -96806 -118391 -653987 -336631 1067621 1915585 1169341
36560 1169341 -35301 -272619 163626 239006 -85607 -296793 -442395 -583229 -115440
36551 -115440 1042423 1485656 67103 -2029551 -2561926 -1251405 8162 -128592 -1014694
36542 -1014694 -1474972 -1393895 -1365544 -1691994 -2262404 -2906172 -3504274 -3967875 -4140677 -3642234
36532 -3642234 -2215358 -484784 296032 -224781 -941821 -904388 -596907 -745481 -906212
36523 -906212 -526982 -383434 -1233530 -1878569 -703411 1305048 1509446 -330653 -1459692
36514 -1459692 -207734 1665925 1797314 361671 -974630 -1566200 -1726600 -1465116 -814342
36505 -814342 -441927 -609381 -441254 565611 1354965 975120 354307 803170 1650070
36496A650070m31860j640743j201713k04331k55551o64810J50097J694194K021647
36487A117000P72233l74131k42428M11631L54230l56277o63952j31166L39084
36478A226224l38009j724405k038365n06524J266806J333375J49868k39410N80419
36469b90021R28004l3284r28661n21885L69081M32887j09594k81993j0772J97971
36459b48267L07437M01827J60664l57858l38003M43577R09846L51313k92932j8687
36449A318917M83366R4048o79964n84941J43354J78058o41598j134097p20205
36440a543062k2313M46847P75689P88429O1142r85012j216664l29810P10972J015137
36430b98645O83106K09364j82624l91783l51160k80628m49191o39285m13002J47710
$$ plain form
36496 1650070 1218210 -422533 -1624246 -1828577 -2084128 -2748938 -2598841 -904647 1117000
36487 1117000 1889233 1515102 1272674 1684305 2038535 1682258 1018306 887140 1226224
36478 1226224 888215 -836190 -2874555 -3381079 -2114273 -780898 -631030 -870440 -290021
36469 -290021 637983 604699 -323962 -845847 -476766 -43879 -153473 -435466 -446238 -248267
36459 -248267 59170 460997 621661 263803 -74200 369377 1279223 1630536 1337604 1318917
36449 1318917 1802283 1896331 1216367 631426 774780 952838 311240 -822857 -1543062
36440 -1543062 -1565375 -1118528 -342839 445590 506732 -478280 -1694944 -2024754 -1313782 -298645
36430 -298645 384461 593825 411201 19418 -331742 -612370 -1061561 -1700846 -2113848 -1966138
36420a966138N61828O81704O71783M49647j16521o16013m97987J3533J65386k20165
36410h72943n97918n80705k82572J14371M72270N22765K12365j5966R2226O1959
36400h74148m06156n76000K10369J114884Q72550r7337k50582N31664P33307k01716
36390A056835q89085l21097M80923K05188o56102p28900J04216P76513P40661
36381G69152M26887K19643j5516l45960m53311j10174L83010M11088l18930j301359
36371c35470j541489o36277O24667J170239R17159N11316J38321m17559p31512
36362c00605j09821Q34622N15026j105594j873571m40059J477185J431110j33163
36353B95130o02117P91256J840614P53879j196802j592209k20870R57187O83873
$$ plain form
36420 -1966138 -1404310 -722606 -50823 398824 282303 -333710 -831697 -818164 -652778 -872943
36410 -872943 -1470861 -2051566 -2334138 -2219767 -1747497 -1224732 -1012367 -1028333 -936107 -874148
36400 -874148 -1280304 -1856304 -1645935 -531051 341499 244162 -6420 525244 1258551 1056835
36390 1056835 167750 -153347 327576 532764 -123338 -852238 -748022 28491 769152
36381 769152 1196039 1415682 1400166 1054206 600895 490721 873731 1284819 965889 -335470
36371 -335470 -1876959 -2513236 -1888569 -718330 198829 710145 848466 430907 -300605
36362 -300605 -410426 424196 939222 -166372 -2039943 -2480002 -1002817 428293 295130
36353 295130 -306987 484269 2324883 3078762 1881960 289751 68881 1026068 1709941
36344A709941k32738n47517l38556m85382j107281j379048p44877L64986J134979
36335a625493J213698P95614K29254j97223k97304p0866K89045N41287N06116
36326A384128J42107l02584l99332j12336k396l62974m99682K88309J260629R76197
36316B372066m62270j326215q40111k88513o98240r98611R5414J648269J738979
36307A240768L31927q92094j069613p53952l27583L74184R56728P11233J7083
36298E88681o9550L77352L49062j55815j51589L29682J72173o49140q18089m0071
36288f7304L53758k11482n74953m1448M27618J86792R8129O26003O96995k36693
36278A257415r21764n45623k98222j008303j219762K77297J834154J332367l31061
$$ plain form
36344 1709941 1477203 929686 591130 105748 -1001533 -2380581 -3125458 -2760472 -1625493
36335 -1625493 -411795 383819 613073 415850 118546 47680 336725 878012 1384128
36326 1384128 1526235 1223651 824319 711983 709587 346613 -153069 135240 1395869 2372066
36316 2372066 1909796 583581 -256530 -545043 -1243283 -2241894 -2146480 -498211 1240768
36307 1240768 1572695 680601 -389012 -1142964 -1470547 -1096363 -139635 571598 588681
36298 588681 519131 896483 1245545 1089730 938141 1267823 1439996 790856 -27233 -67304
36288 -67304 286454 74972 -499981 -541429 -113811 72981 171110 797113 1494108 1257415
36278 1257415 335651 -209972 -508194 -1516497 -2736259 -2458962 -624808 707559 376498
36269C76498q13895j14138R8900j05571N74153J353103J18243k373532k666648
36260c552887J27440K566537J878978k29884p91762o7126k13106j211462j087415
36251b580687M79573J475635O57729p46006j013381j23977P21333P91753L42697
36242D669k4657j4524J26835j15442p55082r29059J21319J678618J977270M25743
36232B495690j342154j433681k05201L33967m92774j077869j15875J272510J267741
36223G02354J76953k23914L30159L38397o28285j013838J0048R22843K81984q94240
36213B461q69098j6232O9886n65850m18079P41592J359001N17655q20066j354238
36203a352968q92324M0213Q33082Q11023k01030j118951n94101R91934J751721
$$ plain form
36269 376498 -437397 -551535 -452635 -558206 15947 1369050 1487293 -886239 -3552887
36260 -3552887 -3425447 -858910 1020068 790184 -1578 -68704 -281810 -1493272 -2580687
36251 -2580687 -2101114 -625479 32250 -713756 -1727137 -1851114 -1129781 -338028 4669
36242 4669 -19988 -34512 92323 -23119 -778201 -1707260 -1585941 92677 2069947 2495690
36232 2495690 1153536 -280145 -485346 -151379 -644153 -1722022 -1837897 -565387 702354
36223 702354 879307 655393 985552 1323949 695664 -318174 -308126 614717 896701 2461
36213 2461 -866637 -882869 -812983 -1378833 -1796912 -1055320 303681 821336 1270 -1352968
36203 -1352968 -2245292 -2205079 -1371997 -560974 -762004 -1880955 -2475056 -1483122 268599
36194B68599Q34357n14171q96914m99330j73404M0689M78328P68536L19472m89016
36184A37146n95575K72590J140128J005648J17071l44361J64326P31926K34076
36175B862975q98768j150643k86856J06491p98989j428694k41301J406209J018545
36166E88969r83980j518973N74960K652151J990848n38297k006745j328247l3141
36157f02455K25519m60064q61696k81908O20782O33892l17863p71248K98013J663742
36147A46714J307820n91017j766803j069547K14763P03965P39715R81408Q89158
36138A556176r0511j113097j082952k97413K33527K75870J16303l04902r00883
36129a607882r13579j3326Q48820P77983L00670K51982K20798m95040j196908
$$ plain form
36194 268599 1102956 588785 -308129 -807459 -980863 -940174 -461846 306690 626162 137146
36184 137146 -458429 -185839 954289 1959937 2077008 1732647 1896973 2628899 2862975
36175 2862975 1964207 813564 526708 633199 -165790 -1594484 -1835785 -429576 588969
36166 588969 -395011 -1913984 -1339024 1313127 3303975 2765678 758933 -569314 -602455
36157 -602455 -376936 -837000 -1698696 -1980604 -1359822 -725930 -1043793 -1815041 -1517028 146714
36147 146714 1454534 863517 -903286 -1972833 -1758070 -1054105 -314390 667018 1556176
36138 1556176 1465665 352568 -730384 -1027797 -794270 -518400 -402097 -706999 -1607882
36129 -1607882 -2521461 -2534787 -1685967 -907984 -607314 -355332 -134534 -629574 -1826482
36120a826482p04097N31030R23674J81343l82808L625O00615N64807N0395m15514
36110d73412n84576k54684N87226J141311M00608j208453j847697n79401J219959
36101a599119J596268N36788k57121J62483Q80763P28721p141k70543o586r7156
36091A667357o52443p02795O706K95233m72650j011579j46567R47365N00575o98440
36081b67238l79240J278166J599309k82373j912808j354922J07192N98171N24325
36072h9418Q89477R28210k54996j424794j053676m2481j53140r42844q13257m3440
36062c000359k7255l23790N71456J986668J690728k61677j313274m15436N79617
36053e13322K15434n22470m05895J36740L95685O17034Q50367M48459l65708l37315
$$ plain form
36120 -1826482 -2530579 -1999549 -1075875 -894532 -1277340 -1273715 -673100 -108293 -57898 -473412
36110 -473412 -1057988 -1312672 -725446 415865 816473 -391980 -2239677 -2819078 -1599119
36101 -1599119 -2851 533937 276816 439299 1320062 2048783 2041642 1771099 1764513 1667357
36091 1667357 1014914 312119 318825 614058 141408 -870171 -1016738 -69373 431202 -267238
36081 -267238 -646478 631688 2230997 1948624 35816 -1319106 -1211914 -613743 -89418
36072 -89418 800059 1728269 1473273 48479 -1005197 -1047678 -1200818 -2143662 -2956919 -3000359
36062 -3000359 -3027614 -3351404 -2779948 -793280 897448 635771 -677503 -1092939 -513322
36053 -513322 -297888 -820358 -1226253 -1089513 -693828 -76794 773573 1222032 856324 519009
36043E19009N30367N76854n96208j033092L23889J491464M86618j361307j455777
36034e18183O4194Q58473J47164n39518j92949L30032J32908l28090l05491K6308
36024c25152Q7685j58619l33151k73515j67459k47921n04932o37676l58501K22308
36014b696933P02926Q59987P19636K87681k97035n00592j4957M46244r9723j290799
36004a883565j610057m60857R94495J482499J095661O10475K95178L2701j64017
35995C92513l52208p05491r62193n84285K31221O00610L05003O7484J92483J37653
35985f77210j84660o2226N22633N34980k68915o87620j34481K75879k18054n69887
35975a469561J14491Q13227M19290k10232J00473N83542K4879p41378k17058Q64447
$$ plain form
36043 519009 1049376 1626230 1030022 -3070 320819 1812283 2298901 937594 -518183
36034 -518183 -453989 404484 551648 12130 -180819 149213 282121 -45969 -351460 -325152
36024 -325152 -237467 -396086 -729237 -1002752 -1170211 -1418132 -1923064 -2560740 -2919241 -2696933
36014 -2696933 -1994007 -1134020 -414384 -126703 -423738 -924330 -939287 -493043 -592766 -1883565
36004 -1883565 -3493622 -3954479 -2959984 -1477485 -381824 228651 523829 556530 392513
35995 392513 40305 -665186 -1627379 -2211664 -1980443 -1379833 -1074830 -1007346 -814863 -677210
35985 -677210 -861870 -924096 -401463 133517 -135398 -823018 -957499 -681620 -899674 -1469561
35975 -1469561 -1355070 -541843 -122553 -332785 -232312 351230 376109 -365269 -582327 282120
35965B82120O01610p35860j066490O4944R78952P98416M22995L68727L2576n00403
35955A247587k21709P01067Q02881j02833m62827J70872J84247j128760j959100
35946g68575q92793N94396M57756o67851o49872P09457J511858O41562r35359
35937E79j727726j304170k40227O38669Q54200N69271K57024N8119p9234K07039
35927g66456J160566J808113Q30878j149434j807855l50642J179301Q75136m40713
35918A338894r80499p28108o35124m75679L79188J055789L13431j045828j162968
35909a940904j29396K85378k52622k23834Q10317J264749K54871q51101o40839
35900a423381L02143O71168L26962j47222n33329o13914J04882J301945J616068
$$ plain form
35965 282120 883730 147870 -918620 -853676 125276 923692 1346687 1715414 1747990 1247587
35955 1247587 1025878 1726945 2529826 2426993 1964166 2135038 2319285 1190525 -768575
35946 -768575 -1661368 -1066972 -609216 -1277067 -1926939 -1217482 294376 935938 579
35937 579 -1727147 -3031317 -3271544 -2632875 -1778675 -1209404 -952380 -894261 -973495 -766456
35927 -766456 394110 2202223 3033101 1883667 75812 -274830 904471 1779607 1338894
35918 1338894 358395 -369713 -1004837 -1480516 -1101328 -45539 267892 -777936 -1940904
35909 -1940904 -2070300 -1784922 -2037544 -2261378 -1451061 -186312 68559 -782542 -1423381
35900 -1423381 -1121238 -450070 -123108 -270330 -803659 -1417573 -1312691 -10746 1605322
35891A605322N64020m47249j90185M31177p5313j254473j425934m04249K74242
35882i22642k25970r69050q58528m9916O58290Q90241P17247K98965j35219l78333
35872i74915m68650m86906k58554K72787O19775L51668j05026m4498L26159J99114
35862e69046l99917n50817L4368N06363K86763l8061J58402M03153o2355r20976
35852a152123j135712m10601M79972P70069M94136J23599j21681l60746o16055
35843a929142n46355J58874J088722J231946K23043q58271o50374O48447J464616
35834H31506R58734j1423l60648k04485j80155k22562O6512M07706J84772m90130
35824I79827r09335q02524m91992j71471K13652M31640P4359o68755r54597k71273
$$ plain form
35891 1605322 2169342 1722093 1531908 1963085 1887772 633299 -792635 -1196884 -922642
35882 -922642 -1148612 -2117662 -2976190 -3026106 -2367816 -1477575 -760328 -461363 -596582 -974915
35872 -974915 -1443565 -1930471 -2189025 -1916238 -1296463 -944795 -1049821 -1094319 -768160 -569046
35862 -569046 -968963 -1519780 -1485412 -979049 -692286 -730347 -571945 -168792 -231147 -1152123
35852 -1152123 -2287835 -2698436 -2218464 -1448395 -954259 -830660 -952341 -1313087 -1929142
35843 -1929142 -2475497 -2316623 -1227901 4045 227088 -631183 -1281557 -633110 831506
35834 831506 1790240 1778817 1418169 1213684 1033529 810967 877479 1285185 1469957 979827
35824 979827 70492 -732032 -1224024 -1395495 -1181843 -750203 -675844 -1344599 -2299196 -2570469
35814b570469Q28097J186077K31710j231215j587419k06678J450627J373684k59285
35805g84871j104283M2486J400947Q67829p85481j199317p3221O65127J10884
35796h59900m66301p2950N11682M67505L27905O09363O21988j53479q34262n62683
35786d11132o803r2018l10101J81211P08770J25691r20112p44281N30277R33033
35776e465k38739j226372n69010O43073O07426l35639m06344O29526J050948l1790
35766A17614j157820o84306P30515J164887L10190l13699J4470J37674p40503
35757d20978j365569l93677J103962R80163o47257j424430k33274J328093J533814
35748D60847Q13905M20442K94542l36953j196751j261071m14679L78717M05135
$$ plain form
35814 -2570469 -1742372 -556295 -324585 -1555800 -3143219 -3349897 -1899270 -525586 -784871
35805 -784871 -1889154 -1846668 -445721 422108 -363373 -1562690 -1635911 -970784 -859900
35796 -859900 -1326201 -1399151 -887469 -419964 -92059 517304 1139292 985813 151551 -411132
35786 -411132 -417935 -509953 -820054 -638843 69927 195618 -724494 -1468775 -938498 -5465
35776 -5465 -244204 -1470576 -2039586 -1396513 -789087 -1124726 -1531070 -901544 149404 117614
35766 117614 -1040206 -1724512 -993997 170890 481080 167381 181851 319525 -420978
35757 -420978 -1786547 -2180224 -1076262 -96099 -743356 -2167786 -2401060 -1072967 460847
35748 460847 1274752 1695194 1989736 1652783 456032 -805039 -1219718 -841001 -435866
35739d35866j19294n38743l65138L55965R27880O79723k9582k09617J70165R5237
35729E30730n98256o92819K23899O29325n24929j735299j088042O70377J311645
35720a273369N87330K14265P74754J006134K79434m37391n10464n55374q72458
35711g87139p69497o9491L68122K45815L09780O37949K33304q77729j026986M46950
35701a288922J686083R37769p82870j311948m13331N06611P68233O50081J1760
35692G63466j316044k167002j110565J078992J923879N80611j012358r33159K94094
35683a898086R77285P23312M04924M06750K38453k58369m63986k9756M18451J44593
35673F63571n70726p87063k61867K01161n0797n67230n09707J16164O07878O96545
$$ plain form
35739 -435866 -555160 -1093903 -1459041 -1103076 -175196 504527 474945 265328 435493 530730
35729 530730 -67526 -760345 -536446 92879 -432050 -2167349 -3255391 -2585014 -1273369
35720 -1273369 -686039 -471774 302980 1309114 1588548 1151157 640693 85319 -787139
35711 -787139 -1556636 -1626127 -1258005 -1012190 -702410 -64461 168843 -708886 -1735872 -1288922
35701 -1288922 397161 1334930 552060 -759888 -1173219 -666608 101625 751706 763466
35692 763466 -552578 -2719580 -3830145 -2751153 -827274 -246663 -1259021 -2192180 -1898086
35683 -1898086 -920801 -197489 207435 614185 852638 594269 130283 100527 518978 663571
35673 663571 92845 -694218 -956085 -754924 -805721 -1372951 -1882658 -1766494 -1158616 -462071
35663d62071P35883P98009M59366k59846n51033P4540Q88344P54337m07613j430006
35653E99910j149466L01172J449297R23953q58659j899927j044608M01055M96514
35644g80759m52687m74297P47448J215064r0887j357446p33080P59236R41342
35635b26066j32438o03291R4138P15313N65420L45560M82239M17394m0269k26205
35625A391795K1006o9491o91301q61302q0362N96577R3200r97996j281827n20746
35615b400447K58605L24518M6100J36072O57201R75812N76693j79684l54536L22924
35605C63258R14685N02779m58834q34148m96602k47803k59540M5599N07955J81092
35595B18441q18785j015246J20968J134584R04694M29483Q38196J121503j12070
$$ plain form
35663 -462071 273812 1071821 1531187 1271341 720308 794848 1683192 2437529 2029916 599910
35653 599910 -549556 -248384 1200913 2124866 1266207 -633720 -1678328 -1277273 -780759
35644 -780759 -1233446 -1707743 -960295 254769 163882 -1193564 -1926644 -1167408 -226066
35635 -226066 -358504 -961795 -867657 -152344 413076 758636 1240875 1658269 1618000 1391795
35625 1391795 1412801 1343310 652009 -209293 -289655 306922 400122 -597874 -1879701 -2400447
35615 -2400447 -2141842 -1817324 -1771224 -1635152 -977951 -2139 574554 394870 40334 363258
35605 363258 1277943 1780722 1321888 487740 -8862 -256665 -516205 -470606 37349 218441
35595 218441 -600344 -1615590 -1494622 -360038 544656 974139 1812335 2933838 2821768
35586B821768j702527j278599Q46915J756582K30219j529985j391495k51008k3477
35577e21607n21227l22144M38090L55372o03736q50366K61176J370253J165218
35568G71029J28440n16032n39656n07044n60620l61187R8602M42339N55384O26031
35558A37286N79143R5666o68965r44426l02925N52517M71992o40437j498900r74206
35548c193255L58054Q71441J03396n38581J95359J433325J290651l80593j629480
35539a489683j030247M94493J116602M70120l14130l80031L2866L60556M52362
35530b87092M42440M29878L93574J50475m82778j220896j306464m05285P75844
35521a510304J249683Q53318J05810o41273j218954j176738k44223Q59308J040922
$$ plain form
35586 2821768 1119241 -159358 687557 2444139 2674358 1144373 -247122 -498130 -521607
35577 -521607 -1042834 -1364978 -926888 -571516 -1175252 -2025618 -1764442 -394189 771029
35568 771029 899469 383437 -156219 -663263 -1223883 -1585070 -1486468 -1044129 -488745 137286
35558 137286 716429 812095 143130 -801296 -1104221 -551704 -79712 -720149 -2219049 -3193255
35548 -3193255 -2835201 -1963760 -1860364 -2398945 -2203586 -770261 520390 139797 -1489683
35539 -1489683 -2519930 -2025437 -908835 -438715 -752845 -1132876 -1100010 -739454 -287092
35530 -287092 155348 585226 978800 1129275 646497 -574399 -1880863 -2286148 -1510304
35521 -1510304 -260621 592697 698507 57234 -1161720 -2338458 -2582681 -1723373 -682451
35512f82451L35849j09614K79067P49344M72687k87316p29809n74775p7761M72095
35502a52684P95164O00577m2753o33008q12174o77210l81385O7998M52972M12157
35492c70346J18804K12308P10232P35499j52512j069261r44731J1372P44121Q02899
35482G98385N28471J09828o06373j368231j419677m54199Q10406J335831Q62729
35473E97170J07153j18674J48184J55921m24061q96531n02107L94033P91510M94128
35463G46726J38397r8071o46572j272532r92679K35346J047334O53612M9666K89118
35453A50345P51629L80430l92110m47673M8616P2856l48364k54387M49005Q10253
35443A220600M10552k03376o28862r12400q35087j57623N05546L38722k68008
$$ plain form
35512 -682451 -346602 -456216 -177149 572195 1044882 757566 27757 -547018 -624779 -152684
35502 -152684 642480 1243057 1200304 567296 -244878 -922088 -1303473 -1235475 -782503 -370346
35492 -370346 -251542 -39234 670998 1406497 1253985 184724 -760007 -748635 -4514 798385
35482 798385 1326856 1436684 830311 -537920 -1957597 -2411796 -1601390 -265559 597170
35473 597170 704323 585649 733833 889754 465693 -430838 -932945 -538912 252598 746726
35463 746726 885123 787052 140480 -1132052 -2124731 -1889385 -842051 -188439 -138773 150345
35453 150345 901974 1282404 890294 442621 491237 564093 215729 -38658 410347 1220600
35443 1220600 1631152 1427776 798914 -113486 -948573 -1106196 -600650 -261928 -529936
35434e29936l12964K7731j84178o04688L2046J330293J250553n82606j828966
35425a402715r12697N12348K71912r19955q91562M18376J207938R26356P08945
35416h1054Q92694N04386m54484n04388O96764J277620K059j486096j004006P68277
35406F11772J298089O2529q44660j61028O73859O5203j119591j050821J44492
35397c20156Q18199N19534L19238N78799L93542m44674q48779m22207k00738n64693
35387a71935l40343P90938J009438o84268k083004q13794J641691J911630r1784
35378A168569j211618j43523Q68758J04305j028564q11789K7824J18396j40157
35369a047799J87612O13816L18791j70615o1479J81660o4869k10018K82832N31691
$$ plain form
35434 -529936 -842900 -815169 -999347 -1604035 -1571989 -241696 1008857 426251 -1402715
35425 -1402715 -2315412 -1803064 -1531152 -2451107 -3342669 -2924293 -1716355 -789999 -81054
35416 -81054 811640 1316026 861542 357154 1053918 2331538 2333597 847501 -156505 611772
35406 611772 1909861 1972390 1127730 966702 1640561 1705764 586173 -464648 -320156
35397 -320156 498043 1017577 1336815 1915614 2309156 1864482 1015703 593496 392758 -171935
35387 -171935 -512278 278660 1288098 603830 -1479174 -2292968 -651277 1260353 1168569
35378 1168569 -43049 -186572 682186 786491 -242073 -1053862 -1026038 -907642 -1047799
35369 -1047799 -860187 -246371 72420 -98195 -159674 21986 -42883 -252901 29931 561622
35359E61622k11845r02760l68285N64026M90410j76776k79276k34488r76781j585205
35349c119358n95149J022478J031104k81178m79291Q25257J322208J21462o52375
35340h04842L63045J291837J89547j630248j661792Q605J214465J002321L78736
35331C51674L04244O41455Q66090N86553l77199j496476j586714k76310J115989
35322A29306J120669J8521p37796n05205J05552L56088N0856n79620r24503l47453
35312a313585Q45025J384748O98183j76390j98818K9985n57916j462302j289627
35303b040697m5796Q35399O69427K49975K88643M71366L40332k1272m51353q63897
35293e67873q07328Q0128J066484R56081p5871n51173O7673N77685Q1462n62148
$$ plain form
35359 561622 349777 -552983 -921268 -357242 133168 -43608 -322884 -557372 -1534153 -3119358
35349 -3119358 -3714507 -2692029 -1660925 -1942103 -2421394 -1596137 -273929 -152467 -804842
35340 -804842 -441797 850040 1039587 -590661 -2252453 -2243848 -1029383 -27062 351674
35331 351674 655918 1297373 2163463 2750016 2372817 876341 -710373 -986683 129306
35322 129306 1249975 1268496 530700 25495 131047 487135 537991 -41629 -966132 -1313585
35312 -1313585 -468560 916188 1614371 1437981 1239163 1269148 711232 -751070 -2040697
35303 -2040697 -2086493 -1251094 -581667 -331692 -43049 428317 768649 747377 296024 -567873
35293 -567873 -1375201 -1295073 -228589 727492 651621 100448 168121 745806 827268 265120
35283B65120l00795L03886J02525o62160q03188j44159L50891K51888J83259N25188
35273G2455P04402J94709n73857q22424m67164j00016j63440m73632m89186Q6257
35263b031896R14314J242072O60219l50768p93735j53902J006906J492359O17196
35254B602765r70808j781930j094593J17894M07296j67401k13771O64741R65273
35245E29466m09125k017753j580888O46092J943734P92743j145618j456295p1101
35236b768745J181458J252313P51349M71848L21809p3210o01305q77532p26982
35227a068997k14072M29713P67842M49671k79260p01860m55872O0231K85898J87438
35217e39268R1229J04734P2816j5906K7621K08128K39011k6048l01569k43717
$$ plain form
35283 265120 -35675 268211 370736 -291424 -1094612 -1238771 -887880 -635992 -452733 72455
35273 72455 776857 971566 397709 -424715 -891879 -991895 -1155335 -1628967 -2118153 -2031896
35263 -2031896 -1117582 124490 784709 433941 -359794 -513696 493210 1985569 2602765
35254 2602765 1631957 -149973 -1244566 -1126672 -719376 -886777 -1100548 -435807 529466
35245 529466 120341 -1897412 -3478300 -2832208 -888474 -95731 -1241349 -2697644 -2768745
35236 -2768745 -1587287 -334974 416375 888223 1210032 1136822 535517 -342015 -1068997
35227 -1068997 -1283069 -853356 -85514 364157 84897 -616963 -1072835 -1012604 -726706 -539268
35217 -539268 -448039 -343305 -270489 -286395 -258774 -50646 188365 162317 -139252 -382969
35207c82969M3764J76161Q9805R6118K64513J98984k81505o56181m10317N7557
35197h04070n5135o14669n78145L86863J165365O94090m44161p75916M2950Q83953
35187i8875Q03649J73765j17298R1250K63276O8039k37003k60455r630J29902
35177H06620q8824l64461j65450M60884P42175J75761o40022p06985M256N25981
35167G49935K41714l84528n84106k12345L16221N14834O5621q67290j378221n79829
35157b117994J017408J664341N37893r67167r97435K58557R72822L39450m91722
35148B16153l78125J93427J83176k57374k00364L65329M46009l01082q82285m06482
35138a021618N50225P24976j04948r42967r64352l22771M47881J022410J057482
$$ plain form
35207 -382969 -339205 -163044 -73239 22879 287392 486376 204871 -451310 -861627 -804070
35197 -804070 -859205 -1473874 -2052019 -1665156 -499791 194299 -249862 -1025778 -982828 -98875
35187 -98875 704774 878539 761241 852491 1115767 1183806 946803 686348 676718 806620
35177 806620 717796 353335 187885 648769 1390944 1566705 926683 219698 223954 749935
35167 749935 991649 607121 23015 -189330 126891 641725 707346 -159944 -1538165 -2117994
35157 -2117994 -1100586 563755 1101648 134481 -862954 -604397 368425 707875 216153
35148 216153 -161972 31455 214631 -42743 -243107 122222 568231 267149 -615136 -1021618
35138 -1021618 -471393 253583 148635 -794332 -1758684 -2081455 -1633574 -611164 446318
35129D46318K57218q18873q71307L70550J242271K16368j623295j762435J25956
35120b417229J558553Q37524n18523k53008J133370J281304l11424j586366j063525
35111a339324K03615N26497l5746k76372J27878M05013R7127l87578n72414m45967
35101a697271j25533L58559P78180P41345K63191j07857m2360L2912m10114j014309
35091a223257q25892L08050J252874R75519j9149l71691K00743N84733O0476n72730
35081C69676k83807N59646P78730J55236m12352l80532j75621k36136l70810l63439
35071c59409m21819o25715n94533j45310K99546M18109N32097Q96275R92001K78070
35061A269312p02157q25107N2675Q27863O10010k11463o73897m84078q7337J69805
$$ plain form
35129 446318 703536 -115337 -986644 -616094 626177 842545 -780750 -2543185 -2417229
35120 -2417229 -858676 -21152 -539675 -792683 340687 1621991 1310567 -275799 -1339324
35111 -1339324 -1135709 -609212 -644958 -921330 -793452 -388439 -291312 -678890 -1251304 -1697271
35101 -1697271 -1822804 -1464245 -686065 55280 318471 210614 168254 201166 -208948 -1223257
35091 -1223257 -2049149 -1741099 -488225 487294 468145 96454 297197 881930 942406 369676
35081 369676 85869 645515 1424245 1579481 1167129 786597 610976 374840 4030 -359409
35071 -359409 -781228 -1406943 -2001476 -2146786 -1847240 -1429131 -897034 -759 991242 1269312
35061 1269312 567155 -257952 -205277 622586 1232596 1021133 347236 -136842 -224179 -54374
35051e4374L62916N23929M09087m4735m33810m30358l50718o81774j147655q92871
35041b740363K35928J234675J192647M70086M6173J25014J45159q6852j49712
35032D72755J27431L85299M29819M33763L07658k94572j096696j215822m68736
35023i19101K07306J80927Q5621O04300J142725P47457k64289p58773n09950k80374
35013B35849l53801k14102K61971M88442K90711K22713L96821J15816p53473j123018
35003d32071k69686P97448O43451m98683j129159o87999j12298j31073k23280
34994b043350K51218Q54100P74715J64946o4554M21326R72575Q95921K37132m83333
34984A980696q28272n78658J92073Q77148O45476n01644j345549q28062L69484
$$ plain form
35051 -54374 308542 832471 1241558 1196823 763013 332655 -18063 -699837 -1847492 -2740363
35041 -2740363 -2504435 -1269760 -77113 392973 439146 564160 709319 622467 472755
35032 472755 600186 985485 1415304 1849067 2156725 1862153 765457 -450365 -919101
35023 -919101 -711795 -530868 -445247 159053 1301778 2049235 1784946 1026173 516223 235849
35013 235849 -117952 -332054 -70083 418359 709070 931783 1328604 1444420 690947 -432071
35003 -432071 -701757 95691 739142 240459 -888700 -1576699 -1688997 -1820070 -2043350
34994 -2043350 -1792132 -938032 -163317 1629 -62925 358401 1330976 2226897 2464029 1980696
34984 1980696 1152424 573766 765839 1642987 2288463 1786819 441270 -386792 -17308
34975a7308N47974n74692j245954j68189J389627J240401m78679j353864j65721
34966h26405J352793J121310k95839p90179Q787M13783m09828j102703m14985
34957i43266O80202M93213o98700j075667r9532P18015K28911n96619k58883Q92193
34947f60133J158752M1688j040361q27574J00811M09890j626r7626N04539R40675
$$ plain form
34975 -17308 530666 -44026 -1289980 -1458169 -68542 1171859 693180 -660684 -826405
34966 -826405 526388 1647698 1351859 561680 570467 984250 574422 -528281 -943266
34957 -943266 -263064 230149 -468551 -1544218 -1643750 -925735 -696824 -1293443 -1552326 -660133
34947 -660133 498619 540307 -500054 -1327628 -1226817 -816927 -818553 -916179 -411640 529035
$$ [...]
##END NTUPLES=NMR SPECTRUM
##END=
