##TITLE=31Pdec_3MBDE7-1
 CDCl3, 64 sc
 16.12.2022
##JCAMPDX= 6.0         $$ Bruker NMR JCAMP-DX V2.0
##DATA TYPE= NMR SPECTRUM
##DATA CLASS= NTUPLES
##ORIGIN= UXNMR, Bruker Analytische Messtechnik GmbH
##OWNER= root
$$ XWIN-NMR		Version 3.5
$$ Fri Dec 16 14:24:08 2022 Russian Standard Time (UT+4h)  she@DPX200
##.OBSERVE FREQUENCY= 81.013821
##.OBSERVE NUCLEUS= ^31P
##.ACQUISITION MODE= SIMULTANEOUS
##.ACQUISITION SCHEME= undefined
##.AVERAGES= 24
##.DIGITISER RES= 16
##SPECTROMETER/DATA SYSTEM= spect
##.PULSE SEQUENCE= zgpg30
##.SOLVENT NAME= CDCl3
##.SHIFT REFERENCE= (INTERNAL, CDCl3, 0, 248.564)
##AUDIT TRAIL= $$ (NUMBER, WHEN, WHO, WHERE, WHAT)
$$ ##TITLE= Audit trail, XWIN-NMR		Version 3.5
$$ ##JCAMPDX= 5.01
$$ ##ORIGIN= Bruker BioSpin GmbH
$$ ##OWNER= she
$$ F:/spectra/data/she/nmr/P31/1/pdata/1/auditp.txt
$$ ##AUDIT TRAIL=  $$ (NUMBER, WHEN, WHO, WHERE, WHAT)
(   1,<2022-12-16 14:23:11.87 +0400>,<she>,<DPX200>,
      <created by zg, POWCHK disabled, PULCHK disabled
       configuration hash MD5:
       00 E9 B6 7A A2 85 ED C7 34 08 36 98 17 FE 4E 26
       data hash MD5: 32K
       7F BA 7E E1 11 3F 3B 66 45 37 58 33 84 31 E2 85>)
(   2,<2022-12-16 14:23:25.25 +0400>,<she>,<DPX200>,
      <Start of raw data processing
       efp BC_mod = 2 LB = 1 FT_mod = 6 PKNL = 1 PHC0 = -10727.21 PHC1 = 278.8558 SI = 64K 
       data hash MD5: 64K
       19 C7 A9 C9 19 26 B5 37 DD 75 11 D0 28 ED E9 34>)
(   3,<2022-12-16 14:23:41.15 +0400>,<she>,<DPX200>,
      <pk PHC0 = 34.45787 PHC1 = 0 
       data hash MD5: 64K
       04 43 61 99 2E 68 06 0E 03 C4 20 3B AF 35 CE 22>)
(   4,<2022-12-16 14:23:45.00 +0400>,<she>,<DPX200>,
      <abs ABSG = 5 
       data hash MD5: 64K
       E4 E5 00 83 30 84 B9 55 0D EC 91 F0 E4 52 0E 66>)
$$ ##END=
$$ 
$$ hash MD5
$$ 47 E1 89 05 4F 3B 74 0F 51 28 0A 5D 9D EB B2 7E
##$RELAX= 
##$RELAX= 
##$RELAX= 
##$RELAX= 
##$RELAX= 
##$RELAX= 
##$RELAX= 
##$RELAX= 
##$RELAX= 
$$ Bruker specific parameters
$$ --------------------------
##$DU= <F:/spectra>
##$EXPNO= 1
##$NAME= <P31>
##$PROCNO= 1
##$TYPE= <nmr>
##$USER= <she>
##$AMP= (0..31)
100 100 100 100 100 100 100 100 100 100 100 100 100 100 100 100 100 100 
100 100 100 100 100 100 100 100 100 100 100 100 100 100 
##$AQSEQ= 0
##$AQ_mod= 1
##$AUNM= <au_zg>
##$AUTOPOS= <>
##$BF1= 81.014009
##$BF2= 200.13
##$BF3= 200.13
##$BF4= 200.13
##$BF5= 200.13
##$BF6= 200.13
##$BF7= 200.13
##$BF8= 200.13
##$BYTORDA= 1
##$CFDGTYP= 0
##$CFRGTYP= 5
##$CHEMSTR= <none>
##$CNST= (0..31)
1 1 145 1 1 1 1 1 1 1 1 1 1 1 1 1 1 1 1 1 1 1 1 1 1 1 1 1 1 1 1 1 
##$CPDPRG= <waltz16>
##$CPDPRG1= <>
##$CPDPRG2= <waltz16>
##$CPDPRG3= <>
##$CPDPRG4= <mlev>
##$CPDPRG5= <mlev>
##$CPDPRG6= <mlev>
##$CPDPRG7= <mlev>
##$CPDPRG8= <mlev>
##$CPDPRGB= <>
##$CPDPRGT= <>
##$D= (0..31)
0 1 0 0 0 0 0 0 0 0 0 0.03 2e-05 3e-06 0 0 0 0 0 0 0 0 0 0 0 0 0 0 0 0 
0 0 
##$DATE= 1671186191
##$DBL= (0..7)
120 120 120 11 120 120 24 19 
##$DBP= (0..7)
150 150 150 150 150 150 150 150 
##$DBP07= 0
##$DBPNAM0= <>
##$DBPNAM1= <>
$$ [...]
##$SUBNAM3= <"">
##$SUBNAM4= <"">
##$SUBNAM5= <"">
##$SUBNAM6= <"">
##$SUBNAM7= <"">
##$SUBNAM8= <"">
##$SUBNAM9= <"">
##$SW= 501.771253377433
##$SWIBOX= (0..15)
0 1 3 0 0 0 0 0 0 0 0 0 0 0 0 0 
##$SW_h= 40650.406504065
##$TD= 32768
##$TD0= 1
##$TE= 0
##$TE2= 300
##$TE3= 300
##$TEG= 300
##$TL= (0..7)
0 120 53 12 22 120 120 120 
##$TP= (0..7)
150 150 150 150 150 150 150 150 
##$TP07= 0
##$TPNAME0= <>
##$TPNAME1= <>
##$TPNAME2= <>
##$TPNAME3= <>
##$TPNAME4= <>
##$TPNAME5= <>
##$TPNAME6= <>
##$TPNAME7= <>
##$TPOAL= (0..7)
0.5 0.5 0.5 0.5 0.5 0.5 0.5 0.5 
##$TPOFFS= (0..7)
0 0 0 0 0 0 0 0 
##$TUNHIN= 0
##$TUNHOUT= 0
##$TUNXOUT= 0
##$USERA1= <user>
##$USERA2= <user>
##$USERA3= <user>
##$USERA4= <user>
##$USERA5= <user>
##$V9= 5
##$VALIST= <valist>
##$VCLIST= <CCCCCCCCCCCCCCC>
##$VD= 0
##$VDLIST= <DDDDDDDDDDDDDDD>
##$VPLIST= <PPPPPPPPPPPPPPP>
##$VTLIST= <TTTTTTTTTTTTTTT>
##$WBST= 1024
##$WBSW= 4
##$XGAIN= (0..3)
0 0 0 0 
##$XL= 0
##$YL= 0
##$YMAX_a= 3976
##$YMIN_a= -2906
##$ZGOPTNS= <>
##$ZL1= 120
##$ZL2= 120
##$ZL3= 120
##$ZL4= 120
##$ABSF1= 248.5645
##$ABSF2= -253.2056
##$ABSG= 5
##$ABSL= 3
##$ALPHA= 0
##$AQORDER= 0
##$ASSFAC= 0
##$ASSFACI= 0
##$ASSFACX= 0
##$ASSWID= 0
##$AUNMP= <proc_1d>
##$AZFE= 0.1
##$AZFW= 0.5
##$BCFW= 0
##$BC_mod= 2
##$BYTORDP= 0
##$COROFFS= 0
##$CY= -3
##$DATMOD= 1
##$DC= 0
##$DFILT= <>
##$DTYPP= 0
##$F1P= 0
##$F2P= 0
##$FCOR= 1
##$FTSIZE= 65536
##$FT_mod= 6
##$GAMMA= 0
##$GB= 0
##$INTBC= 1
##$INTSCL= 6.047779e-11
##$ISEN= 30
##$LB= 1
##$LEV0= 0
##$LPBIN= 0
##$MAXI= 10000
##$MC2= 0
##$MEAN= 0
##$ME_mod= 0
##$MI= 50
##$NCOEF= 0
##$NC_proc= -8
##$NLEV= 6
##$NOISF1= 182.463
##$NOISF2= 159.3651
##$NSP= 0
##$NTH_PI= 0
##$NZP= 0
##$OFFSET= 248.5645
##$PC= 4
##$PHC0= -10692.75
##$PHC1= 278.8558
##$PH_mod= 1
##$PKNL= yes
##$PPARMOD= 0
##$PSCAL= 0
##$PSIGN= 0
##$REVERSE= no
##$SF= 81.0140089999694
##$SI= 65536
##$SIGF1= 159.3651
##$SIGF2= -187.1042
##$SINO= 113.3802
##$SIOLD= 16384
##$SREGLST= <1H.CDCl3>
##$SSB= 0
##$STSI= 65536
##$STSR= 0
##$SW_p= 40650.406504065
##$SYMM= 0
##$S_DEV= 0
##$TDeff= 32768
##$TDoff= 0
##$TI= <>
##$TILT= no
##$TM1= 0
##$TM2= 0
##$TOPLEV= 0
##$USERP1= <user>
##$USERP2= <user>
##$USERP3= <user>
##$USERP4= <user>
##$USERP5= <user>
##$WDW= 1
##$XDIM= 65536
##$YMAX_p= 293182402
##$YMIN_p= -38468386
$$ End of Bruker specific parameters
$$ ---------------------------------
##NTUPLES= NMR SPECTRUM
##VAR_NAME=  FREQUENCY,     SPECTRUM/REAL,   SPECTRUM/IMAG
##SYMBOL=    X,             R,               I
##VAR_TYPE=  INDEPENDENT,   DEPENDENT,       DEPENDENT
##VAR_FORM=  AFFN,          ASDF,            ASDF
##VAR_DIM=   65536,         65536,           65536
##UNITS=     HZ,            ARBITRARY UNITS, ARBITRARY UNITS
##FACTOR=    0.620285442955139, 1,           1
##FIRST=     20137.2065510682, 0,            0
##LAST=      -20513.1999529968, 0,           0
##MIN=       -20513.1999529968, -38468386,   0
##MAX=       20137.2065510682, 293182402,    0
$$ Real data points
##PAGE= N=1
##DATA TABLE= (X++(R..R)), XYDATA
$$ [...]
41282 -1469394 -1765728 -1800189 -2666962 -3257790 -1782057 306638 331548 -882914 -472555
41273 -472555 1328630 1779575 765576 1013842 3053506 3954980 1871658 -1389780 -3210983
41264 -3210983 -3050980 -1953419 -1341921 -2433097 -4782255 -5778410 -3852942 -1336325 -1242571
41255 -1242571 -2305290 -1088640 1719205 2058001 -167108 -72627 4005758 6730626 3660459
41246 3660459 -1555429 -2507091 570041 1940693 -640538 -3309275 -2466962 710492
41238 710492 3165501 3864119 3307765 1727081 -526068 -2358857 -2979419 -2467398 -776252
41229 -776252 2217413 4965482 4584182 530527 -3585578 -3866855 -864772 1665440 2130957
41220 2130957 2623596 4778510 6780607 6033263 3046317 767884 1013373 3282411 6311736
41211 6311736 8823611 9175729 6532625 2680993 712567 1280429 1849845 357844 -2091043
41202 -2091043 -3206413 -2705026 -2235528 -3115624 -5237311 -7391000 -7834729 -5501189 -1483215
41193 -1483215 1622247 2509129 2144637 1465032 -88298 -2632916 -4371125 -3804055 -1989652
41184 -1989652 -886127 -780358 -993398 -1582198 -2471007 -2561077 -1803528 -2235329 -4368519
41175 -4368519 -4764472 -855274 3659645 2938101 -2238481 -4941654 -1776173 2915211
41167 2915211 3921849 1561114 -1038151 -2926170 -4649373 -5710413 -5671002 -5425776 -5015809
41158 -5015809 -2731392 1332385 3861638 3318303 3211826 6747419 11085532 11346200 8007314
41149 8007314 5303090 4026307 1732693 -673168 881839 5938812 8343947 5250734
41141 5250734 1681517 2594947 5314860 4528932 1056760 2797 2180400 3132164 468719
41132 468719 -2807910 -3235563 -1312211 310552 250233 -1057047 -1975520 -257976 4604973
41123 4604973 9150557 8754317 3497609 -1451927 -2356134 -1025197 -1036425 -2737539 -4172238
41114 -4172238 -4594007 -4522216 -3988922 -3080408 -2845034 -3601339 -3788608 -2468580 -1330246
41105 -1330246 -2165482 -4228203 -6250515 -8603074 -10577062 -8480333 -858945 6653740
41097 6653740 7179467 2214208 -329592 2593948 5963684 5371562 2316000 -1152844
41089 -1152844 -6463204 -13516495 -17315408 -14428105 -8714633 -5909043 -6009270 -5754420
41081 -5754420 -5204894 -6275464 -7259670 -4881043 -575104 984751 -855785 -2288882
41073 -2288882 -1751105 -1683282 -2879896 -2276912 1762503 6057874 6762368 4021044 612258
41064 612258 -1751927 -3082700 -3690511 -3405802 -1581172 1975102 5329659 5355058 2268940
41055 2268940 878187 3874302 6407252 2601276 -4268739 -5160456 929280 4302724
41047 4302724 -1610100 -10933319 -14453624 -12081309 -10184449 -10783794 -10362110 -7381763
41039 -7381763 -4338931 -2636603 -1066753 32693 -1938043 -6864761 -9998135 -7114690
41031 -7114690 473482 7452871 9736169 7631000 5098077 6065566 10351339 13455867
41023 13455867 11452592 5298383 -939824 -4629968 -5348284 -3076185 921200 2667219
41015 2667219 -643601 -5318126 -4359390 2881390 8832527 7655630 2605226 -72288
41007 -72288 -654678 -4121521 -10909805 -15463042 -14281554 -10190959 -6876943 -3536589 2051244
40998 2051244 8097097 10125060 6718864 1098003 -2799273 -3741134 -2865356 -1751450
40990 -1751450 -1097071 -231812 2035170 5396687 7559173 6855524 4577920 3327018 3735281
40981 3735281 4369182 4185281 3291581 1846745 130504 -811388 -619141 -1075121 -3771577
40972 -3771577 -7024960 -7888240 -6510937 -5110353 -3334698 815739 5407908 5423935 741504
40963 741504 -2256550 188789 3736207 3294831 743819 352264 937322 -1263991 -5049294
40954 -5049294 -6189527 -5013377 -5487840 -7694574 -7669897 -4653899 -2443601 -3009841 -4272081
40945 -4272081 -4883237 -5946567 -7137285 -6196944 -3257402 -926439 498357 2843624
40937 2843624 4810848 2953700 -1133133 -1209497 4009774 8185509 7011190 4034215
40929 4034215 3391142 3278424 1145038 -820665 -853163 -2585051 -8396122 -12550035 -8388904
40920 -8388904 806948 5653012 3484276 121232 -316880 -258924 -2677775 -6220009 -7976414
40911 -7976414 -6952075 -3563374 1119657 4979214 6290593 5582723 4075103 1591534
40903 1591534 -1449806 -2252565 363157 2417945 25370 -3621475 -2198206 3809434
40895 3809434 7393303 5343708 1795246 243952 -1444801 -5324241 -8433648 -7534105
40887 -7534105 -4473701 -2607303 -1093178 2843330 8086026 10475125 8700891 5686886
40879 5686886 4125635 3634604 2901009 2267264 2880697 4430094 5118490 3948802 2211296
40870 2211296 1986214 3400980 4400206 3461814 1314498 -627592 -2094176 -3182464 -3219372
40861 -3219372 -1856661 -110257 1039198 1740417 1765261 -36563 -3009942 -3909978 -1497802
40852 -1497802 570885 -1030453 -3467884 -1667784 3427348 5767215 3146247 113530
40844 113530 1069104 4862060 7538697 6798916 2659898 -2852704 -5788592 -3516163 1276063
40835 1276063 3161416 939271 -1772687 -2902603 -3822164 -4208495 -1157871 4252686
40827 4252686 5719763 905457 -3758786 -2583836 40784 -3415920 -10639679 -11434382
40819 -11434382 -2392328 7668088 9079211 2913237 -1924034 54982 5918728 9240965
40811 9240965 7160129 2107935 -1990671 -3856453 -4864632 -5998071 -6451504 -5321373
40803 -5321373 -2954482 -222 3366699 6601980 8650256 9274877 9041127 7686542
40795 7686542 4566046 1071986 -147427 655683 -23671 -3560110 -6522463 -5569527 -2160686
40786 -2160686 215938 817727 655512 -721882 -3861034 -6739807 -7118681 -6013913 -5316904
40777 -5316904 -3772562 389901 4291258 3141336 -1953170 -4246173 -679187 3810368
40769 3810368 3626276 225377 -868174 1585685 2875205 -1193594 -8639666 -13091650
40761 -13091650 -10616144 -3975962 542700 167889 -2260519 -3644559 -5045316 -8219256
40753 -8219256 -10531634 -7902267 -1779149 1946428 1418900 1097727 3922100 6255358
40745 6255358 3914063 -815139 -2514232 -372137 1956658 2653009 3140879 3609652 1884627
40736 1884627 -2185392 -5131239 -4511629 -2228498 -1197514 -1224665 -586413 411885 476089
40727 476089 557908 2613307 5572564 6168802 4234637 3402554 5048470 5418836 1740509
40718 1740509 -2254425 -1483317 2013276 1604703 -3207282 -5010565 555619 7961201
40710 7961201 9857991 7229582 6089894 7410306 7005794 4229974 3648765 6736172
40702 6736172 8154680 3582452 -3216901 -5175059 -1024863 4282990 6561268 5902994
40694 5902994 3931026 1399402 -730273 -754738 1600750 3966617 3727383 1043133 -1451675
40685 -1451675 -1649151 22952 1491535 1383559 281515 -122126 1140097 3248380 4086399
40676 4086399 1934705 -2645309 -6472826 -6328608 -2663885 215714 -1080213 -4891265
40668 -4891265 -6829973 -5460621 -3017115 -500095 4283862 11792308 16963188 14212793
40660 14212793 5231351 -2060602 -2844938 -419363 -556960 -3867933 -6481733 -6603276
40652 -6603276 -6903957 -10081160 -14690288 -16795514 -14468422 -9388422 -4666504 -2139347
40644 -2139347 -1453331 -936220 533683 2067235 1580964 -1385493 -4364509 -4525095 -2044908
40635 -2044908 490422 1857115 3493559 6434221 8826537 8160151 4976117 2381122
40627 2381122 1938110 1868370 74097 -2433543 -2633166 246996 3075397 2275853 -1782815
40618 -1782815 -5080482 -4554559 -1026120 2926431 6249429 8952965 9755924 6974834
40610 6974834 1802689 -1945506 -2265200 -1020637 -600350 -816526 -665008 -828603 -2001429
40601 -2001429 -2488807 -458351 2368226 2331033 -1155043 -5065674 -7221003 -8344815 -9328012
40592 -9328012 -9522663 -8803384 -8501523 -8812334 -7857810 -5133964 -3346844 -4320885 -5236386
40583 -5236386 -2220936 3494402 6552013 4489331 486849 -1587044 -1886590 -2790364
40575 -2790364 -4660335 -5620115 -4600463 -2719297 -1790993 -2584590 -4390171 -5527132 -4584766
40566 -4584766 -1890415 554685 1222714 703633 531995 993336 1145018 576244 -159675
40557 -159675 -752091 -1397191 -1706594 -806711 950834 1780899 865936 -226582 327877
40548 327877 2059583 3156748 3226683 3556995 5069952 7597512 10829956 14135354 15606352
40539 15606352 13655581 10112164 9150086 11571631 12457831 7133236 -1905672 -7253793
40531 -7253793 -5637401 -1400975 49024 -901199 -355108 2129091 2838697 222519 -2033510
40522 -2033510 -422990 2660335 2242810 -1172405 -1182122 5547024 13483495 14510227 8064046
40513 8064046 1366003 56042 2345513 3363758 1929614 717093 1770156 4510050
40505 4510050 7313000 8737187 7552478 3818271 197291 131145 3710362 6815248
40497 6815248 5777421 2096034 775762 3876921 7545132 6793067 2073413 -1224556
40489 -1224556 121415 3316691 4325398 3886607 5475021 8566133 8338505 2939967
40481 2939967 -2917123 -3974558 -1155842 754362 204914 46176 2208856 4708054
40473 4708054 4706426 2121819 -908777 -2530974 -2110605 132854 3289196 5965083 6956575
40464 6956575 5713082 2460336 -1429743 -3503998 -1975445 2109167 5339037 5275193
40456 5275193 2900531 1209338 1691429 2963219 3046983 2241359 2685499 5001998 6697669
40447 6697669 5044147 786151 -2542954 -2699852 -519190 2164189 4287593 4898957
40439 4898957 3031229 -522045 -2969147 -2394634 194206 2371688 2471459 -24229 -4066323
40430 -4066323 -6416715 -4286683 227713 1638023 -1199336 -2756880 685957 4442556
40422 4442556 2301203 -3309144 -4707307 -1098571 31003 -5496616 -12363181 -13694402
40414 -13694402 -9647442 -4804951 -1571533 8425 -596065 -3227652 -5227709 -4513334
40406 -4513334 -3002741 -3896157 -6823270 -8468155 -6926314 -2992462 1772139 5917317
40398 5917317 8095571 8348531 8393283 8785698 7306906 2389246 -3442650 -6235185 -5458839
40389 -5458839 -3484693 -1486385 963566 3087548 3211660 1779042 908009 911402 371614
40380 371614 -218305 1540388 5418666 7535730 5675643 2777043 2771558 4982178 5282350
40371 5282350 1802872 -2857135 -4884377 -3082963 533735 2880100 2477909 630427
40363 630427 -89448 1387439 3857214 5774027 6813366 7125225 6376567 4605335 3165449
40354 3165449 3598305 5852299 8389825 9659208 8813747 5687826 1218028 -2433580
40346 -2433580 -3475205 -2427435 -1491077 -1639092 -1327098 1104627 4448932 5372026 2276853
40337 2276853 -2746515 -6455830 -7807344 -7531660 -5458417 -798720 4656922 6506550
40329 6506550 2822796 -2622930 -4640349 -2868733 -1004397 -676559 306874 3176369
40321 3176369 5318620 4082839 866393 -994926 -769527 -424459 -1270049 -2792952 -4276013
40312 -4276013 -5517085 -6066975 -5386868 -3781321 -2073686 -685764 1825 -790683 -2918431
40303 -2918431 -4337530 -3126965 60821 3101820 5172383 6685190 7470875 7284205
40295 7284205 7198778 7819077 7020448 2857305 -1894220 -2305636 1463780 4240480 4027544
40286 4027544 4591478 7588379 8208070 3311623 -1342165 1357016 8470712 10733935
40278 10733935 6254265 2571192 4437287 7205758 5082171 -378912 -3864636 -3637865
40270 -3637865 -1296972 2054010 5404793 6579586 5236644 4702033 7228067 9818360
40262 9818360 8574504 4936110 3259951 3879137 3295456 434802 -2072097 -2867670 -3580807
40253 -3580807 -4798233 -4453958 -1721488 827319 690189 -1452689 -3525058 -4711851
40245 -4711851 -5052498 -4490753 -3579656 -3204849 -2559017 474404 5668604 9356236 8580402
40236 8580402 4466020 -96042 -4018518 -7157666 -7874944 -4558119 1084730 5068707
40228 5068707 5655939 4813766 5052415 6747782 8878507 10452587 10491980 8358301 5190240
40219 5190240 3594327 4534973 5609246 4003629 387526 -2041325 -2029451 -1507419 -2009282
40210 -2009282 -2306595 -926080 1091703 1934068 1867373 1984133 1474998 -955665 -3873751
40201 -3873751 -4603576 -3405359 -2484960 -1193604 2981179 7950764 7404979 526206 -4212558
40192 -4212558 144396 8605064 10622652 4234897 -2785465 -4652120 -3392880 -2397400
40184 -2397400 -994920 1843106 3685957 2280990 -259605 -341212 2002583 3562588
40176 3562588 2243543 -987742 -3507964 -3420986 -1645998 -1768575 -5930540 -10988773 -11601197
40167 -11601197 -7405189 -3604718 -3446112 -4144089 -2455568 -329882 -1294166 -3883126
40159 -3883126 -3123535 2133765 7011026 6183479 -474992 -8067021 -11098414 -7896388
40151 -7896388 -1850356 1798861 976002 -1864277 -3378001 -2781273 -1101074 1010271
40143 1010271 3176043 4396924 3961780 2590850 1537834 1155424 973032 283364 -1745533
40134 -1745533 -5227271 -8366109 -8655001 -5884932 -2481673 -442710 326668 383389 -246666
40125 -246666 -849469 -295823 586788 -596343 -4072683 -7112767 -7900404 -7301200 -5765303
40116 -5765303 -2022717 3329976 6544981 5591627 3234468 2673128 3213655 3079306 3219440
40107 3219440 4798249 5835349 4316094 2238020 2504316 3887771 3267151 1080058
40099 1080058 245809 1068337 1446680 988418 780553 186784 -1918964 -3754762 -2785876
40090 -2785876 -322702 580531 952322 4475016 10341956 12915527 9583080 4347158
40082 4347158 2058522 2842698 3772306 2966867 708888 -1154195 -433207 2579742 4062180
40073 4062180 1230188 -3232369 -5043594 -5115532 -7318899 -10399974 -8671909 -1592732
40065 -1592732 3914198 3003936 -994465 -2913886 -2926553 -3876050 -5908772 -7584575 -8839541
40056 -8839541 -9466388 -7897375 -4599707 -3372513 -6080791 -9231999 -8845733 -5551949
40048 -5551949 -1930086 1568571 4614246 4655031 685645 -3766504 -5303174 -5035381 -4520643
40039 -4520643 -1540339 4977466 9985810 8763579 5059510 5554863 8747186 7571496
40031 7571496 1785174 -1182647 1874765 5952831 7274255 8032310 9012972 6232342
40023 6232342 -695043 -4960254 -3026751 -1294045 -5418302 -9836773 -6672289 397788
40015 397788 1675281 -2353386 -1975598 4832454 8218231 2190507 -5883592 -6983103
40007 -6983103 -3305182 -2579303 -5720864 -7775684 -7196190 -6638294 -6627500 -5178670 -2639777
39998 -2639777 -1020539 637439 4541510 8498302 7943979 3639678 1382680 3283145
39990 3283145 5075901 3404029 118356 -2518754 -5250384 -7798498 -6843586 -1660437
39982 -1660437 2757088 2193688 -832039 -1384308 1034851 3711240 5465173 6198803 4840152
39973 4840152 1856212 762719 2818639 3393223 -1434138 -7613503 -8154285 -3227407
39965 -3227407 661045 64548 -2674408 -4867240 -5671550 -3680481 1552122 5903725
39957 5903725 4590369 -431898 -2835759 -1343232 -386281 -1647785 -2244911 -1753915 -3061347
39948 -3061347 -4910128 -2214829 3675303 4190913 -2707962 -7120981 -1855527 5857358
39940 5857358 5589461 -135070 -888606 4803676 8324083 5181719 363901 -1310953
39932 -1310953 -1616838 -3404003 -5412762 -5584454 -4732934 -4223034 -3455411 -1641339 611372
39923 611372 2594159 3908680 3339789 281367 -2625759 -1669123 2798862 6833569 8774493
39914 8774493 10694426 13185257 13069581 8398865 2155601 -1618563 -2650339 -2822065
39906 -2822065 -2147678 554203 4329992 6410686 5622755 3507444 2188808 2508157 3865384
39897 3865384 4513231 2360587 -2969047 -8768863 -11267702 -9499411 -6223443 -4450661
39889 -4450661 -3974595 -2391207 1025622 4121024 4874379 3993881 3380669 3336528 2953133
39880 2953133 2225288 1589191 -8980 -3918192 -8592418 -10315238 -7802411 -3762489
39872 -3762489 -1250631 -838746 -1858348 -3474698 -3678455 -642249 3442035 3566043 -869854
39863 -869854 -3879888 -1064551 3774746 4412709 1390964 46980 1293897 468375 -4578380
39854 -4578380 -9679766 -10037926 -5742999 -244447 3392496 3382605 -592649 -6245819 -9605124
39845 -9605124 -8519341 -4336746 10188 2206535 1223104 -2141007 -5280034 -5996303
39837 -5996303 -4535164 -2194814 782154 3900099 4793751 2129190 -1286375 -2115705
39829 -2115705 -2056216 -5201454 -10487446 -12298158 -9226834 -6450631 -7418062 -8712345 -6400512
39820 -6400512 -2618884 -1518216 -2308640 -1180298 2101778 4143704 3268761 968568
39812 968568 -1221613 -2837132 -3042965 -1216535 1369410 2996221 3890291 4728965 4207452
39803 4207452 1404950 -817822 880669 4244334 3617146 -1376752 -4734440 -3300599
39795 -3300599 -1470090 -3324229 -5344488 -2321349 3300488 4686390 1319507 -788772
39787 -788772 540057 675644 -2523881 -3924432 98761 4402275 2647827 -2520497
39779 -2520497 -3983019 -1798316 -2418220 -7361784 -10854088 -9636689 -7390331 -6983706
39771 -6983706 -5498838 -883572 2565748 423347 -4685754 -7241656 -6623795 -5735846
39763 -5735846 -4926469 -2685125 -261919 -230951 -1670805 -1584290 -204114 -430077 -2762515
39754 -2762515 -5007609 -6221749 -6785451 -5491868 -1156167 3362490 3438745 -863367 -4705762
39745 -4705762 -4863550 -2348352 889586 3529097 3524318 -11847 -3531988 -2525415 1622209
39736 1622209 3417170 2013881 2042252 4707291 4954066 199052 -4620881 -4741490 -2700942
39727 -2700942 -2976404 -4248205 -2583791 1164431 2972395 2392343 2056164 1774612 -1317105
39718 -1317105 -6780530 -9845411 -7324558 -1243009 4180485 6580718 6078518 4302175
39710 4302175 3336775 3810795 3818151 1449737 -1708584 -1759584 2323282 6651149 6792894
39701 6792894 3157104 588961 2574344 6975550 8590456 5607292 1690833 748225
39693 748225 1606287 205177 -4169237 -7906495 -8042857 -5208063 -1471700 1714660 2964577
39684 2964577 1447455 -1179042 -2068427 -1087421 -588104 -1003049 -356755 1177284 663286
39675 663286 -2135936 -3381703 -1634409 -922459 -3955009 -6874237 -5289423 -1630920
39667 -1630920 -1130270 -3423370 -4027170 -2272380 -1627602 -2870751 -2991808 -1272127 -810130
39658 -810130 -2653139 -3462725 -1255126 696638 -1369339 -5883819 -7896917 -5262235
39650 -5262235 -428606 2964334 3187550 617802 -3186297 -6156655 -6701951 -5074281
39642 -5074281 -3563948 -4340299 -6717016 -7627550 -5683748 -3318757 -3022162 -2960835 357409
39633 357409 5762229 8019037 5280145 1498516 31155 -517937 -1871143 -2399382 -1210225
39624 -1210225 -1211624 -3724946 -4303074 778096 7370244 8599712 4332296 -421533 -3673698
39615 -3673698 -6154217 -5355490 1708864 10478201 12238443 6528561 2122800 4035819
39607 4035819 7691926 8493867 8542282 9490445 7006234 -1121879 -7959602 -6245464 270905
39598 270905 2175966 -1899955 -4829568 -2761108 410396 547235 -1602107 -4071199
39590 -4071199 -6662774 -8322307 -6394366 -997422 3488660 3634329 845092 -1733690
39582 -1733690 -3252601 -4059630 -3436979 -1255369 28053 -1992020 -5885259 -7696670
39574 -7696670 -5659323 -1653828 1637089 3009039 2250880 -422317 -3620382 -5040812
39566 -5040812 -3777654 -1650853 -1111455 -2146150 -2281378 335287 4721478 8155319
39558 8155319 8852901 7295192 5429577 4855358 5385161 5231989 3089974 1096 -1674762
39549 -1674762 -1126847 384927 2034233 4358395 6651858 6017611 1587191 -2359660
39541 -2359660 -1230717 2963297 4003608 844603 -573228 3317414 7756774 6890983
39533 6890983 2746729 1568321 3761901 3871277 59460 -2945243 -2016555 -984097
39525 -984097 -4437897 -10333195 -12869762 -10144425 -4983714 -38325 3749459 4767282
39517 4767282 1306290 -4882721 -9078795 -8830255 -6353077 -4982102 -5635696 -7661256
39509 -7661256 -10657448 -13868484 -15577337 -14769516 -12339693 -9602057 -6770914 -3803272
39501 -3803272 -1457711 -523060 -979679 -2412366 -4002076 -4064087 -1705991 748564 -205374
39492 -205374 -3865373 -5202920 -1914386 1751966 949419 -3004185 -5260764 -4297994 -2167701
39483 -2167701 75184 2679165 4127039 2410158 -893546 -1913921 211070 3038321
39475 3038321 5438140 8415283 11412332 12072071 10102414 7495051 4725612 840894
39467 840894 -2590218 -2312924 1156071 3490101 2738831 930330 -1029085 -4557227 -8320515
39458 -8320515 -7969180 -3251129 206856 -1078140 -3970891 -4933103 -4982501 -5252348 -3616864
39449 -3616864 187827 1862529 -500223 -2470144 -1149765 -812474 -4706994 -7518055
39441 -7518055 -3636549 2437065 2760831 -1138465 -1599772 1687124 1626108 -3781918 -8585592
39432 -8585592 -9072857 -8055722 -7699318 -6078364 -2820639 -1180281 -2293266 -3132113 -1666481
39423 -1666481 1183935 5100284 9999879 12267091 8297114 2055653 1419630 6099955
39415 6099955 7509631 2400164 -2267783 -1229986 1134778 -569669 -4200026 -5821632
39407 -5821632 -6990168 -9932859 -11384944 -7992231 -3208534 -2287375 -4191778 -4538461
39399 -4538461 -3105711 -2485255 -2427814 -1421516 -1134830 -3539748 -6089311 -5353601 -3066455
39390 -3066455 -2888107 -3498820 -1092336 3000321 3671807 265402 -2698328 -2861505 -2289287
39381 -2289287 -2098677 -491177 2718298 4574191 3611297 1947220 1157652 -300187 -3689741
39372 -3689741 -7003628 -7466524 -5158886 -2535964 -1528247 -2138674 -3155625 -3776256 -4713087
39363 -4713087 -7004528 -9380023 -8708304 -4577362 -1345593 -3013630 -7507677 -9111083
39355 -9111083 -5793008 -1011039 1567488 2091041 2701036 4068844 4846151 3460031 -102409
39346 -102409 -3929744 -5922738 -6101244 -6105148 -6186580 -4714351 -1515227 828708 762508
39337 762508 387507 1892845 3471240 1767136 -2932350 -6802135 -7001572 -3856795 476829
39328 476829 3303838 2322401 -2399166 -7795905 -10646366 -10356406 -8226403 -5759181 -4603937
39319 -4603937 -5636818 -6731683 -4403226 680092 3468859 2162978 1786107 6429318
39311 6429318 12073507 12235552 7584671 4184046 4333862 5160059 5053583 5437789 6253480
39302 6253480 5118364 1530767 -2394754 -5492706 -7921536 -8480687 -5839638 -1992626
39294 -1992626 -181185 7174 1009723 1828098 -393139 -3952591 -3855409 206899 3265477
39285 3265477 3394236 4439586 8698521 12768140 13165556 10896691 7912079 4013785
39277 4013785 47423 -725403 2245917 4607748 3409276 1571778 2512999 4259441
39269 4259441 3185929 381584 -564672 -99611 -2036688 -6774478 -9482863 -6253852
39261 -6253852 392841 3902806 1263940 -3046539 -2205888 3864676 7537647 3684547
39253 3684547 -2634991 -3172215 1580849 3944197 1401131 -289096 2624252 6163535
39245 6163535 6091701 4271621 3626553 2726566 5729 -1732878 -11930 2281722 1401615
39236 1401615 -1216863 -1832108 5277 2692013 5749197 7862118 5980058 768883
39228 768883 -1612935 1712728 4582987 894709 -5248285 -5849434 -1480801 946393
39220 946393 -82703 -258937 1008344 166692 -1749068 443349 6000839 7964816 4857503
39211 4857503 3483270 7037747 9448169 6021280 1375602 1015624 2370566 1075995
39203 1075995 5103 4097484 10477083 11897925 7559480 2850194 -153514 -4295233
39195 -4295233 -9687265 -11914619 -9462065 -6761890 -7287009 -8431434 -6279608 -1850062
39187 -1850062 734366 113321 -1244484 -748648 1825149 5130385 7944915 9968809
39179 9968809 11485585 12269907 11308138 8447749 5675376 5138830 6271942 6961765 7397266
39170 7397266 9821993 13581890 13702159 6960368 -2816895 -8696076 -8662444 -6351538 -4441503
39161 -4441503 -1550534 3227902 6777428 5875920 2135929 -357951 -945001 -2382643
39153 -2382643 -5483157 -7504154 -6575549 -4497434 -3732435 -4167570 -4411806 -4083941 -3189762
39144 -3189762 -1345937 663970 800253 -793575 -808500 2072571 3693025 -20317 -6078701
39135 -6078701 -7865917 -4497094 -1275943 -785410 345219 4020651 6125477 3199613
39127 3199613 -1072777 -914109 3133019 5734192 4535498 1592086 -1376290 -4201746
39119 -4201746 -5692417 -4806196 -3883237 -5606189 -7058583 -2820406 5257327 8109776
39111 8109776 1975269 -5507797 -6040986 -1897423 -567275 -2614668 -2277634 2068837
39103 2068837 5906190 6956380 8168931 10739046 10878170 6679585 2630456 3091079
39095 3091079 5435343 4316605 -161238 -3359777 -3424960 -2867511 -3350971 -3350754 -1711314
39086 -1711314 -52363 -196936 -1349610 -1159188 1477347 5265881 7499217 6371028
39078 6371028 3121249 1224671 2319668 3885145 2570583 -1129068 -3674781 -3351970
39070 -3351970 -1899931 -1400355 -2044194 -3389564 -5472520 -7742632 -8751465 -7975812 -6636863
39061 -6636863 -5890041 -5384630 -4333187 -2888662 -1697385 -958449 -560053 -441408 -363920
39052 -363920 22541 510979 289993 -1056256 -2672301 -2652044 528185 5944358 9726720
39043 9726720 8337867 2987979 -1144439 -1215255 -17544 -1283404 -4238112 -5567148
39035 -5567148 -4518160 -2535876 307145 4351989 7140700 5832191 2320178 1262152
39027 1262152 3123651 4048051 2876123 2946072 5757437 8060485 7110060 4113816 620537
39018 620537 -3701613 -7687682 -8276846 -6060116 -5897476 -8896379 -9442852 -4344039 768062
39009 768062 -371560 -5015291 -6333859 -4063716 -3276055 -5197993 -6180411 -4257950 -666576
39000 -666576 3549673 6709493 4635935 -3696526 -10895891 -9220057 -2240010 172969
38992 172969 -2551410 -1389870 5930805 9553372 2887161 -6474006 -7880449 -2033846
38984 -2033846 3150527 5092137 6813980 8615700 7623841 3954195 711399 -1038013
38976 -1038013 -1935464 -783737 2959025 4891749 403164 -6974776 -8614062 -2707199
38968 -2707199 3189109 2961528 -699888 -2267653 -1353436 -933142 -1392901 -629819 1742137
38959 1742137 3745278 3859302 2349740 541559 81411 1664799 3392827 2158472
38951 2158472 -1977720 -4820760 -3260661 518928 2287153 1392553 410648 616203 1003303
38942 1003303 1085012 1431688 1590145 544303 -684183 -36435 1668369 1207506 -1828116
38933 -1828116 -3813246 -2515893 -212767 638941 1240753 3110967 4356578 3150555
38925 3150555 2135982 4781535 9245498 10611865 7843392 3678345 -908477 -6308359
38917 -6308359 -9305746 -5616549 1890310 4823499 1186986 -1602116 1252375 4476203
38909 4476203 2241432 -2161155 -3108713 -2976356 -7073944 -12593979 -12284389 -6990180 -4673753
38900 -4673753 -7194781 -7779786 -3240951 490085 -1505355 -5369836 -5608743 -3770545
38892 -3770545 -4532982 -7475919 -8187318 -5070785 -700644 1977120 1644066 -1558180 -5640014
38883 -5640014 -7736959 -7361359 -7025455 -8385686 -9989853 -9937955 -8119834 -4760813 192420
38874 192420 5117059 7512270 7851811 8887525 10186866 8183810 3241497 966338
38866 966338 3617725 5989648 3782160 360741 142713 718342 -2071958 -5752906 -5199143
38857 -5199143 -1761930 -908319 -2931021 -3437103 -1622711 -695014 -1002517 -134065 722597
38848 722597 -1768304 -5345410 -4080438 1053800 2182148 -2667559 -5524986 -1249277
38840 -1249277 3876442 2177863 -3544706 -5305532 -2249354 -19134 -624228 -482078
38832 -482078 2232956 4893442 5646545 5994133 6827987 6125002 2544609 -1569143 -2895895
38823 -2895895 -1338356 202454 -243949 -1220104 221105 4296986 7325438 5969982
38815 5969982 1911706 222739 3157444 7872819 10568117 10251589 7793722 4277514
38807 4277514 1597474 1715188 3487798 2985920 -957283 -4208641 -2769879 1757209
38799 1757209 4852291 4943761 3690951 2544079 2248806 3952977 7323084 8895696 5722902
38790 5722902 -317776 -4855592 -6303146 -5565983 -2272539 4261529 11141987 13743560
38782 13743560 11745013 9218334 8396137 7567660 5768677 4960518 5901806 5957650 3292762
38773 3292762 -66859 -1636612 -2026585 -2814490 -3503407 -2952570 -1579669 -18518 2127176
38764 2127176 4187007 3790203 849154 -614647 2094702 5511903 4523117 -97624
38756 -97624 -3039965 -2250708 -610279 -26343 1009023 2770561 2144937 -2076346 -5494781
38747 -5494781 -3441492 2123557 4827342 2118404 -2188229 -3714772 -2815400 -2880599 -5321326
38738 -5321326 -7892032 -7442263 -3368642 1584881 3715282 1823396 -1667135 -3436349
38730 -3436349 -2905662 -2315647 -3222472 -4315611 -3620032 -1757990 -1263263 -2692803 -3235266
38721 -3235266 -276822 4704315 7375970 5511733 1180035 -2460943 -4974023 -7802230
38713 -7802230 -10580844 -10635807 -6787489 -1811608 395264 -899934 -3431816 -5617757
38705 -5617757 -7827273 -9891610 -9897875 -6883599 -3011336 -1272026 -2098318 -3930871 -5991858
38696 -5991858 -8241459 -9331465 -7433841 -3341319 -168274 720643 1141560 2654978
38688 2654978 4231456 4623728 4481364 4254690 2569972 -674895 -1886368 1965544 7943215
38679 7943215 9881817 6257823 1622235 -120085 -104549 -998029 -2568080 -3005933 -2354670
38670 -2354670 -2139353 -2697148 -2766384 -1225850 1790543 4938804 6407794 5587157 4112858
38661 4112858 3867041 4107357 2767343 578381 712468 3406346 4560659 1836337 -1242571
38652 -1242571 -454471 2618929 3220344 696958 -1235974 -724784 105371 -528345 -1560827
38643 -1560827 -1748130 -1529318 -1195867 -160615 856415 -190415 -3112757 -4669071 -3113787
38634 -3113787 -1097661 -1742081 -3748352 -3149586 961166 4950874 4872487 509280 -4866464
38625 -4866464 -7552900 -6140237 -2156248 1571722 3340803 3390300 2678496 1734806 902614
38616 902614 787953 1843326 3810060 5694825 6034638 3674225 -859684 -5158529 -7096433
38607 -7096433 -6682491 -4739904 -1006641 4277043 7947556 6394979 604548 -4453166
38599 -4453166 -5967093 -5486854 -4348584 -1228398 3629859 6011910 3184257 -1400677
38591 -1400677 -2860189 -1762725 -1784423 -2647584 -860828 3275268 5069555 2501021 -1154944
38582 -1154944 -3014308 -4112079 -5355695 -4666930 -1147946 1925764 1987297 1731533 4414896
38573 4414896 7201769 4608526 -2317232 -5887918 -1921430 4689512 6845606 4145797
38565 4145797 1844459 3108284 5817786 6639031 5434332 4852336 6986989 11210423
38557 11210423 14783575 15288123 12600851 8459747 4431668 1201557 -398364 351118
38549 351118 1963900 1192309 -2470470 -4721066 -1800675 3575035 5521106 3580339
38541 3580339 3238227 7041096 10373701 8777789 4902083 3984528 5782121 5972686 3517262
38532 3517262 1415959 1054385 787469 -29160 -248276 -289948 -1751119 -3334563 -1807867
38523 -1807867 2370226 5154403 5413077 6095227 7713971 6623826 2144495 -729331
38515 -729331 686418 1941184 -762681 -3479240 -1021036 4176398 6377330 5878519
38507 5878519 6574297 7147460 3186712 -3070347 -3892608 2135124 7333274 6119842 2157524
38498 2157524 1360049 3515834 4446111 2222599 -2052827 -6471696 -8917147 -8382403 -7319811
38489 -7319811 -9409924 -13718391 -14944589 -10986413 -5996366 -3927457 -3450661 -1902210
38481 -1902210 -41213 348943 -19465 -55905 -686150 -2146269 -2282368 -638869 -559736
38472 -559736 -3567526 -5354213 -1862943 3761873 5298114 2194985 -836750 -1208615
38464 -1208615 -335729 627816 1787640 1809233 -835634 -3963584 -3694964 -711278 35076
38455 35076 -3260043 -6409709 -5413098 -1896497 -270193 -1942334 -4405502 -4604828 -1735033
38446 -1735033 2447021 5285510 5683245 4896767 4494092 4476473 4291786 4188475 4084181
38437 4084181 2853004 707428 264801 2632467 4617858 3329821 1531221 3862831
38429 3862831 8967289 10630632 6769167 2036615 485404 616011 -357394 -1756581
38421 -1756581 -1683575 -639500 -21243 625356 2294953 4101129 4094321 1364261 -3443622
38412 -3443622 -8061097 -9016692 -4978695 -67965 -246067 -5354511 -8699373 -6208499
38404 -6208499 -1598751 225735 259014 1636511 2790899 142293 -4582204 -5877382
38396 -5877382 -2828362 -247838 -830816 -1470902 857288 4123295 4843333 3225835 1696197
38387 1696197 772502 -434393 -1306430 -572602 735357 281300 -1686970 -2243957 -116282
38378 -116282 2301822 2237036 -135349 -2801025 -4520263 -4882876 -3511315 -1252803 -817572
38369 -817572 -3739464 -7474019 -8103304 -5404535 -2445300 -697918 787246 1386150 -1139702
38360 -1139702 -5182333 -4845601 1725825 7949371 7250918 2376358 848853 3849095
38352 3849095 6077499 5287179 4748401 5819089 5226784 1874826 -115221 1466250 2373334
38343 2373334 -996806 -4369268 -932614 8456019 15548181 14409520 6874644 -1347300
38335 -1347300 -6543465 -8509885 -8669215 -7915156 -6084439 -3515307 -2151409 -3198228
38327 -3198228 -4458677 -3299972 -1968406 -5115927 -11024424 -11323142 -2792508 6343555
38319 6343555 7230188 2605008 1252314 3760866 2457669 -5237845 -12172959 -12172774 -8167959
38310 -8167959 -6214227 -6987530 -7322401 -6187357 -4888908 -3861346 -2925137 -3040939 -4789948
38301 -4789948 -6509507 -6585194 -6312759 -7857485 -10349000 -10721387 -8122529 -5014181 -3525871
38292 -3525871 -2693459 -370510 3143133 4810897 2612790 -1267057 -2526949 -367288
38284 -367288 868789 -2670667 -8646141 -11161825 -8330887 -4007749 -1984562 -2056595 -2845307
38275 -2845307 -4841618 -8338195 -11176090 -11435081 -10478518 -10534156 -10832247 -9212064 -6403628
38266 -6403628 -5173416 -5471521 -4129894 -334225 1884734 -1236639 -7592430 -11126217
38258 -11126217 -8544108 -2162390 3477889 5795681 4781875 1511202 -2524054 -5462345
38250 -5462345 -5988098 -4458863 -2578927 -1940317 -3069510 -5279633 -6760673 -5523037
38242 -5523037 -1537560 2357097 3068978 688102 -2037554 -3291244 -3288027 -2120594 433899
38233 433899 2238800 -502416 -7634019 -13131865 -11909982 -6303170 -2328934 -1469147
38225 -1469147 -459575 1858078 2510923 -127284 -3151622 -3170947 -646288 1359223 703401
38216 703401 -2475842 -6064403 -7262182 -5409984 -3177613 -2681429 -1664113 2742726
38208 2742726 7652724 7305028 2461462 572016 4723428 8865174 7380064 3191630
38200 3191630 1521123 1196000 -1479560 -4540919 -3426772 436049 1728406 689217
38192 689217 2801588 8731566 11888501 8009730 1306471 -1513282 1076015 5811353
38184 5811353 8766280 7287164 1601545 -3810959 -4092131 -611389 358489 -3052162
38176 -3052162 -5348474 -2666515 393944 -2629213 -10301650 -15188870 -13458439 -7948317
38168 -7948317 -2793689 699829 2950129 4278902 4693705 3656498 482932 -3563020
38160 -3563020 -4912814 -1521450 4112984 7793175 8213965 6755473 4475558 1952275
38152 1952275 607234 1225133 2207558 1949671 1606970 2634690 3239951 913078 -2823174
38143 -2823174 -4226425 -2899348 -1222370 787865 4720044 8051931 5504320 -2212157
38135 -2212157 -7020266 -4055863 1400478 1578900 -3334897 -7049573 -6310776 -3172142
38127 -3172142 -259402 1059141 -1046859 -7092788 -12710061 -11807504 -4537768 1893921
38119 1893921 2042677 -1532316 -2857053 -369560 2749491 4170486 4809974 5682742 5418253
38110 5418253 2667904 -355241 814839 7244375 13862173 14410374 8813872 3276973
38102 3276973 2442966 4103519 3603664 1127673 1129574 5207998 9247275 8762180 4600637
38093 4600637 1622347 2850847 6273720 7152459 2989025 -3706913 -7841637 -7203696
38085 -7203696 -4609161 -3809321 -4701902 -4432648 -2037492 633651 2053282 2223772 933494
38076 933494 -2020244 -4506716 -3366939 856051 3742189 3113500 2105556 3928164
38068 3928164 6594921 5897498 1427970 -3509787 -6375487 -6787937 -4939059 -1797771
38060 -1797771 196543 -270518 -1075673 90419 1548708 411280 -1760862 -857848 2556959
38051 2556959 3315119 -71443 -2614563 -697411 2206240 1198952 -2596034 -4455063
38043 -4455063 -3036353 -564584 1844615 4471559 5903640 4249135 1013294 -334534
38035 -334534 602979 1558712 2636035 6037090 10213290 9735403 3286218 -2973357 -3398857
38026 -3398857 -418497 -125870 -3331152 -5660394 -4776957 -2676689 -1380796 -794453 -981425
38017 -981425 -2502617 -3947883 -2973259 -583386 -410087 -2484892 -2108137 2653218 6576760
38008 6576760 4267657 -1651489 -4077525 -1236880 2179475 2951779 2948944 4040328 4590389
37999 4590389 3289320 2207065 2928427 3065414 355397 -2401498 -950132 3376454
37991 3376454 5096732 2889819 1496122 4017161 6940064 5686928 1540772 -932196
37983 -932196 -1237129 -3184214 -8212432 -12847226 -13866421 -12372283 -10744793 -8500429
37975 -8500429 -4157968 512649 1585568 -1775230 -5915082 -7077114 -5064685 -1865405
37967 -1865405 1245273 3848440 5157419 4433647 2115825 -686491 -3483492 -6321814
37959 -6321814 -8876517 -10461977 -10531250 -8587868 -4456185 478103 3363934 2715616 498443
37950 498443 -161987 1191369 2509470 2675300 2533114 2485820 1533777 -551698 -2280786
37941 -2280786 -2785773 -3207027 -4409732 -5058762 -3644378 -1053461 723558 1482055 2559543
37932 2559543 4322217 5615579 5432434 3818846 1561035 130693 1134899 4281319
37924 4281319 6625371 5675288 2751130 1269022 1974874 2155569 -124668 -3198385 -4130475
37915 -4130475 -2342589 99070 905224 -353849 -1926296 -1478636 1272860 3790759
37907 3790759 3584651 1319693 -407607 -755753 -967220 -1354105 -670696 1073423 1849301
37898 1849301 622542 -1206444 -2342063 -3167237 -3732349 -2869921 -749894 516981 594317
37889 594317 2058970 5394462 6398180 2386582 -2125159 -1056198 3893290 5438142
37881 5438142 1729533 -1055818 1691833 6635546 8246359 6051046 2761831 -755734
37873 -755734 -4385250 -5443053 -1283265 5648571 9309587 6788332 997291 -3219516
37865 -3219516 -3485573 -663005 2603726 3929480 3166275 2218418 2078289 1192925 -1811126
37856 -1811126 -5165333 -5786626 -3067825 1185376 5433793 8625147 9019714 6049096
37848 6049096 2776696 2953801 5464798 5279020 740684 -3637692 -3318243 359235 2682215
37839 2682215 1739544 -395027 -1272638 -531160 692219 1162622 573691 -114863 18683
37830 18683 73236 -1660198 -4537463 -5527639 -3334475 -347463 967665 1304489 2050152
37821 2050152 1822926 -1470096 -6385812 -8977138 -7706566 -4573570 -1595328 912233
37813 912233 2294067 909063 -3034256 -6151991 -5307897 -1458458 1352192 496039 -2712135
37804 -2712135 -4920105 -4404952 -2304704 -283720 1993936 5726625 9652665 10097874
37796 10097874 5444315 -1188271 -5318104 -5846541 -4810676 -3815960 -2902625 -2000112 -1122101
37787 -1122101 467147 3202889 5720536 6286012 5141981 3580968 1722723 -478150
37779 -478150 -1390319 -127844 323284 -3377647 -8647207 -9166204 -4145108 -92078 -1083053
37770 -1083053 -2517006 1341029 7770967 9184637 4282220 -261931 606762 4136633
37762 4136633 4837148 1880243 -1252393 -2268571 -2163967 -2377885 -2507480 -1687925 -506576
37753 -506576 66572 772855 2901856 5035907 3718007 -1338554 -5535938 -5405984 -3668863
37744 -3668863 -4443935 -5704851 -2191506 4798002 7312614 2247657 -3404396 -2417459
37736 -2417459 2874465 5429375 3935622 2663097 3526506 4342779 4140949 4868308 7451025
37727 7451025 10101428 10984835 9799493 7080211 4428900 4201856 6100331 5960155 1671017
37718 1671017 -1868046 1196646 8192988 10728316 6807494 3429630 5580281 9095759
37710 9095759 7703926 1946772 -3017441 -4800260 -4812236 -4375131 -3655844 -3215171 -3767442
37701 -3767442 -5047165 -6250352 -6326927 -3527800 2449108 7176931 4660342 -3903598
37693 -3903598 -8921163 -3894475 5386181 7999482 1765651 -5552474 -7674230 -6376790
37685 -6376790 -5950157 -6596989 -5932080 -3360859 21887 3643605 6786352 7200508 3339190
37676 3339190 -2337345 -4969426 -3035519 -561421 -2065655 -6494046 -8423937 -5172474
37668 -5172474 -97460 2300270 2051187 2149226 3232734 3173433 1183658 -1155354 -2918587
37659 -2918587 -4552867 -5457668 -4471268 -3150196 -4454257 -7278958 -6993023 -3190316 -1718583
37650 -1718583 -5805932 -10235379 -9023631 -4553087 -3128065 -4628353 -3477473 1653383
37642 1653383 6256369 8041987 9560703 11344450 9085073 989790 -6995645 -7459529
37634 -7459529 -280113 8038351 11672374 9618939 4608688 571752 23752 2031726
37626 2031726 3543538 3401012 3247292 3895506 3658942 1785313 527215 1407105 2161150
37617 2161150 517933 -1244533 603786 4886569 6522770 3863211 1007385 1732613
37609 1732613 4549024 5728773 4610484 3259616 2427526 914887 -1182601 -1441253
37601 -1441253 1371928 4490462 3841082 -905605 -5778308 -7200633 -5515085 -3069766
37593 -3069766 -684866 2032864 4015029 3149793 -337625 -3305197 -3542736 -2387390
37585 -2387390 -2176258 -2641472 -1678969 1179048 4060048 5349154 5191966 4105546 1810424
37576 1810424 -1454174 -3546683 -2122153 1996536 4443096 1509214 -5522327 -11401059
37568 -11401059 -12512723 -10250433 -8037215 -6411053 -3113818 2297442 6492919 6291777
37560 6291777 2996819 1038629 2757793 6010229 7016506 4456162 397913 -2025222
37552 -2025222 -1388757 1052203 2641256 1780278 -585209 -2199725 -2390354 -2956901 -5310823
37543 -5310823 -7531064 -6287491 -1963355 600677 -1871478 -6406489 -7759620 -5503368
37535 -5503368 -3512603 -3151198 -1664157 1853714 3922985 2612714 1384818 3145912
37527 3145912 4470915 989496 -4380675 -4896419 -326814 2891496 1885074 691352
37519 691352 1647657 508514 -5741084 -11824732 -10626273 -3465871 1711099 836233 -2702333
37510 -2702333 -4414529 -3840136 -2611766 -1239859 534251 2477295 4345994 6183210
37502 6183210 7153484 5267990 -477895 -7811335 -11840591 -9047202 -1395593 4326594
37494 4326594 3017813 -3080946 -7317621 -7018104 -5742883 -6478585 -6746473 -3181004 2542589
37485 2542589 6273021 7469149 8391797 8826564 6481539 2353818 996702 4406348
37477 4406348 9144208 10687885 7994772 3145990 -813177 -1121473 2777073 7726559
37469 7726559 9648500 8226968 6343648 5097138 3011952 468930 371648 2766861
37461 2766861 3242418 -575778 -4805940 -4970424 -2474593 -1406637 -1771385 -846653 559541
37452 559541 -1188881 -5824315 -8544102 -7230967 -5456003 -6074802 -6160591 -2009472 3682935
37443 3682935 4339783 -1375432 -7121790 -6591859 -555332 5545138 8501750 9034267 8049815
37434 8049815 5058087 934963 -1195816 -59283 1075618 -1438933 -6209953 -8609650
37426 -8609650 -7169189 -4726282 -3299796 -1687278 737178 1564801 -872294 -3879330
37418 -3879330 -3461541 324444 3523165 3052112 -517599 -4319871 -5845554 -4727611
37410 -4727611 -2808452 -1827311 -939537 1861788 5841466 7783561 6846404 5779419 5879891
37401 5879891 4733825 1481078 -95796 2176082 3681865 -150334 -4929842 -2335084
37393 -2335084 7107255 13612529 11053771 3541892 -2312463 -5189777 -6607269 -6555772
37385 -6555772 -5041715 -3452932 -1362438 3682309 10413330 12872606 8838024 4281754
37377 4281754 4843283 7490566 6304914 2591138 2370925 6171517 8461580 6545895
37369 6545895 3410854 1422682 -700985 -3417573 -4200434 -1836820 1089614 1721913
37361 1721913 -146788 -3441021 -6704231 -7124392 -2620844 4065101 7225681 5352033
37353 5352033 2637338 2151807 1911042 -284029 -2609795 -2907110 -2781352 -4360948 -5995026
37344 -5995026 -5076211 -2816569 -2227152 -3010505 -2381729 113069 2322967 3382077 4390138
37335 4390138 5545214 5877693 5733753 6347473 6836595 4876429 960437 -1176667 373430
37326 373430 2912067 3057842 1195757 -23350 98596 122361 -220817 826953 4067665
37317 4067665 7491540 8729153 8246509 8380046 9502698 9226466 6258958 3154784 3250592
37308 3250592 5937340 7495157 6354718 4726071 4464799 4285661 2694414 1150129
37300 1150129 1833863 3866175 4404425 2724001 772281 -12795 -188568 -520549 -633846
37291 -633846 83106 1515841 3098046 4162504 4036890 2684599 1207109 1011254 2622407
37282 2622407 5586073 8674182 9742799 6938155 1288503 -3344148 -4414927 -3258594
37274 -3258594 -1808221 891180 5618375 8427128 4311108 -4411565 -8641557 -3556653
37266 -3556653 5123640 8932005 7085343 5058581 5397174 5246364 2488524 -854242
37258 -854242 -2614816 -3610576 -4562140 -3505412 421237 3273377 718224 -4942368 -6812293
37249 -6812293 -2871435 1134005 19892 -3920252 -5615822 -5274747 -6791951 -9795133
37241 -9795133 -8880507 -1462290 8085485 13681043 13570686 9767378 4857182 1262095
37233 1262095 678495 1935020 1661222 -1024828 -2851071 -1215532 2013551 3728740
37225 3728740 3912624 4164564 4508436 4517296 5067463 5871934 3946083 -1761414 -6661246
37216 -6661246 -5662056 -84151 4689204 6326410 5730931 2571048 -3407622 -8133154
37208 -8133154 -6934529 -2140994 -349327 -2136203 -1865102 1325182 758534 -6179692
37200 -6179692 -11432820 -6901820 3754532 9987353 7540686 1349281 -2327560 -1879283
37192 -1879283 84416 -368809 -4612268 -8431409 -5741902 2591995 7908138 4950830
37184 4950830 -842084 -1876063 529057 -58560 -4005668 -5867724 -4079945 -2800039
37176 -2800039 -4222447 -5830914 -5803951 -4966545 -2711846 2716281 8561158 8529161 1961142
37167 1961142 -3453845 -1339582 5346068 9096551 6942060 1628018 -3054084 -4825143
37159 -4825143 -3155952 135114 2063311 2034912 2369740 4157833 5317768 4191884 2005339
37150 2005339 8004 -2519586 -5220424 -5075145 -776216 4276407 6396038 6249242
37142 6249242 5996452 4886722 1638097 -1464700 -1451787 214661 84262 -1155045 3162
37133 3162 3231884 4334650 2056256 -122807 128771 1109166 1489632 2861260 5523766
37124 5523766 5973336 1942956 -3105413 -4147171 -1315048 989594 542754 -510600
37116 -510600 241017 2114717 3083024 3209205 4742287 8627405 11947537 10597038 5146129
37107 5146129 1812465 5145943 11497322 13587697 10633224 8781044 10903465 11952754
37099 11952754 7325833 449100 -2454968 -945271 1416641 3772080 6738938 7220372
37091 7220372 1806726 -5450150 -6105929 951579 7581292 7841169 4862053 3743353
37083 3743353 3953672 2763512 900720 47960 -1144578 -3781989 -5065402 -2895654
37075 -2895654 -926271 -3427851 -7514518 -6610823 -472517 4422868 4512144 3331944 4892866
37066 4892866 7987836 9343939 8706096 8274340 9344021 11307688 12425940 10658647
37058 10658647 5397169 -898977 -4257304 -2893069 1548019 5886701 7263128 4436109
37050 4436109 -501784 -2922349 -858761 1837806 643538 -2765126 -2836555 1529480
37042 1529480 5553191 5376265 1832813 -2668420 -6390641 -7125499 -3828220 -125174
37034 -125174 -1025653 -5205327 -6186187 -2439009 231044 -1278677 -2104501 1670943 5598104
37025 5598104 4089736 -569900 -3038808 -4034360 -7177231 -10235188 -7775183 -927373
37017 -927373 3471177 3197064 2716656 4464944 5329510 3668827 3245259 6908929 11273938
37008 11273938 11339978 7233613 3263614 2436028 4252815 6286474 6159386 3197302 -829416
36999 -829416 -3659340 -5319587 -7318931 -9334498 -9127398 -5997221 -1921656 1187660
36991 1187660 3142760 4060893 3653955 2521602 2023347 2264365 2069057 1251976 900278
36982 900278 1089588 422865 -1587160 -3404231 -3197384 -437018 3990018 7853213 8580486
36973 8580486 6150245 4069917 5172022 7591711 7842447 6612931 7476495 10327112
36965 10327112 10816080 7213382 3434467 3301129 5339717 5732086 3844319 2215409
36957 2215409 2506644 3626906 3418409 1114074 -1762491 -3032671 -2702603 -2984916 -4543260
36948 -4543260 -4809785 -2100506 1075088 2032424 2661889 5621396 8012917 4903546 -1764024
36939 -1764024 -4536741 -1315544 1802561 237941 -2892262 -2952177 -300489 2712316
36931 2712316 6072315 9622696 10645276 7847261 4293359 3126188 3805780 5251946
36923 5251946 8435257 12606234 13456135 9105771 4029749 2948864 4530203 5117671
36915 5117671 4682520 4680187 4142141 2790466 3839339 8212177 10299511 6017092 1038524
36906 1038524 3145637 9468738 10374658 4635091 1122977 4773056 10141223 11464305
36898 11464305 10791035 11992435 13506547 12232727 9857191 10024154 12102539 12273343
36890 12273343 9155573 4948822 2161235 1667967 2852033 3728207 2135095 -1486627
36882 -1486627 -3576521 -1203066 4441052 9351734 10901856 10019604 9529422 10524512 10602071
36873 10602071 6945129 1392905 -215355 4487991 10536330 12276166 10913678 11051993
36865 11051993 12413540 11134700 7990816 8186772 12337231 14706472 12510081 10274360
36857 10274360 11542117 12381434 8049168 1426395 -860179 2132495 5431133 5592749
36849 5592749 3519629 792797 -2233853 -4559451 -4425249 -1896998 747173 1809560
36841 1809560 1917578 2799715 5226340 7992956 8593195 5690219 1017411 -2513114 -4357704
36832 -4357704 -5772228 -6032502 -2873750 2545966 5367005 3711853 1561827 2274347
36824 2274347 3469174 2144022 805408 3325164 7672903 8668539 6237526 4909633
36816 4909633 5904773 5868567 3752665 2948410 5152997 7373197 7027248 5525101 4748551
36807 4748551 4272070 4295812 6925411 11567138 13180476 8963241 3502621 3038096 7089507
36798 7089507 10235852 10347537 10132309 11206674 11541261 9467119 6265494 3645410 1814660
36789 1814660 1144296 2768922 6133705 8566039 8887158 9161833 11135418 13045112 12054846
36780 12054846 8263044 4226074 1838415 1764389 4639221 10180579 15640157 17709745
36772 17709745 16161090 13755212 12586322 12299271 11705225 10058205 6761871 2144576
36764 2144576 -1225713 -575102 2998147 5088787 3788537 2245567 3701529 6727154
36756 6727154 8112601 8238622 9934757 13169206 14864020 13984134 12925516 12848672 11320889
36747 11320889 6884623 3190616 5232530 12422950 18439735 18192110 12702556 6520484
36739 6520484 2459912 416682 -107554 1187467 3907868 6330986 7359532 7859708
36731 7859708 8931827 10090459 10692411 11858074 14509716 16272537 13647761 7683885
36723 7683885 4036094 5854511 9693788 10732835 9298329 9165978 11452663 13772177
36715 13772177 14405781 13887182 12842500 11284507 9893108 9335264 8625653 6787364 5498292
36706 5498292 6897995 9297495 9057817 7009953 8513563 15371545 21618514 20367587
36698 20367587 12522402 5753432 5907734 11614914 16883039 17553627 15184013 14740028
36690 14740028 18194516 21654117 20629298 16665393 15308652 18182512 21465105 22522465
36682 22522465 23062567 24265460 24086561 22217056 22657927 27272079 31136073 29272698
36674 29272698 24452379 22767764 24445474 25446941 26042810 30240533 36949937 39527237
36666 39527237 35996823 32768762 34824565 38149514 36660200 32319520 32772234 41022299
36658 41022299 52427855 61118456 65228924 66046945 65885772 67570406 73134650 81877327
36650 81877327 91419174 101089702 112375461 125611939 138566993 149736052 161406243
36643 161406243 177492776 198827847 222097089 243275996 260726728 274703404 285238927
36636 285238927 291593338 293182402 289862746 281212489 266534036 246339864 223647309
36629 223647309 203038809 187644903 176588486 165720624 151854694 136676829 125580076
36622 125580076 121869006 122993986 123613186 121355557 117751043 114418445 111406152 109672097
36614 109672097 111787809 118130980 124788797 127900323 128707089 131778494 139131852 148466367
36606 148466367 156468716 161488997 163656300 165016356 169053392 177030959 184934324 187541640
36598 187541640 186062177 187747818 196111708 205411212 208162173 205205157 203838875 207349706
36590 207349706 211415168 211383226 208352102 205684079 203090405 197774892 189557941 181019980
36582 181019980 173085411 164221520 154587271 147276830 143484674 139442740 131216283 120640146
36574 120640146 112899916 109127378 105413107 99410607 93733146 91218049 90657174 89929195
36566 89929195 90096138 92603737 94717656 92353108 86521977 82238846 80886807 78545058
36558 78545058 73245769 68952568 69144280 70329234 66524263 58156654 51573469 49928881
36550 49928881 49173821 44529153 37410855 33394662 35145515 39793082 42644339 41641485
36542 41641485 38258966 35338004 34328641 34124772 32605487 29442471 26740934 26426978
36534 26426978 27788016 28500213 27540736 26050965 25681684 27144612 30055513 32926835
36526 32926835 33531351 30909559 27263468 26108753 27766118 28357214 24637484 18528227
36518 18528227 15065057 16556103 20656096 24011123 25829256 27261956 28751954 29175570
36510 29175570 27284674 23429906 19792362 18685105 20294887 22445375 23060173 22370052
36502 22370052 22062999 22927143 24309218 25330161 25517482 24777458 23968354 24852463 27901417
36493 27901417 30655100 30111310 26555478 23221101 22325201 23302055 24666509 25384447 24549470
36484 24549470 22253712 20840626 22504205 25465225 25735562 23063912 21264091 21663368
36476 21663368 20781440 16662548 12780569 12239440 12592719 10993980 10273856 13756845 17251478
36467 17251478 13873591 5630353 1955737 5799400 9292019 6216644 1304098 2024276
36459 2024276 7028459 9408127 7838754 7304564 10006256 12336434 11655807 10391736
36451 10391736 11225612 12444065 11045702 7773483 5830600 5791411 4843033 1401119 -1748636
36442 -1748636 -480353 5018682 9214654 6846553 -1044518 -8127874 -9793046 -7350527
36434 -7350527 -4650957 -2875750 -774984 1680081 3112428 3819328 5710247 8444662
36426 8444662 8708563 5027179 783576 34067 2075187 3047367 1984897 1949657 4835082
36417 4835082 8183139 8785052 7260708 6741988 8005858 8385707 5765214 1677664 -732139
36408 -732139 -745924 -449777 -1122701 -981555 2167067 6991457 9551963 8444856 6630498
36399 6630498 6624845 6172247 1717951 -5089146 -8348284 -5670988 -1121624 898685 934660
36390 934660 1460376 2338581 2770237 4656863 9419491 13447525 11923449 6463467 3667357
36381 3667357 5799933 8208898 7175197 4929317 4414032 4133151 2115434 1053865
36373 1053865 4592711 10735534 13820561 12164851 9385651 8240191 7244375 4354595
36365 4354595 734403 -882672 293905 2723466 4553750 4873691 3653979 1599267
36357 1599267 107966 547144 2789164 4650809 4054321 2266181 3177955 7681427 10721270
36348 10721270 7148391 -731231 -5656813 -5099978 -3488106 -4156036 -4925439 -3942590 -3801302
36339 -3801302 -5699678 -5066888 1141802 7216485 5845634 -388993 -2438568 1578569
36331 1578569 4299773 1198651 -3253587 -4000025 -2869577 -3348696 -3270913 1682237 9831423
36322 9831423 14097793 10576686 3143211 -1229767 -48083 2822065 2627963 -151172
36314 -151172 -1169210 450668 164303 -4144369 -6813611 -2261059 5046398 5904221 400792
36305 400792 -2013637 2374885 5550857 1001086 -5296965 -3976257 3358043 6911661
36297 6911661 2895228 -2891758 -4887539 -4136638 -3818706 -4094368 -3753354 -3373992 -4351580
36288 -4351580 -6477695 -7970130 -7102346 -3518121 1128814 4030860 3845741 2253725
36280 2253725 2021378 4014987 6863059 8613426 7828992 4331934 158027 -1412973
36272 -1412973 772483 4237879 5809668 4881408 2865589 1206817 1330034 4540962
36264 4540962 9891130 13721625 13511901 10893302 8928941 8150646 7746103 8805812 12844803
36255 12844803 17904999 19882133 18194241 17261673 21642559 31913695 45754148 60503876
36247 60503876 73411378 81402998 82591162 77554296 68209115 56033761 42356295 29849240
36239 29849240 21986621 19834564 20042306 17842912 12536192 8129939 7378800 7568658
36231 7568658 4896380 935012 445616 3560552 5203684 2872568 -229875 -1484888
36223 -1484888 -2863010 -5658392 -6424365 -2629003 1865913 2294802 742490 2565281
36215 2565281 7284867 9386699 7339148 5542060 6823165 8681365 8473005 7519297
36207 7519297 7846159 8403026 6861017 3020448 -1029254 -2638290 -264467 4682906
36199 4682906 8063260 7519717 6036594 7851807 11731998 12553017 9211249 5804661
36191 5804661 4227937 1351537 -4057623 -7168270 -4073904 1120224 1326424 -3663524
36183 -3663524 -7329336 -5490592 -649032 2819795 3724983 3163839 1739598 -368978
36175 -368978 -2267409 -3071277 -3081536 -3029097 -2592128 -832962 1849766 3321192 2062790
36166 2062790 -600084 -1740127 -293130 1940299 3012467 2924056 2153290 55535 -3312523
36157 -3312523 -5314897 -3486912 432337 2113613 310642 -1940968 -2232410 -1835134
36149 -1835134 -2599339 -3617193 -3037458 -1127226 815630 3073424 6382429 9033240
36141 9033240 8036018 3527220 -463227 -815844 870627 893747 -1307900 -2723947 -1386159
36132 -1386159 1039380 2225565 2491909 3156818 3420239 1923966 471169 2430879 7194832
36123 7194832 10106241 9058093 7230298 7299168 7080436 4250429 1650078 3157467 6724391
36114 6724391 6819707 2734154 -678773 -303958 2157978 4802044 8172840 11781840 12444663
36105 12444663 8677324 3658114 1253561 1259170 871016 -687898 -1234962 1155551 5299909
36096 5299909 7519742 5470973 1596116 1152138 5443389 9268669 7825169 3755316
36088 3755316 2983266 5323708 5141331 1146762 -1213452 921232 2525655 -1367595
36080 -1367595 -7398660 -8572924 -4105939 464185 1365878 187239 -148114 894509
36072 894509 2310369 3514261 4534531 5370851 5504993 3909278 305478 -3444018 -4649665
36063 -4649665 -2989224 -890461 -339711 -1060426 -2102234 -2900257 -2184994 1486885 6927167
36054 6927167 10316454 9147019 4295515 -2006445 -7394162 -8509290 -3288410 4377822
36046 4377822 6693954 1290072 -5323340 -6490841 -3689493 -2441470 -3694043 -4129675
36038 -4129675 -2610961 -1103582 -144121 2017920 5798405 9332816 11240674 11668983
36030 11668983 10821034 8750725 6233708 4040959 2169792 1173155 2496290 5770287
36022 5770287 8042401 7812364 7129850 7139709 5015969 -734499 -5238258 -2964431 3547888
36013 3547888 6516225 3546658 -452897 -1909279 -2992522 -5954241 -8494883 -7541323
36005 -7541323 -4001961 -1166147 -773856 -2420747 -4684329 -5437888 -3027675 1617024
35997 1617024 5519621 6868715 6286394 5053456 4003911 3916750 4803704 5109790 3870113
35988 3870113 2950539 4364781 6216889 4903583 989466 -1128741 307363 2352961
35980 2352961 2518206 1876075 1627067 466877 -2500344 -5294001 -5666050 -3909670 -1547459
35971 -1547459 518552 1388925 208622 -1994117 -2964755 -2612757 -3000025 -4224816 -3739025
35962 -3739025 -964190 1135826 882108 570065 2053444 3247350 1843111 -742292
35954 -742292 -2166045 -2845101 -3553012 -2335415 2210298 6869357 7170750 3322600 -831401
35945 -831401 -3183532 -3975409 -2740027 961734 4604951 4820293 2242166 494663 740316
35936 740316 1118336 1166284 2310853 3747249 2608670 -583780 -1162213 3019189 8036023
35927 8036023 9340490 7401601 5452212 4754248 4988236 6648181 9729697 11879078
35919 11879078 10934532 7944501 5103253 2407053 -843659 -3146822 -2909958 -1948325
35911 -1948325 -3018615 -5048673 -5099409 -4131949 -5638383 -8556471 -7465911 -1365211 3594969
35902 3594969 2988117 239156 -79978 125934 -2896980 -6636491 -5706901 -1074485 1203418
35893 1203418 -393275 -1448394 -1629 630672 -1223810 -2429526 -1074456 260212
35885 260212 -187053 -586647 -884650 -4602938 -11259037 -13399466 -6901041 1227558 2069572
35876 2069572 -2579688 -4195917 -610968 3041878 4133950 4534244 3689217 -1230335
35868 -1230335 -7446441 -7551916 -691694 5051983 4525253 2386662 4121116 7095733
35860 7095733 6058992 2151922 338952 1617127 3622308 6133253 10088413 12883295
35852 12883295 10430718 3658300 -1662174 -1934793 785906 2552320 2017846 902945
35844 902945 1794755 5327917 8567919 7530854 2480938 -1442293 -622754 2594478 4183793
35835 4183793 4132966 4478552 4558944 2744478 774033 1205338 1845961 -1634754 -7899927
35826 -7899927 -10720742 -8339129 -6040985 -7339588 -8423382 -5018697 54350 1016900
35818 1016900 -2411610 -5751890 -6888677 -7273343 -7111397 -4866986 -1885129 -2104777 -5370419
35809 -5370419 -5872066 -398485 5762009 5463633 -311314 -4081984 -2360501 833315
35801 833315 1365728 456117 462485 -83143 -3233591 -6412360 -5032139 763046 5791968
35792 5791968 5931316 1599818 -4176737 -8149349 -7925469 -3958231 -264124 -211199 -2134542
35783 -2134542 -2323027 -1257600 -2374195 -5150672 -5068267 -1365059 1054083 -279824 -1032432
35774 -1032432 2673428 7599077 8509951 6028731 4407240 4403290 3503736 1269467 -368336
35765 -368336 -750627 -193006 2275507 6457638 8171240 4186174 -1318970 -1160634 4354618
35756 4354618 7625506 5191456 2429651 4379294 7844176 6891201 2049711 -956829
35748 -956829 402030 2871289 2709019 92827 -2172088 -2068577 197396 2971810 4783437
35739 4783437 5473068 5710011 5567299 4302480 1670327 -1302265 -3088127 -2808907 -901358
35730 -901358 830120 548499 -1365479 -2444100 -1782048 -2099038 -5957190 -11159865 -12971891
35721 -12971891 -10472030 -7447244 -6838920 -7597750 -7611214 -6306647 -3212830 2515710 9114061
35712 9114061 11895430 8741107 3708010 2263934 4507250 6043645 4451207 1613967
35704 1613967 -226989 -1630094 -4047534 -6720856 -7102807 -3959079 867773 4008592
35696 4008592 3756229 1522937 -20356 111171 687529 327846 -831781 -1450029 -119561
35687 -119561 3508924 7635748 8813074 5300101 -55275 -2193084 431176 4192517
35679 4192517 4825361 1755167 -2723116 -6499124 -8655937 -9186508 -9188430 -10107447 -11615585
35670 -11615585 -11506149 -8769559 -5351848 -3630170 -3504258 -3231610 -1771666 880180
35662 880180 4052560 5731621 3486044 -2006018 -6181744 -5721503 -2899500 -2212994 -4196169
35653 -4196169 -5789955 -5690513 -5405180 -5241946 -3474281 -423276 516401 -2222112 -5583852
35644 -5583852 -6186445 -4778577 -3970939 -3876436 -3062398 -2199665 -3285955 -5808352 -6937087
35635 -6937087 -5699911 -4075128 -3331999 -1973807 1434713 5472111 7419252 6307081
35627 6307081 3285584 202074 -1215714 -196967 1827546 2130827 39602 -2104663
35619 -2104663 -2597428 -2848893 -3993190 -3344508 1922364 8709273 10287496 5138858 -912235
35610 -912235 -2838023 -2341167 -3079044 -3999492 -1624026 3439340 6848571 6584219 4715898
35601 4715898 3255451 1754197 -540132 -3045481 -5025473 -6167275 -5678354 -3019981
35593 -3019981 223227 1401362 -48320 -2498368 -4826609 -6584409 -5974333 -1474614
35585 -1474614 4027680 5053947 1278040 -742635 3380965 8785035 7750179 828132
35577 828132 -3737891 -1323864 3517443 4240876 728753 -2439920 -3310789 -4117825 -6148485
35568 -6148485 -6995894 -4562971 -1265295 -1385895 -4911470 -6887574 -3655707 2618363
35560 2618363 7120000 8093573 7181023 5596186 3036820 94091 -1288709 -430119 1322447
35551 1322447 3064279 5268708 7386503 6916280 2519370 -3479763 -7125923 -6251195
35543 -6251195 -1154209 6239788 12560769 14225660 10621314 5173320 1550826 -401784
35535 -401784 -3291669 -7457681 -9741911 -7422437 -2049205 1684124 910095 -2193724
35527 -2193724 -3032543 -401378 2068562 1330679 -469799 443582 3113122 3291864 721882
35518 721882 -100266 2514612 4273288 1846837 -1631813 -1753054 207285 13470 -2435555
35509 -2435555 -3514115 -1947944 -27975 622810 649714 657545 552238 768672 1337921
35500 1337921 683304 -1670659 -2644967 353903 4250640 3752693 -632893 -3089270 -1275902
35491 -1275902 595136 -1129404 -4165261 -4405214 -1653445 1292918 2398765 1070517
35483 1070517 -2232185 -5042735 -4125098 311967 4014970 4083750 2362934 1609959 1429603
35474 1429603 783987 1550500 5646893 10401336 11054237 7466101 4506635 5192159 6654558
35465 6654558 4473377 -1075705 -5207618 -4568659 -1197760 362942 -977910 -1806616
35457 -1806616 287341 2593770 1201109 -2649498 -3995565 -1627146 224711 -1315196
35449 -1315196 -3622294 -3449392 -2044295 -2159912 -3013787 -2044481 349184 1670553 1670204
35440 1670204 2212381 3511814 3853756 2853553 2142440 2786754 4244651 5683886 6489364
35431 6489364 6069097 4868993 4473976 4894711 3508857 -863789 -4901299 -5090561 -3173885
35422 -3173885 -3239102 -4990645 -4802866 -2507208 -1472738 -1808790 409594 5554022 7937590
35413 7937590 3891290 -2474575 -5223694 -4438663 -4146679 -5427391 -5880736 -4253456 -1879726
35404 -1879726 -423732 -810802 -3206549 -5857453 -5589812 -1742456 2205443 3234013
35396 3234013 2826052 3669198 4671719 2881530 -1262313 -4342927 -4630183 -3067890 -788091
35387 -788091 1079683 610827 -2112000 -2878373 1526400 7204961 7212007 1302974 -3683292
35378 -3683292 -3280777 416573 4662514 9681481 14056838 12748243 3975803 -6202804
35370 -6202804 -10332505 -7431371 -1348645 4777298 8649170 7560489 2152500 -1524532
35362 -1524532 1038358 6030497 6612039 2761204 38849 202340 -291152 -2741101 -3944496
35353 -3944496 -2555432 -1543977 -2453276 -2832837 -1771924 -2593144 -6765879 -9830111 -7320381
35344 -7320381 -1150435 3677932 5514142 5438511 3459565 -98363 -1882782 774449
35336 774449 4776575 4673329 409332 -2943580 -2799178 -1518651 -854716 981519 4845500
35327 4845500 7561203 6217785 2657099 650419 511323 -532587 -3651575 -6783310
35319 -6783310 -7419535 -4999275 -610024 3950612 6653634 6338920 3981010 1961267
35311 1961267 1543762 1709929 926675 -688776 -1842070 -2197681 -2616433 -3013154 -1694285
35302 -1694285 1811265 4698524 4104573 1782031 2380520 6526344 9179751 6824129
35294 6824129 2859277 2409345 4395055 3455162 -1415752 -5346774 -5083516 -2981538 -1894090
35285 -1894090 -759657 1789623 3277030 850492 -3467536 -5125980 -3429181 -1764532
35277 -1764532 -2046054 -2677410 -2214439 -1527296 -1360629 -720385 862101 1889647 1535171
35268 1535171 1804448 4756809 8562516 8858314 4321696 -1051606 -2408535 275516
35260 275516 2668810 2200572 1550076 4326021 8817201 9442433 4784853 392913 1232253
35251 1232253 4530421 4081218 -280529 -2569210 180243 3987814 4806560 4369650 5857783
35242 5857783 7622821 5871939 1535796 -409168 1938668 5170259 5840017 4343428
35234 4343428 2704274 1804065 2090245 4011180 5980914 4639617 -473841 -4662344
35226 -4662344 -3401962 1331598 3207696 -237535 -4520969 -4159613 633909 4751908
35218 4751908 4383517 670768 -2521697 -2946800 -1403485 365660 1862747 3408245
35210 3408245 4484676 3956002 2077039 962590 2257954 5142388 7449005 8103348
35202 8103348 7581596 6556590 5192256 3521226 1518302 -1080502 -4095854 -6097963
35194 -6097963 -5323634 -1798100 2043121 3290504 1084560 -2715434 -5295707 -5586815
35186 -5586815 -5225279 -6289284 -8195482 -8138720 -5107953 -1851433 -1480984 -3411023 -4535369
35177 -4535369 -3552976 -1943122 -1110102 -1009577 -1727353 -3920845 -6886408 -8277514 -6837688
35168 -6837688 -3800299 -718480 2271078 4919539 5619721 3554325 674567 -543883
35160 -543883 -439409 -1182370 -2969556 -3442807 -1191139 1990640 3192953 1747884 -275727
35151 -275727 -514637 1238700 2985857 2825939 1127631 -58927 296437 1028145 701851
35142 701851 -363747 -947570 -958266 -1301814 -2039173 -1959187 -178128 2620079 4711384
35133 4711384 4684852 2434794 -698559 -2936419 -3580042 -3241087 -2381741 -464346 2769148
35124 2769148 6019353 7569014 7282969 6403175 5623416 4392080 1979479 -1603146 -5414645
35115 -5414645 -7423025 -5239277 1298023 8351097 10792842 7461980 2447184 391959
35107 391959 1739305 3600780 4073355 3952388 4616770 6118583 7816370 9399893 10352777
35098 10352777 9483914 6272490 2136585 -856108 -2154809 -2410677 -1738433 -358948
35090 -358948 -520972 -4551565 -10122472 -11110690 -5633024 79959 -464495 -5096198 -6877375
35081 -6877375 -4876676 -4523626 -7522802 -8925025 -6295415 -4342009 -6140017 -6527408
35073 -6527408 -695723 5917649 4548688 -2965863 -6032276 -652644 5536441 5108074
35065 5108074 76576 -3785670 -5302072 -6221922 -6205549 -4431510 -2950952 -3896043 -5659100
35056 -5659100 -5833261 -5796713 -8243953 -11906963 -13163725 -11906441 -11301637 -11894673 -10472974
35047 -10472974 -5727474 -1061656 92406 -1255189 -2021940 -1589349 -1514728 -2243364 -2773498
35038 -2773498 -3002198 -3880739 -5061975 -4688982 -2460713 -1030460 -2705502 -5921080 -7026056
35029 -7026056 -5090158 -2686128 -1812262 -1687769 -1634456 -3318187 -7666550 -11632419 -11412941
35020 -11412941 -7963244 -5697273 -5823021 -4921648 -1209854 1695212 -192528 -5239872
35012 -5239872 -8447692 -8121104 -7020554 -7390465 -7929368 -6278624 -2278131 2285414 5755256
35003 5755256 7335308 6581161 3433068 -1069610 -4826968 -6177243 -5465303 -4476605 -3915616
34994 -3915616 -2284215 1783889 6892831 10170665 10769095 10220095 9473497 7885845 5567029
34985 5567029 4244535 4657024 5224327 4611667 3533502 2590291 744739 -1938891 -2536504
34976 -2536504 594707 3788938 2158433 -3091141 -5725423 -3173504 210783 151956
34968 151956 -1398869 -252511 2835005 3241297 -278943 -3672006 -3527766 -1387660 -430979
34959 -430979 -681687 -115169 1311034 1965327 2154228 3883028 6512005 6188563 1439998
34950 1439998 -3609012 -4374235 -2037807 -1327821 -3508603 -5469307 -5319182 -4653706 -4541602
34941 -4541602 -3347729 -334038 2116960 2353250 2544351 4905277 7310924 6442577 3782676
34932 3782676 4142492 8236999 10838685 7765787 1571083 -2054035 -1579860 -509845
34924 -509845 -1569441 -3080078 -2401213 -814701 -2170040 -6917777 -10523060 -9306535
34916 -9306535 -5521963 -4176508 -6428467 -9175721 -10132976 -9647247 -7770636 -3711040
34908 -3711040 1005514 2889823 1502832 252149 411216 -1293163 -6251966 -9552576
34900 -9552576 -6390197 457855 4573898 4700328 3997359 2516829 -2638669 -9530319
34892 -9530319 -10814303 -3598463 5395991 8028209 4416155 840421 718996 1763140
34884 1763140 1042702 -964473 -2137235 -2178355 -2723631 -4452927 -5406362 -3248807 981912
34875 981912 3081674 635756 -3749161 -5776986 -4624017 -2677699 -1511753 -984677
34867 -984677 -1424236 -3263155 -4623685 -2823129 1083636 2554071 -548981 -5170370
34859 -5170370 -7351468 -6611365 -4740496 -2878828 -1529777 -1360815 -2246656 -3017497 -3240559
34850 -3240559 -3638418 -4136447 -3614109 -2137692 -903242 502432 3519262 6577351 5839509
34841 5839509 1666079 -391719 1962843 3248061 -1215054 -6646251 -5388369 514825
34833 514825 1181555 -6676536 -14615251 -13811830 -5461758 3128412 7609467 7862469 4441172
34824 4441172 -1270281 -5527644 -5452906 -2969027 -1997235 -2641475 -1843984 678425 1339171
34815 1339171 -1607887 -4867587 -4460498 -725962 3072548 5202367 6215009 6505141
34807 6505141 5634473 3869314 2467954 2278535 3257930 5084283 6906207 7000871 4518443
34798 4518443 1307337 -98578 -193679 -1557775 -3903139 -3531375 632191 4001104 2458779
34789 2458779 -1289850 -1752214 765412 839846 -2977569 -5318057 -2031092 3713614 6437406
34780 6437406 5791025 5141101 5286348 4045565 1130396 -824632 -483734 270535 -384926
34771 -384926 -1481717 -975611 1492522 4522239 6403956 6044755 3727069 1546361 1801764
34762 1801764 4137695 5338207 2861344 -2162351 -6221292 -7090908 -5523785 -3835130
34754 -3835130 -3551975 -4183817 -3784344 -950558 3392676 6507644 6432339 3716821 458509
34745 458509 -1670886 -2049893 -748977 1378745 2807275 2826194 2721753 4107520 6103495
34736 6103495 5944364 2976396 70102 -434905 -427231 -3213528 -8004049 -10274079 -7724530
34727 -7724530 -2826400 1346859 4549076 6841509 5944036 553309 -5529519 -6433097
34719 -6433097 -1019820 6288914 10980305 11653591 8387713 2106579 -3655081 -4461900
34711 -4461900 -499928 2749441 1615348 -744433 911499 6429862 10613215 9652918
34703 9652918 4411641 -1678776 -5418129 -5445674 -3509179 -3277478 -5667031 -6794248 -3458554
34694 -3458554 1048080 821517 -3897188 -7091018 -6543580 -7115533 -11869824 -15525055 -11755672
34685 -11755672 -3385168 825796 -1745885 -4748032 -2653889 1991033 3297491 -78013
34677 -78013 -4782992 -7876490 -9002465 -8882881 -8213206 -7324560 -5334289 -884800 4760093
34668 4760093 7387751 5079890 1819506 2403804 5208445 4458300 -699738 -4556966
34660 -4556966 -3457065 -911795 -1311097 -3039552 -2137207 456381 637079 -1390220 -888880
34651 -888880 3820340 8315154 8154561 4316363 485779 -2227575 -5192993 -8480333
34643 -8480333 -10007232 -8585730 -6117474 -5747039 -7978218 -9561104 -7448111 -3572378
34635 -3572378 -3327375 -8179218 -12469049 -10146656 -2452946 4628322 8655223 11606821
34627 11606821 13373527 10550708 3276281 -2381467 -2173495 401065 -368527 -4370882
34619 -4370882 -7349069 -7871480 -7769712 -7121343 -3967205 795814 2778858 -103748 -4282408
34610 -4282408 -4867802 -1574863 1387973 671392 -2149665 -2202869 2892369 9369933 10912560
34601 10912560 6176733 608078 -448341 1970549 3336666 2484685 1898374 2319827
34593 2319827 1482947 -1263535 -3108056 -2291622 -1258102 -2753168 -5006161 -3929129
34585 -3929129 725159 4432817 3567077 -337197 -3214037 -3722564 -3901152 -5178350 -6218324
34576 -6218324 -5676161 -4970162 -6029846 -7329334 -5152314 795116 5783674 5509498 1196647
34567 1196647 -2419675 -2718759 -970289 391199 179539 -1472366 -3612765 -4727590
34559 -4727590 -3477804 421639 5962112 10961359 12767537 10400688 6284973 4119579
34551 4119579 4506675 4664385 3078402 1726491 2203431 2519091 323012 -2898610 -3791749
34542 -3791749 -1720309 1385176 4146366 5638831 3772430 -2379808 -9293899 -11833734
34534 -11833734 -9442406 -6234884 -4897809 -3933936 -1466915 1578356 3276616 3124712
34526 3124712 1609354 -539416 -1910792 -1212340 891700 2481882 3020425 3320668 3168743
34517 3168743 1611128 -410011 -712680 424079 241691 -2153323 -4478297 -5150707 -5284986
34508 -5284986 -5672543 -5112419 -3407365 -2696138 -3532336 -2720819 1981201 7396009 8438636
34499 8438636 4580433 -257949 -3160883 -4462417 -5030561 -4408471 -2354910 -273640
34491 -273640 -112403 -2437108 -5729943 -7305943 -5521543 -1703064 705490 -471160
34483 -471160 -4084649 -7191039 -7785913 -5981350 -3816314 -4107761 -7759091 -11632222 -10966958
34474 -10966958 -4914757 1992553 4875770 3263759 -177657 -3402863 -5531577 -5485061
34466 -5485061 -2799883 676577 2014220 289370 -2605145 -4006942 -2623410 767894
34458 767894 3931054 4903246 3566235 1095231 -1806048 -4849376 -6772859 -6177285 -3935515
34449 -3935515 -2473450 -2286826 -1670215 -225969 516926 624565 1982942 3574399 1048462
34440 1048462 -6218540 -12053645 -11485522 -7954066 -7611199 -9772527 -9215828 -5913998 -5399086
34431 -5399086 -9412869 -12784062 -11121499 -6151465 -1448592 2225891 4828179 4661236
34423 4661236 1354930 -1943540 -2528261 -1974185 -3221973 -5784736 -6618048 -4388157 -456787
34414 -456787 3312322 5576244 5203182 2047553 -2067476 -4339403 -2981194 1757292
34406 1757292 7519735 10839995 9928203 6738877 4468320 3110007 275094 -3385592
34398 -3385592 -3628652 701852 4416987 2648710 -2331235 -4892632 -4317035 -4722286 -7912866
34389 -7912866 -11019036 -11347811 -9517108 -7131862 -4835318 -3451519 -3830808 -4588724 -3021527
34380 -3021527 582207 2353068 -207166 -5272763 -9679962 -11899154 -10947330 -6145775
34372 -6145775 -240667 1027093 -3986795 -9205315 -8513780 -4600790 -4971174 -10512035
34364 -10512035 -13986483 -10437123 -3554860 210470 -721327 -3823263 -6888373 -8576358
34356 -8576358 -7584789 -4556001 -2650748 -3489637 -4762381 -4433718 -4428126 -6718392 -8756850
34347 -8756850 -7399625 -4937057 -5638708 -7893208 -6298645 -1283117 491302 -3255981
34339 -3255981 -6450501 -4289433 -270962 778714 771695 3563846 6796586 5651200 1921533
34330 1921533 1881251 6175816 8970675 7298565 4476497 3130302 1411238 -1534533
34322 -1534533 -2368578 643680 3510700 2286364 -797507 -1275603 355402 -58310 -3556254
34313 -3556254 -6898335 -7440118 -5622703 -2975583 -613363 559491 702043 1736835
34305 1736835 4887416 8061557 8028553 4632269 520149 -2518521 -4248145 -3832348 -405018
34296 -405018 4107424 5969373 4121161 1066910 -1102260 -2749504 -4283761 -4891237
34288 -4891237 -4735212 -5372736 -6582171 -5764123 -2241362 819876 984113 152804 807260
34279 807260 1318053 -1323177 -5817930 -7590303 -4911456 -569491 2279730 2749232 960216
34270 960216 -2378153 -4668959 -2914322 2454763 7625654 9898797 9719238 7976016
34262 7976016 4605556 1036584 526962 3674110 6202165 4038277 -1111776 -3935782
34254 -3935782 -2046023 2189729 5391018 6078448 4251358 738109 -2443120 -2877413
34246 -2877413 70933 4265970 6158763 3344129 -3185426 -9089813 -10566381 -8808808
34238 -8808808 -8527317 -11031309 -11779811 -7249316 -1113655 732280 -668814 1243882
34230 1243882 8024928 13014531 10751966 4609357 1492078 2628311 4089002 4201503
34222 4201503 5284949 8159477 9623352 7145380 2956923 1032427 1679869 1739417 -276305
34213 -276305 -1811167 -30021 3832832 5941329 5152660 4406799 6041490 8052223 7122433
34204 7122433 3801602 1642244 1603607 747458 -2525060 -5115318 -3451957 921083 2894851
34195 2894851 351827 -3396430 -4045342 -1176714 2160925 3323654 2144180 -284795
34187 -284795 -3197520 -5784457 -6381017 -3812353 288068 2287223 786151 -1362718
34179 -1362718 -901500 1101274 615576 -3685438 -8489329 -9730065 -6354241 -155501
34171 -155501 5721544 7725173 4195198 -1905523 -4836573 -2284771 2055652 3444448
34163 3444448 1567338 -621662 -1308624 -659463 985132 2840890 2595613 -1367525 -6681966
34154 -6681966 -8382509 -4090635 3546373 9465282 10051803 5263450 -1156508 -4102779
34146 -4102779 -1874667 1653189 1559669 -1861815 -3873399 -2193142 111565 -208620 -1516174
34137 -1516174 96290 4719663 7987295 6464798 1647565 -2092679 -2465352 -1345004
34129 -1345004 -2113041 -5421377 -8061383 -6423928 -839459 4417444 5782695 4147461
34121 4147461 3070537 3934072 4448199 2238573 -1672710 -4227012 -4185189 -2836382 -1221613
34112 -1221613 1014443 3304594 3123457 -674485 -4957271 -5289367 -1325780 2995673
34104 2995673 4395471 3120319 942598 -1143599 -2612422 -3028639 -2906412 -3275386 -3894456
34095 -3894456 -3671297 -2949633 -2908646 -2481702 752762 5515106 6487582 1515395 -4123947
34086 -4123947 -4010342 1215498 5502411 5437900 2784291 75169 -2241207 -4264898 -5710878
34077 -5710878 -6975217 -8428264 -8444620 -4867748 1189982 5681109 6424932 5182307 4186434
34068 4186434 3019967 295757 -3356032 -5638714 -5213553 -3014213 -1322277 -1816755
34060 -1816755 -3988301 -5410877 -4171851 -1014485 1356281 861901 -2198093 -5171319
34052 -5171319 -4690766 218084 6142365 8297951 6376546 4886081 6207757 6535825
34044 6535825 1729049 -5636368 -9362028 -8161831 -6497742 -7504611 -9622916 -10435318
34036 -10435318 -9545783 -6904452 -2237312 2708012 4882379 4200663 3941422 5698515
34028 5698515 7095824 5910082 3362798 1566119 408760 -1149443 -2915362 -4244936
34020 -4244936 -5046409 -4779567 -2530534 843322 2889954 2960259 3115517 4605192 5887586
34011 5887586 5229770 2772824 -866775 -5046322 -7101455 -3577267 4491348 10820986
34003 10820986 10821464 6463714 2158761 -673365 -2066492 -397866 4705417 8868819 7326654
33994 7326654 1813531 -1119317 1682680 6949088 9827035 8502596 4191856 -422831
33986 -422831 -2637644 -2029663 -1116182 -1686006 -1608756 1770319 6123012 5960547 90177
33977 90177 -6489412 -9017862 -7994594 -6538160 -5898458 -5705370 -6347396 -8387876 -10471667
33968 -10471667 -10079529 -6583541 -2281104 156806 752018 1942096 4873926 6893580
33960 6893580 4497933 -1191163 -4475531 -2118404 2015130 2042962 -1842172 -3920900
33952 -3920900 -1175083 2819413 3271348 390200 -1726602 -580156 2395244 4209223
33944 4209223 3436485 1034044 -1067070 -1884128 -1851878 -1474020 -440120 1048677 1061704
33935 1061704 -2088692 -6764547 -8819935 -6139507 -983584 2851711 3952578 3516448
33927 3516448 2786592 1617235 -592855 -3500178 -5734845 -6139363 -5001822 -3771999
33919 -3771999 -3273581 -2591188 -413868 2738931 4651044 4075092 2323641 1346311 784370
33910 784370 -1585447 -5971543 -8640591 -5845360 629016 4446884 2409434 -1302122
33902 -1302122 -999430 2366053 2682300 -2340320 -8025124 -9549459 -7851113 -6478612
33894 -6478612 -5861959 -3940743 -520336 2280923 3181063 2876744 2475858 2525479 3031922
33885 3031922 3211525 2175032 772309 1086694 3020420 3766685 2390058 2090335 5160770
33876 5160770 8406998 7370696 3171987 885787 2216809 4100038 4091739 2909785 1616244
33867 1616244 329933 1379 1528284 2779769 661336 -3306258 -4113110 -1241350
33859 -1241350 -551108 -5629128 -11826811 -12720688 -8981726 -6268815 -6593131 -6782377 -4824581
33850 -4824581 -2893444 -3064501 -3788705 -2733249 -873038 -1300272 -4723703 -8283617 -9153362
33841 -9153362 -7711734 -6066996 -4574316 -1817759 2062444 4458885 3813112 1912733
33833 1912733 931685 158860 -1940587 -4271684 -4981054 -5446869 -8407540 -12582366 -13541664
33824 -13541664 -10422488 -7338662 -6758025 -5874463 -1921940 2888312 5017179 5043608 5697021
33815 5697021 6735799 5902588 3698751 2972815 3843924 2919211 -1346090 -5504081 -5326691
33806 -5326691 -1646011 207686 -3079724 -8375973 -9502158 -4670872 1459338 3998165
33798 3998165 3651964 3866488 4449096 2540987 -889416 -1225169 1920703 2763446 -1722268
33789 -1722268 -6133011 -4319569 1523820 4832447 4379210 3681476 2858739 -1621079 -9058145
33780 -9058145 -13357695 -11597557 -8101854 -7483199 -8443988 -7519239 -4926662 -3121056 -2472790
33771 -2472790 -1914820 -1764515 -2593682 -2858096 -756572 2601238 4567900 4566586 3879985
33762 3879985 2877866 1159121 -330414 -259871 375904 -400302 -1418484 909920 6519007
33753 6519007 9773989 6424315 250275 -1040374 3864457 7661182 4116625 -3316369
33745 -3316369 -6023050 -1829626 2394967 511391 -4822450 -6731131 -3571589 488625
33737 488625 2569748 3478314 3028515 -1176957 -7899087 -10294810 -4169545 5062979 8625585
33728 8625585 5680024 3126011 4889960 7249657 6014711 3002277 2350140 4137538
33720 4137538 5281903 4502881 2978889 1483572 24665 -524200 606749 1814371
33712 1814371 447511 -3515269 -7117365 -7681701 -4818250 -35 3636284 2119347
33704 2119347 -5290032 -12916243 -13371662 -6533331 -332239 -908812 -5432877 -7279141
33696 -7279141 -5135553 -3157248 -4046726 -6235929 -7327414 -6499804 -3506660 1096867
33688 1096867 4282656 2707056 -2283649 -5028180 -2590426 1427495 2118890 -344115
33680 -344115 -2187259 -1710519 -250577 1196405 2802470 3712182 2353852 -624228 -2590978
33671 -2590978 -2830767 -3486229 -5475016 -6142586 -2948902 2441302 5939190 5636509 2743340
33662 2743340 -674903 -2608231 -1033512 4021775 8718643 8730703 4503718 314792
33654 314792 -2082566 -5170221 -9851563 -12134765 -8728790 -2818274 -212847 -1622240
33646 -1622240 -2995656 -2382726 -1773766 -2235917 -2066491 -867023 -964810 -2835428 -3194329
33637 -3194329 -379977 1911396 -255531 -4905379 -6965043 -5331590 -3105758 -1950663
33629 -1950663 -499384 1722812 2842421 2029837 1122441 1482434 1632568 -493893 -4558829
33620 -4558829 -8270364 -9742999 -8753197 -6679166 -5536567 -6010025 -6334694 -4287457 -199001
33611 -199001 3321725 4399597 3109587 203189 -3211380 -4906779 -3046275 1018425
33603 1018425 3696504 3440792 1928793 753076 -166776 -153269 2755742 7998020 11267139
33594 11267139 9728685 5904993 3485323 1808011 -1700815 -5611223 -5899246 -2742932
33586 -2742932 -827439 -1960635 -2234874 1187397 4759010 3687918 -631273 -2789805
33578 -2789805 -1351615 135839 -202607 9435 1975228 2513570 -642679 -4012166 -3008448
33569 -3008448 947901 2656559 1129126 57611 432639 -1385247 -6458786 -9802133
33561 -9802133 -7691230 -3883342 -3895143 -6535156 -6571136 -3564935 -2036350 -3600593 -4865105
33552 -4865105 -3616014 -1672047 -404474 1512070 4109150 4673084 2686540 1874085
33544 1874085 4417709 7039209 6140981 3302708 1908618 1453302 -445875 -2790551
33536 -2790551 -2712918 -811439 -336463 -1726917 -2272949 -931500 650422 1823428 3393840
33527 3393840 4142936 1494114 -3225650 -4840334 -1819539 599442 -1942939 -5828550
33519 -5828550 -4488845 1755755 6046615 4596309 748880 -1618769 -3767171 -8028981
33511 -8028981 -11697587 -9767672 -2715516 3106676 3634383 1744717 1827531 3026001 1251317
33502 1251317 -3807687 -7554023 -6494986 -2463326 18266 -1308007 -4794170 -6754664
33494 -6754664 -4606097 552831 4463522 4159668 1439330 19097 55396 -1414085 -4786262
33485 -4786262 -6671642 -5477104 -4173476 -5197598 -6196193 -4069477 -379343 1091972
33477 1091972 137427 -629548 -1029537 -3351992 -7231714 -8737130 -5763735 -1239261 555986
33468 555986 -1234082 -4174444 -5746417 -5207885 -3455859 -2198224 -2777780 -5173023 -8144756
33459 -8144756 -10087148 -9594305 -6253725 -1779263 693527 -246785 -2623410 -3720578
33451 -3720578 -3337881 -2997564 -3213506 -3569469 -4501304 -6580481 -8396258 -7398214 -2978798
33442 -2978798 2774128 7174187 8672751 7455843 5706938 5965589 7604039 6773539
33434 6773539 2039891 -2253978 -1503510 2511584 4735615 4645805 5474553 6650256 3690784
33425 3690784 -3369183 -7967252 -6080264 -1738502 -70257 168748 2717431 6450434
33417 6450434 7145436 4410860 1945237 1714563 1817647 85834 -2847573 -4060641 -797636
33408 -797636 6294795 11731003 9970510 3165094 185887 5127777 11185674 10313212
33400 10313212 4559984 1517702 2020606 632781 -3024585 -2746756 3003498 7048552
33392 7048552 4374839 -348285 -1078005 172302 -1420992 -3823794 -1553101 3836490
33384 3836490 4867783 -298597 -4822593 -3493891 242815 805608 -1049518 -867268
33376 -867268 1516148 1865725 -1329964 -4302478 -3647634 -1136906 -798647 -3200955 -5185904
33367 -5185904 -4648292 -3024284 -2356024 -1957320 137229 3297626 4199538 1159449 -3131336
33358 -3131336 -4477015 -1953803 1430178 2514170 1289861 326799 1655445 4531870
33350 4531870 6168610 4805205 2000365 1132083 3249923 5381898 3921354 -997887
33342 -997887 -5706007 -7142501 -5514880 -3147211 -2291437 -4198721 -8555819 -12905345
33334 -12905345 -13906062 -10474250 -5163424 -1485075 -291804 271727 1632455 2912987
33326 2912987 2564235 894946 -86738 633867 1493900 325352 -2372040 -3388881 -684733
33317 -684733 3627251 5382784 3165046 -192855 -1044698 1128495 3655054 3905631 1978035
33308 1978035 155381 11318 745289 1066458 1904335 5151283 9578087 10950906 7808167
33299 7808167 4150398 3608493 3863386 1091349 -2493132 -1469257 3397475 5563389
33291 5563389 3342792 2682460 6481267 8618347 3852295 -2657820 -2699053 2681874 5925595
33282 5925595 4928542 4023073 4691701 4040254 2611592 5050601 11133060 14072904 10845102
33273 10845102 7041565 7414121 8115519 3728064 -3151103 -5672547 -2959111 -467816
33265 -467816 -1576432 -4054339 -4561967 -2475427 1016205 4581365 7118696 8320672
33257 8320672 8821115 8800669 7408106 4415935 863499 -2746375 -6638133 -9258959 -7778462
33248 -7778462 -2923727 62481 -1943243 -5301134 -4732355 -457684 3169927 3850156
33240 3850156 2639642 1107898 667404 2817450 6645236 8113186 5252900 1647951
33232 1647951 984524 1166593 -1201811 -3511666 -913730 4443903 5489060 1386097
33224 1386097 -1067427 1416261 3592206 854642 -3224979 -3002587 709058 3281164
33216 3281164 3838306 5003356 7192963 7950283 6155155 3179825 287090 -2128561
33208 -2128561 -3107723 -1739755 706021 1488135 -414663 -3296816 -4999894 -4916283 -3682340
33199 -3682340 -2154045 -1185666 -1655037 -3888882 -6906641 -8709263 -8013469 -5650181 -3363103
33190 -3363103 -1331990 1420536 3838839 2751531 -2247263 -6443082 -5486820 -1265944
33182 -1265944 1204669 1061936 1351919 2435402 909903 -4158383 -8772706 -9481404 -7280495
33173 -7280495 -4255046 -354843 4048992 6161859 4632878 2677076 3898917 6935460
33165 6935460 7591679 4978133 2246280 1785145 2630761 2843672 2210372 1813770 2087526
33156 2087526 2160662 1252455 504890 2289585 6534972 9029999 6023481 106755 -1835555
33147 -1835555 2758971 8907086 10923380 9156481 7434145 6635894 4421359 177091
33139 177091 -3181243 -2634124 1719650 7110820 10454431 10212520 7037379 3010319 113649
33130 113649 -549381 1347210 5023046 8193044 8389483 5231597 710942 -2737928 -3793069
33121 -3793069 -2558767 -493107 725772 1421027 3637485 7122520 7927593 4005955
33113 4005955 -155689 935111 5047367 4577955 -2440341 -9440736 -10559503 -7317861
33105 -7317861 -4179403 -2585227 -2081293 -2882270 -4163458 -3270710 660407 5258791 8811245
33096 8811245 11965599 14018339 12054787 6093626 593063 -1660937 -2566768 -3264731
33088 -3264731 -1262728 3653957 6455840 4207056 932564 441112 46482 -2934191
33080 -2934191 -4422183 -506845 4161543 3289659 -6219 1654885 6767172 6971807
33072 6971807 886011 -4156116 -4279585 -3221885 -3065914 -443095 5117672 7734345
33064 7734345 4312635 187413 1198727 5813955 9293176 10559641 10631926 8724199
33056 8724199 4558363 1318333 2064139 5396628 7879165 8672442 9078182 9482144 9149496
33047 9149496 7498145 4112034 -606094 -3903123 -2457412 3083924 7922459 8581204
33039 8581204 6108332 3304795 1911067 3149981 7267429 11254334 10729744 5734353
33031 5734353 1317474 932822 2696104 3557615 3425082 3490565 4184088 6431510 11039562
33022 11039562 15155341 13689864 6465733 -345528 -2227543 -1205762 -251401 1824175
33014 1824175 6017069 8746715 6906914 3458392 2919190 4602638 5338278 5543564 6959012
33005 6959012 7338725 3792297 -624680 -392504 3345691 3804602 -1182705 -6185386 -6410713
32996 -6410713 -3241384 -3180 2631282 4775046 5152705 3464316 1956155 2505627
32988 2505627 4408864 6277815 7566313 7277343 4245715 59588 -1440224 644738
32980 644738 2558540 1469934 -214882 1009326 3766903 3694754 189728 -2504700 -1230124
32971 -1230124 2042875 3137984 613737 -3498673 -6613805 -7805818 -7495751 -6104601
32963 -6104601 -3470215 513301 4805330 7192289 6189262 3261147 2182250 5058877
32955 5058877 9382775 10460831 6899618 2129005 -54509 367566 1173816 1636508 2353017
32946 2353017 2557718 590054 -3092661 -6135607 -7796732 -9492854 -11175149 -10095167
32938 -10095167 -4838165 1647270 5126158 4922390 3942443 4583918 5970341 5122548 538780
32929 538780 -5209458 -7377877 -4854778 -2626319 -5624883 -11204237 -11950180 -6056253
32921 -6056253 26261 767616 -1580324 -2056781 -347745 829917 1013099 1118922 -72149
32912 -72149 -3902025 -8008134 -8784671 -6438319 -3901815 -2253515 -1062809 -1572550 -5013247
32903 -5013247 -8815319 -9035663 -5991042 -3346972 -2415075 -1734133 -1400309 -2736908 -4031403
32894 -4031403 -2042703 1935126 3017941 572156 -515688 2089154 4525229 3593106
32886 3593106 1890465 2778244 4822853 5026253 3766921 2658836 849787 -2443889
32878 -2443889 -4484186 -2379158 2007202 4408947 3907111 2768358 1928439 212737
32870 212737 -2762942 -5935060 -8325428 -8955067 -6682501 -2577527 -507567 -2325941
32862 -2325941 -4498763 -3112493 -170626 -383829 -3309265 -4260306 -2641628 -3154015 -7197961
32853 -7197961 -8941684 -3467590 5278054 9036323 5701452 1204738 1345796 4940516
32845 4940516 6170345 2332999 -2345063 -1612046 4392008 7999872 3219801 -6081945
32837 -6081945 -10820550 -8255599 -4086348 -3072668 -3551607 -3350776 -4974503 -10244144
32829 -10244144 -14484274 -12236909 -6083876 -3299133 -4987892 -5301504 -1646671 1258728
32821 1258728 -332526 -3029722 -2224691 462444 296204 -3003005 -5479728 -5052444 -3125935
32812 -3125935 -1046426 1060154 2298250 1661312 826227 2653807 6221013 6892798 2856998
32803 2856998 -1465019 -832151 4015488 7456335 5901145 1445953 -1123237 611484
32795 611484 4752516 7286274 6125078 3261409 2604171 5621740 9924907 12272205
32787 12272205 11661043 8908885 4882667 672881 -1680260 -799343 1814232 2981103
32779 2981103 1667845 300713 1722890 5867878 10158758 12519712 13177407 13685788
32771 13685788 14796386 15438909 13602736 8217085 458821 -6506300 -9301846 -6779024
32763 -6779024 -1429512 2173745 1562486 -1002088 -1315557 1307680 3173011 1527473
32755 1527473 -1524684 -2499035 -2062658 -3636808 -6943743 -7125010 -1885700 4041665 4667714
32746 4667714 655029 -2401100 -2359924 -2481319 -4508165 -4912098 -1006400 3089495 1281029
32737 1281029 -5488761 -10051672 -8722527 -5360614 -4504819 -5002575 -3210860 932703
32729 932703 4573923 6463127 7316033 7183495 5850516 4645633 4431765 3007728 -1505842
32720 -1505842 -5699467 -4365984 881279 2215412 -3217795 -8194552 -5218858 2937301
32712 2937301 7460753 5442873 1996556 1465678 2169347 1007634 -1091783 -813609 2613399
32703 2613399 6153571 5925645 760379 -6397906 -10486163 -8673974 -2816945 2933668
32695 2933668 6085729 6384834 4131625 398660 -2079941 -1381543 330253 -896229
32687 -896229 -4916478 -7231174 -5524248 -2877032 -2480597 -2507461 476082 5235186 6990694
32678 6990694 4197523 561896 -282785 739865 287381 -2632958 -5610969 -5840728 -3029577
32669 -3029577 694693 3275836 4735532 6319727 7930505 7712821 4835299 1338954
32661 1338954 -72817 979856 3230070 6103668 9092804 9847481 6222538 416489
32653 416489 -2306298 -184534 2738676 2430887 -59961 -1600998 -1947056 -2241736 -967565
32644 -967565 3957846 9869056 10909718 5614512 -887426 -3249789 -1100062 3051983
32636 3051983 7224553 9476304 7751354 3069254 108367 1638308 4549389 4239089
32628 4239089 768790 -2507634 -4448491 -6508607 -8843298 -9808049 -8915275 -7147946
32620 -7147946 -4853640 -2285189 -1389886 -3693355 -7089137 -8278711 -7683947 -7919487 -8062082
32611 -8062082 -4467538 2356402 7020805 6833109 5035199 4429144 3015856 -691917
32603 -691917 -2823296 550281 6370226 7947501 3937369 -388213 -209554 4085387
32595 4085387 8898508 11056652 9314911 4609984 -705274 -4870129 -7560970 -8459506
32587 -8459506 -6938441 -4214193 -3302376 -4991064 -6361091 -5508605 -4913068 -7096691 -9737969
32578 -9737969 -9161151 -6568597 -6031938 -7374868 -6143030 -879949 4249780 5402812
32570 5402812 3932345 3572921 5406158 7432343 7540607 5482176 2591239 148032
32562 148032 -2034696 -4653988 -6395019 -4553275 552671 4521180 4502629 2880988 2127583
32553 2127583 -368591 -7047264 -12785261 -10220478 -1697845 2238658 -2224795 -6717685
32545 -6717685 -3690745 2471562 3165447 -1102637 -2523461 1501207 5052624 2946252
32537 2946252 -2703068 -6688730 -7139328 -5627416 -3784737 -2130340 -769525 606348
32529 606348 2786640 5857649 8234990 7810846 4180171 -748133 -4513877 -6131094
32521 -6131094 -6085931 -4825664 -2261347 1143525 4029273 5548184 6092171 5995693 4894049
32512 4894049 3261483 2732073 3287218 2136471 -2110075 -5891969 -4617697 808319
32504 808319 4820603 4165189 716307 -2366415 -3665245 -2615901 568140 3401827
32496 3401827 3080260 622651 -433136 112159 -1055946 -4032206 -3932167 1426181 6694877
32487 6694877 5830892 481827 -2705695 -964245 2565693 4368427 4131646 3044858
32479 3044858 1731822 425112 -592765 -1066216 -674767 490998 1053460 -532930 -3437782
32470 -3437782 -4912658 -3925100 -2134317 -678838 1115643 2862225 2372043 -489515
32462 -489515 -2532230 -1883946 -640360 -782441 -1106670 -680874 -1199244 -2660148 -1186652
32453 -1186652 4447669 8447655 5767665 613623 560873 4810891 5766050 1191595 -2868765
32444 -2868765 -1903234 1291020 2346468 1052749 -704972 -1981628 -1945933 -168676 1047655
32435 1047655 -1151177 -4865391 -5140176 -1909219 -732815 -3954217 -7007898 -6191565
32427 -6191565 -4226144 -4348541 -4422880 -1789776 720938 -749746 -4219655 -5349130 -5053400
32418 -5053400 -7387833 -11481431 -11990689 -7387755 -2089915 184061 137779 -739755 -2511394
32409 -2511394 -3957475 -2022089 3412239 7652983 6670597 1823729 -3057012 -6544366
32401 -6544366 -8808211 -8376697 -3605226 3262491 7100768 5823897 2893283 2555078
32393 2555078 4160288 3234618 -1969304 -7019161 -5991593 1048441 7480503 7816248
32385 7816248 3843793 1202223 1713378 2502590 2075376 2889238 6466121 9826989 9654259
32376 9654259 7230666 5850445 5412459 3565760 879987 231741 1248281 297555 -2932059
32367 -2932059 -3746528 249300 4480238 3520981 -1487787 -5473440 -6621832 -6375747 -4594081
32358 -4594081 -320300 3605290 2712452 -1787244 -3499615 -130375 3102708 1645578
32350 1645578 -2022789 -3613987 -3861700 -5431725 -6643612 -3939101 1224229 3442341
32342 3442341 855177 -3100200 -5306241 -5864366 -5072558 -2160743 1413910 1374809 -4090855
32333 -4090855 -10900505 -13405243 -10810128 -7342684 -6840610 -8823666 -9870358 -7929860
32325 -7929860 -4738758 -3641632 -5248767 -6604195 -5330084 -2884947 -2108992 -3098866
32317 -3098866 -3806839 -3607246 -3659981 -4385096 -5079633 -5476226 -5323467 -3420806 95304
32308 95304 1812820 -779753 -4170601 -2708422 2515986 4263389 -144390 -4516210
32300 -4516210 -3045545 1343356 2101780 -1461602 -4628327 -4596878 -2641588 -555999 786651
32291 786651 425833 -1314052 -1528792 1446253 4145866 2187054 -2487018 -3555602 272537
32282 272537 3031465 381721 -3963297 -3797230 876336 4427916 3272730 -496037
32274 -496037 -2821032 -2272999 -306953 1352700 2423754 3461917 4318973 4017410 2539733
32265 2539733 1764984 3143252 4822934 3174649 -2248185 -7232493 -7695083 -4483915
32257 -4483915 -1743997 -1552614 -2272097 -1946117 -1066019 -1111380 -1924150 -2027925 -1026261
32248 -1026261 -292788 -1036559 -2613170 -3392209 -2928700 -2578551 -3761997 -5917749 -6577176
32239 -6577176 -3764693 1622582 6179803 7162917 5124404 2855246 1989575 1791299 1416342
32230 1416342 1670582 3327378 5068454 5010004 3588458 2815756 2893310 1930089 -559450
32221 -559450 -2301550 -1606449 -19947 162662 -405670 888251 4469347 7531083 7493996
32212 7493996 5004278 2687542 1803588 1308965 227272 -407448 632407 1551218 -1390722
32203 -1390722 -8412086 -14155372 -13642296 -8759956 -5581870 -6121011 -6715017 -4712866 -2340830
32194 -2340830 -2394298 -3972531 -4739220 -4196496 -2432943 1161168 5300090 6140386 2357998
32185 2357998 -2058049 -3400529 -3434415 -4992872 -5840591 -2511334 2198939 2208746 -2246770
32176 -2246770 -4681862 -2379072 189874 -632394 -2555394 -2800798 -3116316 -5747131 -8712033
32167 -8712033 -8901059 -6729858 -4395021 -2285528 -229232 276429 -1768746 -4455579
32159 -4455579 -5281507 -3994368 -1393281 1902099 3669465 903552 -4749659 -6538077
32151 -6538077 -1611966 3506960 1722907 -3790584 -4107506 2265961 8246213 9783718
32143 9783718 10613748 13547150 14578033 10041482 4031452 2936415 5791163 6095150
32135 6095150 2197092 -13835 3813873 9368207 9148512 2853234 -2066982 -660412
32127 -660412 2787732 1069024 -5692707 -10591121 -9771807 -6443831 -4303485 -2615877
32119 -2615877 -484510 -547890 -3964114 -6256217 -3751602 -482845 -2102062 -5775286
32111 -5775286 -3979523 2894459 6306303 2680253 -1615583 -907626 1832538 1657256
32103 1657256 -193774 251685 2910734 5213503 6754514 7931142 7134190 3468200
32095 3468200 -493667 -2346591 -3387580 -5102873 -5503415 -2965064 -418016 -1042465
32087 -1042465 -2486512 -318464 4676099 7377380 5225906 276292 -4193328 -5648932
32079 -5648932 -2967279 1180986 1079880 -4860262 -10426934 -9596949 -5080869 -3450727
32071 -3450727 -4877512 -4479322 -1610989 -168706 -605259 609347 3426366 3512221 -117195
32062 -117195 -3634961 -5305283 -6783485 -6747540 -1256190 7452079 10617759 4956566 -2158236
32053 -2158236 -3467876 -1065295 -421489 -1580893 -1641856 -714426 13457 1777723 4902946
32044 4902946 6124519 3732673 999668 139434 -2019145 -7290965 -10710759 -8346168
32036 -8346168 -5385871 -8619538 -14760743 -14757152 -7286040 485915 4196178 6055205 7833158
32027 7833158 8153407 7310497 7421422 6833147 1383766 -7370146 -11963368 -9225897 -4655172
32018 -4655172 -4010238 -5826735 -5310824 -1527746 2247942 2653460 -930679 -5370324 -5515782
32009 -5515782 -3341 5469645 4850288 544717 -161646 3231858 3596077 -2139942 -8153766
32000 -8153766 -9118085 -7149552 -5765919 -3727390 440171 3783434 4042102 4248217 6753332
31991 6753332 7546659 2745375 -3387883 -3901407 141292 1497308 -2103511 -5310245
31983 -5310245 -3530018 1626912 5725668 6039184 2613391 -1588965 -2079422 2286431
31975 2286431 6976191 7722861 6638456 7789454 9111840 5283838 -2385764 -6483763
$$ [...]
##END NTUPLES=NMR SPECTRUM
##END=
