##TITLE=31Pdec_3MBDE1411
 CDCl3, 24 sc
 15.11.2022
##JCAMPDX= 6.0         $$ Bruker NMR JCAMP-DX V2.0
##DATA TYPE= NMR SPECTRUM
##DATA CLASS= NTUPLES
##ORIGIN= UXNMR, Bruker Analytische Messtechnik GmbH
##OWNER= root
$$ XWIN-NMR		Version 3.5
$$ Tue Nov 15 14:17:43 2022 Russian Standard Time (UT+4h)  she@DPX200
##.OBSERVE FREQUENCY= 81.013821
##.OBSERVE NUCLEUS= ^31P
##.ACQUISITION MODE= SIMULTANEOUS
##.ACQUISITION SCHEME= undefined
##.AVERAGES= 24
##.DIGITISER RES= 16
##SPECTROMETER/DATA SYSTEM= spect
##.PULSE SEQUENCE= zgpg30
##.SOLVENT NAME= CDCl3
##.SHIFT REFERENCE= (INTERNAL, CDCl3, 0, 248.564)
##AUDIT TRAIL= $$ (NUMBER, WHEN, WHO, WHERE, WHAT)
$$ ##TITLE= Audit trail, XWIN-NMR		Version 3.5
$$ ##JCAMPDX= 5.01
$$ ##ORIGIN= Bruker BioSpin GmbH
$$ ##OWNER= she
$$ F:/spectra/data/she/nmr/P31/1/pdata/1/auditp.txt
$$ ##AUDIT TRAIL=  $$ (NUMBER, WHEN, WHO, WHERE, WHAT)
(   1,<2022-11-15 14:16:07.43 +0400>,<she>,<DPX200>,
      <created by zg, POWCHK disabled, PULCHK disabled
       configuration hash MD5:
       00 E9 B6 7A A2 85 ED C7 34 08 36 98 17 FE 4E 26
       data hash MD5: 32K
       15 D7 30 D2 CC 57 E3 46 8A 8D 6D 1F 58 5F 2A 09>)
(   2,<2022-11-15 14:16:44.31 +0400>,<she>,<DPX200>,
      <Start of raw data processing
       efp BC_mod = 2 LB = 1 FT_mod = 6 PKNL = 1 PHC0 = -10226.69 PHC1 = 26.45589 SI = 64K 
       data hash MD5: 64K
       72 14 F6 FE FD 85 94 6A AF 2C 1D 44 73 9D D4 55>)
(   3,<2022-11-15 14:17:02.21 +0400>,<she>,<DPX200>,
      <pk PHC0 = 2.59113 PHC1 = 0 
       data hash MD5: 64K
       18 80 39 90 3B 85 7A 2B 74 54 74 36 61 DC D7 E1>)
(   4,<2022-11-15 14:17:08.45 +0400>,<she>,<DPX200>,
      <abs ABSG = 5 
       data hash MD5: 64K
       1D 06 36 BA 9F DE C2 D3 EE 6A B0 75 C9 45 71 B6>)
$$ ##END=
$$ 
$$ hash MD5
$$ 41 7D 6B 59 4B A1 95 DD 6F 12 D8 94 E7 D7 99 F1
##$RELAX= 
##$RELAX= 
##$RELAX= 
##$RELAX= 
##$RELAX= 
##$RELAX= 
##$RELAX= 
##$RELAX= 
##$RELAX= 
$$ Bruker specific parameters
$$ --------------------------
##$DU= <F:/spectra>
##$EXPNO= 1
##$NAME= <P31>
##$PROCNO= 1
##$TYPE= <nmr>
##$USER= <she>
##$AMP= (0..31)
100 100 100 100 100 100 100 100 100 100 100 100 100 100 100 100 100 100 
100 100 100 100 100 100 100 100 100 100 100 100 100 100 
##$AQSEQ= 0
##$AQ_mod= 1
##$AUNM= <au_zg>
##$AUTOPOS= <>
##$BF1= 81.014009
##$BF2= 200.13
##$BF3= 200.13
##$BF4= 200.13
##$BF5= 200.13
##$BF6= 200.13
##$BF7= 200.13
##$BF8= 200.13
##$BYTORDA= 1
##$CFDGTYP= 0
##$CFRGTYP= 5
##$CHEMSTR= <none>
##$CNST= (0..31)
1 1 145 1 1 1 1 1 1 1 1 1 1 1 1 1 1 1 1 1 1 1 1 1 1 1 1 1 1 1 1 1 
##$CPDPRG= <waltz16>
##$CPDPRG1= <>
##$CPDPRG2= <waltz16>
##$CPDPRG3= <>
##$CPDPRG4= <mlev>
##$CPDPRG5= <mlev>
##$CPDPRG6= <mlev>
##$CPDPRG7= <mlev>
##$CPDPRG8= <mlev>
##$CPDPRGB= <>
##$CPDPRGT= <>
##$D= (0..31)
0 1 0 0 0 0 0 0 0 0 0 0.03 2e-05 3e-06 0 0 0 0 0 0 0 0 0 0 0 0 0 0 0 0 
0 0 
##$DATE= 1668507366
##$DBL= (0..7)
120 120 120 11 120 120 24 19 
##$DBP= (0..7)
150 150 150 150 150 150 150 150 
##$DBP07= 0
##$DBPNAM0= <>
##$DBPNAM1= <>
$$ [...]
##$SUBNAM3= <"">
##$SUBNAM4= <"">
##$SUBNAM5= <"">
##$SUBNAM6= <"">
##$SUBNAM7= <"">
##$SUBNAM8= <"">
##$SUBNAM9= <"">
##$SW= 501.771253377433
##$SWIBOX= (0..15)
0 1 3 0 0 0 0 0 0 0 0 0 0 0 0 0 
##$SW_h= 40650.406504065
##$TD= 32768
##$TD0= 1
##$TE= 0
##$TE2= 300
##$TE3= 300
##$TEG= 300
##$TL= (0..7)
0 120 53 12 22 120 120 120 
##$TP= (0..7)
150 150 150 150 150 150 150 150 
##$TP07= 0
##$TPNAME0= <>
##$TPNAME1= <>
##$TPNAME2= <>
##$TPNAME3= <>
##$TPNAME4= <>
##$TPNAME5= <>
##$TPNAME6= <>
##$TPNAME7= <>
##$TPOAL= (0..7)
0.5 0.5 0.5 0.5 0.5 0.5 0.5 0.5 
##$TPOFFS= (0..7)
0 0 0 0 0 0 0 0 
##$TUNHIN= 0
##$TUNHOUT= 0
##$TUNXOUT= 0
##$USERA1= <user>
##$USERA2= <user>
##$USERA3= <user>
##$USERA4= <user>
##$USERA5= <user>
##$V9= 5
##$VALIST= <valist>
##$VCLIST= <CCCCCCCCCCCCCCC>
##$VD= 0
##$VDLIST= <DDDDDDDDDDDDDDD>
##$VPLIST= <PPPPPPPPPPPPPPP>
##$VTLIST= <TTTTTTTTTTTTTTT>
##$WBST= 1024
##$WBSW= 4
##$XGAIN= (0..3)
0 0 0 0 
##$XL= 0
##$YL= 0
##$YMAX_a= 14143
##$YMIN_a= -15788
##$ZGOPTNS= <>
##$ZL1= 120
##$ZL2= 120
##$ZL3= 120
##$ZL4= 120
##$ABSF1= 248.5645
##$ABSF2= -253.2056
##$ABSG= 5
##$ABSL= 3
##$ALPHA= 0
##$AQORDER= 0
##$ASSFAC= 0
##$ASSFACI= 0
##$ASSFACX= 0
##$ASSWID= 0
##$AUNMP= <proc_1d>
##$AZFE= 0.1
##$AZFW= 0.5
##$BCFW= 0
##$BC_mod= 2
##$BYTORDP= 0
##$COROFFS= 0
##$CY= -3
##$DATMOD= 1
##$DC= 0
##$DFILT= <>
##$DTYPP= 0
##$F1P= 0
##$F2P= 0
##$FCOR= 1
##$FTSIZE= 65536
##$FT_mod= 6
##$GAMMA= 0
##$GB= 0
##$INTBC= 1
##$INTSCL= 6.047779e-11
##$ISEN= 30
##$LB= 1
##$LEV0= 0
##$LPBIN= 0
##$MAXI= 10000
##$MC2= 0
##$MEAN= 0
##$ME_mod= 0
##$MI= 50
##$NCOEF= 0
##$NC_proc= -4
##$NLEV= 6
##$NOISF1= 182.463
##$NOISF2= 159.3651
##$NSP= 0
##$NTH_PI= 0
##$NZP= 0
##$OFFSET= 248.5645
##$PC= 4
##$PHC0= -10224.1
##$PHC1= 26.45589
##$PH_mod= 1
##$PKNL= yes
##$PPARMOD= 0
##$PSCAL= 0
##$PSIGN= 0
##$REVERSE= no
##$SF= 81.0140089999694
##$SI= 65536
##$SIGF1= 159.3651
##$SIGF2= -187.1042
##$SINO= 113.3802
##$SIOLD= 16384
##$SREGLST= <1H.CDCl3>
##$SSB= 0
##$STSI= 65536
##$STSR= 0
##$SW_p= 40650.406504065
##$SYMM= 0
##$S_DEV= 0
##$TDeff= 32768
##$TDoff= 0
##$TI= <>
##$TILT= no
##$TM1= 0
##$TM2= 0
##$TOPLEV= 0
##$USERP1= <user>
##$USERP2= <user>
##$USERP3= <user>
##$USERP4= <user>
##$USERP5= <user>
##$WDW= 1
##$XDIM= 65536
##$YMAX_p= 321108448
##$YMIN_p= -11923810
$$ End of Bruker specific parameters
$$ ---------------------------------
##NTUPLES= NMR SPECTRUM
##VAR_NAME=  FREQUENCY,     SPECTRUM/REAL,   SPECTRUM/IMAG
##SYMBOL=    X,             R,               I
##VAR_TYPE=  INDEPENDENT,   DEPENDENT,       DEPENDENT
##VAR_FORM=  AFFN,          ASDF,            ASDF
##VAR_DIM=   65536,         65536,           65536
##UNITS=     HZ,            ARBITRARY UNITS, ARBITRARY UNITS
##FACTOR=    0.620285442955139, 1,           1
##FIRST=     20137.2065510682, 0,            0
##LAST=      -20513.1999529968, 0,           0
##MIN=       -20513.1999529968, -11923810,   0
##MAX=       20137.2065510682, 321108448,    0
$$ Real data points
##PAGE= N=1
##DATA TABLE= (X++(R..R)), XYDATA
$$ [...]
39705e8061J58894J41967M9461l2581n7140r7138j90154j90560J6083K31123J59529
39694A31423j19310k20267j8771J89245J65769K3764o8563j24079j31229K2439
39684a49579K29594J47420k35496l93916J8113N69045N94388J05755k99270k87921
39674B98133q7246J7352K7974K3870k4823j14605j35509m6905M7227N8292J0636
39663G4396l9228n6923j4465O4307Q0336n027p5846k8003N0671R502j30581k14765
39651b85626j59792l536J63274K14957P3090j21388r7691J45793K56961L9448
39641B25490k08529j46001O8007O2524j06315o8197J91891K74935K8979j92460
39631A30324r1356J35321J41492o1370j92053j24873j417J1067q1280j26260J677
$$ y = [-58061, 100833, 242800, 292261, 259680, 202540, 105402, -84752, -275312, -259229, -28106, 131423, 12113, -208154, -226925, -37680, 128089, 151853, 83290, -40789, -172018, -149579, 80015, 227435, -8061, -401977, -383864, 185181, 779569, 885324, 586054, 298133, 210887, 228239, 256213, 280083, 255260, 140655, 5146, -41759, 5468, 63760, 74396, 35168, -21755, -36220, 28087, 108423, 103396, 27550, -453, 50218, 59720, -70861, -285626, -445418, -448954, -285680, -70723, 2367, -119021, -216712, -70919, 186042, 225490, 16961, -129040, -61033, 1491, -104824, -173021, 18870, 293805, 322784, 130324, 38968, 174289, 315781, 254411, 62358, -62515, -63932, -52865, -134145, -260405, -258728]
39620b58728K30470L17570J31679j40434k03970l5789J10826O2660r4417k00133
39610h0266j98170r4797Q7710K56684K87332J73118L0743p0122j63003k49045
39600a9816k40383r6091Q1271J42635M0088j32803k11066j00030J03591J88642
39590b43962Q5959l6659j2790R9866J44241R3208J9082m5300o4832L8462K01164
39579B78439J55004k02463n18933l86460O2308L13168J91018L0047P8284J43790
39569A44202M029j87607j70268m875O0881J3730O3878K53284L41445J45843j83757
39558D80785l44508k43747o0077L3584O6327J28197J67719Q7160l9427n6997j0902
39547B08114p7923j93778p3405K75471M08316N9350l99168m38423q3766K12514
$$ y = [-258728, -28258, 289312, 420991, 280557, 76587, 40798, 151624, 214284, 119867, -80266, -278436, -373233, -285523, -28839, 258493, 431611, 462354, 392232, 229229, -19816, -260199, -356290, -275019, -132384, -92296, -225099, -436165, -536195, -432604, -243962, -158003, -194662, -207452, -107586, 36655, 129863, 148945, 103645, 38813, 77275, 278439, 433443, 230980, -287953, -674413, -612105, -298937, -107919, -77872, 412, 144202, 148231, -39376, -209644, -214519, -153638, -139908, -76030, 177254, 518699, 664542, 480785, 136277, -107470, -167547, -133963, -67636, 60561, 228280, 315440, 276013, 219016, 208114, 130191, -63587, -136992, 138479, 546795, 606145, 206977, -231446, -315212, -102698]
39537a02698K27609J13660J6447n2430l4707J02869J65500l4576k93601k52802
39527a44729K5285J38274q452q7025O9128K18456J64866M8266L4853P3085Q7973
39516F19980Q8363j413k53447m27123j91977K55012L14102j09178l84776j19543
39506b10000K40090J68964j13418j09929J09832J48249L3401P3491J74228r608
39496E05300l35653k84136J49551L34424m3699m86567m26411l095K52085J75289
39486a62912L2335J8663O0608N3898J5646j9572o7658j19488j12138j4918J16642
39475a98894J97190J88534J05613k4950j69334k46195j57048O3884J91071M8871
39465a258k00570k06337Q4117L09702J94725n9487r5570O8358J16959m5282j70657
$$ y = [-102698, 124911, 238571, 255018, 202588, 167881, 270750, 436250, 401674, 108073, -144729, -119444, 18830, 10378, -76647, -7519, 210937, 375803, 424069, 458922, 532007, 619980, 708343, 706930, 453483, 26360, -165617, 89395, 403497, 294319, -90457, -210000, 30090, 199054, 85636, -24293, 85539, 233788, 267189, 340680, 514908, 505300, 169647, -114489, 35062, 369486, 325787, -160780, -587191, -590286, -338201, -162912, -130577, -111914, -51306, 2592, 18238, -1334, -68992, -188480, -300618, -315536, -198894, -1704, 186830, 292443, 267493, 98159, -148036, -305084, -241200, -50129, -1258, -201828, -408165, -324048, -14346, 180379, 120892, 25322, 93680, 210639, 165357, -5300]
39454e300p5345J04212J42601J3138j44566j98865j00226R2907K11208J22383
39444A62147o9790j04822R1126K66424J44958k18544m86179m05767o2853K21927
39434d61373K10554k8737k07663j36605P5110J78933R5641k9895n5990J113O2962
39423b95950J12699J50111J17501k4447j87864k23017r0123J03058K30443K41522
39413A33933J28422r1587l02069l00836k2988K85421K78150o6797l72894k98230
39403f29475O7651L45090L12721Q8650p7922o4174N8539J18462K2248j10845o9653
39392F1292J39142K43133P9579j48640j72678m6059Q104j7927R749L4833q1543
39381A08985k02668p9057J61044J39727j24631j98118L9744J79511q097j86618
$$ y = [-5300, -80645, 23567, 166168, 179306, 34740, -164125, -264351, -171444, 39764, 162147, 92357, -12465, 78661, 345085, 490043, 271499, -214680, -620447, -683300, -461373, -250819, -279556, -487219, -623824, -548714, -369781, -274140, -304035, -360025, -358912, -295950, -183251, -33140, 84361, 59914, -127950, -350967, -441090, -338032, -107589, 133933, 262355, 170768, -131301, -432137, -455125, -169704, 108446, 41649, -331245, -629475, -561824, -216734, 95987, 184637, 106715, 42541, 101080, 219542, 241790, 130945, 61292, 200434, 443567, 523146, 374506, 201828, 155769, 163873, 145946, 155695, 190528, 108985, -93683, -172740, -11696, 128031, 3400, -194718, -154974, 24537, 16440, -170178]
39371a70178p8666M8699p5033j85837J1370K29635Q0983j77637n0345K91778K51127
39360A75896j59074k92946N7475L19686Q4036k75444k64207j4765M4141j16814
39350d42016j86005l2508J83661K80323J83687p2729k96650k44028O6938L20606
39340b38721L04753J35514k4348j84250l01045j68887J98734L80287R1883l09489
39330a15569k68222J72387M36974K28567j39233k58966j14455O0276J17631M9848
39320A69238q3990j54666n0310J30282J35286p7835k06328N165L58731M06662
39310F32235L6489l57917l66990p2772Q9804q0230k96894j92109J78802M06482
39300b3100K57094n0820j49341L3799K31988J81638q2043k77033j95520N1449
$$ y = [-170178, -248844, -200145, -275178, -461015, -449645, -220010, -139027, -316664, -367009, -75231, 175896, 16822, -276124, -218649, 101037, 185073, -90371, -354578, -369343, -325202, -442016, -628021, -660529, -476868, -196545, -12858, -85587, -382237, -626265, -559327, -238721, 66032, 201546, 177198, -7052, -308097, -476984, -278250, 102037, 193920, -115569, -383791, -211404, 225570, 454137, 314904, 55938, -58517, 1759, 119390, 169238, 85248, -69418, -119728, 10554, 145840, 68005, -138323, -133158, 225573, 632235, 668724, 310807, -56183, -128955, -39151, -119381, -416275, -608384, -429582, -23100, 233994, 183174, 33833, 67632, 299620, 481258, 399215, 122182, -73338, -21889]
39290b1889J64355M1471q7606j1567J26998N7943j56043j89627J7972J45378Q40
39279H8225j75371j12793O7878R4483j4337m4056K4984K6661o8851j22047q0635
39268c15859l2154k2542k1576k9397l6633M2334J97072J99495q2988l63028k50662
39257g15938J65570M13971K99575Q5135j1046p2579j39549m9518J73283J84422
39247C33326j35378l59041r5749L82634M93752J38368k47486l17000j22809J25044
39237A95661K67491J96464m8966k14279j27909k582j39858m13555m13606p5248
39227g76387K32664K75588K01091J41552r7k04890j94491J12118L47387J98087
39217C32622j25387k31573j10325j8748j6652J6224M7473m5202j60880q4603J28358
$$ y = [-21889, 142466, 183937, 96331, 84764, 211762, 269705, 113662, -75965, -57993, 87385, 88225, -87146, -199939, -132061, -37578, -51915, -95971, -70987, -44326, -113177, -235224, -315859, -348013, -370555, -392131, -421528, -458161, -415827, -218755, -19260, -102248, -465276, -715938, -550368, -136397, 163178, 248313, 237267, 164688, 25139, -24379, 148904, 333326, 197948, -161093, -256842, 125792, 619544, 757912, 510426, 193426, 70617, 195661, 463152, 659616, 610650, 396371, 268462, 265880, 126022, -287533, -701139, -776387, -543723, -268135, -67044, 74508, 74411, -130479, -324970, -212852, 134535, 332622, 207235, -24338, -134663, -153411, -170063, -153839, -106366, -151568, -312448, -397051, -268693]
39206b68693K10566J05523R896P94m2469j19041n9027J22879J62448l1945j98817
39195a07886j35570j0602m9167j48747p1080J47483K49827J35114n3101j61972
39185b05701j46163M960K43880L77852K17775j38056l47285k37456l4535m9175
39175c13904k29257k15923J31112M56621L29018j51385m13565j37601L33813M72188
39165B61117K33139j9558j01613j54616k44873k14329k2925J11293P0163L0098
39155e2104J19765J76049O3076m4686K6811J05898l4568k44680k21632k2382L9398
39144h9055p3937j01530K1539O0044o6263j11116P3596K70124K37428O1977l2207
39133B50600k3653m8211j56360k79546l28817k13998J01218M53165N42071K83747
$$ y = [-268693, -58127, 47396, 57292, 58086, 15617, -103424, -162451, -39572, 122876, 90931, -107886, -243456, -254058, -303225, -451972, -523052, -375569, -125742, 9372, -43729, -205701, -351864, -346904, -103024, 274828, 492603, 354547, 7262, -230194, -264729, -313904, -543161, -759084, -627972, -171351, 157667, 6282, -407283, -544884, -211071, 261117, 494256, 474698, 373085, 218469, -26404, -240733, -263658, -152365, -82202, -52104, 67661, 243710, 306786, 262100, 288911, 394809, 360241, 115561, -106071, -128453, -89055, -162992, -264522, -242983, -182939, -249202, -360318, -286722, -16598, 220830, 282807, 250600, 226947, 178736, 22376, -257170, -585987, -799985, -698767, -245602, 296469, 580216]
39123E80216l8848j27516m5512o4262k32480l15226j53352J00863J74155O460
39113a15502j81378j51122O1776J86004P1729r2133m0760J70469K39116O9674
39103B17873q9028k9349J19938J18820l6438j47897r1144O7648J57332M9377j79154
39092A57978k31206P3990M45015L82411j22804m92069l36993J6794O4181j50181
39082a92884k25958p6030N9428J13012K19720L11317J63514j36469k24622l1004
39072a9976J05344j2998j80057j90622j09252k328J91380L59215K13354j86373
39062A67687l42071m0898K57481J23197j64171j10143J66781J75869r8180k07631
39052g2079k0844J15114K2884n6410K0387M7580p6737j07203R2292K43552R5527
$$ y = [580216, 541368, 413852, 368340, 304078, 71598, -243628, -396980, -296117, -121962, -115502, -296880, -448002, -386226, -200222, -128493, -220626, -261386, -90917, 148199, 217873, 128845, 99496, 219434, 338254, 301816, 153919, 62775, 130423, 287755, 337132, 157978, -73228, 762, 445777, 828188, 705384, 213315, -123678, -106884, -42703, -192884, -418842, -494872, -435444, -322432, -102712, 208605, 372119, 235650, 11028, -19976, 85368, 72370, -107687, -298309, -407561, -409889, -218509, 140706, 354060, 167687, -174384, -215282, 42199, 165396, 1225, -108918, 57863, 233732, 135552, -72079, -92923, 22191, 45075, -11335, 9052, 56632, -20105, -127308, -35016, 208536, 304063]
39041C04063j55719k01077j00816r1370j22280K9525K90293L21300L5494k41843
39031F7570k27246n0117j3609j38405j53362P1955K82466J66566j62684k53963
39021d10829N6724L64275K43494j37288k80365r9403L1572m7975n0901J78920
39011a51776L29207J46115r7363l8186J71195J28146j45260k50716n4227J53015
39001A90150J40127J2025n3205l8501N082M5732L1278l5055j0800J62681K34552
38990F84066l8678m11453l90245K0670K59855K1173l14829k90106j2111J30500
38980c41158P8768N5390J16766J29487P3146L1154l4917j89637k77106j00410
38970d58517J80335J73208j69007m07712j82435L12119N64648L22320j91796n37850
$$ y = [304063, 148344, -52733, -153549, -244919, -367199, -337674, -47381, 273919, 309413, 67570, -159676, -209793, -223402, -361807, -515169, -443214, -160748, 5818, -156866, -410829, -354105, 10170, 253664, 116376, -163989, -263392, -231820, -279795, -330696, -151776, 177431, 323546, 226183, 187997, 359192, 487338, 342078, 91362, 37135, 190150, 330277, 342302, 289097, 250596, 255678, 301410, 332688, 297633, 286833, 449514, 684066, 645388, 233935, -156310, -135640, 124215, 145388, -169441, -459547, -471658, -341158, -262390, -207000, -90234, 39253, 112399, 143553, 108636, -81001, -358107, -458517, -278182, -104974, -273981, -681693, -864128, -552009, 12639, 334959, 143163, -394687]
38960c94687m50019m5225L00088L32157J71501J00504J61999J57439K9028k2535
38950C40250R5473J40561j08469m41494m42213o0735L10016L47204J42232l9548
38940B83277j15010j55570j76730j47783j17541j42044j36644J5329K26268K68731
38930a97717R7777p7407r8859n2616o1991o8225K6490J30537P2656j19004k28650
38919e77009j35162O1805K07630K65147K87936K92768K01446o8153m12305n08284
38909c84181j57998L26266L63438j25092m91159j92220M19053N57227R1028l41138
38899F5224k78675L2754J80228J47746R7167N021j63549k33014r0178P1703P5627
38888h9946P5197K28720L15579P2923k77357k84417M2218K40327Q1082j64469
$$ y = [-394687, -844706, -889931, -589843, -257686, -86185, 14319, 176318, 333757, 362785, 340250, 435723, 576284, 467815, 26321, -415892, -476627, -166611, 180593, 322825, 283277, 168267, 12697, -164033, -311816, -429357, -571401, -708045, -692716, -466448, -197717, -99940, -177347, -276206, -328822, -390813, -459038, -432548, -302011, -229355, -348359, -577009, -712171, -650366, -442736, -177589, 110347, 403115, 604561, 536408, 124103, -384181, -542179, -215913, 147525, 22433, -468726, -660946, -241893, 315334, 406362, 65224, -213451, -180697, -469, 147277, 244444, 249465, 85916, -147098, -237276, -165573, -89946, -14749, 213971, 529550, 602473, 325116, 40699, 82917, 323244, 404326, 239857]
38878B39857j99330p3274K1207K0397n7094j74061j96486O540K94620L33567N0191
38867B66134k27199k12170k0842O2884j9516j20720j39360p1960O3306J91013
38857b28430J75550O351j20426n8841N8831K8584r0156o6565J17295K10467N8587
38846I1247j72642k29157q4200Q3886J37078Q5615l146q6873j30050r3974P010
38835c95206Q5381O8035j6313q1373r3479p8582l8544M5615J15787O3148q3848
38824d09379j22155N1494K29862J41684j33713k16566O2875M03326M02635N3648
38814D63711k77636k98011o9278J31498J11374r3380k87667l03279j51275N208
38804g68735M5650K2288N4180J45737K01299J93519J95791K23659J71060r980
$$ y = [239857, 40527, -32747, -11540, 8857, -48237, -222298, -418784, -412244, -117624, 215943, 266134, 38935, -173235, -194077, -131193, -150709, -271429, -410789, -482749, -419443, -228430, -52880, -46529, -166955, -225796, -166965, -138381, -228537, -295102, -177807, 32660, 91247, -81395, -310552, -394752, -310866, -173788, -88173, -91319, -178192, -308242, -402216, -395206, -309825, -241790, -258103, -339476, -432955, -511537, -550081, -504466, -388679, -325531, -409379, -531534, -480040, -250178, -108494, -242207, -458773, -395898, 7428, 410063, 463711, 186075, -111936, -181214, -49716, 61658, -31722, -319389, -622668, -773943, -768735, -723085, -700797, -646617, -500880, -299581, -106062, 89729, 313388, 484448, 474468]
38794D74468j63870j02858J11011K07988O3909j30012j36104K975M2796j08020
38784B62283k63647k11532L0749K59508L05991J59814o8291k43443k91140k34993
38774b94701j55554j03067n7270L1388J72116K94492K84367J12144o9416n8796
38764A55703J09032J44428j04191l70255k90233P2093K82177J17969j65182k19371
38754b67830j6421K29957L47755K86593Q5178j20463j96731j89595k27936k24119
38744b93612L7779M23270M39924n0846m89829l62524L6927P8970k03697k17736
38734f01374J62271L65236Q3546j94513J6214L90964L13446j35751l17166l6794
38724D6079J97715J3694k71175k00268J12492K14651L4077p4790M3143J06660
$$ y = [474468, 310598, 207740, 318751, 526739, 590648, 460636, 324532, 327507, 370303, 262283, -1364, -212896, -182147, 77361, 383352, 543166, 474875, 231432, -59708, -294701, -450255, -553322, -610592, -579204, -407088, -112596, 171771, 283915, 214499, 155703, 264735, 409163, 304972, -65283, -355516, -283423, -1246, 116723, -48459, -267830, -284251, -54294, 293461, 580054, 665232, 544769, 348038, 158443, -69493, -293612, -255833, 167437, 607361, 556515, 66686, -295838, -258911, -179941, -383638, -601374, -439103, -73867, 9679, -184834, -168620, 222344, 535790, 400039, 82873, 46079, 243794, 257488, -13687, -213955, -101463, 113188, 147265, 72475, 115618, 222278]
38714B22278q9170k91789j83092R9953J71852n203r5924N5123K06427J44735O683
38703B41873J255N9127j8825k19101l34378k43442j9737J75530K13379R6476n440
38692e3283N0958J29239k7590l31865l60101J2295L28756J90271j32353j19167
38682c12840J94296L09383O1367j70255q7841J24242J62875L2453p0044o7070
38672A76566l1212l8137r4679j35216o9137Q9279J84361J16589j1524p2823j00843
38661A3224j30945m7074J61900J99917j26301m63023l20590J55848L25068j6005
38651b47981l38510j63172L05444N47921L96281R3833q0303n2499L4505l3889
38641D61630k59414l39970q3723K08395J35154j42125j25988J66760J92598j78687
$$ y = [222278, 133108, -158681, -341773, -241820, -69968, -75171, -171095, -115972, 90455, 235190, 241873, 243128, 302255, 283430, 64329, -270049, -513491, -533228, -357698, -144319, -47843, -53283, -2325, 126914, 99324, -232541, -592642, -580347, -251591, -61320, -193673, -312840, -118544, 190839, 252206, 81951, -5890, 118352, 281227, 313680, 243636, 176566, 145354, 107217, 12538, -122678, -191815, -102536, 81825, 198414, 186890, 114067, 13224, -117721, -164795, -2895, 197022, 70721, -392302, -712892, -557044, -231976, -247981, -586491, -749663, -444219, 103702, 499983, 593816, 513513, 461014, 495519, 461630, 202216, -137754, -221477, -13082, 122072, -20053, -146041, 20719, 213317, 34630]
38631C4630l74287m4223L45086K58041r8826k12913q4994n8999j48901j07657
38621d93043L2573L1656o6260n930J86398K38611J19092O0287J10883P5301p4093
38610B15475j12981K9064J19865M408j39455p7564J30616K10877K7315k42153
38600A65467k94624o4504J57739Q2047j57766j70318R5316K46426O0412j61120
38590d0925q8075J27331J59782M2809J0442L7891m3936j45292n7057J23526J26931
38579B53427j4440m4257L0757l3632k32116k88331j40202j9103J695J01299K64328
38568a20575J87298j93246m80246l57858k2524J78471K44369L57870M50498K84430
38558E28487j09745l82530k90445J7712K01168J06601j19175k48371k19460j24636
$$ y = [34630, -339657, -383880, -38794, 219247, 120421, -92492, -177486, -236485, -385386, -493043, -460470, -428814, -495074, -501004, -314606, -75995, 43097, 103384, 214267, 289568, 215475, 102494, 131558, 251423, 255831, 116376, 38812, 169428, 380305, 407620, 165467, -129157, -193661, -35922, 46125, -111641, -281959, -186643, 59783, 120195, -40925, -129000, -1669, 158113, 200922, 211364, 249255, 205319, 60027, 2970, 126496, 253427, 238987, 194730, 225487, 191855, -40261, -328592, -468794, -487897, -486202, -384903, -120575, 66723, -126523, -606769, -964627, -987151, -808680, -564311, -206441, 244057, 528487, 418742, 36212, -254233, -236521, -35353, 71248, -47927, -296298, -515758, -640394]
38548f40394j7867J29757K76512K85739J37096k54j1505J9041K2440P8509J64324
38537D43398M3196l21648n15353k15639K36084K75791l1115j26533J19859K46704
38527A54744L3520j37031J3388J68211N863j99291m3623K78418K49654j40487
38517C83366l65898j46418J92483K44366N6595m6741L6842R1785o1489k88349
38507I6542k98936l7955K05522J45560j38474l20750k44579l7943J51789L02383
38497a76841L61940K05769j25905l49122k57360J3911J81150J48724K3312q1950
38487e6372j10440l0019J10896J63601M5513j31902k10116j86082j51320j05461
38477f61702J9851J87349K57109J77616N5994P35j5509p5238j53369j27340L3200
$$ y = [-640394, -658261, -528504, -251992, 33747, 170843, 170589, 159084, 178125, 200565, 279074, 443398, 486594, 164946, -350407, -566046, -329962, -54171, -85286, -211819, -91960, 154744, 188264, 51233, 64621, 232832, 238695, 39404, -4219, 274199, 523853, 383366, 17468, -128950, 63533, 307899, 364494, 317753, 354595, 446380, 384891, 96542, -202394, -240349, -34827, 110733, -27741, -348491, -593070, -631013, -479224, -176841, 185099, 390868, 264963, -84159, -341519, -327608, -146458, 2266, 25578, -56372, -166812, -196831, -85935, 77666, 123179, -8723, -218839, -404921, -556241, -661702, -641851, -454502, -197393, -19777, 36217, 36952, 21443, -53795, -207164, -334504, -301304]
38466c01304J73332J41914K7596N2112K10422K19279n8878l43343l02503l8910
38456b20283P8078k9728r7382o247M9208k9512l5861J53541K97081J58399q1368
38445B35926q8809J02920J68288Q827j29608p8513Q242o0193j95929j64227P2646
38434a20430K89386K57411j3693k99815l85058k47373l4601J17646J98604K39365
38424A442J94055N350k26472k74991o6748J66684J50905n8900j44410J1777J42564
38413i8744J0854j92566j17991J94597L58685K18081L3124O882k4851k35644m39860
38402b87433l60978o6818J51645K00375K04649K09265J29907l7679j83928k33915
38392b74910j70283J1781K18457K56619J02498J1096J37010K35145L0488k93427
$$ y = [-301304, -127972, 13942, 41538, 93650, 304072, 523351, 464473, 121130, -181373, -220283, -142205, -171933, -269315, -275562, -226354, -255866, -291727, -138186, 158895, 317294, 235926, 147117, 250037, 418325, 427152, 297544, 219031, 227273, 167080, -28849, -193076, -120430, 168956, 426367, 412674, 112859, -272199, -519572, -554173, -436527, -237923, 1442, 195497, 200847, -25625, -300616, -367364, -200680, -49775, -108675, -253085, -241308, -98744, -87890, -280456, -398447, -203850, 154835, 372916, 406040, 412922, 388071, 152427, -287433, -648411, -715229, -563584, -363209, -158560, 50705, 180612, 142933, -40995, -274910, -445193, -433412, -214955, 41664, 144162, 155258, 292268, 527413, 557901, 264474]
38382B64474l38989j00939O9065L2139j6209K4144J8206p6804j20477q0052o9126
38371c94568o0444Q6329K76341K35604k8342j97728j35127j6108P3293K26327
38361F5577L28018R1668l53012m42572j4651L54217J94846j54963j43106J25082
38351E1104J54842q8680j89907j0137J47343R2164m408J3594M1374l5759j23720
38340D7810q4308N3398J46956J14393R967l3703L8757R4851m0745l03807m13365
38329c69796k44023R227J35370J69517K13890K12132R2562m3439q0038q3180j43842
38318a31620j73731o3068R0244J19793N1045K4423N2868M3260j8188o6548p7417
38307a48939n9530p261M5753L0887k7088k3056L7706M5135J5579O6536J16722
$$ y = [264474, -74515, -175454, -106389, -74250, -90459, -66315, -48109, -124913, -245390, -325442, -394568, -455012, -368683, -92342, 143262, 114920, -82808, -217935, -234043, -160750, 65577, 393595, 485263, 132251, -310321, -324972, 29245, 224091, 69128, -73978, 51104, 205946, 117266, -72641, -82778, 64565, 156729, 152321, 165915, 207289, 171530, 47810, -36498, 16900, 163856, 278249, 288216, 254513, 293270, 388121, 347376, 43569, -369796, -613819, -604592, -469222, -299705, -85815, 126317, 218879, 175440, 95402, 12222, -131620, -305351, -368419, -278175, -158382, -107337, -82914, -30046, 13214, -4974, -71522, -148939, -208469, -215730, -169977, -139090, -166178, -189234, -151528, -106393, -90814, -24278, 92444]
38296I2444m9491l15463k47479K03670M54041R6732m24413m18515N7786L39987
38286b10701J36441j67540j68413O7249K55416K71364J52138l3311k06811k98386
38276b02554k75021j15855J39166K83400J17787j77032j65803J71776K98996n4915
38266A9945l79445j57930K59374K01349k04122k36400K00661M03002K4628l69894
38256b38832k20929K03386L25924J18883l4319j2285q968p6699m7329J12126J90405
38245C11363M3832j78206k13108j5204J75307J19727j07363k05615o4694Q4797
38235d9164L7262p7995m7560N9846M9292l3620j4815L9126p3900k67937k34351
38224f13816M5283K20228R2746j07861j05360M5659J28330J03090R5874J59680
$$ y = [92444, 42953, -272510, -519989, -316319, 137722, 234454, -189959, -608474, -550688, -210701, -74260, -241800, -410213, -342964, -87548, 183816, 335954, 302643, 95832, -202554, -477575, -593430, -454264, -170864, -53077, -230109, -395912, -224136, 74860, 19945, -359500, -517430, -258056, -56707, -260829, -497229, -296568, 106434, 131062, -238832, -459761, -256375, 69549, 188432, 154113, 141828, 132860, 56161, 8832, 120958, 311363, 355195, 176989, -36119, -51323, 123984, 243711, 136348, -69267, -133961, -49164, -11902, -89897, -137457, -77611, -28319, -61939, -76754, -37628, -111528, -379465, -613816, -568533, -348305, -255559, -363420, -468780, -423121, -294791, -191701, -95827, 63853]
38214F3853K04040J43303L0822m680K9707n8992l42997n19358k61927K12618L59299
38203a44312J37226Q0558L57231M17812k8351l84667j34453K09001n5526n63337
38193a08818m72757P5137K17050j11909j34794K88455L93494o1826l29976l1302
38183b77246J88053r5097k81262R7932M42129J49072k68857r8375K91489J37520
38173B85358l30632l18147J13718K01760j37798k02415K14359M63074J48132k71126
38163A66283k82092l4577P5443K2907L1847J73160L21392L16319R1208j98198
38153F83692k49280k1026J20316n5316k24615m4065J95673R522m11639m38284
38143d35022j2322K79037J61858K1500J55878L12270J95005q0821k73421l27002
$$ y = [63853, 267893, 411196, 442018, 437338, 467045, 408053, 65056, -454302, -716229, -503611, -144312, -7086, 73472, 430703, 848515, 820164, 435497, 301044, 510045, 454519, -108818, -581575, -506438, -289388, -401297, -536091, -247636, 145858, 84032, -245944, -277246, -89193, -184290, -465552, -367620, 74509, 223581, -45276, -143651, 147838, 285358, -45274, -363421, -249703, -47943, -185741, -388156, -173797, 289277, 437409, 166283, -115809, -150386, -74943, -52036, -20189, 152971, 474363, 790682, 881890, 683692, 434412, 413386, 533702, 478386, 253771, 209706, 405379, 414901, 3262, -435022, -447344, -168307, -6449, 15051, 170929, 483199, 678204, 597383, 323962, -3040]
38133c040k28111M0606K69163J70167j20034j46755J34280K44406k4671k48404
38123H7607p6766K04842J79593o1453j64786n3797J29840L08892L70009J10404
38113A034385l71334n63725k06479K44920K39474p5878j65214L0105Q5487j58533
38103I3208l88263l64094j97762k1730J89985L65863K93355l311j64836J9477
38093a78108K76097K20069j03397k87713j13821J76902K03676p6517l20724k35330
38083d38866M5584J43199m3140k01557o8861J87028K25320J9390j47323r7097
38073c76323O1762J52622J26274K8288o3071n4861O5076J59288J02737k0807m3275
38062A37710J2909j2264j14680j21114r387K6671q5325j44693j010J90509K12284
$$ y = [-3040, -231151, -190545, 78618, 248785, 128751, -18004, 116276, 360682, 336011, 87607, 10841, 215683, 395276, 333823, 169037, 115240, 245080, 553972, 923981, 1034385, 663051, 99326, -107153, 137767, 377241, 301363, 136149, 166254, 251741, 93208, -295055, -659149, -856911, -878641, -688656, -322793, -29438, -32749, -197585, -178108, 97989, 318058, 214661, -73052, -186873, -9971, 193705, 117188, -203536, -438866, -393282, -250083, -293223, -494780, -563641, -376613, -151293, -131903, -279226, -376323, -314561, -161939, -35665, -7377, -70448, -125309, -60233, 99055, 201792, 180985, 137710, 150619, 138355, 23675, -97439, -106826, -80155, -165480, -310173, -311183, -120674, 91610]
38051I1610J01403K7726Q245l6911o3654J3024Q6955k3872k40745k63089K082
38040b97226K75444K69460L9731j45147j47961m8403K4233J7749m3107r4531q4194
38029b33952j5899P9381J92903K81659K13757o6716l36785k85979L1469J87044
38019D6882m8129l69083l75891j12251J03689J82222K50387K76323J12381j18110
38009e1580q7358K17448M05455K30259r2593k55418k49672k17847j77249q7623
37999c66178R452Q8430J95664K83816K07449L417q3277O835L2897q3875m4410
37988B50220K87577M89625J56689l94937n11904j46532J20943k5646k54920j95705
37978b24590M0896J52048J04078N8439O3653M4188k5632r0564r5455l6655J2906
$$ y = [91610, 193013, 220739, 228984, 192073, 128419, 141443, 228398, 204526, -36219, -299308, -297226, -21782, 247678, 287409, 142262, -5699, -54102, -29869, -12120, -55227, -149758, -233952, -249851, -170470, 22433, 304092, 517849, 451133, 114348, -171631, -140162, 46882, -1247, -370330, -746221, -858472, -754783, -572561, -322174, -45851, 66530, -51580, -138938, 78510, 483965, 714224, 621631, 366213, 116541, -101306, -278555, -366178, -356726, -268296, -72632, 211184, 418633, 422050, 338773, 345608, 378505, 294630, 250220, 537797, 1027422, 1184111, 789174, 277270, 130738, 251681, 226035, -28885, -224590, -183694, -31646, 72432, 130871, 194524, 238712, 213080, 122516, 27061, -9594, 3312]
37967C312m5049j71406j68677L0551J81771N8380j65759j60340L9472J16577J8094
37956b63074R31J19713J15367q8242k12532j11170j5257q0382q7777J25161K95909
37945b01353J40159j55649k07366qJ61119J21167j4348j27962j67790p0060J47442
37934c74649L01010K60266J43209J02700P3508m9610j57818j17607n3005j40721
37924a2717k57702j53675J19792K72078K00239N4986n1711j07051m6130J35651
37914A53760J96738o1966l80423l17086P1838K74129R0100j12947n0312N3553
37904h2616o0426k05479q9370J77505K87422K25727J86612J63441M280k14969
37894C92127k50252j08392n9188j84444k35492n0061J68018J61519M893m1688
$$ y = [3312, -41737, -213143, -381820, -351269, -169498, -111118, -276877, -437217, -397745, -281168, -263074, -262143, -142430, -27063, -115305, -327837, -439007, -454264, -534646, -622423, -497262, -201353, -61194, -216843, -424209, -424217, -263098, -141931, -156279, -284241, -452031, -522091, -374649, -73639, 186627, 329836, 432536, 506044, 456434, 298616, 181009, 128004, -12717, -270419, -424094, -304302, -32224, 168015, 223001, 171290, 64239, 18109, 153760, 350498, 288532, -91891, -408977, -337139, -63010, 27090, -85857, -136169, -82616, -143042, -348521, -437891, -260386, 27036, 252763, 439375, 602816, 607096, 392127, 141875, 33483, -25705, -210149, -445641, -495702, -327684, -166165, -161272, -202960]
37884b02960O0302J05176l064j04566n2626N6868N2245m5695q7424m7924j9189
37873b88857J5097J57133L17217K36024q8598k74556q1437J83188J03423j87336
37863I1298j99627J41911L79717K24038o8570j70644j37390j46451j25298M6881
37853C5865K08565J29339q7241j32577M5304J86306J02065j08547k26941j35466
37843A6672J11062L09086K51629l7547k90386l11328j83078n1744R6247K62293
37833A72906K63415J3004k09117j14939R8194K0973k70987k72762J40089M49332
37823B90108K49392j60334k58184n2459M7556p8101j38184K3642J60230L0239
37813A13905k04999k10678L2268J98794P4717j58964j96279k5675R5352L3757
$$ y = [-202960, -142658, -37482, -40546, -145112, -197738, -140870, -88625, -134320, -221744, -269668, -288857, -273760, -116627, 200590, 436614, 348016, 73460, -7977, 175211, 278634, 91298, -108329, 33582, 413299, 637337, 568767, 398123, 260733, 114282, -11016, 35865, 244430, 373769, 286528, 153951, 199255, 385561, 487626, 379079, 152138, 16672, 127734, 436820, 688449, 650902, 360516, 49188, -133890, -185634, -89387, 172906, 436321, 449325, 240208, 125269, 223463, 244436, -26551, -299313, -159224, 290108, 539500, 379166, 120982, 68523, 116079, 37978, -100206, -76564, 83666, 113905, -91094, -301772, -269504, -70710, 4007, -154957, -351236, -376911, -281559, -247802]
37803b47802o4567m8240L1367Q7556J56453K27771J38402j32480k70678m4228
37793a66446K54618J74761j90268l18000o2316J50965L1301j65024j37092n216
37783d32717J5650K6553J85221L40151K79847J05908J9858l6257j86212k90078
37773B7924j76675m778p353o6867L8269J50822j8390l01122k70417L4247J51014
37762d43326k1424q0747J30797K38074J7331j95415j03062M7014m2847j52536
37752f06141N0245L63495L37230P210j77637o6294M7720j7882q9655k9579K4655
37741a56633l7462o3522R8820L03834K70925m1083l61436l94459j29002J44583
37731c65435J58798Q005L2235L01008M27163J01949l76359m47685p7747K02376
$$ y = [-247802, -312369, -360609, -329242, -241686, -85233, 142538, 280940, 148460, -122218, -166446, 88172, 262933, 72665, -245335, -307651, -156686, -125385, -290409, -427501, -432717, -417067, -390514, -205293, 134858, 414705, 520613, 540471, 504214, 318002, 27924, -148751, -153529, -160882, -227749, -189480, -38658, -57048, -358170, -628587, -594340, -443326, -464750, -545497, -414700, -176626, -159295, -354710, -457772, -410758, -453605, -606141, -555896, -192401, 144829, 152039, -25598, -91892, -44172, -62054, -151709, -181288, -156633, -194095, -257617, -158797, 145037, 415962, 374879, 13443, -381016, -510018, -365435, -206637, -198632, -166397, 134611, 561774, 663723, 287364, -160321, -238068, -35692]
37721c5692Q3913j13566j2036K20410J66104j69405l67321k10113O3503J57411
37711b16792Q5915L5173P0676J26446J46001R4610o5423k69869l06826m8990L01686
37700d7393L88725J48015j01337r5193K1380n6199l05271l74253p2714L47175
37690a47065M91644K70722o7589k57209k45449j46422q2820r3659j33808j32283
37680e43938o0958N1709J63146K36769K21812P6707j50137l06259k54816j0192
37670e76157K56943L49494K05046l9094j68956j24909o3626j24143k08731j32403
37660f26536O4969J53320O3665j6760L3164P7804r561r4981P054K21143L22306
37649A95587K54497J20762n3467k91528m41698k71987J53088M38344L22936O24
$$ y = [-35692, 48221, -65345, -77381, 143029, 309133, 139728, -227593, -437706, -374203, -216792, -130877, -95704, -25028, 101418, 247419, 342029, 276606, 6737, -300089, -349079, -47393, 341332, 489347, 388010, 292817, 314197, 257998, -47273, -421526, -494240, -147065, 344579, 615301, 547712, 290503, 45054, -101368, -184188, -277847, -411655, -543938, -604896, -553187, -390041, -153272, 68540, 145247, -4890, -311149, -565965, -576157, -319214, 30280, 235326, 196232, 27276, -97633, -161259, -285402, -494133, -626536, -561567, -408247, -344582, -361342, -328178, -250374, -259935, -354916, -347862, -126719, 195587, 450084, 570846, 517379, 225851, -215847, -487834, -334746, 103598, 426534, 427158]
37639D27158j60151p6087L6582K5841j3594M6248J20630J5362k47746l65268j26564
37628c17589K38475K90776k9528k88398j49314J61782K15132Q081j01142m834
37618B3441R901k03291l43907j03020L48345N63811L74956J3231k38482l06162
37608A38823k60221j66553m3163J08036K44540K62777J04702j10796j88330j20631
37598c0816r2977j65271j61054o38R2495n6014k21419r3503K05424K86636J08326
37587a28811P073R6900Q7035j55708k99037p8423K16679J59063j56269k71996
37577e23494n0603K02605K42493J33628j495j27556j49398L8376K75759K40012
37567B80327o1576k24664l2695K09888J55755o2738r4693N3376N8425j83190l83792
$$ y = [427158, 267007, 190920, 227502, 253343, 239749, 285997, 406627, 421989, 174243, -191025, -317589, -79114, 211662, 182134, -106264, -255578, -93796, 121336, 129417, 28275, 23441, 33342, -169949, -513856, -616876, -268531, 295280, 670236, 683467, 444985, 138823, -121398, -287951, -331114, -223078, 21462, 284239, 388941, 278145, 89815, -30816, -123793, -289064, -450118, -450756, -358261, -414275, -635694, -729197, -523773, -237137, -128811, -121738, -24838, 62197, -93511, -392548, -470971, -254292, -95229, -251498, -523494, -574097, -371492, -128999, 4629, 3134, -124422, -273820, -235444, 40315, 280327, 218751, -5913, -38608, 171280, 327035, 264297, 169604, 222980, 281405, 98215, -285577]
37556b85577k55742J34111M38491L58548o0087l92291k29611K84232N15299J18484
37546F25857m71780o01942k37404J23836K10062J91905J96647J04120q9573j51501
37536i9773j7336N9380n5573j39727k4496Q5680l2475k20292j83308N6882K31676
37525c39362K06962O6260o4550q9453K5800J40143L1642k41286l03470R457L41643
37514b16214L08822N8770m347J37994J58473l5966j81867j19433j2091m2461j63062
37503a11382k10110p0214K53783N51085M63643r3514o52313o56902j69992K30384
37493d65532K37722J02138Q8521R4256k0574j09864r242J48909J47759J6048p4430
37482A55711p3430k7116M7030R3215M648j56358j31878J38499L17106J21076k19773
$$ y = [-285577, -541319, -407208, 31283, 389831, 329744, -62547, -292158, -7926, 507373, 625857, 154077, -447865, -685269, -561433, -351371, -159466, 37181, 141301, 51728, -99773, -117109, -57729, -113302, -253029, -277525, -191845, -224320, -444612, -627920, -571038, -339362, -132400, -66140, -130690, -220143, -194343, -54200, -22558, -263844, -567314, -557857, -216214, 92608, 151378, 147031, 285025, 443498, 407532, 225665, 106232, 94141, 51680, -111382, -321492, -391706, -137923, 413162, 876805, 783291, 130978, -525924, -695916, -465532, -227810, -125672, -37151, 57105, 36531, -73333, -82575, 66334, 214093, 230141, 155711, 82281, 55165, 102195, 195410, 200058, 43700, -88178, 50321, 367427, 488503, 268730]
37471B68730k79566o8455K7739j15759j94428j3355J84497J23069n6887k2516
37461a46931K32856L78311K14225r2195k82105l16820l08258k80817j66437J4967
37451g53204J39937J70246K10701L06292L11185R0973k24596l54021k11661J1053
37441c03095J23060J30530J05415L0154r9112j43731J9619K62568L13325J12008
37431E50741j16960j97323k19781l05591l28146j02392K36069L32607J18114q2586
37421a15248n3948L287j19714k18619j2022L06567K96252l0732k08080m2007J41292
37410e2972R8408L7568J48664K06665j6331k97105l00728r8133L6172R5670K05524
37399F3402K35519N516k70852k17121J04431K60882Q1090j87407l17356k90986
$$ y = [268730, -10836, -79291, -51552, -167311, -361739, -375094, -190597, -67528, -124415, -146931, 85925, 464236, 678461, 586266, 304161, -12659, -320917, -601734, -768171, -753204, -613267, -443021, -232320, 73972, 385157, 476130, 251534, -102487, -314148, -303095, -180035, -49505, 55910, 86064, -13048, -156779, -137160, 125408, 438733, 550741, 433781, 236458, 16677, -288914, -617060, -719452, -483383, -150776, -32662, -115248, -169196, -165909, -285623, -504242, -516264, -209697, 86555, 55823, -152257, -194264, -52972, 45436, 83004, 231668, 438333, 422002, 124897, -175831, -273964, -237792, -142122, 63402, 298921, 304437, 33585, -183536, -79105, 181777, 262867, 75460, -241896, -532882]
37389e32882q6501K87404N41981L42650j51420l99775j99944J07333K07374J54741
37379B70961O1802j06068k80688k52144l7597R2329P6172J31207K46656J09145
37369C11775k70529l91632l2085L18297J87179j57951j79062R2149J86677n0591
37359A4227l02502k53018J16459N72788P33407L42052l27722o35126l81635q4902
37349b05972j47757k32232P4273M47470L32366r1364j94344O0890J36019j05072
37339G4277k05865M4005K90735K68490J34927J0916k01276l78605j89004K33967
37329H2567K70211k17266n17825j12595M83515M73125o4957l99527k54914l3903
37319b91569k1597L882K45408M53529K79962j79924m50880k43056J88577L21466
$$ y = [-532882, -619383, -331979, 210002, 552652, 401232, 1457, -198487, -91154, 116220, 270961, 332763, 226695, -53993, -306137, -343734, -251405, -175233, -44026, 202630, 311775, 41246, -350386, -382471, -64174, 123005, -34946, -214008, -121859, 64818, 14227, -288275, -541293, -424834, 147954, 881361, 1223413, 895691, 260565, -121070, -205972, -353729, -585961, -511688, -64218, 268148, 176784, -17560, 43330, 179349, 74277, -131588, -87583, 203152, 471642, 606569, 617485, 416209, 37604, -151400, 82567, 352778, 135512, -382313, -494908, -11393, 461732, 396775, -2752, -257666, -291569, -313166, -309284, -63876, 389653, 669615, 489691, 38811, -204245, -15668, 305798]
37309C05798p860l76156l02786J08212L24853J49136m7895M9093K32023J69323
37299F03741n4181j32543m8901k6508r8301q0243O6445J53165O3781r0016j41529
37288B14910m4595J17957J91747P2263j35045j83832k1372J05532J8344j22910
37278B12999j16815n9645j04381j00637J43821L99100K65671j62734l61531j43651
37268b7803R2776O754k27381k97591k02945p6649J02696L29785L81448J33201
37258B14291j40524j10132J22538K06120Q2908L062O0183O8936p1220k05085j96407
37247C4670j21306q2878l5446Q3602J91924J57608j6704j82780j82238J7776K65858
37236A30086L22036R8397k14102l46003k41053n4643P0168Q9087o402j54161j74364
$$ y = [305798, 297938, -78218, -381004, -272792, 52061, 201197, 153302, 202395, 434418, 603741, 549560, 417017, 368116, 341608, 243307, 163064, 229509, 382674, 446455, 356439, 214910, 170315, 288272, 480019, 552282, 417237, 233405, 212033, 317565, 335909, 212999, 96184, 36539, -67842, -168479, -24658, 374442, 640113, 477379, 115848, -27803, 64973, 71727, -155654, -453245, -656190, -732839, -630143, -300358, 81090, 214291, 73767, -36365, 86173, 292293, 375201, 378263, 438446, 507382, 436162, 231077, 34670, -86636, -169514, -204960, -121358, 70566, 228174, 211470, 28690, -153548, -135772, 130086, 452122, 550519, 336417, -9586, -250639, -305282, -235114, -146027, -152429, -306590, -480954]
37225d80954L2939K73237K70424P6586K731J29404J97358O2776o7547j3097P3091
37214E56948n313j46585j53832p0344m7282n2885J3223O8394p143j04080n4472
37203c371N0474K0742o3968P539J49241P7553j73407k46225l5598J30935K8462
37192e7623j20418n2173J00598O0222j27840j83012l2729J10389Q8573k336J2121
37181b04228J45117K36681J41818q4310k07234p0934J84500K58597M9974k24102
37171B25879k94591j36053M1717M2398r4090j14949J31680M08616L07510j59492
37161C58625m61676k68926L2684o4345l40847j73143M07743O66187K76061j90860
37151B41503j70910J06059J51636K1105N0276J65876M5111k45146l20929j03390
$$ y = [-480954, -448015, -174778, 95646, 172232, 174963, 304367, 501725, 564501, 496954, 483857, 556948, 551635, 405050, 251218, 180874, 133592, 80707, 93930, 162324, 155181, 51101, -3371, 47103, 67845, 3877, 11416, 160657, 238210, 64803, -181422, -217020, -86085, -57623, -178041, -230214, -129616, -69394, -197234, -380246, -412975, -302586, -214013, -216349, -204228, -59111, 177570, 319388, 235078, 27844, -43090, 141410, 400007, 449981, 225879, -68712, -204765, -163048, -120650, -214740, -329689, -198009, 210607, 518117, 358625, -103051, -371977, -339293, -403638, -744485, -917628, -509885, 156302, 432363, 241503, 70593, 176652, 328288, 349393, 399669, 565545, 610656, 365510, 44581, -58809]
37141e8809J00801R8841q601j09386j76250j20120J01808K66778J23491j76212
37131D2341k33590J2933K15236J57432J7611L180M4676o354j15393j52255q9709
37120a03892p797J1398m1881p1390L7440K15682K16674m1655k94154k74792p5020
37109d29387P1539J61328K78105K86497N8505j62688p8440J14564O010k76579
37099B9454k02333K47349M50685J11015k78267k36080J0707L6955o9920q59J52516
37088B51222J00377p5502p3888O8908O1987j06537j78955j06284p4784q4763N3591
37077a64628K79191K72350j4026k12487q3539J46288J78309O7152J5967j945j27899
37066C54733k82270k47053l1193J13515O1276k3501L6088J61027J53136K032r8279
$$ y = [-58809, 41992, 140833, 132232, 22846, -153404, -273524, -171716, 95062, 218553, 42341, -191249, -178316, 36920, 194352, 211963, 215143, 259819, 253465, 138072, -14183, -103892, -111689, -100291, -142172, -213562, -176122, 39560, 256234, 214579, -79575, -354367, -429387, -357848, -196520, 81585, 368082, 426587, 263899, 185459, 300023, 306033, 29454, -172879, 74470, 525155, 636170, 357903, 121823, 132530, 169485, 99565, 98706, 251222, 351599, 276097, 202209, 271117, 333104, 226567, 47612, -58672, -133456, -218219, -164628, 114563, 386913, 372887, 160400, 76861, 223149, 401458, 468610, 484577, 482632, 354733, 72463, -174590, -205783, -92268, -30992, -54493, -18405, 142622, 295758, 297790, 199511]
37055A99511l1161P9990N5410q2279j41089k5272J47869K19217J68362O4341o5124
37044E89775k11060k90763k07771j725J68531K08874J67043J09507K8328p6520
37034D84219j24687o3540J5823j2711j14977j35273l0910O8035P0417M9776P0991
37023B77163L5650j41396l02354k07254R6867K85109J77964l9762j09460l3052
37013C9475J2832l7043r3167q2174k3176L4169N3538K6783L962M8867J18346Q4197
37001A86609n9618j33779j6873J67471K26914J49826M3846n7909j63583j92087
36991A50817o0967J50371K79590K62415J09331j73739m64048m71540p6785L77564
36981H3009M35822J23708j21435r5683m1673j57452k71407j81087j232O1768M7397
$$ y = [199511, 168350, 248340, 303750, 221471, 80382, 55110, 202979, 422196, 590558, 654899, 589775, 378715, 87952, -119819, -121544, 46987, 255861, 422904, 532411, 560739, 484219, 359532, 295992, 311815, 299104, 184127, 48854, 17944, 85979, 156396, 206172, 277163, 312813, 171417, -130937, -338191, -241324, 43785, 221749, 181987, 72527, 39475, 52307, 15264, -77903, -160077, -183253, -149084, -95546, -68763, -64801, -15934, 102412, 186609, 126991, -6788, -23661, 143810, 370724, 520550, 564396, 506487, 342904, 150817, 89850, 240221, 519811, 782226, 891557, 717818, 253770, -217770, -294555, 83009, 518831, 642539, 521104, 425421, 383748, 226296, -45111, -226198, -227430, -165662, -118265]
36970a18265J03200J87084J64045P5284N6657P0992k1826j63702j28999J08394
36960C32864K73324J58256q3130j57442l2786N9422j3722j15543q7645k48p744
36949C25606o0836K2609K13228K37247k1298k96295k81072l4960J50427J68453
36939D23109J43330J32087N2105q6589j33418n0330M066o0647j09026j2774J19737
36928D21650J06697k2530p8442K177Q4817N9913K797N5999K31127L93753M10302
36917A668260K62251N6249q768K62233Q35259J287192J080992J74537p89066j128692
36907C700447q62651n34626m15434k89695m4350M3876j67699l32400j48666J04702
36897A053504R324k84222k96453n204J57066M7329q724J36670J72885p7422k54721
$$ y = [-118265, -15065, 172019, 336064, 411348, 468005, 538997, 517171, 353469, 224470, 332864, 606188, 764444, 681314, 523872, 491086, 550508, 536786, 421243, 333598, 333350, 325606, 264770, 287379, 500607, 737854, 716556, 420261, 139189, 104229, 254656, 423109, 566439, 698526, 750631, 664042, 530624, 480294, 484360, 423713, 314687, 301913, 421650, 528347, 505817, 427375, 429552, 514369, 574282, 577079, 633078, 864205, 1257958, 1668260, 1930511, 1986760, 1977992, 2240225, 3075484, 4362676, 5443668, 5618205, 4829139, 3700447, 2837796, 2303170, 1887736, 1598041, 1553691, 1597567, 1429868, 1097468, 948802, 1053504, 1062828, 778606, 482153, 476949, 634015, 681344, 672620, 809290, 982175, 904753, 650032]
36886F50032m691L99941L97168n5465m11795k78224J11999K89354J74266Q4527
36876A357112K02448L06725J39034j68548k65654r2115O7423M2171j1902N3436
36866A630130J28496R5059O2998J49380K41922J94079N0691j17654l65556o34887
36856A434658o39736k79316R2315J36734K0670P2165K04707J22006j13934k00408
36846H49861j25251r6471p6136J06271K87810J67428j04456j10786Q5597L839
36836I87706l93957n50537j90210K54817L43077K11113J64228J55181J8990j48621
36826H51787j91565j81335k08935j49865Q6937L04364K76593Q8527m087Q7966
36816I60387K54132L53496K95680Q1821j52149k48019k03840j25805o1029l3559
$$ y = [650032, 645341, 1045282, 1442450, 1386985, 975190, 696966, 808965, 1098319, 1272585, 1357112, 1559560, 1866285, 2005319, 1836771, 1571117, 1479002, 1546425, 1588596, 1576694, 1630130, 1758626, 1853685, 1916683, 2066063, 2307985, 2502064, 2552755, 2435101, 2069545, 1434658, 794922, 515606, 607921, 744655, 765325, 837490, 1042197, 1164203, 1050269, 849861, 724610, 628139, 552003, 658274, 946084, 1113512, 1009056, 898270, 983867, 987706, 593749, 43212, -146998, 107819, 450896, 662009, 826237, 981418, 1000408, 851787, 660222, 478887, 269952, 120087, 207024, 511388, 787981, 876508, 872421, 960387, 1214519, 1568015, 1863695, 1945516, 1793367, 1545348, 1341508, 1215703, 1154674, 1121115]
36806A121115j20309k70188k21868R9831L13746J00290k30111j84314J01198J08872
36796H18262j44571j63907R2421J27429j54661k35123P0813K44187j7402k46763
36786C90685j4132L62692M11555K49752K13648K23640N2808j60056j75550j09194
36776A445848j59769j78437M8947L45609L79805J45876j25214l11181l65281j96946
36766A029257J24847K98440J79594m192l4432O732K3184J25542L27627L78160
36756B454759J51743j20375k31200k64049k86344j74735M2874Q9253q8961j71504
36746A401461j3121J02195q238j01755K5540J99624K40059K22750J60485r0212
36736B138788m02899l96814q3006P6669m9590o4832J61353K17751m9779k16442
$$ y = [1121115, 1000806, 730618, 508750, 608581, 922327, 1022617, 792506, 608192, 709390, 818262, 673691, 509784, 602205, 729634, 574973, 339850, 410663, 654850, 637448, 390685, 376553, 739245, 1150800, 1400552, 1614200, 1837840, 1890648, 1730592, 1555042, 1445848, 1286079, 1107642, 1156589, 1502198, 1882003, 2027879, 1902665, 1591484, 1226203, 1029257, 1154104, 1452544, 1632138, 1627946, 1593514, 1600246, 1623430, 1748972, 2076599, 2454759, 2606502, 2486127, 2254927, 1990878, 1704534, 1529799, 1572673, 1661926, 1572965, 1401461, 1388340, 1490535, 1482297, 1380542, 1406082, 1605706, 1845765, 2068515, 2229000, 2138788, 1735889, 1339075, 1256069, 1332738, 1283148, 1218316, 1379669, 1597420, 1547641, 1331199]
36726A331199q4072l2486k04328j63929K08626L48200K2661j71268J03954K67401
36716A625958q1537l38721K7071M50942K37751k30268k19930R8095J07565j20420
36706A556506j17208N8001P9321O9982K32298K61953p6337l26791p6527K68388
36696A929586K17017O3531K14911L35928L1950l03624k11341k9554j51700j90148
36686A906556J94342M62130J77907o6535K38501M58569K3770l32774J34296O87333
36676C884095L70578k34110j14919K77397j6206n17547j87588N36036N03591l5948
36666D465379l1312L23138J25885k76863P3424P43016O17400M2218J49605O64128
36656F896018N54842J99966O15265J253687R87925M84150J030682J920834J794079
$$ y = [1331199, 1247127, 1214641, 1010313, 846384, 1055010, 1403210, 1425871, 1254603, 1358557, 1625958, 1544421, 1205700, 1232771, 1683713, 1921464, 1691196, 1471266, 1569361, 1676926, 1556506, 1439298, 1497299, 1576620, 1646602, 1878900, 2140853, 2064516, 1737725, 1661198, 1929586, 2146603, 2210134, 2425045, 2760973, 2792923, 2489299, 2277958, 2248404, 2096704, 1906556, 2100898, 2563028, 2740935, 2674400, 2912901, 3371470, 3395240, 3062466, 3196762, 3884095, 4254673, 4020563, 3905644, 4183041, 4166835, 3649288, 3461700, 3997736, 4501327, 4465379, 4434067, 4757205, 4883090, 4606227, 4679651, 5422667, 6040067, 6082285, 6231890, 6896018, 7450860, 7650826, 8266091, 9519778, 10507703, 10991853, 12022535, 13943369, 15737448]
36647A5737448J525285K660623M158136M213825M033526N756907Q105646Q869776
36639E5061172J0080874J4869465K0983416K5058052L1608603M6494597N9822715
36632B63978894M9134026P995528l8852508o0119536n1568771l4278825k4911610
36625A11377198k1328404j6279747j0642011q202621p527045n563459l369611
36618C8464300l029298l183625j840063j22642K81963L85698J665431L340960
36610C5962724M336389N199211N946886N009155K492905J345384K817874L866912
36602F6977440J796527j419601k335393p54287J796505N379859R571117J0471579
36594I1483746M509413n621811j2953959j4052386j1499843q886719o946373n151792
$$ y = [15737448, 17262733, 19923356, 24081492, 28295317, 32328843, 38085750, 46191396, 55061172, 65142046, 80011511, 100994927, 126052979, 157661582, 204156179, 263978894, 313112920, 321108448, 282255940, 222136404, 170567633, 136288808, 111377198, 90048794, 73769047, 63127036, 54924415, 47397370, 41833911, 38464300, 35435002, 32251377, 30411314, 30288672, 30570635, 30956333, 32621764, 35962724, 40299113, 45498324, 51445210, 56454365, 58947270, 60292654, 63110528, 66977440, 68773967, 67354366, 65018973, 64264686, 66061191, 71441050, 81012167, 91483746, 95993159, 90371348, 77417389, 63365003, 51865160, 42978441, 36032068, 30880276]
36586C0880276l823488l249853k803999k101400j638764j631452j504528r92853
36578A3133939n55423l77421q6229L19047L51877L5079k1352L20207N67590N92008
36568A4279322Q18923J344738J782083K065104K556718L309128L989414M453189
36560C4598619M567385L653125J152600k138498m519023n211362m897747m389360
36552B2815739l727077k814114k009312j644108j551703j422302j191895q95029
36544G560199n48494k95507k91087m12822m25790l48351k90248j28020K03534
36535E023414L56575P9041j79183J45613P34786P53048J21002l80425l01540l2848
36525F319483K671p8896q8870j56588l53780m26937j84611K14157N30486O73011
$$ y = [30880276, 27056788, 23806935, 21002936, 18901536, 17262772, 15631320, 14126792, 13133939, 12578516, 12201095, 12114866, 12433913, 12785790, 12820869, 12799517, 13119724, 13687314, 14279322, 15098245, 16442983, 18225066, 20290170, 22846888, 26156016, 30145430, 34598619, 39166004, 42819129, 43971729, 41833231, 37314208, 32102846, 27205099, 22815739, 19088662, 16274548, 14265236, 12621128, 11069425, 9647123, 8455228, 7560199, 7011705, 6716198, 6425111, 6012289, 5586499, 5238148, 4947900, 4819880, 5023414, 5379989, 5459030, 5279847, 5425460, 6160246, 6913294, 7034296, 6653871, 6352331, 6319483, 6322154, 6243258, 6154388, 5997800, 5644020, 5217083, 5032472, 5246629, 5777115, 6450126]
36515F450126N83049K63314l8552o7285J0083j58982m62299m24973l749K77645
36505F428377J23639j29570r6745J56846M22212O92459R24671Q52393L48628l09239
36495I413671p81224j007684j034537q32441n21761m35168o53999p78834m99358
36486B868665j22388j24071l82622l54549M7215K84184K6922l21201k40834J10376
36476A791697J57622j99155m41687k22806J52609K36662O1213n1114k4206j3942
36466A446893m2365l0804p0009k56180l57271r3326K99133K88455j30237l64200
36456F90089j03136K57144K88059J18495M6119J6190j26626k36015j30937J6100
36446H35482l6157j48489l3950K28732K95191O6951k19374l40619k65143o0390
$$ y = [6450126, 7033175, 7296489, 7257937, 7190652, 7200735, 7041753, 6579454, 6154481, 6150732, 6428377, 6552016, 6422446, 6325701, 6482547, 6904759, 7597218, 8521889, 9374282, 9722910, 9413671, 8632447, 7624763, 6590226, 5757785, 5236024, 4800856, 4146857, 3368023, 2868665, 2746277, 2622206, 2239584, 1885035, 1932250, 2216434, 2243356, 1922155, 1681321, 1791697, 1949319, 1750164, 1308477, 1085671, 1238280, 1474942, 1536155, 1485041, 1460835, 1446893, 1404528, 1373724, 1303715, 1047535, 690264, 596938, 896071, 1184526, 1054289, 690089, 586953, 844097, 1132156, 1250651, 1296770, 1312960, 1186334, 950319, 819382, 835482, 799325, 650836, 616886, 845618, 1140809, 1207760, 988386, 647767, 382624, 322234]
36436C22234J56783K47735J88653R3194K2835n3993o9976R0977K70262J24409
36426A393113l07292n24747k81146M0364N2923o2197J1963J36826L5700j37083
36416C58424p6677P5408k9813k80291k33541J51331M30499L38909R8113R011R3264
36405I34637K02425K15117Q9858r0282j62034j15998j48920l16876l60509j19786
36395A27632J27046O4963j40727j08098J53179K97773J96481N0088J7229N9002
36385H44568J00050P8344p2342k66753k64688m7222O0161q4159j21477K07005
36375D33487M98218K54805k69199m08372r1178J44088N0733o6182K300Q6107P6942
36364G11749Q7172Q1365j12409l41011k31285J39700K61174K3059q4045J66019
$$ y = [322234, 479017, 726752, 915405, 1008599, 1031434, 977441, 907465, 998442, 1268704, 1393113, 1085821, 561074, 279928, 320292, 373215, 311018, 322981, 459807, 495507, 358424, 281747, 357155, 327342, 47051, -186490, -35159, 395340, 734249, 832362, 841373, 934637, 1137062, 1352179, 1442037, 1351755, 1189721, 1073723, 924803, 607927, 247418, 127632, 254678, 319641, 178914, 70816, 223995, 521768, 718249, 768337, 785566, 844568, 944618, 1022962, 950620, 683867, 419179, 371957, 432118, 347959, 226482, 433487, 931705, 1186510, 917311, 508939, 417761, 561849, 612582, 546400, 548700, 634807, 711749, 798921, 880286, 767877, 426866, 195581, 335281, 596455, 619514, 535469, 701488]
36354G01488L12047J4565l14488j99882P7380k7775l61016l02777J78095M16987
36344D94624P8073l34221k41714J98964M11374K17765n8125j54807j35583j02037
36334C74313j6671R4421P8576m9494l9233J63531K08450j29233m75072l34311
36324a24723J35057L29533J00066j08601m3074K4954r6513j60745j965J07620
36314A61609l0013j31690O0027K72259J55772r9674q8215J42068K33681J34172
36304H09996Q1113J07872K9490j45145k01546r8899j8391m3099o9932k7921L2903
36293D56441M2567l8486j82803k26077j5028K94153L45191R2921j10761o4673
36283E93445K4226j1758k7801M8334K0247j30096q5207K17801L49348Q5271j84180
$$ y = [701488, 1013535, 1028100, 713612, 513730, 591110, 563335, 202319, -100458, 77637, 494624, 572697, 238476, -3238, 195726, 607100, 824865, 766740, 611933, 476350, 374313, 357642, 452063, 530639, 481145, 441912, 605443, 813893, 684660, 209588, -124723, 10334, 339867, 439933, 331332, 288258, 313212, 216699, 55954, 53989, 161609, 131596, -94, 59933, 332192, 487964, 388290, 300075, 442143, 675824, 809996, 891109, 998981, 1028471, 883326, 681780, 582881, 564490, 521391, 451459, 423538, 456441, 499008, 460522, 277719, 51642, 36614, 330767, 675958, 768879, 658118, 593445, 617671, 605913, 578112, 626446, 646693, 516597, 431390, 649191, 998539, 1083810, 899630]
36272H99630j27784k212p1120p4746K04818M09188K02005j19814j73766j15643
36262A030556j59425p0748K51869L30632p7268l73463n5725M13820M41173K69419
36252B000840K96239K30958j57758l29048M173J29049k87257k67676O75594J215384
36242C510498M41192j27215R32313K026568J298327Q59973L953174Q281971P336215
36233B8513016k55191p508138p924416l564400q18124j422615k094639j067070
36225C858423j24519m82842q64177l48053Q0763k49526m54195J8260L25292p6608
36215A682818m35522j90917Q4147n5265j19262J93121L44066N3193j45001M026
36205A415404j3231l48139l59276J26072L17471j28605l88680Q0406N09706J38090
$$ y = [899630, 771846, 769634, 698514, 623768, 828586, 1237774, 1439779, 1319965, 1146199, 1030556, 871131, 800383, 1052252, 1382884, 1305616, 932153, 876428, 1290248, 1731421, 2000840, 2297079, 2528037, 2370279, 2041231, 2045404, 2174453, 1887196, 1619520, 2295114, 3510498, 3951690, 3824475, 4756788, 6783356, 8081683, 8941656, 12894830, 21176801, 28513016, 28257825, 20749687, 12825271, 9260871, 8442747, 7020132, 4925493, 3858423, 3733904, 3251062, 2386885, 2038832, 2119595, 1870069, 1415874, 1434134, 1759426, 1682818, 1247296, 1056379, 1140526, 1085261, 965999, 1159120, 1503186, 1556379, 1411378, 1415404, 1402173, 1054034, 694758, 820830, 1138301, 1009696, 621016, 701422, 1211128, 1349218]
36195A349218m45831l08677K99644M98515K32407J02703J91503R4692j39427p1675
36185A803072K39441K60121j03215l23735p2412L45241M84166K79398k5948j89793
36175B696336j62912j38117l40734o51255o44423j88902K60934K47583p1528k25367
36165G81615j22220l9053p0459l5297R5128R7897q5905j81301L631K32565J44044
36154H20645k08684l71815r0676L12466L43147Q14k44044j39371L5241j1627j22268
36143C23828l8882J18913J20172Q2222J91741K23319q3466l69654q9422M85522
36133I64293N00696j56665o11673l40846Q2016K2463k22166j06032J51903L9670
36123C23659k26510m1146M66142N32940k7707n26725m46935r7152L2129j6254
$$ y = [1349218, 903387, 594710, 894354, 1392869, 1625276, 1727979, 1919482, 2014174, 1874747, 1803072, 2042513, 2302634, 2199419, 1875684, 1803272, 2148513, 2632679, 2912077, 2886129, 2696336, 2533424, 2395307, 2054573, 1403318, 758895, 569993, 830927, 1078510, 1006982, 781615, 659395, 620342, 549883, 514586, 609714, 707611, 621706, 440405, 444036, 676601, 820645, 611961, 240146, 149470, 461936, 805083, 805897, 561853, 422482, 457723, 446096, 323828, 284946, 403859, 524031, 606253, 797994, 1021313, 937847, 568193, 478771, 964293, 1464989, 1308324, 696651, 355805, 437821, 460284, 238118, 132086, 283989, 323659, 97149, 56003, 522145, 1055085, 1027378, 500653, 53718, -43434, -11305, -27559]
36113b7559M9481J93488J63304n1687k12073j71769P195K11402L67550M16975
36103I46307L28977J38884p1031k08760k08861j04288l2722o8344q8689M6254
36093F77727K20697J72334j06570k97917j76414Q6755J63951k5258k78315l68141
36083F8849k21289O1079K51125J71024o7101j29061R4374K72343Q7901k44689
36073C44555k48903Q8886K69329L5486k32941j08961K43722L59209J53676p0142
36063H33916j58655k27662k91913j97135K1625R4856m9120j37399J5728K29856
36053A34097K78390K07775J47027O1722q1466j40025k6657Q6724L4712o6172n3784
36042E82343k6873j23575j79456M5786M17114N52048L43324L5841j68790k66507
$$ y = [-27559, 21922, 215410, 378714, 327027, 114954, -56815, -49620, 161782, 529332, 946307, 1275284, 1414168, 1343137, 1134377, 925516, 821228, 788506, 720162, 631473, 677727, 898424, 1070758, 964188, 666271, 489857, 576612, 740563, 715305, 436990, 68849, -152440, -91361, 159764, 330788, 263687, 134626, 229000, 501343, 589244, 344555, 95652, 184538, 453867, 489353, 256412, 147451, 391173, 750382, 904058, 833916, 675261, 447599, 155686, -41449, -19824, 75032, 25912, -111487, -95759, 134097, 412487, 620262, 767289, 829011, 747545, 607520, 580863, 667587, 702299, 636127, 582343, 555470, 431895, 252439, 298225, 715339, 1267387, 1610711, 1646552, 1477762, 1211255]
36032A211255k51015j01709K5434o9254k69896k44555M0359K37480J44491k0901
36022G01689k0868M3336j3119j01898j6517K31346M71883O36584P17891N81680
36012C232007J02597n23113q49995o50051j65136J68644J41870j26161l81542
36003I49120m33131k37988P4204K68315K09540K6613l1378P1306J04358o9730
35993I31229k52174j97493p627J9584j41125k34398j74704j51471k06264q3202
35983d97645L02235N84352M27776L3780j52386n1462O2304M3017l770j0197l4929
35972G03075p7682p1842m9470q2032r3496K8925J78357J40144n6847j60146p7190
35961C81796R086m7256j45652j16986M5085J97826K03786N4872j02289j10394
$$ y = [1211255, 960240, 858531, 883965, 814711, 544815, 300260, 340619, 578099, 722590, 701689, 680821, 724157, 711038, 609140, 592623, 823969, 1295852, 1932436, 2650327, 3232007, 3334604, 2811491, 1961496, 1311445, 1146309, 1314953, 1456823, 1330662, 949120, 515989, 278001, 352205, 620520, 830060, 856673, 825295, 896601, 1000959, 931229, 679055, 481562, 473935, 493519, 352394, 117996, -56708, -208179, -414443, -497645, -195410, 388942, 816718, 850498, 698112, 646650, 708954, 751971, 748201, 738004, 703075, 625393, 553551, 504081, 422049, 328553, 357478, 535835, 675979, 619132, 458986, 381796, 390882, 343626, 197974, 80988, 126073, 323899, 527685, 582557, 480268, 369874]
35951C69874j2373N17r4972r2463P5945J69794L9358q3001J9524J28768m3066
35940D77905k88031j74657K29913M05865J41893k05298k70689j00731P3955J40471
35930D30596P9075q1279k07194j85414j08040j14541j24908n144J15442M0395
35920a61012r1220m952J97952J86471p159m4304R4874R0839p7516n1796K38999
35909C71176L98438K19111j8983r7991j73104l09817k56665K9691J48668j12845
35899A97679l74396k45194J01785K91888K93385K48818J35748n1605j29452n6275
35889D12381q1032k68615k98164n5204N8230j89643l63698n9243L69553L69175
35879a06260O9229m1215L0692m0822j43469P5123M06570K79740k51250m80000
$$ y = [369874, 357501, 358018, 263046, 170583, 246528, 416322, 455680, 372679, 392203, 520971, 477905, 189874, 15217, 245130, 650995, 792888, 587590, 316901, 216170, 290125, 430596, 509671, 428392, 221198, 35784, -72256, -186797, -311705, -316849, -201407, -161012, -252232, -257184, -59232, 127239, 120080, 75776, 170650, 261489, 183973, 132177, 371176, 769614, 988725, 969742, 871751, 698647, 388830, 132165, 161856, 310524, 197679, -176717, -421911, -320126, -28238, 265147, 513965, 649713, 598108, 468656, 412381, 331349, 62734, -235430, -290634, -232404, -422047, -785745, -844988, -475435, -106260, -37031, -78246, -47554, -88376, -231845, -156722, 249848, 529588, 278338, -201662]
35869b01662j15945L12762L15771Q3152L358N8691L5714l9216j5296N9462N760
35858E02551k05642l96669l51248k2949L50775M25728J70399m6996K0762J20233
35848E66944o0213l17217k44638N9376J27949j06001k34069q4233M6191k9098
35838b75009r9548j8858L3765l6981j7498J86585L00638J29428r9581j18892k7581
35827d3532l0728o2271L0030J63859J82231J34709J27510Q0299r7818k57804k08891
35816A7594l4322M3725r69l4731k5178l1159k0898P2714J77773J62346L1946j15116
35804B43725k44080l28379k50583K9720K97867L06883J23199J7012N1327M3296
35794B89987o6128r7495K7257J04146k4478j78798j11634P5297P1208j33350j91038
$$ y = [-201662, -317607, -4845, 310926, 394078, 397436, 456127, 491841, 452625, 437329, 496791, 502551, 296909, -99760, -451008, -473957, -123182, 302546, 472945, 425949, 446711, 566944, 506731, 189514, -55124, 4252, 132201, 26200, -207869, -292102, -245911, -275009, -374557, -393415, -359650, -396631, -414129, -227544, 73094, 202522, 102941, -15951, -43532, -74260, -136531, -106501, 57358, 239589, 374298, 501808, 582107, 484289, 226485, 17594, -16728, 26997, 26028, -8703, -33881, -65040, -85938, -13224, 164549, 326895, 358841, 243725, -355, -328734, -579317, -549597, -251730, 55153, 178352, 195364, 246691, 289987, 223859, 126364, 153621, 257767, 233289, 54491, -57143, 18154, 89362, -43988, -235026]
35783b35026O6112L28154K50093k8784j09418M5251Q2811j34993k90996j30553
35773a57349J19377J16172o3444q4656R6708J95034N8652j40418j96302q9991
35763a46217J06893L14608L92031K16851j19651l65806l92845k76618j10062P1436
35753c09380J78983J09621n9058j15079l422J15289J36029J36372J74919J67211
35743E31485N1690q9455j57801j44695o1135Q2015J84688J20865o3479j85005
35733B69173j86485j78074j92665j26610K3784J06771P7307P6229J47767J21604
35723A38801r0412l06273l33201k12802o4082J08445K87984L32942J82795R398
35713E3595j5604M9834P9494R4924J45499J47883L9011o8837p4324o4881j16812
$$ y = [-235026, -168914, 159240, 409333, 380549, 271131, 316382, 399193, 264200, -26796, -157349, -37972, 78200, 14756, -69900, 26808, 221842, 280494, 140076, -56226, -146217, -39324, 275284, 667315, 884166, 764515, 398709, 5864, -270754, -380816, -309380, -130397, -20776, -79834, -194913, -198335, -83046, 52983, 189355, 364274, 531485, 583175, 493720, 335919, 191224, 130089, 212104, 396792, 517657, 454178, 269173, 82688, -95386, -288051, -414661, -390877, -284106, -206799, -130570, 17197, 138801, 48389, -257884, -591085, -803887, -867969, -759524, -471540, -138598, 44197, 53595, 37991, 87825, 167319, 262243, 407742, 555625, 594636, 525799, 451475, 386594, 269782]
35702B69782j04398N8778J69730J1480k56372k85835l9243J85267J74535j3620
35692A70104k29392l34117j83626K01944M85138L38233o6812k10240P6225L72725
35682F20182K54891j58337m15393k91801M3800K90396K77523N2385j65579j71225
35672C36842M829J24801M4744j10269j39278k7447Q3591J05432P0450L5921K4418
35661E54034M2082P3917O9283J869o0190j6967J12826J73750N9146j30815k00977
35650F77958j23112p4705j66209k52426j47719N8159R9171o5916j77661o5985
35640b38445J01511R4720l8021q7635j4802M0699J0622l4714m1848l3833k5735
35629b67481j1727j9787o6605q8783k5657P4568J37305J83126K42456K28608N7704
$$ y = [269782, 165384, 224162, 393892, 405372, 149000, -136835, -176078, 9189, 183724, 170104, -59288, -393405, -577031, -375087, 110051, 448284, 381472, 171232, 247457, 620182, 875073, 716736, 301343, 9542, 53342, 343738, 621261, 673646, 508067, 336842, 341671, 466472, 511216, 400947, 261669, 234222, 317813, 423245, 493695, 529616, 554034, 596116, 670033, 739316, 741185, 680995, 664028, 776854, 950604, 1009750, 878935, 677958, 554846, 480141, 313932, 61506, -86213, -28054, 71117, 5201, -172460, -238445, -136934, -42214, -80235, -167870, -182672, -141973, -131351, -166065, -207913, -241746, -267481, -279208, -298995, -365600, -454383, -480040, -405472, -268167, -85041, 157415, 386023, 443727]
35618D43727j59463k17996q8227O3424R7598J5843j05003j66394j00672J0030
35608b07133k2992j94642k20510M1296K93162K32757P1813J81745L84094J77803
35598G37393l46189m88258j4602M10899K25527j91501j86467J38622K01495o4124
35588D22795j89166k7985M9682j23727k19068j3983K16937J74184K084j0031R2774
35577C74496O4181j02558j60655J5320K49006K75158M2909k11722k09034K9882
35567C66983J70376O319k15540j38336J44980K09547l7822k02832k1809K34209
35557E16075J86770j12544l28208l09640j63488j9669M9007P980n2654L6930K33610
35546D4169K41136l5459k39777n5373K76153K92529L227j71246o9779M2003r133
$$ y = [443727, 284264, 66268, -21959, 41465, 139063, 154906, 49903, -116491, -217163, -207133, -230125, -424767, -645277, -603981, -310819, -78062, -6249, 175496, 559590, 737393, 391204, -97054, -111656, 299243, 524770, 333269, 146802, 285424, 486919, 422795, 233629, 205644, 255326, 131599, -87469, -101452, 115485, 289669, 291753, 281722, 374496, 438677, 336119, 175464, 190784, 439790, 714948, 757857, 546135, 337101, 366983, 537359, 543678, 328138, 189802, 334782, 544329, 506507, 303675, 281866, 516075, 702845, 590301, 262093, -47547, -211035, -230704, -181697, -173717, -226371, -189441, 44169, 285305, 249846, 10069, -45304, 230849, 523378, 526605, 355359, 285580, 327583, 318450]
35535C18450m6624P5534J93413J14675p5080j59227o8645J03623K16510J45062
35525H17691j06094l13950k45426J7049J61249P5042m6740n3281k1310k4625r180
35514B50425M004j14303l02427k74142M5184L31641L08285J09101j3057o5342
35504B79369j45782j58646j0162J19739K9356j39683j11373P9159J67228Q3884
35494A93089j1405m3667o8452o9984q5M1291n7603j68509q8471J12379K00398
35483C8981J61285J55911J63908L2221j50866j15339J27959K52377J06401j03234
35473F69604j89311k03322j91702q1067P4395O6629j02025j48321L9359J92759
35463A26998R5159p8145p0843O5333J27155Q3961J5888q0303k05386k43369j30394
$$ y = [318450, 271826, 347360, 540773, 655448, 580368, 421141, 352496, 456119, 672629, 817691, 711597, 397647, 152221, 169270, 330519, 405561, 358821, 305540, 284230, 259605, 250425, 254429, 140126, -162301, -436443, -391259, -59618, 248667, 357768, 344711, 279369, 133587, -25059, -35221, 84518, 113874, -25809, -137182, -58023, 109205, 193089, 181684, 138017, 69565, -419, -504, 40787, -16816, -185325, -273796, -161417, 38981, 200266, 356177, 520085, 552306, 401440, 286101, 414060, 666437, 772838, 669604, 480293, 276971, 85269, 4202, 78597, 145226, 43201, -105120, -65761, 126998, 222157, 144012, 73169, 138502, 265657, 349618, 365506, 285203, 79817, -163552, -293946]
35452b93946R012N2508M5402M5966O409n7150j0622J27383J22448q2635j96031
35441b31256k7259J88401J98754J60100K86633L56879M2584m46242n60881k08776
35431b41063J36566J52395M1659Q0822J92274J62038L301r8924m3223J14363K20292
35420G20500J12700k00408m39124l16918O3733K83282J25082j71674k51620n6761
35410a31208J94110K94713K13382N3514o3877j06651j31468j59501j25754j9548
35400A7712L7135k5487q1250r055R0970Q1868N0044J21338J50155o9490l60629
35389C311l24547M6955L20191K56609J03391J02344J00892r8660l22207k75611
35379h7332j3231J53978J06456K358k4636j5636l5478n3625k3162J4905l9291
$$ y = [-293946, -284934, -232426, -187024, -141058, -134649, -191799, -202421, -75038, 47410, -35225, -231256, -258515, -70114, 128640, 288740, 575373, 932252, 974836, 528594, -32287, -241063, -104497, 47898, 89557, 170379, 362653, 524691, 527992, 429068, 385845, 500208, 720500, 833200, 632792, 193668, -123250, -59517, 223765, 348847, 177173, -74447, -131208, 62902, 357615, 570997, 624511, 560634, 453983, 322515, 163014, 37260, 17712, 54847, 29360, -51890, -60945, 30025, 111893, 161937, 283275, 433430, 363940, 3311, -321236, -274281, 45910, 302519, 405910, 508254, 609146, 510486, 188279, -87332, -100563, 53415, 159871, 162229, 137593, 121957, 86479, 32854, 9692, 24597, -14694]
35368a4694k06685l31771k06527J33799L52195K10198p9951j40668K3253Q3448
35358a77403m3474q4299P0299J52395r313j88670j62197n8137m5652j6322J19175
35347d43598J48734n9601j97940K9469L54242L32071P4664L5506J91198P1417
35337E36162l69890n61346j93664K69343K80972k7444j59170k962J46078J25535
35327D3614O2966O1417N6906l836p4245j07548r0982j3595O7059J0487j87654
35316a75411k67429k6987L03423L02525l2379k45197q0866J51588Q8107j15106
35306i7732n9662K23356L08540O1286j48287m3163J38922O6547j53794j91574
35296A04439k0527J22119J55944J64406R2623j44635l11670q5186L32187L48015
$$ y = [-14694, -221379, -553150, -759677, -625878, -273683, -63485, -143436, -284104, -260851, -177403, -220877, -305176, -234877, -82482, -91795, -280465, -442662, -500799, -546451, -562773, -443598, -294864, -354465, -552405, -522936, -168694, 163377, 238041, 273547, 464745, 536162, 166272, -395074, -588738, -319395, -38423, -65867, -225037, -227999, -81921, 43614, 106580, 167997, 224903, 221067, 146822, 39274, -51708, -65303, 1756, 12243, -175411, -442840, -469827, -166404, 136121, 103742, -141455, -222321, -70733, 17374, -97732, -157394, 65962, 374502, 435788, 287501, 244338, 383260, 449807, 296013, 104439, 83912, 206031, 361975, 526381, 619004, 474369, 162699, 77513, 409700, 757715]
35286G57715j33279m89190k95476O2234P5160q1174L7455L00176K26337j49453
35276C10505l09958r6686J17131J22203J18211J55046m0596m45418n33199n0576
35266f53337M77639M45535J794k59561j59746j0138q905m3199l1823m3557o0339
35255c45637L5854K04396K54916J45553K7344k5674q8877j67327j48844k9592
35245a37888L8149l273j9176P8343J74690J41354L1324k8618k8091m1706q4856
35234A20252j06156q5019n6605m8847l8109K2533J24663J64610N0475j24770j35254
35223a12227N5828J60999n7246l78261l58444M3292L80765L36274J12407L8640
35213B22027P5592n904j58933j36496M7818J06754m6613j57785o6984L6933k0935
$$ y = [757715, 624436, 135246, -160230, -97996, -22836, -104010, -66555, 233621, 459958, 310505, 547, -96139, 20992, 143195, 261406, 416452, 375856, -69562, -602761, -653337, -175698, 269837, 271631, 12070, -147676, -157814, -166719, -209918, -241741, -285298, -345637, -309783, -105387, 149529, 295082, 322426, 296752, 207875, 40548, -108296, -137888, -99739, -103012, -122188, -43845, 130845, 272199, 303523, 274905, 246814, 205108, 120252, 14096, -70923, -127528, -176375, -214484, -191951, -67288, 97322, 147797, 23027, -112227, -56399, 104600, 47354, -330907, -689351, -646059, -265294, 70980, 183387, 222027, 297619, 291715, 132782, -3714, 44104, 150858, 104245, -53540, -120524, -83591, -104526]
35202a04526p9057N1048J88469N0667k22846k27613M9892J75353l1173j81085
35192c30871L9392L05088J43446k72367l38349N6867L65865K31529j0388O0671
35182B50883K62424J43859k44012l92758j04429K23001J82671j09469k63357j58898
35172b10085L698P2706J01896J44533J19856k0898j46895j05884M5191J13897
35162A18015N0065l639M3619R6477N3762k6373n4253p0626j37911j85504j33343
35151b49711o4500p7520p3417O2879J67686J1373k40366j75539K05203M09887
35141b4025J90293q0231k9005J34940N3623j21543k0521K26064J54192k12804
35131B70983l20296L8968L60961J89241k21013l37939j12805R0061J06608R2769
$$ y = [-104526, -183583, -132535, 55934, 106601, -116245, -343858, -293966, -118613, -149786, -330871, -291479, 13609, 157055, -115312, -453661, -396794, -30929, 200600, 190212, 250883, 513307, 657166, 413154, 20396, -84033, 138968, 321639, 212170, -51187, -210085, -206387, -133681, -31785, 112748, 232604, 211706, 64811, -41073, 4118, 118015, 168080, 164441, 208060, 304537, 358299, 331926, 277673, 207047, 69136, -116368, -249711, -314211, -391731, -465148, -402269, -234583, -223210, -463576, -639115, -433912, -24025, 166268, 86037, 57032, 191972, 245595, 124052, 103531, 329595, 483787, 270983, -49313, -10345, 350616, 539857, 318844, -19095, -131900, -41839, 64769, 157538]
35121A57538J10487Q970k09850k49088O5129M33126M02125k7885l68866k74772
35111D6914J3271L5242k21691l26651p4211J97345J34664p9996k8139K69928L75492
35100C42168J02785k14647k25245m267J66610K01068J72491O8050j63651m02472
35090D2890m28423k06654O0111J84277J75911J40561J03454K1338p2795n3191
35080c2521J08124K15257O2784k24385k65349N6557L49081K04712k09365l64206
35070i9311j20815R5653m1881k82015k12759R6948K12770k726j97685p1927J83822
35059d39926K00034L507k8444K19814L74662J36225k17536k25982L6768R3895
35049A53017j31846j88280J06304K96340L5169l06671k28432J18947K63510J81431
$$ y = [157538, 268025, 276995, 67145, -181943, -116814, 316312, 718437, 690552, 321686, 46914, 60185, 95427, -126264, -452915, -527126, -329781, -195117, -275113, -303252, -33324, 342168, 444953, 230306, 5061, 794, 167404, 368472, 540963, 609013, 445362, 42890, -385533, -592187, -532076, -347799, -171888, -31327, 72127, 93465, 20670, -32521, 75603, 290860, 353644, 129259, -136090, -79533, 269548, 474260, 264895, -99311, -220126, -124473, -166354, -448369, -661128, -564180, -351410, -354136, -551821, -623748, -439926, -239892, -236385, -264829, -45015, 329647, 465872, 248336, 22354, 59122, 153017, 21171, -167109, -60805, 235535, 270704, -35967, -264399, -145452, 118058, 299489]
35039B99489J48760J15486j10453k80277m2433K87850J09901l76305l71047J68391
35029e0638L59025j50724n55220k16638L07392K51330j21152r9327K43246K97553
35019B64847J5039j20888N396P2122J8370Q1612K15258J38913p7003r9214L7191
35008E51643q595k15579k06173N9411J85626J4911j43773p1017N6108L3505r6341
34997A59726k25689k88244j70683J34444L33676J69191j33593j71327K479K7637
34987a62383j01385p6313J10248J77240J19266J50258J54797j30322m43903k75098
34977d77595J88877K35619j67515k68326J57039L70558m6967m37428j69840L39191
34967b76387M00370J32699K8759M8779p6442j47996J05064L47600J37445k41812
$$ y = [299489, 448249, 563735, 453282, 173005, 130572, 418422, 528323, 152018, -219029, -50638, 308387, 157663, -397557, -614195, -306803, -55473, -176625, -275952, -32706, 264847, 279886, 158998, 164394, 236516, 254886, 336498, 551756, 690669, 613666, 514452, 551643, 543048, 327469, 121296, 180707, 366333, 381244, 237471, 166454, 222562, 256067, 159726, -65963, -354207, -524890, -390446, -56770, 112421, -21172, -192499, -190020, -162383, -263768, -340081, -229833, -52593, 66673, 216931, 371728, 241406, -202497, -477595, -288718, -53099, -220614, -488940, -331901, 38657, -8310, -445738, -615578, -276387, 123983, 256682, 285441, 334220, 257778, 109782, 214846, 562446, 699891, 458079]
34957D58079k14109J18195K04941M845o7354K7752m3942k53986k29115K1238R2710
34946A19254q8944j78544o8522j4090o7888M892J89971J85267k8205j30462m6715
34935a23986m1380j62871j54271J289K2504p8234N1804M00515M58314M1557l32208
34924H3033k18745J11923J76876q996j13713m0171P2266J38988J18305n7577k94084
34913c1895l23320r3430J04201R2814P1902J92084K27525j3906k75329k17149
34903b66503M8309J63896P6473Q751L0210K1172k6052m481N8352L5199n2902p1268
34891B1156j8143j4532q3272j34425j27369p2555O0842K58560L60598K44061M0347
34880E35268k9701K4028J6741q4505j25507n6023k4522j20006k02264r2204J71340
$$ y = [458079, 243970, 362165, 567106, 571951, 504597, 532349, 488407, 234421, 5306, 26544, 119254, 30310, -148234, -216756, -230846, -298734, -293842, -103871, 81396, 53191, -77271, -123986, -165366, -328237, -482508, -481219, -458715, -536949, -485145, -84630, 373684, 415241, 83033, -135712, -23789, 153087, 144091, 30378, -9793, 62473, 201461, 319766, 262189, -31895, -355215, -448645, -344444, -251630, -179728, 12356, 239881, 225975, -49354, -266503, -218194, -54298, 22175, 30926, 61136, 82308, 56256, 51775, 110127, 145326, 92424, 21156, 3013, -11519, -94791, -229216, -356585, -429140, -368298, -109738, 250860, 494921, 535268, 505567, 529595, 546336, 461831, 336324, 280301, 255779, 135773, -66491, -158695, 12645]
34869A2645L53797K66724m5904l36183l67205j33264J39017K26214J16625l0865
34859B01601q1717l7017J4564J3135n283L1755J01571Q7655k6563p0098P0432
34848C00035K12870J00585j83396k84396q2500J40406J26834k5402j01178r8179
34838A05679j21256j33098l9980Q8095J00942R895l9448P5L2147q438o8776p4983
34826a49146k6164K4767L7423K1703J6122K6535K3160K1606P9111J45262N5027
34815B75406j91054l06533j08556J36856Q3436j23627p7592J68236J53189j71659
34805a61898k88052J8898K45210j0630l61590k62416J27615K91003K06269K11901
34795A6310K62543J9444m14900n36229k34524P3278J77455L22313N68117N27308
$$ y = [12645, 366442, 633166, 587262, 251079, -116126, -249390, -110373, 115841, 232466, 201601, 119884, 82867, 97431, 110566, 105283, 137038, 238609, 326264, 299701, 229603, 300035, 512905, 613490, 430094, 145698, 63198, 203604, 330438, 305036, 203858, 105679, -15577, -148675, -188655, -100560, 382, 10277, -29171, -29096, 3051, -5387, -74163, -149146, -175310, -150543, -113120, -91417, -75295, -48760, -25600, -3994, 75117, 220379, 275406, 84352, -222181, -330737, -193881, -110445, -234072, -311664, -143428, 9761, -161898, -449950, -431052, -185842, -196472, -558062, -820478, -692863, -401860, -195591, 16310, 278853, 298297, -116603, -652832, -887356, -814078, -636623, -314310, 253807, 781115]
34785G81115L3730m41319m14259m4798J93117J69755O3172n3399j86551j85993
34775h5430O1303L18439K58546k9234j50199R447J62729J12654P594L184m252
34764F64781j19320j86415m0324J57435J19665j14797k25915j01904J6719l9238
34754A30687r5075L5692J95742J30979p5970j38234l5798m200q3926o9392M4819
34743C5324r899k49958k71659J05414M15515J78633l30599m37223l1602L37166
34733b58888K98760Q1609R250L9493k71p7379q6369o1603n1885P924J22357J35476
34721A58474j3137j25628l5865J12956R7047l3490p1178r417j7711j10227j08763
34710a56939M2310J61789J06720k8445q9310q4184j00802j18820o7255j680l6214
$$ y = [781115, 814845, 373526, -40733, -85531, 107586, 277341, 340513, 287114, 100563, -85430, -24127, 294312, 552858, 523624, 373425, 382872, 545601, 658255, 665849, 669033, 664781, 545461, 359046, 318722, 476157, 595822, 481025, 255110, 153206, 169925, 130687, 35612, 71304, 267046, 398025, 322055, 183821, 148023, 143823, 59897, -9495, 35324, 25425, -224533, -496192, -390778, 24737, 203370, -127229, -564452, -596054, -258888, 39872, 121481, 130731, 170224, 169953, 92574, 6205, -55398, -107283, -99359, 22998, 158474, 145337, 19709, -16156, 96800, 193847, 160357, 89179, 79762, 62051, -48176, -156939, -114629, 47160, 153880, 125435, 36125, -48059, -148861, -267681, -334936, -336616, -372830]
34699c72830j04893j03K72370L83530J11076k69191k90472N6703K89986J06248
34689A82424k16434k49312R024K20823J99338M9424q0189j37724j12303m1409
34679a76338k8635q9334p1717Q9102J82704L8745j23684o275K22705J32852k30429
34668f0304l12324J06739N11094L79019p4782k63411o5917J26748P0043o0271
34658C56634n9824O033M998k9464k3832m4138j70916k86761j76463J53801M12815
34647A42883L63142J17831l6709m6232j06814k66929k87127m6006J78888J10946
34637A23873n0488P0494L70046L63133m6953l75301k83579n5673p5802k15445
34627a75695j22033J47452K23617L5338j04543k5032O8948j4732j35132o1040
$$ y = [-372830, -477723, -477826, -205456, 178074, 289150, 19959, -270513, -213810, 76176, 182424, -34010, -283322, -274298, -53475, 145863, 195287, 115098, -22626, -134929, -176338, -204973, -294307, -366024, -276922, -94218, -55473, -179157, -185432, 37273, 170125, -60304, -372628, -265889, 245205, 624224, 549442, 286031, 220114, 346862, 416905, 356634, 296810, 302843, 307841, 278377, 254545, 210407, 39491, -247270, -423733, -269932, 142883, 506025, 623856, 587147, 540915, 434101, 167172, -119955, -165961, 12927, 123873, 73385, 143879, 513925, 877058, 830105, 454804, 171225, 115552, 39750, -175695, -297728, -150276, 73341, 108679, 4136, -20896, 48052, 33320, -101812, -162852]
34617a62852J55990K51754J21280n3114o7599L2216M3386q0897j60952q1900J0279
34606G591m6260j30182k3639J87469K07843J8461p6570M2909J25631K0814l8010
34595B96057J20930K20309m3494m41998m97765j77980J16731J80507J89308K53668
34585B16273K10320k0238k14215j60035M7742J85324J74739N0488j55443l42720
34575g765l25213o3638J99075K08880K7806p8044j7994N3022M5322R4316K88652
34564D24419M09488J79259k68820m52340j77351J49596P9854k25643k62312K8431
34554a15419K05485Q2146M995J82663K54616q9381m82849l87878N4129K44584
34544d6909M8334j00851J1594Q5970p6831j99238q119L11220M10922K40140j8199
$$ y = [-162852, -6862, 244892, 366172, 313058, 245459, 277675, 321061, 240164, 79212, -2688, 7591, -38669, -168851, -192490, -5021, 202822, 221283, 144713, 187622, 313253, 334067, 296057, 416987, 637296, 593802, 151804, -345961, -523941, -407210, -226703, -37395, 216273, 426593, 406355, 192140, 32105, 79847, 265171, 439910, 490398, 334955, -7765, -332978, -396616, -197541, 11339, 39145, -38899, -56893, -3871, 41451, 135767, 424419, 833907, 1013166, 744346, 292006, 114655, 264251, 344105, 118462, -143850, -115419, 90066, 172212, 177207, 359870, 614486, 525105, 42256, -345622, -291493, -46909, 1425, -99426, -87832, -1862, -78693, -277931, -286050, 25170, 436092, 676232, 658033]
34533F58033k18775k60710o4340K48348L53141R9987k74929m54357l69259j15713
34523c98574K00724L89582K35819j46857k97659l370L46742K96749l5252k07494
34513C80410j26627m6001m1414L9087J50388N1488k19121l05246p9511J63746
34503c2801J94886J42542J26356m413k95267m14072j28687K15728J37039k31346
34493b90035l08923N4861L70851K80236O4543J25632L26566K41614j36464l70696
34483C58185k33369J1436P9329P3998J98851L11425J00589l69813o32252m06913
34473e08534L3243K34435J11673o4996j04643p0920n1602l27J12542J72755P3772
34462f2602j05005j84027q9582J00606K51599K49395P3855j31219j61370j2511
$$ y = [658033, 439258, 178548, 114208, 362556, 715697, 815684, 540755, 86398, -282861, -398574, -197850, 191732, 427551, 280694, -16965, -20335, 326407, 623156, 587904, 380410, 253783, 207782, 166368, 205455, 355843, 407331, 188210, -117036, -196547, -32801, 162085, 304627, 430983, 426570, 131303, -282769, -411456, -195728, -58689, -290035, -598958, -544097, -173246, 106990, 171533, 297165, 623731, 865345, 728881, 358185, 124816, 136252, 215581, 289579, 488430, 799855, 900444, 530631, -101621, -508534, -475291, -240856, -129183, -194179, -298822, -369742, -421344, -421671, -309129, -136374, -62602, -167607, -351634, -441216, -340610, -89011, 160384, 234239, 103020, -58350, -70861]
34452g0861Q2656j2367j30452r7914m8230j56812k28730L7457M38145M17109q3543
34441A46458m42237k55553Q2513O0628j48481p5717K05544K44728K1006o1643
34431b22754P7587Q8238j34080k69568j81043j14172j34553M3607M32677N59869
34421A45808K06137j77176j67372J3498J520p7520K5065J25632k0358j73162k8514
34410a26442J62599L2822j62864L2397L78529K70801j82296k85735N9358J99786
34400C78955j23456l64998j70504O6795K4262L0753L31356M84360J05553l68348
34390C94728l33828J4986P0981j78835k45478k3489J16865M1913K1490J63047
34380D2380K23611O9736j10091j43063p8789o3Q1527J15430N4422m182M7284J15125
$$ y = [-70861, 11795, -572, -131024, -228938, -277168, -433980, -662710, -625253, -187108, 230001, 146458, -295779, -551332, -468819, -408191, -556672, -632389, -426845, -182117, -161111, -222754, -145167, -56929, -191009, -460577, -641620, -755792, -890345, -846738, -414061, 145808, 351945, 174769, 7397, 20895, 22415, -55105, -30040, 95592, 75234, -97928, -126442, 36157, 68979, -93885, -61488, 317041, 587842, 405546, 119811, 179169, 378955, 255499, -109499, -280003, -213208, -188946, -158193, 173163, 657523, 763076, 394728, 60900, 75886, 146867, -31968, -277446, -300935, -184070, -142157, -120667, 42380, 265991, 335727, 225636, 82573, 3784, 3721, 85248, 200678, 255100, 250918, 298202, 413327]
34368D13327O7808k225L9120O7130p7655k11077o8540J64283P4875k53482k81513
34357f7949J35932M67566K81207j53878l26585j84713m4955n3355p4459L088J19773
34346A01672J61900O8984j26290k83518k65097j07554L0499R9679J68699K02569
34336E1543P9373j17650j08291J54101L28374J49469j82444k97786j55691m153
34326a03155J5673l1566q5992j49029j55268j1893K08755K88228J25675j26510
34316b5082k34760j26125O8295J69853J28178M2164J2731K4389K2333L7690J17093
34305B36759J74295P8712j13857k03607j42085q3160q9451k1250J68336K59506
34295B64198P5394k10357k91680j33912N1800J36564J47280Q2341q7804k35985
$$ y = [413327, 481135, 478910, 518030, 585160, 507505, 296428, 227888, 392171, 467046, 213564, -67949, 67983, 535549, 816756, 662878, 336293, 151580, 106625, 53270, -21189, -18101, 101672, 263572, 332556, 206266, -77252, -342349, -449903, -419404, -319725, -151026, 51543, 130916, 13266, -95025, 59076, 387450, 536919, 354475, 56689, -99002, -103155, -87482, -119048, -205040, -354069, -509337, -521230, -312475, -24247, 101428, -25082, -259842, -385967, -317672, -147819, -19641, 22523, 35254, 59643, 81976, 119666, 236759, 411054, 489766, 375909, 172302, 30217, -52943, -142394, -163644, 4692, 264198, 339592, 129235, -162445, -296357, -244557, -107993, 39287, 121628, 33824, -202161]
34285b02161j45669J60889L63024K31069o6788j89099o0524Q1807N7750k6416
34275B03882J162P8019J0452j76692k23130k9126J47385M4678k17255l08713j30959
34264f00297J32742L03065K97160M6392l57761n11494r9117N36279O69357J58612
34254E74938l23281k42492Q2804Q2289j72726j87867J07105K99752J87380l686
34244D04216r4586j64623k20975j16543P3893K8031k73557l67044L7564N36668
34234a56956N29711L8328l50671k85496k7775J7917j52458k38200j01709P4859
34224f52450Q7426k467K4750K18747L72996K94290M5658j57639k04716j34936
34214a08341o208J32033J73142L5169j72912k24689o8765Q4848M0267j35751k29622
$$ y = [-202161, -347830, -186941, 176083, 407152, 340364, 151265, 90741, 172548, 230298, 203882, 205044, 283063, 293515, 116823, -106307, -135433, 11952, 56630, -160625, -469338, -600297, -467555, -164490, 132670, 179062, -178699, -690193, -789310, -253031, 416326, 574938, 251657, 9165, 91969, 174258, 1532, -186335, -79230, 220522, 407902, 404216, 309630, 145007, -75968, -192511, -118618, -90587, -364144, -731188, -693624, -156956, 372755, 411083, 60412, -225084, -252859, -234942, -387400, -625600, -727309, -652450, -565024, -567491, -542741, -323994, 49002, 343292, 388950, 231311, 26595, -108341, -114549, 17484, 190626, 225795, 52883, -171806, -240571, -155723, -115456, -251207, -480829]
34203d80829j60387l7142K6319N0022J11526J87131J48296m3801k06097j25732
34193e30694J15777J93372J266j39886O2106L81225L48377n1434l17919j36113
34183g3923J98638K29067n5033k93318k68165q5187P5340J47294J28743L9310
34173D2766l4795P144J28998J54488j9379k57693l09997j01351J58348K12113
34163a9358P0105k2245N6241J36299N3033o7847k3556R8959N2309j39468k03594
34152i122p7563L601n4722n3975P2804P2172j58950k87276n9065K24048J58669
34141a69379r0296n7644K50324L79322J65572p4389j24790j35556k01574j59542
34131b17952K3232R8093j7768n7377R9717J66843k6487j73198k0454J38678k9072
$$ y = [-480829, -641216, -678358, -652039, -602017, -490491, -303360, -155064, -198865, -404962, -530694, -414917, -221545, -220279, -360165, -298059, 83166, 431543, 380109, 62190, -73923, 124715, 353782, 298749, 5431, -262734, -347921, -272581, -125287, 3456, 42766, 7971, 15115, 144113, 298601, 279222, 21529, -288468, -389819, -231471, -19358, 50747, 28502, 84743, 221042, 274075, 206228, 182672, 281631, 333940, 194472, -9122, -86685, -83084, -137806, -191781, -118977, -46805, -205755, -493031, -552096, -328048, -169379, -259675, -317319, -66995, 312327, 477899, 403510, 278720, 143164, -58410, -217952, -194720, -96627, -114395, -171772, -72055, 94788, 68301, -104897, -125351, 13327, -15745]
34120a5745k51586p9755K96715L14078j5508j22793J31784K13614j48958m59725
34110a37879k50893J71828K47192J481j41692r2710q7279j20916M7927L57591
34100e350M13139Q7854k46877k33803L0055K06939J38340p7177k45612k14222
34090a46714J1591K27458K34664R2901J0559J0828o1599j98391j80072M2655J93428
34079B37308M9629k36729l61839k42299j3051J86786K68381J72628m1806j86669
34069a67661j46117n958R2163J05830M9951l6276l3845J34389K81838J43679j38838
34058B79155j00992K99839M68239M0853m62374l67897J16190K45231q2885k42381
34048A92978K9613K24914l8183l88358l44527n0328P7786L1189O4811J62694J23635
$$ y = [-15745, -267331, -347086, -50371, 263707, 248199, 125406, 257190, 470804, 321846, -137879, -388772, -216944, 30248, 31729, -109963, -202673, -289952, -410868, -362941, -5350, 407789, 495643, 248766, 14963, 45018, 251957, 390297, 313120, 67508, -146714, -135123, 92335, 326999, 419900, 430459, 441287, 379688, 181297, 1225, 43880, 237308, 286937, 50208, -311631, -553930, -566981, -380195, -111814, 60814, 19008, -167661, -313778, -319736, -227573, -121743, -71792, -108068, -141913, -7524, 274314, 417993, 279155, 178163, 478002, 946241, 987094, 524720, 156823, 273013, 518244, 435359, 192978, 222591, 447505, 409322, 20964, -323563, -373891, -296105, -264916, -200105, -37411, 86224]
34037H6224j969k324Q4013N0834o0462k2030J37783J41638n7414j67260k2343
34026A66690J56027J10236q9819k02635j54826n3681J4721L3904j8705j35728
34016a73816j94609n3429K38587M32308L46160Q0061j19559j64939j69733j86840
34006C4191r5325J34422K48528K2154l37497l97954r7829J75967J58134K1853
33996a33356m6K4179l7570p6742L2500J29230M962k13160k40159p6104M8981Q0938
33984d56347J59218K80869K81625J46408K9024m2344j72407k96999k03246Q0590
33974a93609K27013N6384k14195k79739q3441K33378M80272M47375N6922m10685
33964C19675n14523k05679Q6469N9524p1562O542J97298K05755L9078m4578L1751
$$ y = [86224, 84255, 81931, 165944, 216778, 156316, 134286, 272069, 413707, 356293, 189033, 166690, 322717, 432953, 343134, 140499, -14327, -68008, -53287, -19383, -38088, -173816, -368425, -421854, -183267, 249041, 595201, 675262, 555703, 390764, 221031, 34191, -61134, 73288, 321816, 343970, 6473, -391481, -489310, -313343, -155209, -133356, -133402, -109223, -146793, -223535, -191035, -61805, -56843, -270003, -510162, -586266, -537285, -456347, -297129, -16260, 265365, 411773, 440797, 398453, 226046, -70953, -274199, -193609, 33404, 89788, -124407, -404146, -487587, -254209, 226063, 673438, 730360, 319675, -194848, -400527, -314058, -254534, -326096, -319554, -122256, 83499, 122577, 77999, 109750]
33953A09750J00421O4577J257l3522o8798q8768l5930N3731Q2897M7674J0712
33942B44001m2821j51574k15504r2374J30097J64762r4517l80301l53627j1953
33932h03811L15926L53105J52583l7749j05774j48872k13623j47752J31997L70960
33922a33010K52830j00738k36905k8475J35588k7613k44425j38797J60678K41472
33912a19395M4062j21321r9446m4058o9680j01068r1406q3586l0776J47734L06662
33901b62278J86713j45878k81892j1812L79116M96695K93335J222j83538j98163
33891B73520o5518R0328R2998r4597k98186l17074j13785J83795L71181K97332
33881D19994M8557o4767J01867K48521K5333l80292m40260o4928K61849K20260
$$ y = [109750, 210171, 274748, 276005, 242483, 173685, 84917, 48987, 102718, 185615, 233289, 244001, 201180, 49606, -165898, -258272, -128175, 36587, -57930, -438231, -791858, -803811, -487885, -134780, 17803, -19946, -125720, -274592, -488215, -635967, -503970, -133010, 119820, 19082, -217823, -246298, -110710, -138323, -382748, -521545, -360867, -119395, -75333, -196654, -296100, -340158, -409838, -510906, -602312, -685898, -716674, -568940, -262278, -75565, -221443, -503335, -515147, -136031, 360664, 653999, 655221, 471683, 273520, 208002, 298330, 391328, 296731, -1455, -318529, -432314, -248519, 122662, 419994, 468551, 403784, 505651, 754172, 779505, 399213, -41047, -105975, 155874, 376134]
33871C76134N6445M9299M1906j69970l68289k34745J17793L16824K44609N5700
33861D85706j28071k29278j25234J32128K15627k6011k49531j25050R2732k9154
33851A3864l41276l21425O8065L31164K43045J16883J77190K20924P5835q8891
33841D95378j19578j28083j82478j37936K0976M9936j25858k18338m3095J72819
33831b16257J85502Q2936n559j67036l76644l08871J37001M79003K80259j52361
33821f2027k06190J14964K64547M0327j82493j31480j1251n2256j30805n7436
33811d14100Q3475J11539M0604m931N142M3993J23124K07766J64694n8197k87313
33800A5796k97047q8932J11951J35159N9309Q8194K57999L45732J44349k17992
$$ y = [376134, 432579, 481878, 523784, 353814, -14475, -249220, -131427, 185397, 430006, 485706, 357635, 128357, 3123, 135251, 350878, 324867, 75336, -49714, 43018, 13864, -327412, -648837, -580772, -249608, -6563, 110320, 287510, 508434, 584269, 495378, 375800, 247717, 65239, -72697, -51721, -1785, -127643, -345981, -389076, -216257, -30755, 52181, 46622, -120414, -497058, -805929, -668928, -189925, 90334, -62027, -268217, -153253, 111294, 151621, -30872, -162352, -173603, -225859, -356664, -414100, -330625, -219086, -178482, -183413, -178271, -134278, -11154, 196612, 361306, 303109, 15796, -281251, -370183, -258232, -123073, -63764, 24430, 282429, 628161, 772510, 554518]
33790E54518l84074k16841L0676P6982l5570q8612k3094N8513R6958Q4860k0580
33779A33736j87496k17796K187K48368K14313m1645j81699r0239Q930m1897j13743
33768b66981o4128L2348N6841M4931P4715J09938P8068j0028j08551j97072k25530
33757d75449j17239R7600K53023K23875N7901j04054j58241p4410R3775K10319
33747G100J66059Q613j13880j25675n3002O7216J75293J44666o2581k27543q9625
33736a03359K48946L73502R4419k85175l72007j70918N556p888p7631n1267J0659
33725c35163k3700r9137k8206J80615K40139j4558k93131k00152J45770K24129
33715b03394r3386k98498j6177M04152M29838J27180n0468O895M7847j1222n0180
$$ y = [554518, 170444, -46397, -15721, 61261, 25691, -62921, -86015, -27502, 69456, 154316, 133736, -53760, -271556, -269369, -21001, 193312, 151667, -30032, -120271, -111341, -153238, -266981, -331109, -298761, -241920, -196989, -122274, -12336, 65732, 55704, -52847, -249919, -475449, -592688, -495088, -242065, -18190, 39711, -64343, -222584, -296994, -203219, 7100, 173159, 181772, 67892, -57783, -110785, -43569, 131724, 276390, 213809, -13734, -103359, 145587, 519089, 613508, 328333, -43674, -214592, -209036, -216924, -294555, -345822, -335163, -358863, -458000, -486206, -305591, -65452, -80010, -373141, -573293, -427523, -203394, -296780, -595278, -611455, -207303, 222535, 349715, 299247, 306142, 353989, 342767, 292587]
33704B92587j04771k48239k40250J43384N32868L56252k19686m33359p6721K28530
33694B30595P4099j60913q8863L7684j02127k71771j35450J20766J31078m7230
33684b12132j22493m7114P2353K20085K98494R2052k74858k99974J12185L54353
33674A92951N9794k41235j4245L08415N0039m75970m07993K33806N53323J84959
33664D43844k44126j98659N2634P6851o2054j16502j03718j17813p8971P4936
33654b73578K35596L07644K81075R0854k71488n17911l29203J26309L43086J65587
33644A57971q0776j43930q9817R494J59570J95743n4884l34765k07142K07702
33634a80834L24206J0016k14177o4472P2634j13192l00943j36480J43425J53733
$$ y = [292587, 187816, -60423, -300673, -157289, 375579, 731831, 512145, 78786, 2065, 230595, 304694, 143781, 54918, 92602, -9525, -281296, -416746, -295980, -164902, -212132, -334625, -381739, -309386, -89301, 209193, 301245, 26387, -273587, -161402, 192951, 252745, 11510, -2735, 305680, 355719, -120251, -528244, -294438, 258885, 443844, 199718, 1059, 53693, 130544, 68490, -48012, -151730, -269543, -348514, -273578, -37982, 269662, 550737, 641591, 370103, -147808, -477011, -350702, -7616, 157971, 77195, -66735, -156552, -147058, 12512, 208255, 153371, -181394, -388536, -180834, 143372, 153388, -60789, -125261, -52627, -165819, -466762, -603242, -459817, -306084]
33624c06084R651M8624K18511K15755K5976r0347k4756R2203J36193Q5961l1819
33613C79868j42413j77307j88289k38632k00304N7466L12284K17150j13744k22662
33603c16583n1158n471j75079j36978K24503L82585L2439l44094k55061L8837
33593f06060Q2365J1042J50725K96015R2364k12662j31558J93598K11591r7338
33583i918k16065K1036K03484N9515j79505k33009j28870r815N8515M2290q482
33572d00824Q3942L29748L83822J7558m00617l48509O9964K90958J41716j3532
$$ y = [-306084, -296433, -247809, -29298, 186457, 212433, 122086, 97330, 189533, 325726, 411687, 379868, 237455, 60148, -128141, -366773, -567077, -509611, -197327, 19823, -93921, -316583, -367741, -373212, -548291, -685269, -460766, -78181, -45742, -389836, -644897, -606060, -523695, -512653, -361928, -65913, 26451, -186211, -317769, -124171, 87420, -9918, -225983, -204947, -1463, 58052, -121453, -354462, -483332, -493147, -434632, -392342, -400824, -316882, 12866, 396688, 414246, 13629, -334880, -264916, 26042, 167758, 154226]
$$ [...]
##END NTUPLES=NMR SPECTRUM
##END=
